JobTech Taxonomy - Arbetsplatsmodell
type: ConceptScheme
description: Terminologi för begrepp av typerna 'work-place-model'
publisher: https://jobtechdev.se/en

JobTech Taxonomy - Arbetsplatsmodell
type: Collection
description: Begrepp av typen 'Arbetsplatsmodell' (kod 'work-place-model')
member: Arbete på plats
member: Hybridarbete
member: Distansarbete

Distansarbete
type: Concept
in scheme: JobTech Taxonomy - Arbetsplatsmodell
top concept of: JobTech Taxonomy - Arbetsplatsmodell
definition: Arbetstagaren utför sitt arbete från bostaden eller någon annan plats, som inte är i arbetsgivarens lokaler.
alternative label: Distans

Hybridarbete
type: Concept
in scheme: JobTech Taxonomy - Arbetsplatsmodell
top concept of: JobTech Taxonomy - Arbetsplatsmodell
definition: Arbetstagaren växlar mellan att arbeta i arbetsgivarens lokaler och från bostaden eller någon annan plats, som inte är i arbetsgivarens lokaler.
alternative label: Hybrid

Arbete på plats
type: Concept
in scheme: JobTech Taxonomy - Arbetsplatsmodell
top concept of: JobTech Taxonomy - Arbetsplatsmodell
definition: Arbetstagaren arbetar i arbetsgivarens lokaler eller utgår från arbetsgivarens lokaler men arbete utförs i fält eller hos kund.
alternative label: På plats