Relationskompetens
type: Concept
in scheme: JobTech Taxonomy - Generell kompetensgrupp
top concept of: JobTech Taxonomy - Generell kompetensgrupp
definition: Att på ett lyhört och/eller inspirerande sätt kommunicera och samspela, med kunder och kollegor, för att nå verksamhetens mål.
broad match: 6QJ9 rPt dva
narrow match: khoN YFX YKn
narrow match: ApAJ VYx bwf
narrow match: 1uJQ qgW en2
narrow match: 4mzV SAi rK6
narrow match: 4uAV 121 eHo
narrow match: jNFe 6Ms W3C
narrow match: Wnk5 cWe pvo
narrow match: sCVF YAu Ei9

Organiseringskompetens
type: Concept
in scheme: JobTech Taxonomy - Generell kompetensgrupp
top concept of: JobTech Taxonomy - Generell kompetensgrupp
definition: Att utifrån givna krav på resultat, kunna planera och strukturera arbetet.
broad match: 6QJ9 rPt dva
narrow match: 4DDo JNJ H72
narrow match: 2nwk rJ8 XEK
narrow match: XDZT uPz Jd3
narrow match: hHnq Fio pRF
narrow match: jGBs cqK 42Q

Anpassningskompetens
type: Concept
in scheme: JobTech Taxonomy - Generell kompetensgrupp
top concept of: JobTech Taxonomy - Generell kompetensgrupp
definition: Att utifrån förändrade omständigheter kunna anpassa sitt handlingssätt efter verksamhetens behov och förväntningar.
broad match: 6QJ9 rPt dva
narrow match: ApSP 7px q34
narrow match: kPF6 ivf 2Jd
narrow match: TjM5 xqW 3Q4
narrow match: TbEd 32g riM

Prioriteringskompetens
type: Concept
in scheme: JobTech Taxonomy - Generell kompetensgrupp
top concept of: JobTech Taxonomy - Generell kompetensgrupp
definition: Att effektivt prioritera mellan konkurrerande arbetsuppgifter för att nå verksamhetens mål.
broad match: 6QJ9 rPt dva
narrow match: nsiP KbK At9
narrow match: hnP1 hDr FqJ
narrow match: 74C8 qib U2o
narrow match: vSHX c5p Y6q
narrow match: Loej x8A YBH

Utvecklingskompetens
type: Concept
in scheme: JobTech Taxonomy - Generell kompetensgrupp
top concept of: JobTech Taxonomy - Generell kompetensgrupp
definition: Att pröva nya tankar och handlingssätt för att bidra till verksamhetens utveckling.
broad match: 6QJ9 rPt dva
narrow match: TnAF T4P njq
narrow match: HiNT ZPG GXf
narrow match: qh5J xwB JMp
narrow match: YF7e tDn ijA

JobTech Taxonomy - Generell kompetensgrupp
type: ConceptScheme
description: Terminologi för begrepp av typerna 'generic-skill-group'
publisher: https://jobtechdev.se/en

JobTech Taxonomy - Generell kompetensgrupp
type: Collection
description: Begrepp av typen 'Generell kompetensgrupp' (kod 'generic-skill-group')
member: Anpassningskompetens
member: Prioriteringskompetens
member: Relationskompetens
member: Organiseringskompetens
member: Utvecklingskompetens