Gröna ESCO-kompetenser
type: Concept
in scheme: JobTech Taxonomy - ESCO kompetenssamling
top concept of: JobTech Taxonomy - ESCO kompetenssamling
definition: Samlingen innehåller ESCO-kompetenser som har specificerats som gröna. Se ESCOs metoddokument för mer detaljerad beskrivning av ESCOs metod för att definiera vilka kompetenser som är gröna: https://esco.ec.europa.eu/system/files/2023-07/Green%20Skills%20and%20Knowledge%20-%20Labelling%20ESCO.pdf

Digitala ESCO-kompetenser
type: Concept
in scheme: JobTech Taxonomy - ESCO kompetenssamling
top concept of: JobTech Taxonomy - ESCO kompetenssamling
definition: Samlingen innehåller ESCO-kompetenser som har specificerats som digitala. Se ESCOs metoddokument för mer detaljerad beskrivning av ESCOs metod för att definiera vilka kompetenser som är digitala: https://esco.ec.europa.eu/system/files/2023-07/Green%20Skills%20and%20Knowledge%20-%20Labelling%20ESCO.pdf

JobTech Taxonomy - ESCO kompetenssamling
type: ConceptScheme
description: Terminologi för begrepp av typerna 'esco-skill-collection'
publisher: https://jobtechdev.se/en

JobTech Taxonomy - ESCO kompetenssamling
type: Collection
description: Begrepp av typen 'ESCO kompetenssamling' (kod 'esco-skill-collection')
member: Gröna ESCO-kompetenser
member: Digitala ESCO-kompetenser