JobTech Taxonomy - Färdighet
type: ConceptScheme
description: Terminologi för begrepp av typerna 'skill', 'skill-headline'
publisher: https://jobtechdev.se/en

JobTech Taxonomy - Kompetensbegrepp
type: Collection
description: Begrepp av typen 'Kompetensbegrepp' (kod 'skill')
member: Fordonskunskap
member: Skadebesiktning
member: Natur- och kulturhänsyn - Röjning/Förröjning
member: Järnvägslagstiftning
member: tYmW Y78 yBt
member: v5gC 68g J2R
member: Motorcyklar, reparationsvana
member: Gruvavfall
member: Ålderskontroll
member: Kompensationsodling
member: Repslagning
member: Mästarbrev, timrare
member: Hjärt-kärlsjukdomar, specialistkompetens för fysioterapeuter
member: cGXP
member: Exploratory testing/Utforskande testning
member: Ljusbordsprogrammering
member: rFsK iHo cNt
member: Speldramaturgi
member: m5yx wHx kVR
member: RoHS-direktivet
member: qjsN zZ2 KwE
member: kM3z axv hj1
member: Sömnadsarbeten
member: Utbildning inom okulär farmakologi
member: Reparation av stränginstrument
member: zVBN P7y GNE
member: Certifierad ventilationsrengörare
member: pwNB ces 8hN
member: Advanced-MIRG
member: Certifikat, IPC-specialist på IPC-A-610
member: nze1 zrD 3NS
member: Solfilmsmontering
member: mczu WBE VSW
member: kWzP mt7 77b
member: Materialkunskap, hantverk
member: kzto Ymy cPC
member: Certifierad kostrådgivare
member: Cybersäkerhet, IoT/sakernas Internet
member: Bamboo, byggverktyg
member: Ledbygge, klättring
member: Evenemangssäkerhet
member: Flismaskinskötsel, skogsbruk
member: n5Ww Cc9 xYG
member: Robotsvetsning
member: Mötesadministration
member: Mediepedagogik
member: Trådning
member: qXBs ALp yFY
member: Mästarbrev, installatör - inbrottslarm
member: Textilteknik
member: Fiskerikontroll
member: Brottsutredning
member: Diplomerad solskyddstekniker
member: Energibesiktning
member: Lättbetongarbete
member: EPW, Europeisk plastsvetsare, certifikat
member: Näringslära
member: Brandskyddsmålning
member: Begränsat fartygsbefäl klass VIII, inre fart
member: Nöjesparksarbete
member: yZWG ynW 4iQ
member: xkRd Nex xa2
member: Rådgivning om receptfria läkemedel
member: Mästarbrev, skräddare
member: jSAi QKc JQk
member: Läkemedelsformulering
member: Orgelvård
member: x5PF qFY shE
member: Nätverksprogrammering
member: Biodrivmedel, utveckling
member: EASA-certifikat, kategori B1.2 (flyg kolvmotor)
member: Röjsågskörkort Nivå RB
member: Orofacial medicin, specialistkompetens för tandläkare
member: Dokumenthantering
member: Systematiskt brandskyddsarbete (SBA)
member: Behörighetsbevis enligt FSD 5115, behörighetsklass G
member: Biluthyrning

JobTech Taxonomy - Kompetensgrupp
type: Collection
description: Begrepp av typen 'Kompetensgrupp' (kod 'skill-headline')
member: oLM7 u3d yJ5
member: Sång
member: Integrationsplattformar
member: Applikationsplattformar
member: vSJu K1R wk3
member: Dataundervisning
member: Programvara för digitalt skapande
member: Kommunikationsprotokoll
member: Programmering, CNC-styrsystem
member: wLYs CKS wK8
member: Materialkunskap
member: Hårdvara
member: mTLu uo2 gq2
member: jTAz uCP RNc
member: Spelmotorer
member: Elektronikkompetenser
member: Specialistkompetens för tandläkare
member: Svets-/lödarmetoder med verifierad kunskap
member: Specialistområde för sjuksköterska
member: xKbn JBn EPE
member: Allmänna datakunskaper
member: Dialekt
member: Hänvisningsdatorer
member: xSJR 1Kq pxB
member: Yrkesutbildning
member: kRoQ fPR 8oK
member: Specialistbevis för läkare
member: p1WM wCw LTd
member: Kvalitetssystem
member: Behörigheter, sjöfart
member: jv6G f2M ao5
member: Övriga specialiteter, sjöfart
member: Idrott/aktivitet
member: srsj GQb CE1
member: m7Aj ZBk 1m8
member: s48H Sft DTn
member: Telefonväxlar
member: Databaser
member: Specialistkompetens för psykologer
member: Dans
member: Styr- och utvecklingsmodeller
member: xAWr WYq JPP
member: Transportnätsystem
member: Elbehörigheter
member: zmYu aAM TuF
member: Inriktning på lärarkompetens
member: Mobiltelefonsystem
member: Routingprotokoll
member: Yrkesbevis/examen
member: Inriktning på högskolelärarkompetens
member: Specialistområde för arbetsterapeut
member: Datorspråk
member: Kvalitetsverktyg
member: Yrkesövergripande kompetenser
member: nHDU dpj R9H
member: Programmerings- och systemutvecklingsverktyg
member: on11 B1f LEw
member: Specialistinriktning inom fysioterapi

Kylteknik
type: Concept
in scheme: JobTech Taxonomy - Färdighet
definition: Kylteknik
broader: zmYu aAM TuF
related: K8yg U4C gkY
related: yXbD NTH ijE
related: PRQn 9yw NJA

Stålkonstruktion
type: Concept
in scheme: JobTech Taxonomy - Färdighet
definition: Stålkonstruktion
broader: zmYu aAM TuF
related: mis4 feV uex
related: thZP oR7 WrY
related: w6ud quG dgh
related: 33Nt DSs YYA
related: XeBP nMe pXx

Kärnfysik
type: Concept
in scheme: JobTech Taxonomy - Färdighet
definition: Kärnfysik
broader: zmYu aAM TuF
related: mp2Y vyC RFV
related: KM7d Z6Y LCJ

OOS, styr- och utvecklingsmodell
type: Concept
in scheme: JobTech Taxonomy - Färdighet
definition: OOS, styr- och utvecklingsmodell
alternative label: OOS
broader: Styr- och utvecklingsmodeller
related: cBBa ngH fCx
related: D9SL mtn vGM
related: DJh5 yyF hEM
related: UxT1 tPF Kbg
related: 4Jty HpK a3Q
related: UXKZ 3zZ ipB

Skorstensfejarexamen
type: Concept
in scheme: JobTech Taxonomy - Färdighet
definition: Skorstensfejarexamen är en examen på eftergymnasial nivå kopplad till utbildning med inriktning mot arbete som skorstensfejare.
broader: Yrkesbevis/examen
related: SUfj 4D9 FNx

Omsorgsutbildning/Omvårdnadsutbildning
type: Concept
in scheme: JobTech Taxonomy - Färdighet
definition: Omsorgsutbildning/Omvårdnadsutbildning är gymnasial eller eftergymnasial yrkesinriktad utbildning med inriktning mot arbete inom hälso- och sjukvård.
alternative label: Omsorgsutbildning, Omvårdnadsutbildning
broader: Yrkesbevis/examen
related: jY19 knH MJp
related: LP4Z ABV gRm
related: 7pz9 eY9 D2s
related: tAJS JNb hDH

Naturmedicin
type: Concept
in scheme: JobTech Taxonomy - Färdighet
definition: Naturmedicin
broader: zmYu aAM TuF
related: oXSW fbY XrY
related: YKL2 FCB 1yr
related: F19Z oB6 pg3
related: 85cq 6uK 4cK

Finmekanik
type: Concept
in scheme: JobTech Taxonomy - Färdighet
definition: Finmekanik avser området som omfattar tillverkning, installation, justering och reparation av tekniska och vetenskapliga precisionsinstrument. Kompetensen inkluderar arbete med lås, vapen, hjälpmedel för personer med funktionsnedsättning samt olika typer av inpasseringssystem och ur.
broader: zmYu aAM TuF
related: e6nk AGp y28

2D-grafik-Corel Paint Shop Pro
type: Concept
in scheme: JobTech Taxonomy - Färdighet
definition: 2D-grafik-Corel Paint Shop Pro
broader: Programvara för digitalt skapande
related: 8Bmh vtM zts
related: 34Tn BQQ tfo
related: 4Jty HpK a3Q
related: LeQV umf wUS
related: Mbt6 3ko DiD

Hälsoinformatik
type: Concept
in scheme: JobTech Taxonomy - Färdighet
definition: Hälsoinformatik
broader: zmYu aAM TuF
related: HPxT fQJ zwT
related: womV SEj CAH
related: Z2MZ eYc Lfv
related: nu7c QuB KVQ
related: jv1x tpK 32p
related: 4Jty HpK a3Q
related: 6zAR EHM Kwj

Repro
type: Concept
in scheme: JobTech Taxonomy - Färdighet
definition: Repro
broader: zmYu aAM TuF
related: 4BsK q2C sCL
related: xuSE mtB Mir

Osteologi
type: Concept
in scheme: JobTech Taxonomy - Färdighet
definition: Osteologi
broader: zmYu aAM TuF
related: sXgV QFg vpb

Bower, pakethanterare
type: Concept
in scheme: JobTech Taxonomy - Färdighet
definition: Bower, pakethanterare
alternative label: Bower
broader: Programmerings- och systemutvecklingsverktyg
related: D9SL mtn vGM
related: DJh5 yyF hEM
related: UxT1 tPF Kbg
related: 4Jty HpK a3Q
related: UXKZ 3zZ ipB

Comal, programmeringsspråk
type: Concept
in scheme: JobTech Taxonomy - Färdighet
definition: Comal, programmeringsspråk
broader: Datorspråk
related: DJh5 yyF hEM
related: 4Jty HpK a3Q

Sjukhusstädning
type: Concept
in scheme: JobTech Taxonomy - Färdighet
definition: Sjukhusstädning
broader: zmYu aAM TuF
related: Z6TY xDf Yup

Kalibrering
type: Concept
in scheme: JobTech Taxonomy - Färdighet
definition: Kalibrering avser processen att justera och kontrollera instrument eller system för att säkerställa noggrannhet och precision i mätningar och prestanda. Den involverar jämförelse med standarder eller referensvärden och kan tillämpas inom olika områden såsom elektronik och finmekanik.
broader: zmYu aAM TuF
related: e6nk AGp y28
related: fWrt sLg koW

Barnvagnar/Bilbarnstolar
type: Concept
in scheme: JobTech Taxonomy - Färdighet
definition: Barnvagnar/Bilbarnstolar
alternative label: Barnvagnar
alternative label: Bilbarnstolar
broader: zmYu aAM TuF
related: YKL2 FCB 1yr

Formtillverkning
type: Concept
in scheme: JobTech Taxonomy - Färdighet
definition: Formtillverkning
broader: zmYu aAM TuF
related: o31g CX1 qhQ
related: UcNa inr snV

Arbets- och miljömedicin, specialistkompetens för läkare
type: Concept
in scheme: JobTech Taxonomy - Färdighet
definition: Arbets- och miljömedicin, specialistkompetens för läkare
broader: Specialistbevis för läkare
related: nu7c QuB KVQ

Bluetooth-teknik
type: Concept
in scheme: JobTech Taxonomy - Färdighet
definition: Bluetooth-teknik
broader: Kommunikationsprotokoll
related: BAeH eg8 T2d
related: cBBa ngH fCx
related: nDaB vdy eAy
related: D9SL mtn vGM
related: DJh5 yyF hEM
related: SPYW 7Z1 ShT
related: 4Jty HpK a3Q
related: 13md uyV BNG
related: UXKZ 3zZ ipB
related: MYAz x9m 2LJ

Design/Visualisering-Autodesk 3ds Max Design
type: Concept
in scheme: JobTech Taxonomy - Färdighet
definition: Design/Visualisering-Autodesk 3ds Max Design
alternative label: Design-Autodesk ds Max Design
alternative label: Visualisering-Autodesk ds Max Design
broader: mTLu uo2 gq2
related: DqLe pH6 jyj
related: Q5DF juj 8do
related: K8yg U4C gkY
related: SgNH hag n9D
related: Pd51 xnr KCY
related: PRQn 9yw NJA
related: zfve s6G tpc
related: ETAR ggZ Wuw
related: 41KB bfk 5jR
related: PF4H kQD zpL
related: 4Jty HpK a3Q

Mode, barnkonfektion/Design, barnkonfektion
type: Concept
in scheme: JobTech Taxonomy - Färdighet
definition: Mode, barnkonfektion/Design, barnkonfektion
alternative label: Design, barnkonfektion
alternative label: Mode, barnkonfektion
broader: zmYu aAM TuF
related: PF4H kQD zpL

WAN
type: Concept
in scheme: JobTech Taxonomy - Färdighet
definition: WAN
broader: nHDU dpj R9H
related: 1CX5 mZw Vcq
related: VCpu 5EN bBt
related: DJh5 yyF hEM
related: fWrt sLg koW
related: 4Jty HpK a3Q
related: 13md uyV BNG

Monitor, affärssystem
type: Concept
in scheme: JobTech Taxonomy - Färdighet
definition: Monitor, affärssystem
alternative label: Monitor
broader: xSJR 1Kq pxB
related: eQ4M CNm ozj
related: iWcY mko rq2
related: q81z 3oD 1qu
related: ij8k EwC zyB
related: 4Jty HpK a3Q

Infektionssjukdomar, specialistkompetens för läkare
type: Concept
in scheme: JobTech Taxonomy - Färdighet
definition: Infektionssjukdomar, specialistkompetens för läkare
broader: Specialistbevis för läkare
related: nu7c QuB KVQ

Svagsynsoptik
type: Concept
in scheme: JobTech Taxonomy - Färdighet
definition: Svagsynsoptik
broader: zmYu aAM TuF
related: PUhV DVQ MM6

Arbetssociologi
type: Concept
in scheme: JobTech Taxonomy - Färdighet
definition: Arbetssociologi
broader: zmYu aAM TuF
related: sXgV QFg vpb

Materialplanering, VVS
type: Concept
in scheme: JobTech Taxonomy - Färdighet
definition: Materialplanering, VVS
broader: zmYu aAM TuF
related: thZP oR7 WrY
related: w6ud quG dgh
related: XeBP nMe pXx
related: fLKb bJ3 69p
related: 3UzE P8A 9sS
related: cGxX R9c kW1

ID-märkning med mikrochip
type: Concept
in scheme: JobTech Taxonomy - Färdighet
definition: ID-märkning med mikrochip
broader: zmYu aAM TuF
related: Lrsj wRZ sFV
related: WL4E r4b ek4
related: 4Jty HpK a3Q

Beslutsstödsystem
type: Concept
in scheme: JobTech Taxonomy - Färdighet
definition: Beslutsstödssystem avser IKT-system som används som stöd för företags- eller organisationsbeslut. Källa: ESCO
broader: zmYu aAM TuF
related: Qo7p wjf gtv
related: 4Jty HpK a3Q

Gymnasieutbildning
type: Concept
in scheme: JobTech Taxonomy - Färdighet
definition: Gymnasieutbildning är en högskoleförberedande utbildning eller ett yrkesprogram.
broader: Yrkesbevis/examen
related: XW9L tA9 WaX

Paketsortering
type: Concept
in scheme: JobTech Taxonomy - Färdighet
definition: Paketsortering avser processen att organisera och sortera paket för leverans, vilket omfattar både manuell och maskinell sortering. Kompetensen kräver kunskaper om sorteringssystem och skicklighet i att hantera olika typer av paket för att säkerställa effektiv distribution.
broader: zmYu aAM TuF
related: gaBh 1vR tNE

Maskinbefäl klass III (behörighet)
type: Concept
in scheme: JobTech Taxonomy - Färdighet
definition: Maskinbefäl klass III (behörighet)
broader: Behörigheter, sjöfart
related: Rsoy sS6 6c4

Trafikledning, taxiverksamhet
type: Concept
in scheme: JobTech Taxonomy - Färdighet
definition: Trafikledning, taxiverksamhet
broader: zmYu aAM TuF
related: 4aPu 2nd 8X6

Teatervetenskap
type: Concept
in scheme: JobTech Taxonomy - Färdighet
definition: Teatervetenskap
broader: zmYu aAM TuF
related: iBUL s38 izZ
related: sXgV QFg vpb

Microsoft Autopilot, systemutvecklingsverktyg
type: Concept
in scheme: JobTech Taxonomy - Färdighet
definition: Microsoft Autopilot, systemutvecklingsverktyg
alternative label: Microsoft Autopilot
broader: Programmerings- och systemutvecklingsverktyg
related: DJh5 yyF hEM
related: 4Jty HpK a3Q
related: UXKZ 3zZ ipB

Organisationsteori
type: Concept
in scheme: JobTech Taxonomy - Färdighet
definition: Organisationsteori
broader: zmYu aAM TuF
related: sXgV QFg vpb

Plastmontering
type: Concept
in scheme: JobTech Taxonomy - Färdighet
definition: Plastmontering
broader: zmYu aAM TuF
related: yPQ4 EaN Dtj
related: Kxm9 N3V shF

Verksamhetsledning, hotell- och konferens
type: Concept
in scheme: JobTech Taxonomy - Färdighet
definition: Verksamhetsledning, hotell- och konferens
broader: zmYu aAM TuF
related: eX3C MtJ nPA

Profylaxbehandling
type: Concept
in scheme: JobTech Taxonomy - Färdighet
definition: Profylaxbehandling
broader: zmYu aAM TuF
related: 5dxv nVQ N8o

Tryckfrihetslagstiftningen
type: Concept
in scheme: JobTech Taxonomy - Färdighet
definition: Tryckfrihetslagstiftningen
broader: zmYu aAM TuF
related: br6a VVS V3y
related: DZVN v5g Fco
related: JfYV ZGg 6rm

Övermaskineri
type: Concept
in scheme: JobTech Taxonomy - Färdighet
definition: Övermaskineri
broader: zmYu aAM TuF
related: 4BsK q2C sCL
related: 4Jty HpK a3Q

Gesällbrev, skräddare
type: Concept
in scheme: JobTech Taxonomy - Färdighet
definition: Gesällbrev, skräddare är ett bevis på att en hantverkare har genomgått utbildning och avlagt de delprov som krävs inom det specifika hantverksyrket, och därigenom uppnått ett erkännande av färdigheter och kompetens inom yrket. Utfärdas av Sveriges hantverksråd i samråd med aktuell branschorganisation.
broader: Yrkesbevis/examen
related: mwVN oEH g9k

Bastuba
type: Concept
in scheme: JobTech Taxonomy - Färdighet
definition: Bastuba
broader: wLYs CKS wK8
related: AWJF wqZ va9

Nöjesjournalistik
type: Concept
in scheme: JobTech Taxonomy - Färdighet
definition: Nöjesjournalistik
broader: zmYu aAM TuF
related: SgNH hag n9D

Installationsteknik
type: Concept
in scheme: JobTech Taxonomy - Färdighet
definition: Installationsteknik avser färdigheter och kunskaper inom planering, installation och underhåll av tekniska system och utrustning.
broader: zmYu aAM TuF
related: wCx8 rY3 XUT
related: thZP oR7 WrY
related: w6ud quG dgh
related: 4BsK q2C sCL
related: Cppd 9P7 HeR
related: XeBP nMe pXx
related: KttZ Skc bMR

Konstgrafik
type: Concept
in scheme: JobTech Taxonomy - Färdighet
definition: Konstgrafik
broader: zmYu aAM TuF
related: 34Tn BQQ tfo
related: 4Jty HpK a3Q

Ortodonti/Tandreglering
type: Concept
in scheme: JobTech Taxonomy - Färdighet
definition: Ortodonti, eller tandreglering, är en odontologisk kompetens som fokuserar på att diagnostisera, förebygga och behandla felställningar i tänder och käkar. Behandlingen syftar till att förbättra bettfunktion, estetik och munhälsa genom att stegvis flytta tänder med hjälp av exempelvis tandställningar eller andra ortodontiska apparaturer. Arbetet innefattar planering, genomförande och uppföljning av behandlingar utifrån patientens individuella behov.
broader: zmYu aAM TuF
related: HPxT fQJ zwT
related: 39yB xPQ ozd

Lampskärmssömnad
type: Concept
in scheme: JobTech Taxonomy - Färdighet
definition: Lampskärmssömnad
broader: zmYu aAM TuF
related: UZBj yDX Ctp

HDML, programmeringsspråk
type: Concept
in scheme: JobTech Taxonomy - Färdighet
definition: HDML, programmeringsspråk
alternative label: HDML
broader: Datorspråk
related: BAeH eg8 T2d
related: Fv7d YhP YmS
related: D9SL mtn vGM
related: DJh5 yyF hEM
related: 4Jty HpK a3Q

Handboll, instruktör/Handboll, tränare
type: Concept
in scheme: JobTech Taxonomy - Färdighet
definition: Handboll, instruktör/Handboll, tränare
alternative label: Handboll, instruktör
alternative label: Handboll, tränare
broader: Idrott/aktivitet
related: EA6o N1N QtT

Certifikat, brandfarliga heta arbeten
type: Concept
in scheme: JobTech Taxonomy - Färdighet
definition: Certifikat, brandfarliga heta arbeten Källa: brandfarligaarbeten.se
broader: s48H Sft DTn
related: bZ4J riZ zK6
related: MW1P GNJ 4F9
related: q2Ge zrQ zJb
related: 9mJN VwW Xjg
related: ayQ4 G3W A2w
related: wQ1E Bzk ZyA
related: fLKb bJ3 69p
related: 3UzE P8A 9sS
related: a75S eLg JWH
related: q8Ho 3Xw sHq
related: yyF7 jsW EeP

Parasport, ledarerfarenhet
type: Concept
in scheme: JobTech Taxonomy - Färdighet
definition: Parasport, ledarerfarenhet
broader: zmYu aAM TuF
related: EA6o N1N QtT

Post, sorteringsvana
type: Concept
in scheme: JobTech Taxonomy - Färdighet
definition: Post, sorteringsvana
broader: zmYu aAM TuF
related: gaBh 1vR tNE

Sjukhusfysikerexamen
type: Concept
in scheme: JobTech Taxonomy - Färdighet
definition: Sjukhusfysikerexamen är en yrkesexamen på högskolenivå kopplad till utbildning med inriktning mot sjukhusfysiker.
broader: Yrkesbevis/examen
related: KM7d Z6Y LCJ

Hortonomexamen
type: Concept
in scheme: JobTech Taxonomy - Färdighet
definition: Hortonomexamen
broader: Yrkesbevis/examen
related: XurM DVs ggn
related: yXbD NTH ijE
related: 9QMD sZ3 ZjX

Structural Engineering
type: Concept
in scheme: JobTech Taxonomy - Färdighet
definition: Structural Engineering
broader: zmYu aAM TuF
related: thZP oR7 WrY
related: K8yg U4C gkY
related: XeBP nMe pXx
related: PRQn 9yw NJA

Handgravyr
type: Concept
in scheme: JobTech Taxonomy - Färdighet
definition: Handgravyr avser en hantverksteknik där mönster och bilder graveras direkt på ytor av olika material, oftast metaller eller glas. Denna kompetens inkluderar teknisk skicklighet och precision för att skapa detaljerade och unika designmönster, vilket ofta används inom områden som smyckestillverkning och konsthantverk.
broader: zmYu aAM TuF
related: nwSm phw sPo
related: aKdV u7V R5j

Mansroll
type: Concept
in scheme: JobTech Taxonomy - Färdighet
definition: Mansroll
broader: zmYu aAM TuF
related: iBUL s38 izZ

Fast food/snabbmat
type: Concept
in scheme: JobTech Taxonomy - Färdighet
definition: Fast food avser snabbmat som tillverkas och serveras med fokus på effektivitet och korta väntetider. Kompetensen omfattar kunskaper i tillagning och hantering av livsmedel anpassade för snabbservering, vilket inkluderar en rad yrkesroller inom restaurang- och livsmedelsbranschen.
broader: zmYu aAM TuF
related: BStc SJh DKG
related: s1Qk o98 2o1
related: a8gg ktU w8V
related: tPox ie4 X9X

Pizzabakning
type: Concept
in scheme: JobTech Taxonomy - Färdighet
definition: Pizzabakning avser processen att tillaga pizza genom att förbereda deg, sås och toppings samt baka den i en ugn till önskad konsistens och smak. Kompetensen omfattar kunskaper i ingredienser, tillagningsmetoder och bakningstekniker.
broader: zmYu aAM TuF
related: BStc SJh DKG
related: a8gg ktU w8V

Yrkesbevis, Återvinningsarbetare på ÅVC
type: Concept
in scheme: JobTech Taxonomy - Färdighet
definition: Yrkesbevis, Återvinningsarbetare på ÅVC, avser fördjupade kunskaper och färdigheter i yrkesrollen enligt branschstandard. Kompetensbevis utfärdas av Sobona
broader: s48H Sft DTn
related: X7HR rZK 4wj
related: yXbD NTH ijE

Gummivalsning
type: Concept
in scheme: JobTech Taxonomy - Färdighet
definition: Gummivalsning
broader: zmYu aAM TuF
related: ENV6 BNa brP

Dekorslipning
type: Concept
in scheme: JobTech Taxonomy - Färdighet
definition: Dekorslipning
broader: zmYu aAM TuF
related: aKdV u7V R5j

Reggio Emila-pedagogik, erfarenhet
type: Concept
in scheme: JobTech Taxonomy - Färdighet
definition: Reggio Emila-pedagogik, erfarenhet
broader: zmYu aAM TuF
related: Hi9c iTe gHH
related: XW9L tA9 WaX
related: 5ek3 Cgq WeZ

Arkiv- och informationshantering, erfarenhet
type: Concept
in scheme: JobTech Taxonomy - Färdighet
definition: Samla in, organisera, lagra, tillgängliggöra och skydda information i fysiska arkiv eller digitala system.
broader: zmYu aAM TuF
related: eQ4M CNm ozj
related: wVfo Njx 1rB
related: TQkt eeK eNp
related: SgNH hag n9D
related: Fp7x Yqt bx9
related: eWiB mGP MjE
related: mZsb A1K Gec
related: zKvJ GnC Szx
related: 3i4a Ufc qpp
related: V7Yz 4WV g4z
related: 83wV GJa vMd
related: 4Jty HpK a3Q
related: bExu 8gk azk
related: pok1 ipJ yzD
related: Qbvf 6nd Esn

Järnvägsfrakt
type: Concept
in scheme: JobTech Taxonomy - Färdighet
definition: Järnvägsfrakt
broader: zmYu aAM TuF
related: AuTi FEo j3R
related: nNxJ YWy vR2

Barnsjukvård
type: Concept
in scheme: JobTech Taxonomy - Färdighet
definition: Barnsjukvård avser vård och behandling av sjuka och skadade barn och ungdomar, inklusive akutsjukvård, barnmedicin och barnkirurgi. Denna kompetens omfattar även stöd och vägledning till föräldrar samt genomförande av hälsokontroller för barn, där barnsjuksköterskor och andra vårdpersoner spelar en central roll.
broader: zmYu aAM TuF
related: NFUg y9y 1TY
related: nu7c QuB KVQ
related: ek9W qqp XpF
related: seu9 VoQ VNo
related: LP4Z ABV gRm
related: kHgb AHf vrY
related: gXqW s5Q ZjN
related: 6zAR EHM Kwj
related: Z8ci bBE tmx

Restaurangstädning
type: Concept
in scheme: JobTech Taxonomy - Färdighet
definition: Restaurangstädning
broader: zmYu aAM TuF
related: Z6TY xDf Yup

Mänskliga rättigheter, områdeskunskap
type: Concept
in scheme: JobTech Taxonomy - Färdighet
definition: Mänskliga rättigheter, områdeskunskap
broader: zmYu aAM TuF
related: vPP6 rsw dck

Massaberedning
type: Concept
in scheme: JobTech Taxonomy - Färdighet
definition: Massaberedning
broader: zmYu aAM TuF
related: hxm6 xkr dHm

Mästarbrev, rörinstallatör
type: Concept
in scheme: JobTech Taxonomy - Färdighet
definition: Mästarbrev, rörinstallatör
broader: Yrkesbevis/examen
related: fLKb bJ3 69p

Avfallssortering
type: Concept
in scheme: JobTech Taxonomy - Färdighet
definition: Avfallssortering avser processen att separera olika typer av avfall för att möjliggöra återvinning och korrekt hantering. Denna kompetens inkluderar kunskap om olika materialtyper och de riktlinjer som gäller för sortering och återvinning av avfall.
broader: zmYu aAM TuF
related: X7HR rZK 4wj

Certifikat, sodahusoperatör
type: Concept
in scheme: JobTech Taxonomy - Färdighet
definition: Certifikat, sodahusoperatör
broader: s48H Sft DTn
related: 4obu LL6 RqJ

MFC, programbibliotek
type: Concept
in scheme: JobTech Taxonomy - Färdighet
definition: MFC, programbibliotek
broader: zmYu aAM TuF
related: DJh5 yyF hEM
related: 4Jty HpK a3Q

Fotoetsning
type: Concept
in scheme: JobTech Taxonomy - Färdighet
definition: Fotoetsning
broader: zmYu aAM TuF
related: aKdV u7V R5j

Radarnavigering, erfarenhet
type: Concept
in scheme: JobTech Taxonomy - Färdighet
definition: Radarnavigering, erfarenhet
broader: zmYu aAM TuF
related: EA6o N1N QtT
related: CbQK 7th Tyf
related: aA2Z 9XX R1v
related: 4Jty HpK a3Q

Fartyg, undervisning
type: Concept
in scheme: JobTech Taxonomy - Färdighet
definition: Fartyg, undervisning
broader: zmYu aAM TuF
related: kDnq Q98 sD3

Koreografi, karaktärsdans
type: Concept
in scheme: JobTech Taxonomy - Färdighet
definition: Koreografi, karaktärsdans
broader: zmYu aAM TuF
related: gmRr 7tt eHj

Takrengöring
type: Concept
in scheme: JobTech Taxonomy - Färdighet
definition: Takrengöring är kompetensen att utföra takrengöring på ett effektivt, skonsamt och säkert sätt utifrån takmaterial.
broader: zmYu aAM TuF
related: idjo 2Wr a3E

Hundmassage
type: Concept
in scheme: JobTech Taxonomy - Färdighet
definition: Hundmassage
broader: zmYu aAM TuF
related: MSzH F2n Emb

Språk och språkutveckling, undervisning
type: Concept
in scheme: JobTech Taxonomy - Färdighet
definition: Språk och språkutveckling, undervisning
broader: Inriktning på lärarkompetens
related: 5ek3 Cgq WeZ

Reklamfilm, utformning
type: Concept
in scheme: JobTech Taxonomy - Färdighet
definition: Reklamfilm, utformning
broader: zmYu aAM TuF
related: 8Bmh vtM zts

Bergteknik
type: Concept
in scheme: JobTech Taxonomy - Färdighet
definition: Bergteknik
broader: zmYu aAM TuF
related: rwpH 6RA XTT
related: 4Jty HpK a3Q

Ljudteknik, spelfilm
type: Concept
in scheme: JobTech Taxonomy - Färdighet
definition: Ljudteknik, spelfilm
broader: zmYu aAM TuF
related: 4BsK q2C sCL
related: CkRH 4Qn iX3
related: 4Jty HpK a3Q

Mobiltelefoner
type: Concept
in scheme: JobTech Taxonomy - Färdighet
definition: Mobiltelefoner
broader: zmYu aAM TuF
related: oXSW fbY XrY
related: YKL2 FCB 1yr
related: 85cq 6uK 4cK

Vattenreningsanläggning, underhåll
type: Concept
in scheme: JobTech Taxonomy - Färdighet
definition: Vattenreningsanläggning, underhåll
broader: zmYu aAM TuF
related: Cppd 9P7 HeR

Forensiskt område dokument och handstil
type: Concept
in scheme: JobTech Taxonomy - Färdighet
definition: Kompetensen avser kunskaper om och tillämpning av metoder för analys av dokument och handstil inom brottsutredning. Det innefattar äkthets- och urkundsundersökningar av dokument, pass, sedlar och körkort, samverkan med gränspolisen för gränskontroll, utredning av framställningssätt för handlingar samt jämförande undersökningar av handskriven text.
broader: zmYu aAM TuF
related: vPP6 rsw dck
related: rNcE Zno pD8

Ornament
type: Concept
in scheme: JobTech Taxonomy - Färdighet
definition: Ornament
broader: zmYu aAM TuF
related: 1Nwn GYH wkH

Lagerhanteringsprogram
type: Concept
in scheme: JobTech Taxonomy - Färdighet
definition: Lagerhanteringsprogram avser programvara som används för att effektivt styra och underlätta hantering av lager och varuflöden. Kompetensen innebär att kunna använda dessa system för att registrera, kontrollera och optimera lagerhållning och leveranser, vilket bidrar till en bättre översikt och effektivitet inom lagerverksamheten.
broader: zmYu aAM TuF
related: WhBn FAp ZNW
related: iWcY mko rq2
related: kLyY rwr aJr
related: bwnk nv2 1cR
related: nNxJ YWy vR2
related: 4Jty HpK a3Q

Specialistbehörig inom pedagogisk psykologi
type: Concept
in scheme: JobTech Taxonomy - Färdighet
definition: En specialistbehörighet och en fördjupad specialistkompetens för psykologer inom pedagogisk psykologi.
broader: Specialistkompetens för psykologer
related: VYeq GDF a2g

Försäkringstjänster, produktkunskap
type: Concept
in scheme: JobTech Taxonomy - Färdighet
definition: Försäkringstjänster, produktkunskap avser förståelsen av olika försäkringsprodukter och deras egenskaper, samt de villkor och regler som är kopplade till dessa produkter. Denna kompetens innefattar även förmåga att analysera kunders behov och risker för att kunna rekommendera lämpliga försäkringslösningar.
broader: zmYu aAM TuF
related: Ru4W zn2 LEz
related: 9dLz BCK oDA
related: p16X 44f rwZ

Bokbinderiteknik
type: Concept
in scheme: JobTech Taxonomy - Färdighet
definition: Bokbinderiteknik avser processen och metoderna för att sammanfoga och binda olika typer av trycksaker, såsom böcker, broschyrer och tidskrifter. Kompetensen innefattar både användning av maskiner för bokbindning samt hantverksmässiga tekniker för att säkerställa hållbarhet och kvalitet i slutprodukten.
broader: zmYu aAM TuF
related: mPzg 93F QEv

Undervattenssprängning
type: Concept
in scheme: JobTech Taxonomy - Färdighet
definition: Undervattenssprängning
broader: zmYu aAM TuF
related: DPPw 4wa AsH

Karosseriteknik
type: Concept
in scheme: JobTech Taxonomy - Färdighet
definition: Karosseriteknik avser kompetensen att tillverka, montera och reparera karosser och exteriöra delar på motorfordon. Denna kompetens innefattar arbete med olika material och tekniker för att säkerställa fordonens struktur och utseende.
broader: zmYu aAM TuF
related: Lzpv ofL 3H5
related: L4hA SJP SFi

MicroMore, redovisningssystem
type: Concept
in scheme: JobTech Taxonomy - Färdighet
definition: MicroMore, redovisningssystem
alternative label: MicroMore
broader: xSJR 1Kq pxB
related: eQ4M CNm ozj
related: Y6yY SuR hVh
related: Uw4n UB2 RCW
related: iWcY mko rq2
related: q81z 3oD 1qu
related: cRmd 536 pT1
related: ij8k EwC zyB
related: 4Jty HpK a3Q

Försäkringsjuridik
type: Concept
in scheme: JobTech Taxonomy - Färdighet
definition: Försäkringsjuridik avser det rättsområde som omfattar regler och lagar relaterade till försäkringar, inklusive tillämpningar av civilrätt och speciallagar för både privata och offentliga försäkringssystem.
broader: zmYu aAM TuF
related: Ru4W zn2 LEz
related: ZQiZ 6Kd D3a
related: 9dLz BCK oDA

Elm, programmeringsspråk
type: Concept
in scheme: JobTech Taxonomy - Färdighet
definition: Elm, programmeringsspråk
broader: Datorspråk
related: BAeH eg8 T2d
related: D9SL mtn vGM
related: DJh5 yyF hEM
related: 4Jty HpK a3Q
related: Mbt6 3ko DiD

Utbildning, INSTA 800 (SS627801)
type: Concept
in scheme: JobTech Taxonomy - Färdighet
definition: Utbildning, INSTA 800 (SS627801)
broader: zmYu aAM TuF
related: Z6TY xDf Yup

Kärnborrning
type: Concept
in scheme: JobTech Taxonomy - Färdighet
definition: Kärnborrning
broader: zmYu aAM TuF
related: 7zKm 4NW eey

Reumatologi, specialistkompetens för fysioterapeuter
type: Concept
in scheme: JobTech Taxonomy - Färdighet
definition: Reumatologi, specialistkompetens för fysioterapeuter
broader: Specialistinriktning inom fysioterapi
related: s7vU FhY L5Z

Provtagning, industri
type: Concept
in scheme: JobTech Taxonomy - Färdighet
definition: Provtagning, industri
broader: zmYu aAM TuF
related: yJk6 azD ywF
related: 4obu LL6 RqJ
related: rxmK wwM 1NA
related: Vfum e6B 7Bw
related: 1G6H AuG qyy
related: kF59 fge kts
related: dMVD VYy kgg
related: QEBd qHu vGr
related: icae Y69 H8E
related: gJtZ EBc n2z

Sampling
type: Concept
in scheme: JobTech Taxonomy - Färdighet
definition: Sampling
broader: zmYu aAM TuF
related: 4BsK q2C sCL
related: CkRH 4Qn iX3
related: 4Jty HpK a3Q

Softboll, instruktör/Softboll, tränare
type: Concept
in scheme: JobTech Taxonomy - Färdighet
definition: Softboll, instruktör/Softboll, tränare
alternative label: Softboll, instruktör
alternative label: Softboll, tränare
broader: Idrott/aktivitet
related: EA6o N1N QtT

Konteringsvana
type: Concept
in scheme: JobTech Taxonomy - Färdighet
definition: Konteringsvana
broader: zmYu aAM TuF
related: eQ4M CNm ozj
related: bYde Frc xcB
related: ZQTR hVC QhJ
related: L7eh ihX vM5
related: MGk3 LvL AU2
related: ij8k EwC zyB
related: p16X 44f rwZ

Kategoristyrning
type: Concept
in scheme: JobTech Taxonomy - Färdighet
definition: Kategoristyrning
broader: zmYu aAM TuF
related: 85cq 6uK 4cK

Interface Definition Language, programspråk
type: Concept
in scheme: JobTech Taxonomy - Färdighet
definition: Interface Definition Language, programspråk
broader: Datorspråk
related: DJh5 yyF hEM
related: 4Jty HpK a3Q

Biografmaskinistcertifikat
type: Concept
in scheme: JobTech Taxonomy - Färdighet
definition: Biografmaskinistcertifikat
broader: s48H Sft DTn
related: 9DdK AZY ZNK
related: CkRH 4Qn iX3
related: 4Jty HpK a3Q

Mykologi
type: Concept
in scheme: JobTech Taxonomy - Färdighet
definition: Mykologi
broader: zmYu aAM TuF
related: e9FK VKh ahW

Latex, konst
type: Concept
in scheme: JobTech Taxonomy - Färdighet
definition: Latex, konst
broader: zmYu aAM TuF
related: 34Tn BQQ tfo

Studerandeverksamhet
type: Concept
in scheme: JobTech Taxonomy - Färdighet
definition: Studerandeverksamhet
broader: zmYu aAM TuF
related: vPP6 rsw dck
related: oEmP NC1 sXE

Rulloffsettryckning
type: Concept
in scheme: JobTech Taxonomy - Färdighet
definition: Rulloffsettryckning
broader: zmYu aAM TuF
related: XeJB bkn mRn

Brobyggnad
type: Concept
in scheme: JobTech Taxonomy - Färdighet
definition: Brobyggnad
broader: zmYu aAM TuF
related: bZ4J riZ zK6
related: q2Ge zrQ zJb
related: 9mJN VwW Xjg
related: NnB3 eWH auo

Träteknik
type: Concept
in scheme: JobTech Taxonomy - Färdighet
definition: Träteknik omfattar kompetens inom konstruktion, bearbetning och tillverkning av träprodukter samt användning av trä som material i olika applikationer. Denna kompetens innefattar både teoretisk kunskap och praktiska färdigheter relaterade till träbearbetning, materialegenskaper och tillverkningsprocesser.
broader: zmYu aAM TuF
related: mis4 feV uex
related: VKKg e4t t46
related: UdrS qzV P7i
related: 8ddv P8e iYz
related: 9mJN VwW Xjg
related: v7W3 cLQ q2S
related: XeBP nMe pXx
related: AUs8 M5f dLt

Hårdvara
type: Concept
in scheme: JobTech Taxonomy - Färdighet
top concept of: JobTech Taxonomy - Färdighet
definition: Hårdvara
narrower: urLT mLe FHv
narrower: Skrivare, installation och underhåll
narrower: Bildskärmar, installation och underhåll
narrower: Switchar, installation och underhåll
narrower: q2v1 YcS Dff
narrower: Bildprojektor, installation och underhåll
narrower: Servrar, installation och underhåll
narrower: Router, installation och underhåll
narrower: Scanner, installation och underhåll

Tvätta kläder och textiler
type: Concept
in scheme: JobTech Taxonomy - Färdighet
definition: Tvätta kläder och textiler avser processer för rengöring av kläder och textilier, för att avlägsna smuts, fläckar och obehagliga lukter. Kompetensen omfattar kunskap om olika tvättmetoder och materialvård, inklusive valet av rätt tvättmedel och temperaturer för att säkerställa kvalitet och hållbarhet hos textilier.
broader: zmYu aAM TuF
related: o1gn FoS fB7
related: 4DET dLf iB9

Flygteknik
type: Concept
in scheme: JobTech Taxonomy - Färdighet
definition: Flygteknik avser kunskaper och färdigheter relaterade till konstruktion, analys och underhåll av luftfartyg som flygplan och helikoptrar. Denna kompetens omfattar olika tekniska aspekter såsom felsökning, inspektion och funktionskontroller av luftfartyg.
broader: zmYu aAM TuF
related: K8yg U4C gkY
related: nuXg Wjc JPd
related: PRQn 9yw NJA
related: 4Jty HpK a3Q
related: eRkT cTv H9v

Motorlåsteknik
type: Concept
in scheme: JobTech Taxonomy - Färdighet
definition: Motorlåsteknik
broader: zmYu aAM TuF
related: e6nk AGp y28

Ljudredigeringsprogram, undervisning/Videoredigeringsprogram, undervisning
type: Concept
in scheme: JobTech Taxonomy - Färdighet
definition: Ljudredigeringsprogram, undervisning/Videoredigeringsprogram, undervisning
alternative label: Ljudredigeringsprogram, undervisning
alternative label: Videoredigeringsprogram, undervisning
broader: Dataundervisning
related: 1CX5 mZw Vcq
related: 4Jty HpK a3Q

Flygplatsljus, installation och underhåll
type: Concept
in scheme: JobTech Taxonomy - Färdighet
definition: Flygplatsljus, installation och underhåll
broader: zmYu aAM TuF
related: MW1P GNJ 4F9

Orofacial medicin, specialistkompetens för tandläkare
type: Concept
in scheme: JobTech Taxonomy - Färdighet
definition: Orofacial medicin, specialistkompetens för tandläkare
broader: Specialistkompetens för tandläkare
related: HPxT fQJ zwT

Läkemedelsrådgivning
type: Concept
in scheme: JobTech Taxonomy - Färdighet
definition: Läkemedelsrådgivning
broader: zmYu aAM TuF
related: TMsM oNw j6z
related: XjcN 5LT bWx

Commercial Pilot License/CPL
type: Concept
in scheme: JobTech Taxonomy - Färdighet
definition: Commercial Pilot License/CPL
alternative label: CPL
alternative label: Commercial Pilot License
broader: s48H Sft DTn
related: 7n3y FTE qSe

Fordonsservice, tunga fordon
type: Concept
in scheme: JobTech Taxonomy - Färdighet
definition: Fordonsservice, tunga fordon, avser kompetensen inom underhåll och reparation av tunga motorfordon som lastbilar, bussar, traktorer och entreprenadmaskiner. Denna kompetens innefattar diagnostisering av tekniska fel och utförande av service och reparation på dessa fordon, inklusive hantering av reservdelar och tillbehör.
broader: zmYu aAM TuF
related: Lzpv ofL 3H5

Hyresjuridik
type: Concept
in scheme: JobTech Taxonomy - Färdighet
definition: Hyresjuridik
broader: zmYu aAM TuF
related: U8HK Jdi GuC
related: 4GAs rKs 2Ne
related: X1Ac Y9P PJo

Dörrautomatik, låsteknik
type: Concept
in scheme: JobTech Taxonomy - Färdighet
definition: Dörrautomatik, låsteknik
broader: zmYu aAM TuF
related: e6nk AGp y28
related: 4Jty HpK a3Q

Områdesansvar, äldreomsorg
type: Concept
in scheme: JobTech Taxonomy - Färdighet
definition: Områdesansvar, äldreomsorg
broader: zmYu aAM TuF
related: coyZ Cyv Srw

Nyhetsredaktion
type: Concept
in scheme: JobTech Taxonomy - Färdighet
definition: Nyhetsredaktion
broader: zmYu aAM TuF
related: 4BsK q2C sCL
related: xuSE mtB Mir
related: CkRH 4Qn iX3
related: 3J38 DNz YKK

2D-grafik-CorelDRAW
type: Concept
in scheme: JobTech Taxonomy - Färdighet
definition: 2D-grafik-CorelDRAW
broader: Programvara för digitalt skapande
related: 8Bmh vtM zts
related: 34Tn BQQ tfo
related: 4Jty HpK a3Q
related: LeQV umf wUS
related: Mbt6 3ko DiD

Mopedmotorer, reparationsvana
type: Concept
in scheme: JobTech Taxonomy - Färdighet
definition: Mopedmotorer, reparationsvana avser praktisk kompetens att analysera, underhålla och reparera mopedmotorer. Denna kompetens omfattar kunskap om mopedmotorers konstruktion och funktion samt färdighet i att utföra nödvändiga reparationer och serviceåtgärder.
broader: zmYu aAM TuF
related: Lzpv ofL 3H5

Personaladministration
type: Concept
in scheme: JobTech Taxonomy - Färdighet
definition: Personaladministration
broader: zmYu aAM TuF
related: NQTS fou E6u
related: mNoS AN5 drn
related: NxXz fBh w7j
related: L7eh ihX vM5
related: 7mn2 kA9 ftp
related: Fp7x Yqt bx9
related: bjqk F3A 5Hk
related: 4GAs rKs 2Ne
related: wby2 mwq fWV
related: uxst tkg zDh
related: X1Ac Y9P PJo
related: ij8k EwC zyB

Gjutning, pressteknik
type: Concept
in scheme: JobTech Taxonomy - Färdighet
definition: Gjutning, pressteknik
broader: zmYu aAM TuF
related: J9Vz JxJ Bji

Svenska för invandrare, undervisning
type: Concept
in scheme: JobTech Taxonomy - Färdighet
definition: Svenska för invandrare, undervisning
broader: zmYu aAM TuF
related: mcRJ kq2 jFr

Yrkesutbildning, bryggeritekniker
type: Concept
in scheme: JobTech Taxonomy - Färdighet
definition: Yrkesutbildning, bryggeritekniker är en yrkeshögskoleutbildning med inriktning till byggertitekniker.
broader: Yrkesutbildning
related: icae Y69 H8E

Sopransaxofon
type: Concept
in scheme: JobTech Taxonomy - Färdighet
definition: Sopransaxofon
broader: wLYs CKS wK8
related: AWJF wqZ va9

Harpa, undervisning musikskola
type: Concept
in scheme: JobTech Taxonomy - Färdighet
definition: Harpa, undervisning musikskola
broader: zmYu aAM TuF
related: mcRJ kq2 jFr

Sjukdomar hos gris, specialistkompetens för veterinärer
type: Concept
in scheme: JobTech Taxonomy - Färdighet
definition: En fördjupad specialistkompetens för veterinär inom sjukdomar hos gris.
broader: vSJu K1R wk3
related: WL4E r4b ek4

Industrisömnad
type: Concept
in scheme: JobTech Taxonomy - Färdighet
definition: Industrisömnad avser kompetensen att utföra sömnadsarbeten inom industriell produktion av kläder och andra textilprodukter. Denna kompetens involverar användning av olika symaskiner och tekniker för att sy ihop textilmaterial samt säkerställa att produkterna uppfyller kvalitetsstandarder och produktionskrav.
broader: zmYu aAM TuF
related: skLS kpa Ui1

Hälsojournalistik/Skönhetsjournalistik
type: Concept
in scheme: JobTech Taxonomy - Färdighet
definition: Hälsojournalistik/Skönhetsjournalistik
alternative label: Hälsojournalistik
alternative label: Skönhetsjournalistik
broader: zmYu aAM TuF
related: SgNH hag n9D

Office SharePoint Server (MOSS), applikationsplattform
type: Concept
in scheme: JobTech Taxonomy - Färdighet
definition: Office SharePoint Server (MOSS), applikationsplattform
alternative label: Office SharePoint Server (MOSS)
broader: Applikationsplattformar
related: BAeH eg8 T2d
related: cBBa ngH fCx
related: D9SL mtn vGM
related: DJh5 yyF hEM
related: UxT1 tPF Kbg
related: 4Jty HpK a3Q
related: UXKZ 3zZ ipB
related: MYAz x9m 2LJ

Datakommunikation
type: Concept
in scheme: JobTech Taxonomy - Färdighet
definition: Datakommunikation avser överföring av digital information mellan enheter genom olika kommunikationskanaler och teknologier. Denna kompetens innefattar kunskap om nätverksprotokoll, datakontinuitet och säkerhet för att möjliggöra effektiv och säker kommunikation inom datorsystem och nätverk.
broader: zmYu aAM TuF
related: nDaB vdy eAy
related: SPYW 7Z1 ShT
related: fWrt sLg koW
related: 4Jty HpK a3Q

Motorbranschens yrkesdiplom
type: Concept
in scheme: JobTech Taxonomy - Färdighet
definition: Motorbranschens yrkesdiplom
broader: Yrkesbevis/examen
related: Lzpv ofL 3H5
related: dKUb KBP mw3
related: WhBn FAp ZNW
related: kLyY rwr aJr
related: L4hA SJP SFi

Specialistbehörig inom beroendepsykologi
type: Concept
in scheme: JobTech Taxonomy - Färdighet
definition: En specialistbehörighet och en fördjupad specialistkompetens för psykologer inom beroendepsykologi.
broader: Specialistkompetens för psykologer
related: VYeq GDF a2g

Studieinformation, institution
type: Concept
in scheme: JobTech Taxonomy - Färdighet
definition: Studieinformation, institution avser att ge relevant och korrekt information om studier och utbildningsprogram inom en institution. Detta innefattar kommunikation av detaljer kring kursinnehåll, ansökningsprocesser och studievillkor för att stödja studenter och intressenter i deras utbildningsval.
broader: zmYu aAM TuF
related: ZQTR hVC QhJ
related: oEmP NC1 sXE

Sameslöjd, konsulenterfarenhet
type: Concept
in scheme: JobTech Taxonomy - Färdighet
definition: Sameslöjd, konsulenterfarenhet
broader: zmYu aAM TuF
related: mcRJ kq2 jFr
related: 1CX5 mZw Vcq

Instruktörskurs i medicinsk simulering
type: Concept
in scheme: JobTech Taxonomy - Färdighet
definition: Instruktörskurs i medicinsk simulering
broader: Yrkesbevis/examen
related: NFUg y9y 1TY
related: nu7c QuB KVQ
related: bEDv SL7 VrL
related: 6eAB cbY i9T
related: ek9W qqp XpF
related: PHJN fva yxs
related: seu9 VoQ VNo
related: jY19 knH MJp
related: nrVt xUL KdQ
related: LP4Z ABV gRm
related: 1tGC fXC mxX
related: cuaN Rj5 YCc
related: dyWo sDb MLQ
related: gXqW s5Q ZjN
related: 6zAR EHM Kwj
related: Z8ci bBE tmx

Sömnad
type: Concept
in scheme: JobTech Taxonomy - Färdighet
definition: Sömnad
broader: zmYu aAM TuF
related: PF4H kQD zpL

Ljudteknik, inspelningsstudio
type: Concept
in scheme: JobTech Taxonomy - Färdighet
definition: Ljudteknik, inspelningsstudio
broader: zmYu aAM TuF
related: 4BsK q2C sCL
related: CkRH 4Qn iX3
related: 4Jty HpK a3Q

Rational SoDA, systemutvecklingsverktyg
type: Concept
in scheme: JobTech Taxonomy - Färdighet
definition: Rational SoDA, systemutvecklingsverktyg
alternative label: Rational SoDA
broader: Programmerings- och systemutvecklingsverktyg
related: D9SL mtn vGM
related: DJh5 yyF hEM
related: 4Jty HpK a3Q
related: MYAz x9m 2LJ

Butiksprojektering
type: Concept
in scheme: JobTech Taxonomy - Färdighet
definition: Butiksprojektering
broader: zmYu aAM TuF
related: dUuh wwa FGj

Filmning, dokumentär
type: Concept
in scheme: JobTech Taxonomy - Färdighet
definition: Filmning, dokumentär
broader: zmYu aAM TuF
related: CkRH 4Qn iX3
related: 3J38 DNz YKK
related: 4Jty HpK a3Q

Verksamhetsledning, idrottsanläggning
type: Concept
in scheme: JobTech Taxonomy - Färdighet
definition: Verksamhetsledning, idrottsanläggning
broader: zmYu aAM TuF
related: wby2 mwq fWV

Marknadsundersökningar, statistisk analys
type: Concept
in scheme: JobTech Taxonomy - Färdighet
definition: Marknadsundersökningar, statistisk analys
broader: zmYu aAM TuF
related: 48KE fDE ryL
related: dUuh wwa FGj
related: 83wV GJa vMd
related: 4Jty HpK a3Q

Bogserfartyg
type: Concept
in scheme: JobTech Taxonomy - Färdighet
definition: Bogserfartyg
broader: Övriga specialiteter, sjöfart
related: Rsoy sS6 6c4
related: CbQK 7th Tyf
related: KttZ Skc bMR
related: kDnq Q98 sD3

Operationssjukvård, specialistområde för sjuksköterska
type: Concept
in scheme: JobTech Taxonomy - Färdighet
definition: En fördjupad specialistkompetens för sjuksköterska inom operationssjukvård.
broader: Specialistområde för sjuksköterska
related: PHJN fva yxs
related: cuaN Rj5 YCc
related: dyWo sDb MLQ
related: oj4c P4b cja

Klassisk balett, undervisning
type: Concept
in scheme: JobTech Taxonomy - Färdighet
definition: Klassisk balett, undervisning
broader: zmYu aAM TuF
related: mcRJ kq2 jFr

Dialektisk beteendeterapi/DBT
type: Concept
in scheme: JobTech Taxonomy - Färdighet
definition: Dialektisk beteendeterapi/DBT
alternative label: DBT
alternative label: Dialektisk beteendeterapi
broader: zmYu aAM TuF
related: UUQi UJ5 MSb
related: VYeq GDF a2g

Tjänstemannaavtal
type: Concept
in scheme: JobTech Taxonomy - Färdighet
definition: Tjänstemannaavtal
broader: jv6G f2M ao5
related: mNoS AN5 drn
related: L7eh ihX vM5
related: bjqk F3A 5Hk

Neurosjukvård, specialistområde för sjuksköterska
type: Concept
in scheme: JobTech Taxonomy - Färdighet
definition: En fördjupad specialistkompetens för sjuksköterska inom neurosjukvård.
broader: Specialistområde för sjuksköterska
related: 6zAR EHM Kwj

SO:s grundutbildning
type: Concept
in scheme: JobTech Taxonomy - Färdighet
definition: SO:s grundutbildning
broader: Yrkesbevis/examen
related: ZQiZ 6Kd D3a

Foliering/Wrapping
type: Concept
in scheme: JobTech Taxonomy - Färdighet
definition: Foliering/Wrapping avser tekniken att täcka ytor på fordon, skyltar eller andra objekt med folie, vilket ger en ny estetisk yta eller skyddande lager. Kompetensen omfattar kunskaper i materialval, anpassning och applikation av folier för att uppnå önskade resultat i design och funktionalitet.
alternative label: Foliering
alternative label: Wrapping
broader: zmYu aAM TuF
related: dKUb KBP mw3

XSL, programmeringsspråk
type: Concept
in scheme: JobTech Taxonomy - Färdighet
definition: XSL, programmeringsspråk
alternative label: XSL
broader: Datorspråk
related: BAeH eg8 T2d
related: Fv7d YhP YmS
related: D9SL mtn vGM
related: DJh5 yyF hEM
related: 4Jty HpK a3Q

Inkasso- och kravhanteringsvana
type: Concept
in scheme: JobTech Taxonomy - Färdighet
definition: Inkasso- och kravhanteringsvana
broader: zmYu aAM TuF
related: br6a VVS V3y
related: L7eh ihX vM5
related: q81z 3oD 1qu
related: JAFv ZaP tDG
related: FfMN Bw1 qYR
related: ij8k EwC zyB

Git, versionshanteringssystem
type: Concept
in scheme: JobTech Taxonomy - Färdighet
definition: Git, versionshanteringssystem
alternative label: Git
broader: Programmerings- och systemutvecklingsverktyg
related: D9SL mtn vGM
related: DJh5 yyF hEM
related: 4Jty HpK a3Q
related: MYAz x9m 2LJ

Fordonsinriktning-personbilsteknik, undervisning
type: Concept
in scheme: JobTech Taxonomy - Färdighet
definition: Fordonsinriktning-personbilsteknik, undervisning
broader: Inriktning på lärarkompetens
related: 2x2V UeL 6ke

Kundbemötande och service
type: Concept
in scheme: JobTech Taxonomy - Färdighet
definition: Kundbemötande och service avser interaktionen mellan en företagare och kunder för att skapa en positiv upplevelse och tillfredsställelse. Kompetensen innefattar att förstå och möta kunders behov, hantera frågor och klagomål samt att upprätthålla en professionell och vänlig attityd i alla kontakter.
broader: Yrkesövergripande kompetenser
related: 9DdK AZY ZNK
related: ieVp d5L rS9

Acceleratorfysik
type: Concept
in scheme: JobTech Taxonomy - Färdighet
definition: Acceleratorfysik
broader: zmYu aAM TuF
related: KM7d Z6Y LCJ

Underhållsarbete, VA-nät/Underhållsarbete, gatunät
type: Concept
in scheme: JobTech Taxonomy - Färdighet
definition: Underhållsarbete, VA-nät/Underhållsarbete, gatunät
alternative label: Underhållsarbete, VA-nät
alternative label: Underhållsarbete, gatunät
broader: zmYu aAM TuF
related: bZ4J riZ zK6

Garp, redovisningssystem
type: Concept
in scheme: JobTech Taxonomy - Färdighet
definition: Garp, redovisningssystem
alternative label: Garp
alternative label: Garpkunskaper
alternative label: Redovisningssystemet garp
broader: xSJR 1Kq pxB
related: eQ4M CNm ozj
related: q81z 3oD 1qu
related: ij8k EwC zyB
related: 4Jty HpK a3Q

Skarvisolering
type: Concept
in scheme: JobTech Taxonomy - Färdighet
definition: Skarvisolering
broader: zmYu aAM TuF
related: bZ4J riZ zK6
related: yXbD NTH ijE
related: fLKb bJ3 69p
related: cGxX R9c kW1

Idrottsutrustning, produktkunskap
type: Concept
in scheme: JobTech Taxonomy - Färdighet
definition: Produktkunskap, idrottsutrustning
broader: zmYu aAM TuF
related: oXSW fbY XrY
related: YKL2 FCB 1yr
related: 85cq 6uK 4cK

Speldramaturgi
type: Concept
in scheme: JobTech Taxonomy - Färdighet
definition: Speldramaturgi
broader: zmYu aAM TuF
related: zfve s6G tpc
related: 4Jty HpK a3Q
related: Mbt6 3ko DiD

Parlando, telefonväxel
type: Concept
in scheme: JobTech Taxonomy - Färdighet
definition: Parlando, telefonväxel
broader: Telefonväxlar
related: 4aPu 2nd 8X6
related: ByrL ANp UwV
related: 4Jty HpK a3Q

Amerikansk fotboll, instruktör/Amerikansk fotboll, tränare
type: Concept
in scheme: JobTech Taxonomy - Färdighet
definition: Amerikansk fotboll, instruktör/Amerikansk fotboll, tränare
alternative label: Amerikansk fotboll, instruktör
alternative label: Amerikansk fotboll, tränare
broader: Idrott/aktivitet
related: EA6o N1N QtT

Påläggssvetsning
type: Concept
in scheme: JobTech Taxonomy - Färdighet
definition: Påläggssvetsning avser en metod inom svetsning där ett material, vanligtvis en metalllegering, appliceras på ytan av ett objekt för att förbättra dess egenskaper eller för att reparera skador. Denna kompetens omfattar tekniska färdigheter för att genomföra svetsning med precision så att en stark och hållbar bindning uppnås mellan grundmaterialet och det pålagda materialet, vilket ofta utförs av svetsare och gasskärare.
broader: on11 B1f LEw
related: wQ1E Bzk ZyA

Digitala tekniker inom hantverk
type: Concept
in scheme: JobTech Taxonomy - Färdighet
definition: Digitala tekniker inom hantverk avser användning av digitala verktyg och metoder för att skapa, designa och producera hantverksprodukter. Denna kompetens innefattar förmåga att integrera traditionella hantverkstekniker med digital teknik för att förbättra precision, effektivitet och kreativitet i hantverksprocesser.
broader: zmYu aAM TuF
related: nwSm phw sPo
related: UZBj yDX Ctp
related: mwVN oEH g9k
related: aKdV u7V R5j
related: vJQk YvC XB7
related: 4Jty HpK a3Q
related: vhUJ LyD XWc

Maskinbefäl klass VII, examen
type: Concept
in scheme: JobTech Taxonomy - Färdighet
definition: Maskinbefäl klass VII, examen avser avklarad utbildning på eftergymnasial nivå med inriktning mot arbete som maskinbefäl.
broader: s48H Sft DTn
related: Rsoy sS6 6c4
related: kZwz D8K bKs
related: CbQK 7th Tyf
related: Lm3Z gek GYc
related: FKCE Anf zGH
related: KttZ Skc bMR
related: kDnq Q98 sD3

Instudering, musik/Repertoarkännedom
type: Concept
in scheme: JobTech Taxonomy - Färdighet
definition: Instudering, musik/Repertoarkännedom
alternative label: Instudering, musik, Repertoarkännedom
broader: zmYu aAM TuF
related: AWJF wqZ va9

Vävning
type: Concept
in scheme: JobTech Taxonomy - Färdighet
definition: Vävning avser en teknik inom textilkonst där två eller flera trådar korsas för att skapa tyg eller textilier. Kompetensen omfattar kunskaper om olika vävmetoder, material och verktyg som används i tillverkningsprocessen.
broader: zmYu aAM TuF
related: aKdV u7V R5j

Växthusarbete
type: Concept
in scheme: JobTech Taxonomy - Färdighet
definition: Växthusarbete
broader: zmYu aAM TuF
related: XBh3 Xrm C4R
related: 2xQ4 4kh kTZ

Tillverkningsindustri-I-DEAS
type: Concept
in scheme: JobTech Taxonomy - Färdighet
definition: Tillverkningsindustri-I-DEAS
broader: mTLu uo2 gq2
related: mis4 feV uex
related: xm5G vGn iyk
related: mp2Y vyC RFV
related: 3jEy yuT aVo
related: rwpH 6RA XTT
related: K8yg U4C gkY
related: PRQn 9yw NJA
related: 4Jty HpK a3Q

Zoho Office Suite
type: Concept
in scheme: JobTech Taxonomy - Färdighet
definition: Zoho Office Suite
broader: Allmänna datakunskaper
related: eQ4M CNm ozj
related: Y6yY SuR hVh
related: Uw4n UB2 RCW
related: fdLf oPp wVw
related: vPP6 rsw dck
related: iWcY mko rq2
related: ZQTR hVC QhJ
related: br6a VVS V3y
related: 1CX5 mZw Vcq
related: L7eh ihX vM5
related: MGk3 LvL AU2
related: jJF3 qaQ Zsh
related: oEmP NC1 sXE
related: bjqk F3A 5Hk
related: H2Zj eL9 x28
related: dJXy Rpq a2u
related: pwRH MT1 8nR
related: cRmd 536 pT1
related: zKvJ GnC Szx
related: n6iX f2z XfE
related: DZVN v5g Fco
related: ij8k EwC zyB
related: JfYV ZGg 6rm
related: vCAb uuo ek5
related: 4Jty HpK a3Q
related: p16X 44f rwZ
related: pok1 ipJ yzD

RTOS, operativsystem
type: Concept
in scheme: JobTech Taxonomy - Färdighet
definition: RTOS, operativsystem
alternative label: RTOS
broader: xAWr WYq JPP
related: K8yg U4C gkY
related: nDaB vdy eAy
related: 33Nt DSs YYA
related: SPYW 7Z1 ShT
related: PRQn 9yw NJA
related: 4Jty HpK a3Q
related: Mbt6 3ko DiD

Mammografi
type: Concept
in scheme: JobTech Taxonomy - Färdighet
definition: Mammografi
broader: zmYu aAM TuF
related: 1tGC fXC mxX
related: 4Jty HpK a3Q

Faktalitteratur
type: Concept
in scheme: JobTech Taxonomy - Färdighet
definition: Faktalitteratur
broader: zmYu aAM TuF
related: SgNH hag n9D

Sandspackling-maskinell
type: Concept
in scheme: JobTech Taxonomy - Färdighet
definition: Sandspackling-maskinell
broader: zmYu aAM TuF
related: QKvX v7r PNL

Elektrostålugn
type: Concept
in scheme: JobTech Taxonomy - Färdighet
definition: Elektrostålugn
broader: zmYu aAM TuF
related: E87t egE pjA
related: UcNa inr snV

Luftbehandling
type: Concept
in scheme: JobTech Taxonomy - Färdighet
definition: Luftbehandling
broader: zmYu aAM TuF
related: yXbD NTH ijE
related: fLKb bJ3 69p
related: 3UzE P8A 9sS

Lantbruksekonomi
type: Concept
in scheme: JobTech Taxonomy - Färdighet
definition: Lantbruksekonomi avser kunskap och färdigheter inom ekonomiska aspekter av lantbruksproduktion och verksamhet. Kompetensen innefattar tillämpning av ekonomiska principer för att optimera resurser, kostnader och avkastning i lantbrukets olika områden.
broader: zmYu aAM TuF
related: KYmy iqC xiQ
related: 9QMD sZ3 ZjX
related: k3R3 UkC nK2
related: RYCQ ogb uUY

Teknisk illustration
type: Concept
in scheme: JobTech Taxonomy - Färdighet
definition: Teknisk illustration
broader: zmYu aAM TuF
related: DqLe pH6 jyj

Black Jack, croupierutbildad
type: Concept
in scheme: JobTech Taxonomy - Färdighet
definition: Black Jack, croupierutbildad
broader: Yrkesbevis/examen
related: YHwG fk2 MDL

VPN, privat nätverk
type: Concept
in scheme: JobTech Taxonomy - Färdighet
definition: VPN, privat nätverk
alternative label: VPN
broader: nHDU dpj R9H
related: BAeH eg8 T2d
related: 1CX5 mZw Vcq
related: VCpu 5EN bBt
related: DJh5 yyF hEM
related: 4Jty HpK a3Q
related: 13md uyV BNG

Yrkesbevis, anläggningsdykare
type: Concept
in scheme: JobTech Taxonomy - Färdighet
definition: Yrkesbevis, anläggningsdykare
broader: Yrkesbevis/examen
related: DPPw 4wa AsH

Tillverkning av segel
type: Concept
in scheme: JobTech Taxonomy - Färdighet
definition: Tillverkning av segel
broader: zmYu aAM TuF
related: UZBj yDX Ctp

Familjeterapiutbildning
type: Concept
in scheme: JobTech Taxonomy - Färdighet
definition: Familjeterapiutbildning
broader: Yrkesbevis/examen
related: dJXy Rpq a2u
related: pok1 ipJ yzD

Skorstensmurning
type: Concept
in scheme: JobTech Taxonomy - Färdighet
definition: Skorstensmurning
broader: zmYu aAM TuF
related: NnB3 eWH auo

24Seven Office, affärssystem
type: Concept
in scheme: JobTech Taxonomy - Färdighet
definition: 24Seven Office, affärssystem
alternative label: 24Seven Office
broader: xSJR 1Kq pxB
related: eQ4M CNm ozj
related: iWcY mko rq2
related: q81z 3oD 1qu
related: ij8k EwC zyB
related: 4Jty HpK a3Q

Ateljéfotografering/Studiofotografering
type: Concept
in scheme: JobTech Taxonomy - Färdighet
definition: Ateljéfotografering/Studiofotografering
alternative label: Ateljéfotografering
alternative label: Studiofotografering
broader: zmYu aAM TuF
related: 3J38 DNz YKK

CompTIA Security
type: Concept
in scheme: JobTech Taxonomy - Färdighet
definition: CompTIA Security+
broader: s48H Sft DTn
related: cBBa ngH fCx
related: 4Jty HpK a3Q

Eldfastmurning
type: Concept
in scheme: JobTech Taxonomy - Färdighet
definition: Eldfastmurning
broader: zmYu aAM TuF
related: NnB3 eWH auo

Internetbaserad stöd och behandling
type: Concept
in scheme: JobTech Taxonomy - Färdighet
definition: Internetbaserad stöd och behandling
broader: zmYu aAM TuF
related: BWwk fYX S5B
related: nu7c QuB KVQ
related: bEDv SL7 VrL
related: TPH4 2AM isT
related: VYeq GDF a2g
related: 4Jty HpK a3Q

Testning, mjukvara/Verifiering, mjukvara
type: Concept
in scheme: JobTech Taxonomy - Färdighet
definition: Testning, mjukvara/Verifiering, mjukvara avser processen att utvärdera mjukvaruprodukter för att säkerställa att de uppfyller specifikationer och krav. Denna kompetens innefattar planering, genomförande och dokumentation av tester för att verifiera och validera funktionaliteten hos programvara och system.
alternative label: Testning, mjukvara
alternative label: Verifiering, mjukvara
broader: zmYu aAM TuF
related: K8yg U4C gkY
related: nDaB vdy eAy
related: D9SL mtn vGM
related: DJh5 yyF hEM
related: SPYW 7Z1 ShT
related: PRQn 9yw NJA
related: 4Jty HpK a3Q

Gödslingsmaskin
type: Concept
in scheme: JobTech Taxonomy - Färdighet
definition: Gödslingsmaskin
broader: zmYu aAM TuF
related: KwVo sQu G2e

Överrättstjänstgöring, hovrätt/Överrättstjänstgöring, kammarrätt
type: Concept
in scheme: JobTech Taxonomy - Färdighet
definition: Överrättstjänstgöring, hovrätt/Överrättstjänstgöring, kammarrätt
alternative label: Överrättstjänstgöring, hovrätt
alternative label: Överrättstjänstgöring, kammarrätt
broader: zmYu aAM TuF
related: br6a VVS V3y
related: JfYV ZGg 6rm
related: qsJJ EYo fzA

2D-grafik-GIMP
type: Concept
in scheme: JobTech Taxonomy - Färdighet
definition: 2D-grafik-GIMP
broader: Programvara för digitalt skapande
related: 8Bmh vtM zts
related: 34Tn BQQ tfo
related: 4Jty HpK a3Q
related: LeQV umf wUS
related: Mbt6 3ko DiD

Modern dans, undervisning
type: Concept
in scheme: JobTech Taxonomy - Färdighet
definition: Modern dans, undervisning
broader: zmYu aAM TuF
related: mcRJ kq2 jFr

Stina, resebokningssystem
type: Concept
in scheme: JobTech Taxonomy - Färdighet
definition: Stina, resebokningssystem
alternative label: Stina
broader: kRoQ fPR 8oK
related: fdLf oPp wVw
related: 4Jty HpK a3Q

Gesällbrev, servering
type: Concept
in scheme: JobTech Taxonomy - Färdighet
definition: Gesällbrev, servering
broader: Yrkesbevis/examen
related: UjoW meY Zwt

Arkitekttävlingar
type: Concept
in scheme: JobTech Taxonomy - Färdighet
definition: Arkitekttävlingar
broader: zmYu aAM TuF
related: Pd51 xnr KCY
related: 41KB bfk 5jR

Off-line, videoredigering
type: Concept
in scheme: JobTech Taxonomy - Färdighet
definition: Off-line, videoredigering
broader: zmYu aAM TuF
related: 4BsK q2C sCL
related: CkRH 4Qn iX3
related: 4Jty HpK a3Q

Stämledning, inriktning instrumentalist
type: Concept
in scheme: JobTech Taxonomy - Färdighet
definition: Stämledning, inriktning instrumentalist
broader: zmYu aAM TuF
related: AWJF wqZ va9

Matros (behörighet)
type: Concept
in scheme: JobTech Taxonomy - Färdighet
definition: Matros (behörighet)
broader: Behörigheter, sjöfart
related: CbQK 7th Tyf

Kompetensbevis, industriteknik BAS inriktning underhåll
type: Concept
in scheme: JobTech Taxonomy - Färdighet
definition: Kompetensbevis, industriteknik BAS inriktning underhåll
broader: s48H Sft DTn
related: yJk6 azD ywF
related: YiQw N87 zLU
related: ENV6 BNa brP
related: 4obu LL6 RqJ
related: hxm6 xkr dHm
related: LEvM 7Hs w8i
related: rxmK wwM 1NA
related: Vfum e6B 7Bw
related: VKKg e4t t46
related: UdrS qzV P7i
related: 1G6H AuG qyy
related: vaEp iBS c5h
related: yPQ4 EaN Dtj
related: kF59 fge kts
related: iZLB KpD LLo
related: o31g CX1 qhQ
related: 4DET dLf iB9
related: skLS kpa Ui1
related: aU9p ekE Fqf
related: UcNa inr snV
related: icae Y69 H8E
related: gJtZ EBc n2z
related: AUs8 M5f dLt

Radarsystem, erfarenhet
type: Concept
in scheme: JobTech Taxonomy - Färdighet
definition: Erfarenhet av att använda radarsystem. System som använder radiovågor eller mikrovågor för att registrera ett föremåls hastighet, riktning, avstånd och höjd. Systemen kan användas för detektion av flygplan, fartyg och väderformationer. Källa: ESCO
broader: zmYu aAM TuF
related: LP8B auW wMp
related: K8yg U4C gkY
related: nDaB vdy eAy
related: yct8 Pun DWd
related: Lm3Z gek GYc
related: sXgV QFg vpb
related: SPYW 7Z1 ShT
related: PRQn 9yw NJA
related: V7Yz 4WV g4z
related: 4Jty HpK a3Q

Kristen verksamhet
type: Concept
in scheme: JobTech Taxonomy - Färdighet
definition: Kristen verksamhet avser aktiviteter och organisationer som är kopplade till den kristna tron och dess uttryck. Den omfattar allt från församlingens ledarskap och gudstjänster till undervisning i trosfrågor och själavård.
broader: zmYu aAM TuF
related: 2L2s EU8 PzR
related: x5rn vga gRK

Ledningssystem (ISO 9000-serien)
type: Concept
in scheme: JobTech Taxonomy - Färdighet
definition: Ledningssystem (ISO 9000-serien)
broader: Kvalitetssystem
related: mis4 feV uex
related: xm5G vGn iyk
related: v9nU 6Fw 4Qg
related: Qo7p wjf gtv
related: mNoS AN5 drn
related: qn2U dB9 Cmh
related: mp2Y vyC RFV
related: 3jEy yuT aVo
related: rwpH 6RA XTT
related: K8yg U4C gkY
related: 7mn2 kA9 ftp
related: puim 6PY DGj
related: nDaB vdy eAy
related: D9SL mtn vGM
related: 33Nt DSs YYA
related: rE1E m3d cx1
related: DJh5 yyF hEM
related: SPYW 7Z1 ShT
related: XeBP nMe pXx
related: dMVD VYy kgg
related: PRQn 9yw NJA
related: UxT1 tPF Kbg
related: UXKZ 3zZ ipB

Installation av EU-typgodkända spisar och restaurangapparater för matlagning
type: Concept
in scheme: JobTech Taxonomy - Färdighet
definition: Installation av EU-typgodkända spisar och restaurangapparater för matlagning
broader: s48H Sft DTn
related: KttZ Skc bMR

Utåtagerande beteende, erfarenhet
type: Concept
in scheme: JobTech Taxonomy - Färdighet
definition: Utåtagerande beteende, erfarenhet avser kunskap och praktisk erfarenhet av att hantera och förstå uttryck för utåtagerande beteenden hos individer, särskilt i utbildnings- och stödjande sammanhang. Denna kompetens innebär insikt i beteendemönster och strategier för effektivt bemötande och stödgivning för att främja ett positivt beteendeutveckling.
broader: zmYu aAM TuF
related: Hi9c iTe gHH
related: XW9L tA9 WaX

Andlig repertoar
type: Concept
in scheme: JobTech Taxonomy - Färdighet
definition: Andlig repertoar
broader: p1WM wCw LTd
related: AWJF wqZ va9

ELW, Europeisk lasersvetsspecialist, yrkesdiplom
type: Concept
in scheme: JobTech Taxonomy - Färdighet
definition: ELW, Europeisk lasersvetsspecialist, yrkesdiplom
alternative label: ELW
alternative label: Europeisk lasersvetsspecialist
broader: Svets-/lödarmetoder med verifierad kunskap
related: vaEp iBS c5h

Piano, undervisning musikskola
type: Concept
in scheme: JobTech Taxonomy - Färdighet
definition: Piano, undervisning musikskola
broader: zmYu aAM TuF
related: mcRJ kq2 jFr

WAP-teknik
type: Concept
in scheme: JobTech Taxonomy - Färdighet
definition: WAP-teknik
broader: zmYu aAM TuF
related: Fv7d YhP YmS
related: nDaB vdy eAy
related: VCpu 5EN bBt
related: DJh5 yyF hEM
related: SPYW 7Z1 ShT
related: 4Jty HpK a3Q
related: 13md uyV BNG
related: UXKZ 3zZ ipB

Tillstånd som försäkringsförmedlare
type: Concept
in scheme: JobTech Taxonomy - Färdighet
definition: En svensk försäkringsförmedlare måste ha tillstånd av Finansinspektionen för att bedriva försäkringsdistribution. Ansökan görs hos och tillstånd fås av Finansinspektionen.
broader: s48H Sft DTn
related: 9dLz BCK oDA

Reparationsvana, inredningssnickerier
type: Concept
in scheme: JobTech Taxonomy - Färdighet
definition: Reparationsvana, inredningssnickerier, avser färdighet i att utföra reparationer och underhåll av inredningar och möbler i trä. Kompetensen omfattar teknisk kunskap och praktiska färdigheter för att laga, restaurera och förbättra inredningselement inom olika verksamheter.
broader: zmYu aAM TuF
related: 9mJN VwW Xjg
related: 1Nwn GYH wkH

Kundanalys
type: Concept
in scheme: JobTech Taxonomy - Färdighet
definition: Kundanalys
broader: zmYu aAM TuF
related: oXSW fbY XrY
related: NQTS fou E6u
related: Fu4x 7KG YgC
related: Fp7x Yqt bx9
related: wby2 mwq fWV

Ortopediska inlägg, tillverkning
type: Concept
in scheme: JobTech Taxonomy - Färdighet
definition: Ortopediska inlägg, tillverkning, avser processen att skapa specialanpassade inlägg för skor med syftet att stödja fötter, korrigera olika fotbesvär och förbättra gångfunktion. Denna kompetens innefattar kunskaper om fotens anatomi och biomekanik, samt färdighet i att använda material och tekniska verktyg för att tillverka inlägg som ger optimal komfort och funktionalitet.
broader: zmYu aAM TuF
related: vJQk YvC XB7

Sömsvetsning
type: Concept
in scheme: JobTech Taxonomy - Färdighet
definition: Vid sömsvetsning har man ersatt de stavformiga elektroderna, som används vid punktsvetsning, med elektrodrullar. Mellan dessa matas arbetsstyckena fram under tryck. Elektrodrullarna ligger an mot arbetsstycket under hela svetsförloppet. Källa: Svetskommissionen
broader: on11 B1f LEw
related: wQ1E Bzk ZyA
related: L4hA SJP SFi

Doktorsexamen, kemiämnen
type: Concept
in scheme: JobTech Taxonomy - Färdighet
definition: Doktorsexamen, kemiämnen
broader: Yrkesbevis/examen
related: Gm5j S2Y aTB
related: cYCo PxY zQd

Krediträtt
type: Concept
in scheme: JobTech Taxonomy - Färdighet
definition: Krediträtt
broader: zmYu aAM TuF
related: br6a VVS V3y
related: DZVN v5g Fco
related: JfYV ZGg 6rm

A-ljud
type: Concept
in scheme: JobTech Taxonomy - Färdighet
definition: A-ljud
broader: zmYu aAM TuF
related: 4BsK q2C sCL
related: CkRH 4Qn iX3
related: 4Jty HpK a3Q

Rostfria stål och andra legerade stål, materialkunskap svets
type: Concept
in scheme: JobTech Taxonomy - Färdighet
definition: Rostfria stål och andra legerade stål, materialkunskap svets
broader: Materialkunskap
related: wQ1E Bzk ZyA

Utbildningsintyg, betongpump
type: Concept
in scheme: JobTech Taxonomy - Färdighet
definition: Utbildningsintyg, betongpump
broader: Yrkesbevis/examen
related: 3MBw pDA P2F

Utbildningsbevis, industriisolerare
type: Concept
in scheme: JobTech Taxonomy - Färdighet
definition: Utbildningsbevis, industriisolerare
broader: Yrkesbevis/examen
related: yXbD NTH ijE
related: cGxX R9c kW1

Förarbevis (inkl Klass I)
type: Concept
in scheme: JobTech Taxonomy - Färdighet
definition: Förarbevis (inkl Klass I)
broader: s48H Sft DTn
related: f71c gjL RDq

Koreografi, klassisk balett
type: Concept
in scheme: JobTech Taxonomy - Färdighet
definition: Koreografi, klassisk balett
broader: zmYu aAM TuF
related: gmRr 7tt eHj

Flamencodans, undervisning
type: Concept
in scheme: JobTech Taxonomy - Färdighet
definition: Flamencodans, undervisning
broader: zmYu aAM TuF
related: mcRJ kq2 jFr

Bilning
type: Concept
in scheme: JobTech Taxonomy - Färdighet
definition: Bilning
broader: zmYu aAM TuF
related: bZ4J riZ zK6
related: q2Ge zrQ zJb
related: AD3U cFH rbe
related: iHrC aRv fVm

Movex, affärssystem
type: Concept
in scheme: JobTech Taxonomy - Färdighet
definition: Movex, affärssystem
alternative label: Affärssystemet movex
alternative label: Movex
alternative label: Movexkunskaper
broader: xSJR 1Kq pxB
related: eQ4M CNm ozj
related: Y6yY SuR hVh
related: Uw4n UB2 RCW
related: iWcY mko rq2
related: q81z 3oD 1qu
related: cRmd 536 pT1
related: ij8k EwC zyB
related: 4Jty HpK a3Q

Lärarexamen mot fritidshem
type: Concept
in scheme: JobTech Taxonomy - Färdighet
definition: Lärarexamen mot fritidshem
broader: Yrkesbevis/examen
related: CFW8 eBa NaV

Relining, tätningsmetod
type: Concept
in scheme: JobTech Taxonomy - Färdighet
definition: Relining, tätningsmetod
broader: zmYu aAM TuF
related: fLKb bJ3 69p
related: 3UzE P8A 9sS

Ekologisk produktion
type: Concept
in scheme: JobTech Taxonomy - Färdighet
definition: Ekologisk produktion
broader: zmYu aAM TuF
related: XurM DVs ggn
related: KYmy iqC xiQ
related: yXbD NTH ijE
related: k3R3 UkC nK2
related: 3LdB WEJ 8Ms

Skyltmontering
type: Concept
in scheme: JobTech Taxonomy - Färdighet
definition: Skyltmontering avser installation och placering av skyltar på olika ytor, såsom fasader och tak. Kompetensen innefattar kunskap om material, verktyg och tekniker för att säkerställa korrekt och hållbar montering av skyltar.
alternative label: Skyltmontage
broader: zmYu aAM TuF
related: HXzD qvt HV6

Relationsmarknadsföring
type: Concept
in scheme: JobTech Taxonomy - Färdighet
definition: Relationsmarknadsföring
broader: zmYu aAM TuF
related: WX67 Pfb WMN

Asset Information Management
type: Concept
in scheme: JobTech Taxonomy - Färdighet
definition: Asset Information Management
broader: zmYu aAM TuF
related: UXKZ 3zZ ipB

Zoobutiksdjur
type: Concept
in scheme: JobTech Taxonomy - Färdighet
definition: Zoobutiksdjur
broader: zmYu aAM TuF
related: YKL2 FCB 1yr

Textning
type: Concept
in scheme: JobTech Taxonomy - Färdighet
definition: Textning
broader: zmYu aAM TuF
related: 4Jty HpK a3Q
related: CSUf ZVM a7Z

Borrkort
type: Concept
in scheme: JobTech Taxonomy - Färdighet
definition: Borrkort
broader: s48H Sft DTn
related: f71c gjL RDq

Veterinärmedicin, specialistkompetens för fysioterapeuter
type: Concept
in scheme: JobTech Taxonomy - Färdighet
definition: Veterinärmedicin, specialistkompetens för fysioterapeuter
broader: Specialistinriktning inom fysioterapi
related: s7vU FhY L5Z

Bebop
type: Concept
in scheme: JobTech Taxonomy - Färdighet
definition: Bebop
broader: p1WM wCw LTd
related: AWJF wqZ va9

Tankoperativ kurs, kem
type: Concept
in scheme: JobTech Taxonomy - Färdighet
definition: Tankoperativ kurs, kem
broader: s48H Sft DTn
related: Rsoy sS6 6c4
related: kZwz D8K bKs
related: kDnq Q98 sD3

Rättsodontologi
type: Concept
in scheme: JobTech Taxonomy - Färdighet
definition: Rättsodontologi
broader: zmYu aAM TuF
related: HPxT fQJ zwT

Byggkonstruktion-IMPACT Reinforcement
type: Concept
in scheme: JobTech Taxonomy - Färdighet
definition: Byggkonstruktion-IMPACT Reinforcement
broader: mTLu uo2 gq2
related: thZP oR7 WrY
related: w6ud quG dgh
related: Pd51 xnr KCY
related: XeBP nMe pXx
related: ETAR ggZ Wuw
related: 41KB bfk 5jR
related: 4Jty HpK a3Q

Gesällbrev, glashantverksyrken
type: Concept
in scheme: JobTech Taxonomy - Färdighet
definition: Gesällbrev, glashantverksyrken är ett bevis på att en hantverkare har genomgått utbildning och avlagt de delprov som krävs inom det specifika hantverksyrket, och därigenom uppnått ett erkännande av färdigheter och kompetens inom yrket. Utfärdas av Sveriges hantverksråd i samråd med aktuell branschorganisation.
broader: Yrkesbevis/examen
related: aKdV u7V R5j

Brokkmaskin
type: Concept
in scheme: JobTech Taxonomy - Färdighet
definition: Brokkmaskin
broader: zmYu aAM TuF
related: AD3U cFH rbe
related: iHrC aRv fVm

Energiskog
type: Concept
in scheme: JobTech Taxonomy - Färdighet
definition: Energiskog
broader: zmYu aAM TuF
related: KwVo sQu G2e
related: yXbD NTH ijE

Oracle Forms, programmeringsverktyg
type: Concept
in scheme: JobTech Taxonomy - Färdighet
definition: Oracle Forms, programmeringsverktyg
alternative label: Oracle Forms
alternative label: Oracle-kunskaper
alternative label: Oraclekunskap
alternative label: Oracleutveckling
broader: Programmerings- och systemutvecklingsverktyg
related: D9SL mtn vGM
related: DJh5 yyF hEM
related: 4Jty HpK a3Q
related: MYAz x9m 2LJ

Hantering av farligt avfall
type: Concept
in scheme: JobTech Taxonomy - Färdighet
definition: Hantering av farligt avfall avser processen för insamling, transport, lagring och bortskaffande av avfall som kan utgöra risker för människors hälsa eller miljön. Denna kompetens involverar kunskaper om regler och rutiner för säker hantering av farliga ämnen och avfall.
broader: zmYu aAM TuF
related: idjo 2Wr a3E
related: X7HR rZK 4wj
related: yXbD NTH ijE
related: Cppd 9P7 HeR

HTTP/HTTPS, kommunikationsprotokoll
type: Concept
in scheme: JobTech Taxonomy - Färdighet
definition: HTTP/HTTPS, kommunikationsprotokoll
alternative label: HTTP/HTTPS
broader: Kommunikationsprotokoll
related: BAeH eg8 T2d
related: cBBa ngH fCx
related: Fv7d YhP YmS
related: D9SL mtn vGM
related: VCpu 5EN bBt
related: DJh5 yyF hEM
related: 4Jty HpK a3Q
related: 13md uyV BNG
related: UXKZ 3zZ ipB
related: MYAz x9m 2LJ

AbiWord
type: Concept
in scheme: JobTech Taxonomy - Färdighet
definition: AbiWord
broader: Allmänna datakunskaper
related: eQ4M CNm ozj
related: Y6yY SuR hVh
related: Uw4n UB2 RCW
related: fdLf oPp wVw
related: vPP6 rsw dck
related: iWcY mko rq2
related: ZQTR hVC QhJ
related: br6a VVS V3y
related: 1CX5 mZw Vcq
related: L7eh ihX vM5
related: MGk3 LvL AU2
related: jJF3 qaQ Zsh
related: oEmP NC1 sXE
related: bjqk F3A 5Hk
related: H2Zj eL9 x28
related: dJXy Rpq a2u
related: pwRH MT1 8nR
related: cRmd 536 pT1
related: zKvJ GnC Szx
related: n6iX f2z XfE
related: DZVN v5g Fco
related: ij8k EwC zyB
related: JfYV ZGg 6rm
related: vCAb uuo ek5
related: 4Jty HpK a3Q
related: p16X 44f rwZ
related: pok1 ipJ yzD

Eiffel, programmeringsspråk
type: Concept
in scheme: JobTech Taxonomy - Färdighet
definition: Eiffel, programmeringsspråk
alternative label: Eiffel
broader: Datorspråk
related: BAeH eg8 T2d
related: Fv7d YhP YmS
related: D9SL mtn vGM
related: DJh5 yyF hEM
related: 4Jty HpK a3Q

Sun Java Enterprise System, webbserverprogram
type: Concept
in scheme: JobTech Taxonomy - Färdighet
definition: Sun Java Enterprise System, webbserverprogram
alternative label: Java-utveckling
alternative label: Javakompetens
alternative label: Javakunskap
alternative label: Javautveckling
alternative label: Sun Java Enterprise System
broader: Applikationsplattformar
related: BAeH eg8 T2d
related: cBBa ngH fCx
related: D9SL mtn vGM
related: DJh5 yyF hEM
related: UxT1 tPF Kbg
related: 4Jty HpK a3Q
related: UXKZ 3zZ ipB
related: MYAz x9m 2LJ

Lastbilsmonterad kran < 18 ton/m
type: Concept
in scheme: JobTech Taxonomy - Färdighet
definition: Lastbilsmonterad kran < 18 ton/m
broader: zmYu aAM TuF
related: 3MBw pDA P2F

Hushållslärarexamen
type: Concept
in scheme: JobTech Taxonomy - Färdighet
definition: Hushållslärarexamen
broader: Yrkesbevis/examen
related: oQUQ D11 HPx

Tenorsaxofon
type: Concept
in scheme: JobTech Taxonomy - Färdighet
definition: Tenorsaxofon
broader: wLYs CKS wK8
related: AWJF wqZ va9

IBM Integration Bus
type: Concept
in scheme: JobTech Taxonomy - Färdighet
definition: IBM Integration Bus
broader: Integrationsplattformar
related: BAeH eg8 T2d
related: cBBa ngH fCx
related: D9SL mtn vGM
related: DJh5 yyF hEM
related: 4Jty HpK a3Q
related: UXKZ 3zZ ipB
related: MYAz x9m 2LJ

Industriella styrsystem
type: Concept
in scheme: JobTech Taxonomy - Färdighet
definition: Industriella styrsystem avser system och teknologier som används för att övervaka och styra industriella processer och maskiner. Kompetensen omfattar förståelse för både hårdvara och mjukvara som är involverad i automatisering och reglering av produktionsflöden inom olika branscher.
broader: zmYu aAM TuF
related: nDaB vdy eAy
related: SPYW 7Z1 ShT
related: 4Jty HpK a3Q

Community management
type: Concept
in scheme: JobTech Taxonomy - Färdighet
definition: Community management
broader: zmYu aAM TuF
related: Pz9M srJ Lc9
related: k1Nx auG sNh
related: 4Jty HpK a3Q

Trafikundervisning, lastbil
type: Concept
in scheme: JobTech Taxonomy - Färdighet
definition: Trafikundervisning, lastbil
broader: zmYu aAM TuF
related: nuXg Wjc JPd
related: yVZH zHh 6fG

Taktil stimulering
type: Concept
in scheme: JobTech Taxonomy - Färdighet
definition: Taktil stimulering
alternative label: Taktilterapi
broader: zmYu aAM TuF
related: sq3e WVv Fjd
related: jY19 knH MJp
related: F19Z oB6 pg3
related: tAJS JNb hDH

Glaskonst
type: Concept
in scheme: JobTech Taxonomy - Färdighet
definition: Glaskonst
broader: zmYu aAM TuF
related: 34Tn BQQ tfo
related: PF4H kQD zpL

Waldorfförskola, erfarenhet
type: Concept
in scheme: JobTech Taxonomy - Färdighet
definition: Waldorfförskola, erfarenhet
broader: zmYu aAM TuF
related: Hi9c iTe gHH

Modellarbeten, skrädderi
type: Concept
in scheme: JobTech Taxonomy - Färdighet
definition: Modellarbeten, skrädderi
broader: zmYu aAM TuF
related: mwVN oEH g9k

Grovplåtslageri
type: Concept
in scheme: JobTech Taxonomy - Färdighet
definition: Grovplåtslageri avser processen att tillverka och montera detaljer av grovplåt för användning i byggnads- och konstruktionsarbeten. Denna kompetens omfattar även reparation och uppförande av tunga metallbalkar och plåtar i stålkonstruktioner och ställningar.
broader: zmYu aAM TuF
related: TrwQ RXT W8a

Lagerhållning
type: Concept
in scheme: JobTech Taxonomy - Färdighet
definition: Lagerhållning avser processen att hantera och organisera lagret av varor och produkter inom ett företag. Kompetensen innefattar kunskap om lagerföring, inventering och distribution av varor för att säkerställa effektivitet och korrekt hantering av lagerresurser.
broader: Yrkesövergripande kompetenser
related: Lzpv ofL 3H5

Termissionsmätning
type: Concept
in scheme: JobTech Taxonomy - Färdighet
definition: Termissionsmätning
broader: zmYu aAM TuF
related: MW1P GNJ 4F9

Växtfysiologi
type: Concept
in scheme: JobTech Taxonomy - Färdighet
definition: Växtfysiologi
broader: zmYu aAM TuF
related: yXbD NTH ijE
related: dsK3 hkt zGy
related: e9FK VKh ahW

Möbelvärdering
type: Concept
in scheme: JobTech Taxonomy - Färdighet
definition: Möbelvärdering
broader: zmYu aAM TuF
related: Ru4W zn2 LEz
related: dUuh wwa FGj

Miljöledning (ISO 14000-serien)
type: Concept
in scheme: JobTech Taxonomy - Färdighet
definition: Miljöledning (ISO 14000-serien)
broader: Kvalitetssystem
related: mis4 feV uex
related: xm5G vGn iyk
related: v9nU 6Fw 4Qg
related: Qo7p wjf gtv
related: qn2U dB9 Cmh
related: mp2Y vyC RFV
related: 3jEy yuT aVo
related: rwpH 6RA XTT
related: thZP oR7 WrY
related: K8yg U4C gkY
related: 7mn2 kA9 ftp
related: puim 6PY DGj
related: nDaB vdy eAy
related: 33Nt DSs YYA
related: rE1E m3d cx1
related: yXbD NTH ijE
related: SPYW 7Z1 ShT
related: XeBP nMe pXx
related: dMVD VYy kgg
related: PRQn 9yw NJA
related: 4Jty HpK a3Q

Bettfysiologi, specialisering tandteknik
type: Concept
in scheme: JobTech Taxonomy - Färdighet
definition: Bettfysiologi, specialisering tandteknik
broader: zmYu aAM TuF
related: 39yB xPQ ozd

Guld, specialisering tandteknik
type: Concept
in scheme: JobTech Taxonomy - Färdighet
definition: Guld, specialisering tandteknik
broader: zmYu aAM TuF
related: 39yB xPQ ozd

Dövblindtolkning
type: Concept
in scheme: JobTech Taxonomy - Färdighet
definition: Dövblindtolkning
broader: zmYu aAM TuF
related: PQDm Z63 zst

Projektledning, erfarenhet
type: Concept
in scheme: JobTech Taxonomy - Färdighet
definition: Projektledning, erfarenhet, avser förmågan att leda, planera och genomföra projekt inom olika branscher och sammanhang. Kompetensen omfattar kunskap om projektets livscykel, resurshantering, tidsplanering och riskhantering, samt förmåga att kommunicera effektivt med projektteam och intressenter.
broader: Yrkesövergripande kompetenser
related: Qo7p wjf gtv
related: nDaB vdy eAy
related: AuTi FEo j3R
related: SPYW 7Z1 ShT

Kandidatexamen i skådespeleri
type: Concept
in scheme: JobTech Taxonomy - Färdighet
definition: Kandidatexamen i skådespeleri
broader: Yrkesbevis/examen
related: iBUL s38 izZ

Magnetisk resonanstomografi/MRT
type: Concept
in scheme: JobTech Taxonomy - Färdighet
definition: Magnetisk resonanstomografi/MRT
alternative label: MRT
alternative label: Magnetisk resonanstomografi
broader: zmYu aAM TuF
related: 1tGC fXC mxX
related: 4Jty HpK a3Q

Basun
type: Concept
in scheme: JobTech Taxonomy - Färdighet
definition: Basun
broader: wLYs CKS wK8
related: AWJF wqZ va9

Ställverk, installation och underhåll
type: Concept
in scheme: JobTech Taxonomy - Färdighet
definition: Ställverk, installation och underhåll
broader: zmYu aAM TuF
related: MW1P GNJ 4F9
related: nDaB vdy eAy

Försäljningsvana, auktionsförsäljning
type: Concept
in scheme: JobTech Taxonomy - Färdighet
definition: Försäljningsvana, auktionsförsäljning avser färdigheter och erfarenheter kopplade till försäljning av varor eller fast egendom genom auktioner. Denna kompetens innefattar kunskap om auktionsprocesser, förmåga att förhandla och hantera engagemang, samt förståelse för marknadsdynamik inom auktionsförsäljning.
broader: zmYu aAM TuF
related: dUuh wwa FGj

Byggnation av orgelhus
type: Concept
in scheme: JobTech Taxonomy - Färdighet
definition: Byggnation av orgelhus avser processen att konstruera och montera hus för orglar, vilket inkluderar design, materialval och tekniska aspekter. Kompetensen innefattar kunskap om akustik och traditionella hantverkstekniker som används inom musikinstrumenttillverkning, speciellt kopplat till orglar.
broader: zmYu aAM TuF
related: aKdV u7V R5j

Entomologi
type: Concept
in scheme: JobTech Taxonomy - Färdighet
definition: Entomologi
broader: zmYu aAM TuF
related: e9FK VKh ahW

Försäkringsadministration
type: Concept
in scheme: JobTech Taxonomy - Färdighet
definition: Försäkringsadministration innebär att hantera och registrera försäkringsärenden, dokumentera avtal och förändringar samt löpande uppdatera kundinformation och försäkringsuppgifter i digitala system. Arbetsuppgifterna omfattar handläggning av nyteckning och ändringar av försäkringar, in- och utflytt av kapital, diarieföring, koordination med försäkringsbolag och stöd till kundservice.
broader: zmYu aAM TuF
related: 9dLz BCK oDA
related: p16X 44f rwZ

Glasblåsning
type: Concept
in scheme: JobTech Taxonomy - Färdighet
definition: Glasblåsning avser en hantverksteknik där smält glas formes genom att blåsa luft i en glassfär, vilket skapar olika former och objekt. Kompetensen involverar kunskaper om glasets egenskaper, temperaturhantering och metodik för att skapa såväl funktionella som dekorativa föremål.
broader: zmYu aAM TuF
related: aKdV u7V R5j

KBT, samtalsterapi
type: Concept
in scheme: JobTech Taxonomy - Färdighet
definition: KBT, samtalsterapi, avser en form av psykoterapi som fokuserar på att förändra negativa tankemönster och beteenden genom strukturerade samtal. Kompetensen inkluderar metoder och strategier för att stödja individer i att hantera psykologiska utmaningar och förbättra mental hälsa.
broader: zmYu aAM TuF
related: BWwk fYX S5B
related: dJXy Rpq a2u
related: UUQi UJ5 MSb
related: VYeq GDF a2g

Datorlingvistik
type: Concept
in scheme: JobTech Taxonomy - Färdighet
definition: Datorlingvistik
broader: zmYu aAM TuF
related: UxT1 tPF Kbg
related: 4Jty HpK a3Q

Mat- och menykunskap
type: Concept
in scheme: JobTech Taxonomy - Färdighet
definition: Mat- och menykunskap avser kunskap om olika typer av maträtter, ingredienser, tillagningsmetoder och menyer inom restaurang- och livsmedelsbranschen. Denna kompetens omfattar förmågan att förstå och förmedla information om matens ursprung, smakprofiler och presentation, vilket är centralt för yrken som kockar, kallskänkor, hovmästare och servitörer.
broader: zmYu aAM TuF
related: BStc SJh DKG
related: UjoW meY Zwt

Takläggning
type: Concept
in scheme: JobTech Taxonomy - Färdighet
definition: Takläggning
broader: zmYu aAM TuF
related: 3g5x Tm7 8QH
related: 9mJN VwW Xjg

Enklare fordonsservice
type: Concept
in scheme: JobTech Taxonomy - Färdighet
definition: Enklare fordonsservice avser grundläggande underhåll och reparation av fordon, vilket kan inkludera åtgärder som oljebyten, däckbyte och enklare reparationer. Kompetensen innefattar kunskap om fordonets system och komponenter samt praktiska färdigheter för att genomföra serviceåtgärder på ett säkert och effektivt sätt.
broader: zmYu aAM TuF
related: FjdF H2e tAG

Havsfiske
type: Concept
in scheme: JobTech Taxonomy - Färdighet
definition: Havsfiske
broader: zmYu aAM TuF
related: XurM DVs ggn
related: Lm3Z gek GYc

Borrning, CNC
type: Concept
in scheme: JobTech Taxonomy - Färdighet
definition: Borrning, CNC
broader: zmYu aAM TuF
related: VKKg e4t t46
related: vaEp iBS c5h
related: 4Jty HpK a3Q

Simultantolkning
type: Concept
in scheme: JobTech Taxonomy - Färdighet
definition: Simultantolkning
broader: zmYu aAM TuF
related: PQDm Z63 zst

Galvanisering
type: Concept
in scheme: JobTech Taxonomy - Färdighet
definition: Galvanisering
broader: zmYu aAM TuF
related: YiQw N87 zLU

Hopsättning, gummi
type: Concept
in scheme: JobTech Taxonomy - Färdighet
definition: Hopsättning, gummi
broader: zmYu aAM TuF
related: Kxm9 N3V shF

Militär vädertjänst
type: Concept
in scheme: JobTech Taxonomy - Färdighet
definition: Militär vädertjänst
broader: zmYu aAM TuF
related: LP8B auW wMp
related: 4Jty HpK a3Q

Barndans, undervisning
type: Concept
in scheme: JobTech Taxonomy - Färdighet
definition: Barndans, undervisning
broader: zmYu aAM TuF
related: mcRJ kq2 jFr

Ljussättning, scenproduktion
type: Concept
in scheme: JobTech Taxonomy - Färdighet
definition: Ljussättning, scenproduktion
broader: zmYu aAM TuF
related: 4BsK q2C sCL
related: CkRH 4Qn iX3

IFU-diplom, skadereglerare
type: Concept
in scheme: JobTech Taxonomy - Färdighet
definition: IFU-diplom, skadereglerare
broader: Yrkesbevis/examen
related: Ru4W zn2 LEz

Kärnavfallshantering
type: Concept
in scheme: JobTech Taxonomy - Färdighet
definition: Kärnavfallshantering
broader: zmYu aAM TuF
related: yXbD NTH ijE
related: KM7d Z6Y LCJ

Läkemedelsteknik
type: Concept
in scheme: JobTech Taxonomy - Färdighet
definition: Läkemedelsteknik
broader: zmYu aAM TuF
related: v9nU 6Fw 4Qg
related: qn2U dB9 Cmh
related: 4Jty HpK a3Q
related: bExu 8gk azk

Arbetsrättsliga frågor
type: Concept
in scheme: JobTech Taxonomy - Färdighet
definition: Arbetsrättsliga frågor
broader: zmYu aAM TuF
related: Qo7p wjf gtv
related: mNoS AN5 drn
related: vPP6 rsw dck
related: L7eh ihX vM5
related: ZQiZ 6Kd D3a

Grekiska, cirkelledning
type: Concept
in scheme: JobTech Taxonomy - Färdighet
definition: Grekiska, cirkelledning
broader: zmYu aAM TuF
related: 1CX5 mZw Vcq

Tjänstgöring gastankfartyg
type: Concept
in scheme: JobTech Taxonomy - Färdighet
definition: Tjänstgöring gastankfartyg
broader: s48H Sft DTn
related: Rsoy sS6 6c4
related: kZwz D8K bKs
related: CbQK 7th Tyf
related: KttZ Skc bMR
related: kDnq Q98 sD3

Certifikat nålepilation
type: Concept
in scheme: JobTech Taxonomy - Färdighet
definition: Certifikat nålepilation
broader: s48H Sft DTn
related: xr7w N6Q QMA

Falsning, plåt
type: Concept
in scheme: JobTech Taxonomy - Färdighet
definition: Falsning, plåt
broader: zmYu aAM TuF
related: L4hA SJP SFi
related: bXfo 4hb SXx

CNC-programmering, Bosch
type: Concept
in scheme: JobTech Taxonomy - Färdighet
definition: CNC-programmering, Bosch
broader: Programmering, CNC-styrsystem
related: vaEp iBS c5h
related: 4Jty HpK a3Q

Aktivitet och psykisk hälsa, specialistområde för arbetsterapeut
type: Concept
in scheme: JobTech Taxonomy - Färdighet
definition: Ett specialistområde och en fördjupad specialistkompetens för arbetsterapeut inom aktivitet och psykisk hälsa.
broader: Specialistområde för arbetsterapeut
related: TPH4 2AM isT

Elixir, programmeringsspråk
type: Concept
in scheme: JobTech Taxonomy - Färdighet
definition: Elixir, programmeringsspråk
broader: Datorspråk
related: BAeH eg8 T2d
related: cBBa ngH fCx
related: Q5DF juj 8do
related: D9SL mtn vGM
related: DJh5 yyF hEM
related: UxT1 tPF Kbg
related: UXKZ 3zZ ipB

Inriktning på lärarkompetens
type: Concept
in scheme: JobTech Taxonomy - Färdighet
top concept of: JobTech Taxonomy - Färdighet
definition: Inriktning på lärarkompetens
narrower: Vård- och omsorgsinriktning, undervisning
narrower: wFmN RwN uKx
narrower: rMAJ LtV Buz
narrower: tFQp CMY XaS
narrower: Filosofi, undervisning
narrower: Fordonsinriktning-godshantering, undervisning
narrower: Klassisk grekiska, språk och kultur, undervisning på gymnasienivå
narrower: umCR Xa1 HKq
narrower: Spanska, undervisning
narrower: tkRF GjY HxJ
narrower: yBqM aw8 hWJ
narrower: Modersmål, undervisning gymnasienivå
narrower: wWkX mBk RTh
narrower: Bild, undervisning gymnasienivå
narrower: Hem- och konsumentkunskap, undervisning
narrower: Bygginriktning-anläggningsfordon, undervisning
narrower: Samhällskunskap, undervisning grundskolenivå
narrower: Teknik, undervisning gymnasienivå
narrower: Engelska, undervisning gymnasienivå
narrower: tqxw vEf tcR
narrower: zgbR pMp zMB
narrower: Trä- och metallslöjd, undervisning
narrower: Engelska, undervisning grundskolenivå
narrower: Naturbruksinriktning, undervisning
narrower: Handels- och administrationsinriktning, undervisning
narrower: Biologi, undervisning gymnasienivå
narrower: juhE YYk eS2
narrower: Matematik, undervisning grundskolenivå
narrower: Fordonsinriktning-lastbil och mobila maskiner, undervisning
narrower: Moderna språk, undervisning gymnasienivå
narrower: nBQU tWb TC5
narrower: Svenska som andraspråk undervisning gymnasienivå
narrower: Svenska, undervisning grundskolenivå
narrower: xaJe i6p ZV1
narrower: y2qp oR2 Dsg
narrower: Svenska som andraspråk, undervisning grundskola
narrower: Naturvetenskaplig inriktning, undervisning
narrower: Franska, undervisning
narrower: Fordonsinriktning-karosseri och lackering, undervisning
narrower: Modersmål, undervisning grundskolenivå
narrower: Hantverksinriktning, undervisning
narrower: si3K 5Lb SZd
narrower: va6d 291 N19
narrower: Språk och språkutveckling, undervisning
narrower: rWxX ovc MuR
narrower: Elinriktning-automation, undervisning
narrower: Bygginriktning-plåtslageri, undervisning
narrower: kTWV pdu C2w
narrower: Kemi, undervisning gymnasienivå
narrower: Svenska, undervisning gymnasienivå
narrower: kvrB bj8 7rx
narrower: Restaurang- och livsmedelsinriktning, undervisning
narrower: Biologi, undervisning grundskolenivå
narrower: Samhällskunskap, undervising gymnasienivå
narrower: Bygginriktning-husbyggnad, undervisning
narrower: Elinriktning-dator- och kommunikationsteknik, undervisning
narrower: Dans för yrkesdansare, undervisning
narrower: Moderna språk, undervisning grundskolenivå
narrower: Slöjd, undervisning
narrower: Kemi, undervisning grundskolenivå
narrower: Specialpedagogik
narrower: kJGe dRZ LB4
narrower: skDv HzL Vhg
narrower: Psykologi, undervisning
narrower: xQbn aKU 1Nn
narrower: Fysik, undervisning grundskolenivå
narrower: w7Am VmF 1KD
narrower: Hotell- och turisminriktning, undervisning
narrower: Företagsekonomi, undervisning
narrower: Fordonsinriktning-personbilsteknik, undervisning
narrower: Fysik, undervisning gymnasienivå
narrower: rseM fd3 K7N
narrower: Barn- och fritidskunskap, undervisning
narrower: Bygginriktning-måleri, undervisning
narrower: Övriga språk, undervisning

U-landsfrågor, undervisning folkhögskola
type: Concept
in scheme: JobTech Taxonomy - Färdighet
definition: U-landsfrågor, undervisning folkhögskola
broader: zmYu aAM TuF
related: 4KhP FxL uZ5

Inriktning transfusionsmedicin
type: Concept
in scheme: JobTech Taxonomy - Färdighet
definition: Inriktning transfusionsmedicin
broader: zmYu aAM TuF
related: wNrt Ysj WuT

Korgmakeri
type: Concept
in scheme: JobTech Taxonomy - Färdighet
definition: Korgmakeri avser tillverkning och reparation av korgar och korgliknande produkter, ofta med naturliga material som halm, rör och andra växtfibrer. Kompetensen omfattar såväl traditionella tekniker som en förståelse för de material som används för att skapa funktionella och estetiska produkter.
broader: zmYu aAM TuF
related: aKdV u7V R5j

Moderna språk, undervisning grundskolenivå
type: Concept
in scheme: JobTech Taxonomy - Färdighet
definition: Moderna språk, undervisning grundskolenivå
broader: Inriktning på lärarkompetens
related: oQUQ D11 HPx

Sjukdomar hos nötkreatur, specialistkompetens för veterinärer
type: Concept
in scheme: JobTech Taxonomy - Färdighet
definition: En fördjupad specialistkompetens för veterinär inom sjukdomar hos nötkreatur.
broader: vSJu K1R wk3
related: WL4E r4b ek4

Lägenhetsreparationer
type: Concept
in scheme: JobTech Taxonomy - Färdighet
definition: Lägenhetsreparationer
broader: zmYu aAM TuF
related: QKvX v7r PNL

Unreal Engine, spelmotor
type: Concept
in scheme: JobTech Taxonomy - Färdighet
definition: Unreal Engine, spelmotor
alternative label: Electronic news gathering
alternative label: Unreal Engine
broader: Spelmotorer
related: Q5DF juj 8do
related: 4Jty HpK a3Q
related: Mbt6 3ko DiD

Markprojektering
type: Concept
in scheme: JobTech Taxonomy - Färdighet
definition: Markprojektering
broader: zmYu aAM TuF
related: XBh3 Xrm C4R
related: XurM DVs ggn
related: GMDo DVo Yzh
related: thZP oR7 WrY
related: yXbD NTH ijE
related: U8HK Jdi GuC
related: Pd51 xnr KCY
related: XeBP nMe pXx
related: ETAR ggZ Wuw
related: 4Jty HpK a3Q

Rättssociologi
type: Concept
in scheme: JobTech Taxonomy - Färdighet
definition: Rättssociologi
broader: zmYu aAM TuF
related: sXgV QFg vpb

Rörbockning
type: Concept
in scheme: JobTech Taxonomy - Färdighet
definition: Rörbockning
broader: zmYu aAM TuF
related: UcNa inr snV

Teppanyaki-kök
type: Concept
in scheme: JobTech Taxonomy - Färdighet
definition: Teppanyaki-kök
broader: zmYu aAM TuF
related: BStc SJh DKG

Gips, specialisering tandteknik
type: Concept
in scheme: JobTech Taxonomy - Färdighet
definition: Gips, specialisering tandteknik
broader: zmYu aAM TuF
related: 39yB xPQ ozd

Livsmedelskontroll
type: Concept
in scheme: JobTech Taxonomy - Färdighet
definition: Livsmedelskontroll avser systematiska åtgärder för att säkerställa att livsmedel uppfyller föreskrivna kvalitets- och säkerhetsstandarder. Den omfattar inspektioner, provtagningar och uppföljningar för att skydda konsumenternas hälsa och säkerhet.
broader: zmYu aAM TuF
related: puim 6PY DGj
related: yXbD NTH ijE
related: dAu7 VyL hsy
related: WL4E r4b ek4

MS Works
type: Concept
in scheme: JobTech Taxonomy - Färdighet
definition: MS Works
broader: Allmänna datakunskaper
related: eQ4M CNm ozj
related: Y6yY SuR hVh
related: Uw4n UB2 RCW
related: fdLf oPp wVw
related: vPP6 rsw dck
related: iWcY mko rq2
related: ZQTR hVC QhJ
related: br6a VVS V3y
related: 1CX5 mZw Vcq
related: L7eh ihX vM5
related: MGk3 LvL AU2
related: jJF3 qaQ Zsh
related: oEmP NC1 sXE
related: bjqk F3A 5Hk
related: H2Zj eL9 x28
related: dJXy Rpq a2u
related: pwRH MT1 8nR
related: cRmd 536 pT1
related: zKvJ GnC Szx
related: n6iX f2z XfE
related: DZVN v5g Fco
related: ij8k EwC zyB
related: JfYV ZGg 6rm
related: vCAb uuo ek5
related: 4Jty HpK a3Q
related: p16X 44f rwZ
related: pok1 ipJ yzD

Djurslagsspecialisering, smådjur
type: Concept
in scheme: JobTech Taxonomy - Färdighet
definition: Djurslagsspecialisering, smådjur
broader: zmYu aAM TuF
related: WL4E r4b ek4

Balansering av hjul
type: Concept
in scheme: JobTech Taxonomy - Färdighet
definition: Balansering av hjul avser processen att justera vikten på ett hjul för att säkerställa att det roterar jämnt och utan störningar under körning. Denna kompetens innefattar kunskap om tekniska metoder för balansering samt användning av specifika verktyg och maskiner för att uppnå korrekt balans, vilket bidrar till förbättrad körupplevelse och minskad slitage på fordonet.
broader: zmYu aAM TuF
related: Lzpv ofL 3H5
related: Kxm9 N3V shF

Pensionsförsäkringar
type: Concept
in scheme: JobTech Taxonomy - Färdighet
definition: Pensionsförsäkringar
broader: zmYu aAM TuF
related: Y6yY SuR hVh
related: Bbkh nrm 2J8
related: Ru4W zn2 LEz
related: pTr9 RBT 9ur
related: FfMN Bw1 qYR
related: 9dLz BCK oDA

Starta eget företag, cirkelledning
type: Concept
in scheme: JobTech Taxonomy - Färdighet
definition: Starta eget företag, cirkelledning
broader: zmYu aAM TuF
related: 1CX5 mZw Vcq

Mästarbrev, köttyrket i detaljhandeln/köttmästare
type: Concept
in scheme: JobTech Taxonomy - Färdighet
definition: Mästarbrev, köttyrket i detaljhandeln/köttmästare är ett bevis på högsta kompetensnivå inom ett hantverksyrke där innehavaren har uppnått mästarnivå, oftast genom ett mästarprov och uppfyllande av samtliga krav enligt branschens regler. Utfärdas av Sveriges hantverksråd i samråd med aktuell branschorganisation.
alternative label: Mästarbrev, köttyrket i detaljhandeln
alternative label: Mästarbrev, köttyrket i köttmästare
broader: Yrkesbevis/examen
related: Fp7x Yqt bx9
related: s1Qk o98 2o1

Fotografering, småbildskamera
type: Concept
in scheme: JobTech Taxonomy - Färdighet
definition: Fotografering, småbildskamera
broader: zmYu aAM TuF
related: 4BsK q2C sCL
related: CkRH 4Qn iX3
related: 3J38 DNz YKK

Mästarbrev, pälssömmare
type: Concept
in scheme: JobTech Taxonomy - Färdighet
definition: Mästarbrev, pälssömmare
broader: Yrkesbevis/examen
related: mwVN oEH g9k

Glidform
type: Concept
in scheme: JobTech Taxonomy - Färdighet
definition: Glidform
broader: zmYu aAM TuF
related: bZ4J riZ zK6
related: q2Ge zrQ zJb
related: 9mJN VwW Xjg

Sun SeeBeyond eGate Integrator, integrationsplattform
type: Concept
in scheme: JobTech Taxonomy - Färdighet
definition: Sun SeeBeyond eGate Integrator, integrationsplattform
alternative label: Sun SeeBeyond eGate Integrator
broader: Integrationsplattformar
related: BAeH eg8 T2d
related: cBBa ngH fCx
related: D9SL mtn vGM
related: 4Jty HpK a3Q
related: MYAz x9m 2LJ

EMAS (miljösystem)
type: Concept
in scheme: JobTech Taxonomy - Färdighet
definition: EMAS (miljösystem)
broader: Kvalitetssystem
related: mis4 feV uex
related: xm5G vGn iyk
related: v9nU 6Fw 4Qg
related: Qo7p wjf gtv
related: mp2Y vyC RFV
related: K8yg U4C gkY
related: puim 6PY DGj
related: nDaB vdy eAy
related: 33Nt DSs YYA
related: rE1E m3d cx1
related: yXbD NTH ijE
related: SPYW 7Z1 ShT
related: XeBP nMe pXx
related: dMVD VYy kgg
related: PRQn 9yw NJA
related: 4Jty HpK a3Q

Hemsideproduktion, undervisning
type: Concept
in scheme: JobTech Taxonomy - Färdighet
definition: Hemsideproduktion, undervisning
broader: Dataundervisning
related: 1CX5 mZw Vcq
related: 4Jty HpK a3Q

Instrumentunderhåll
type: Concept
in scheme: JobTech Taxonomy - Färdighet
definition: Instrumentunderhåll avser processer och åtgärder för att säkerställa att tekniska och vetenskapliga instrument fungerar korrekt och är i gott skick. Detta inkluderar inspektion, rengöring, justering och reparation av instrument för att bibehålla precision och tillförlitlighet i olika tillämpningar.
broader: zmYu aAM TuF
related: e6nk AGp y28
related: QEBd qHu vGr
related: fWrt sLg koW

Recitation
type: Concept
in scheme: JobTech Taxonomy - Färdighet
definition: Recitation
broader: zmYu aAM TuF
related: iBUL s38 izZ
related: SgNH hag n9D
related: xuSE mtB Mir

3-års montör
type: Concept
in scheme: JobTech Taxonomy - Färdighet
definition: 3-års montör
broader: Yrkesbevis/examen
related: a75S eLg JWH
related: yyF7 jsW EeP

Bildmixning
type: Concept
in scheme: JobTech Taxonomy - Färdighet
definition: Bildmixning
broader: zmYu aAM TuF
related: 4BsK q2C sCL
related: CkRH 4Qn iX3
related: 3J38 DNz YKK
related: 4Jty HpK a3Q

Dödsbon med företagsbestånd
type: Concept
in scheme: JobTech Taxonomy - Färdighet
definition: Dödsbon med företagsbestånd
broader: zmYu aAM TuF
related: zKvJ GnC Szx

Maskinskötsel, malmförädling
type: Concept
in scheme: JobTech Taxonomy - Färdighet
definition: Maskinskötsel, malmförädling avser kompetensen att sköta och övervaka maskiner och utrustning inom malmförädling. Denna kompetens innefattar ansvar för drift och underhåll av maskiner som krossar, mal och anrikar malm, samt säkerställande av effektiv och säker produktion.
broader: zmYu aAM TuF
related: LEvM 7Hs w8i

Keyboard
type: Concept
in scheme: JobTech Taxonomy - Färdighet
definition: Keyboard
broader: wLYs CKS wK8
related: AWJF wqZ va9

Teater
type: Concept
in scheme: JobTech Taxonomy - Färdighet
definition: Teater
broader: zmYu aAM TuF
related: ezKk kss CiQ
related: mwVN oEH g9k
related: 3i4a Ufc qpp
related: rYSG 3WJ LmC
related: LyBp bY6 bZK

Kulturgeografi
type: Concept
in scheme: JobTech Taxonomy - Färdighet
definition: Kulturgeografi
broader: zmYu aAM TuF
related: wVfo Njx 1rB
related: sXgV QFg vpb
related: Qbvf 6nd Esn

OOAD, objektorienterad analys och design
type: Concept
in scheme: JobTech Taxonomy - Färdighet
definition: OOAD, objektorienterad analys och design
alternative label: OOAD
broader: Styr- och utvecklingsmodeller
related: cBBa ngH fCx
related: DJh5 yyF hEM
related: 4Jty HpK a3Q
related: UXKZ 3zZ ipB

Synthesizer
type: Concept
in scheme: JobTech Taxonomy - Färdighet
definition: Synthesizer
broader: wLYs CKS wK8
related: AWJF wqZ va9

Ruby on Rails, programmeringsspråk
type: Concept
in scheme: JobTech Taxonomy - Färdighet
definition: Ruby on Rails, programmeringsspråk
alternative label: Ruby on Rails
broader: Datorspråk
related: BAeH eg8 T2d
related: Fv7d YhP YmS
related: nDaB vdy eAy
related: D9SL mtn vGM
related: DJh5 yyF hEM
related: SPYW 7Z1 ShT
related: 4Jty HpK a3Q

Underjordssprängning, malmproduktion
type: Concept
in scheme: JobTech Taxonomy - Färdighet
definition: Underjordssprängning, malmproduktion
broader: xKbn JBn EPE
related: sX9n CWa KVC

Kraftvärmeteknik
type: Concept
in scheme: JobTech Taxonomy - Färdighet
definition: Kraftvärmeverk producerar el och den värme som bildas överförs till fjärrvärmesystemet. Källa: www.energiforetagen.se
broader: zmYu aAM TuF
related: yXbD NTH ijE
related: PRQn 9yw NJA

Hjälpmedelsservice för fysisk och/eller kognitiv funktionsnedsättning
type: Concept
in scheme: JobTech Taxonomy - Färdighet
definition: Hjälpmedelsservice för fysisk och/eller kognitiv funktionsnedsättning avser stöd och anpassning av hjälpmedel för att möjliggöra ökad funktionalitet och självständighet för personer med funktionsnedsättningar. Denna kompetens innefattar förmågor att identifiera behov, rekommendera och anpassa hjälpmedel samt ge teknisk och praktisk support för att förbättra livskvaliteten.
broader: zmYu aAM TuF
related: e6nk AGp y28
related: TPH4 2AM isT
related: 4Jty HpK a3Q

Legitimation som psykoterapeut
type: Concept
in scheme: JobTech Taxonomy - Färdighet
definition: Legitimation som krävs för att kunna arbeta som psykoterapeut i Sverige. Utfärdas av Socialstyrelsen.
broader: Yrkesbevis/examen
related: NFUg y9y 1TY
related: nu7c QuB KVQ
related: bEDv SL7 VrL
related: 6eAB cbY i9T
related: dJXy Rpq a2u
related: 4P8B LtK JgE
related: r1Gk 3EN bpw
related: UUQi UJ5 MSb
related: VYeq GDF a2g
related: dyWo sDb MLQ
related: 6zAR EHM Kwj
related: oj4c P4b cja

Avloppsteknik/Vattenreningsteknik
type: Concept
in scheme: JobTech Taxonomy - Färdighet
definition: Avloppsteknik/Vattenreningsteknik
alternative label: Avloppsteknik
alternative label: Vattenreningsteknik
broader: zmYu aAM TuF
related: v9nU 6Fw 4Qg
related: K8yg U4C gkY
related: puim 6PY DGj
related: rE1E m3d cx1
related: yXbD NTH ijE
related: PRQn 9yw NJA
related: bExu 8gk azk

Korrekturläsning
type: Concept
in scheme: JobTech Taxonomy - Färdighet
definition: Korrekturläsning avser processen att noggrant granska och rätta texter för att identifiera och korrigera språkliga fel, såsom stavning, grammatik, interpunktion och stil. Denna kompetens innefattar att säkerställa att textens innehåll är klart och sammanhängande samt att den följer relevanta språkliga normer och riktlinjer.
broader: zmYu aAM TuF
related: SgNH hag n9D
related: zKvJ GnC Szx
related: zfve s6G tpc
related: 4Jty HpK a3Q

AZ-900: Microsoft Azure Fundamentals
type: Concept
in scheme: JobTech Taxonomy - Färdighet
definition: AZ-900: Microsoft Azure Fundamentals
broader: s48H Sft DTn
related: VCpu 5EN bBt
related: DJh5 yyF hEM
related: 4Jty HpK a3Q
related: UXKZ 3zZ ipB
related: MYAz x9m 2LJ

ASP.NET, programmeringsspråk
type: Concept
in scheme: JobTech Taxonomy - Färdighet
definition: ASP.NET, programmeringsspråk
alternative label: ASP.NET
broader: Datorspråk
related: BAeH eg8 T2d
related: Fv7d YhP YmS
related: D9SL mtn vGM
related: DJh5 yyF hEM
related: 4Jty HpK a3Q

Data- och nätverkslösningar, produktkunskap
type: Concept
in scheme: JobTech Taxonomy - Färdighet
definition: Data- och nätverkslösningar, produktkunskap
broader: zmYu aAM TuF
related: oXSW fbY XrY
related: 4Jty HpK a3Q

Web Content Accessibility Guidelines/WCAG
type: Concept
in scheme: JobTech Taxonomy - Färdighet
definition: Web Content Accessibility Guidelines/WCAG
alternative label: WCAG
alternative label: Web Content Accessibility Guidelines
broader: zmYu aAM TuF
related: cBBa ngH fCx
related: DJh5 yyF hEM
related: 4Jty HpK a3Q
related: UXKZ 3zZ ipB

Konferenstolkning
type: Concept
in scheme: JobTech Taxonomy - Färdighet
definition: Konferenstolkning
broader: zmYu aAM TuF
related: PQDm Z63 zst

GOC-behörighet
type: Concept
in scheme: JobTech Taxonomy - Färdighet
definition: GOC-behörighet
broader: Behörigheter, sjöfart
related: kZwz D8K bKs
related: kDnq Q98 sD3

Glasyrberedning
type: Concept
in scheme: JobTech Taxonomy - Färdighet
definition: Glasyrberedning
broader: zmYu aAM TuF
related: hxm6 xkr dHm

Gruppreseförsäljning/Konferensreseförsäljning
type: Concept
in scheme: JobTech Taxonomy - Färdighet
definition: Gruppreseförsäljning/Konferensreseförsäljning avser kompetens att planera, förmedla och sälja resor för grupper samt arrangera konferenser och evenemang, vilket inkluderar att boka resor, logi och aktiviteter som uppfyller kunders behov.
alternative label: Gruppreseförsäljning
alternative label: Konferensreseförsäljning
broader: oLM7 u3d yJ5
related: fdLf oPp wVw

Gymnastik, instruktör/Gymnastik, tränare
type: Concept
in scheme: JobTech Taxonomy - Färdighet
definition: Gymnastik, instruktör/Gymnastik, tränare avser kompetens att utbilda och träna individer inom gymnastik, oavsett nivå, från nybörjare till avancerade utövare. Denna kompetens innefattar kunskaper om gymnastiska tekniker, säkerhetsaspekter samt förmåga att planera och genomföra träningar och lektioner på ett strukturerat sätt.
alternative label: Gymnastik, instruktör
alternative label: Gymnastik, tränare
broader: Idrott/aktivitet
related: EA6o N1N QtT

Svenska som andraspråk undervisning gymnasienivå
type: Concept
in scheme: JobTech Taxonomy - Färdighet
definition: Svenska som andraspråk undervisning gymnasienivå
broader: Inriktning på lärarkompetens
related: 2x2V UeL 6ke
related: 4KhP FxL uZ5

PA-mixning
type: Concept
in scheme: JobTech Taxonomy - Färdighet
definition: PA-mixning
broader: zmYu aAM TuF
related: 4BsK q2C sCL
related: CkRH 4Qn iX3
related: 4Jty HpK a3Q

Turkiska, cirkelledning
type: Concept
in scheme: JobTech Taxonomy - Färdighet
definition: Turkiska, cirkelledning
broader: zmYu aAM TuF
related: 1CX5 mZw Vcq

Röst- och talrubbningar, specialistkompetens för läkare
type: Concept
in scheme: JobTech Taxonomy - Färdighet
definition: Röst- och talrubbningar, specialistkompetens för läkare
broader: Specialistbevis för läkare
related: nu7c QuB KVQ

Signalsystem
type: Concept
in scheme: JobTech Taxonomy - Färdighet
definition: Signalsystem
broader: zmYu aAM TuF
related: nDaB vdy eAy
related: SPYW 7Z1 ShT
related: 4Jty HpK a3Q

Bildskärmar, installation och underhåll
type: Concept
in scheme: JobTech Taxonomy - Färdighet
definition: Bildskärmar, installation och underhåll
broader: Hårdvara
related: fWrt sLg koW
related: 4Jty HpK a3Q
related: 13md uyV BNG

Celesta
type: Concept
in scheme: JobTech Taxonomy - Färdighet
definition: Celesta
broader: wLYs CKS wK8
related: AWJF wqZ va9

Fordonstillbehör
type: Concept
in scheme: JobTech Taxonomy - Färdighet
definition: Fordonstillbehör
broader: zmYu aAM TuF
related: oXSW fbY XrY
related: JnTF wXr 6Eh
related: YKL2 FCB 1yr
related: 85cq 6uK 4cK

Yrkesetik inom hälso- och sjukvård
type: Concept
in scheme: JobTech Taxonomy - Färdighet
definition: Källa: Vårdförbundet
broader: zmYu aAM TuF
related: HPxT fQJ zwT
related: ezKk kss CiQ
related: NFUg y9y 1TY
related: nu7c QuB KVQ
related: bEDv SL7 VrL
related: 6eAB cbY i9T
related: ek9W qqp XpF
related: TPH4 2AM isT
related: PHJN fva yxs
related: s7vU FhY L5Z
related: seu9 VoQ VNo
related: jY19 knH MJp
related: nrVt xUL KdQ
related: 1tGC fXC mxX
related: cuaN Rj5 YCc
related: F19Z oB6 pg3
related: UUQi UJ5 MSb
related: dyWo sDb MLQ
related: 3H17 ZZr BEc
related: HATH AfN RRz
related: tAJS JNb hDH
related: gXqW s5Q ZjN
related: 6zAR EHM Kwj
related: xr7w N6Q QMA
related: Z8ci bBE tmx
related: uxHV KXc PKD
related: vTgW pnr QMp

Precisionsteknik/Låga toleranser
type: Concept
in scheme: JobTech Taxonomy - Färdighet
definition: Precisionsteknik/Låga toleranser
alternative label: Låga toleranser
alternative label: Precisionsteknik
broader: zmYu aAM TuF
related: K8yg U4C gkY
related: nDaB vdy eAy
related: SPYW 7Z1 ShT
related: PRQn 9yw NJA

Film/redigering-DaVinci Resolve
type: Concept
in scheme: JobTech Taxonomy - Färdighet
definition: Film/redigering-DaVinci Resolve
alternative label: Film-DaVinci Resolve
alternative label: redigering-DaVinci Resolve
broader: Programvara för digitalt skapande
related: 4BsK q2C sCL
related: CkRH 4Qn iX3
related: 3J38 DNz YKK
related: 4Jty HpK a3Q

City blues
type: Concept
in scheme: JobTech Taxonomy - Färdighet
definition: City blues
broader: p1WM wCw LTd
related: AWJF wqZ va9

Certifierad akupunktör
type: Concept
in scheme: JobTech Taxonomy - Färdighet
definition: Certifierad akupunktör är en certifiering som intygar man genomgått utbildning och uppnått kompetens inom området enligt branschstandarder.
broader: s48H Sft DTn
related: F19Z oB6 pg3

Medierätt
type: Concept
in scheme: JobTech Taxonomy - Färdighet
definition: Medierätt
broader: zmYu aAM TuF
related: q8wL kdi WaW
related: br6a VVS V3y
related: 6aak 8eh iwT
related: DZVN v5g Fco
related: JfYV ZGg 6rm

Layout-QuarkXpress
type: Concept
in scheme: JobTech Taxonomy - Färdighet
definition: Layout-QuarkXpress
broader: Programvara för digitalt skapande
related: 8Bmh vtM zts
related: SgNH hag n9D
related: zfve s6G tpc
related: k1Nx auG sNh
related: 4Jty HpK a3Q
related: Mbt6 3ko DiD

Fasadputsning
type: Concept
in scheme: JobTech Taxonomy - Färdighet
definition: Fasadputsning
broader: zmYu aAM TuF
related: NnB3 eWH auo

Solresor, ledarerfarenhet
type: Concept
in scheme: JobTech Taxonomy - Färdighet
definition: Solresor, ledarerfarenhet
broader: zmYu aAM TuF
related: A6X3 efC VNy

Minilab
type: Concept
in scheme: JobTech Taxonomy - Färdighet
definition: Minilab
broader: zmYu aAM TuF
related: Vfum e6B 7Bw

Fordonstestning
type: Concept
in scheme: JobTech Taxonomy - Färdighet
definition: Fordonstestning
broader: zmYu aAM TuF
related: Lzpv ofL 3H5

Försöksdjursmetodik
type: Concept
in scheme: JobTech Taxonomy - Färdighet
definition: Försöksdjursmetodik avser tillvägagångssätt och tekniker som används vid hantering och användning av försöksdjur för vetenskaplig forskning och utveckling. Kompetensen innefattar kunskaper om djurens välfärd, etik, lagstiftning samt metoder för att säkerställa validitet och pålitlighet i forskningsresultat.
broader: zmYu aAM TuF
related: wNrt Ysj WuT
related: Lrsj wRZ sFV
related: WL4E r4b ek4

Analys/Beräkning-Bentley Building Analysis-Design
type: Concept
in scheme: JobTech Taxonomy - Färdighet
definition: Analys/Beräkning-Bentley Building Analysis-Design
alternative label: Analys-Bentley Building Analysis-Design
alternative label: Beräkning-Bentley Building Analysis-Design
broader: mTLu uo2 gq2
related: thZP oR7 WrY
related: K8yg U4C gkY
related: Pd51 xnr KCY
related: XeBP nMe pXx
related: PRQn 9yw NJA
related: ETAR ggZ Wuw
related: 41KB bfk 5jR
related: 4Jty HpK a3Q

Hörselvård, medicintekniskt område ingenjör
type: Concept
in scheme: JobTech Taxonomy - Färdighet
definition: Hörselvård, medicintekniskt område ingenjör
broader: zmYu aAM TuF
related: 39yB xPQ ozd

Fastighetsförvaltning
type: Concept
in scheme: JobTech Taxonomy - Färdighet
definition: Fastighetsförvaltning avser hantering och administration av fastigheter för att säkerställa deras långsiktiga värde och funktion. Kompetensen omfattar planering och genomförande av underhåll och uthyrning av lokaler.
broader: zmYu aAM TuF
related: df9D e6y 61z
related: U8HK Jdi GuC

Försäkringar, personaladministration
type: Concept
in scheme: JobTech Taxonomy - Färdighet
definition: Försäkringar, personaladministration
broader: zmYu aAM TuF
related: mNoS AN5 drn
related: L7eh ihX vM5
related: Fp7x Yqt bx9
related: bjqk F3A 5Hk
related: ij8k EwC zyB

Administration inom fastighetsmäkleri
type: Concept
in scheme: JobTech Taxonomy - Färdighet
definition: Administration inom fastighetsmäkleri omfattar hantering av administrativa och praktiska rutiner kopplade till bostadsförsäljningar. Det innefattar förberedelse av objektsbeskrivningar och annan dokumentation, insamling av faktauppgifter från bostadsrättsföreningar och kommuner, bokning och planering av visningar, kundkontakter, hantering av kontrakt samt sammanställning av rapporter och statistik.
broader: zmYu aAM TuF
related: p16X 44f rwZ

Bearbetningsteknik
type: Concept
in scheme: JobTech Taxonomy - Färdighet
definition: Bearbetningsteknik
broader: zmYu aAM TuF
related: mis4 feV uex
related: mp2Y vyC RFV
related: VKKg e4t t46
related: UdrS qzV P7i
related: vaEp iBS c5h
related: K8yg U4C gkY
related: PRQn 9yw NJA

ESA (Elsäkerhetsanvisningarna)
type: Concept
in scheme: JobTech Taxonomy - Färdighet
definition: ESA (Elsäkerhetsanvisningarna) avser riktlinjer och regler för att säkerställa elsäkerhet vid arbeten som involverar elektriska installationer och anläggningar. Kompetensen omfattar också kunskap om riskhantering relaterad till elarbete.
alternative label: ESA
alternative label: Elsäkerhetsanvisningarna
broader: zmYu aAM TuF
related: 3ZtN hhA SM7
related: MW1P GNJ 4F9
related: w6ud quG dgh
related: fWrt sLg koW
related: yyF7 jsW EeP

PostgreSQL, databashanterare
type: Concept
in scheme: JobTech Taxonomy - Färdighet
definition: PostgreSQL, databashanterare, avser en kompetens inom hantering av databaser med hjälp av PostgreSQL-systemet. Denna kompetens omfattar installation, konfiguration, och administrering av databaser samt utförande av uppgifter som säkerhetskopiering, återställning och optimering av databasprestanda.
alternative label: PostgreSQL
broader: Databaser
related: BAeH eg8 T2d
related: cBBa ngH fCx
related: Fv7d YhP YmS
related: D9SL mtn vGM
related: DJh5 yyF hEM
related: 4Jty HpK a3Q
related: MYAz x9m 2LJ

Inriktning klinisk mikrobiologi
type: Concept
in scheme: JobTech Taxonomy - Färdighet
definition: Inriktning klinisk mikrobiologi
broader: zmYu aAM TuF
related: wNrt Ysj WuT

Drönarjournalistik
type: Concept
in scheme: JobTech Taxonomy - Färdighet
definition: Drönarjournalistik
broader: zmYu aAM TuF
related: SgNH hag n9D
related: 3J38 DNz YKK

Utveckla energibesparingsstrategier
type: Concept
in scheme: JobTech Taxonomy - Färdighet
definition: Utveckla energibesparingsstrategier
broader: zmYu aAM TuF
related: wCx8 rY3 XUT
related: yXbD NTH ijE

VVS, fartygserfarenhet
type: Concept
in scheme: JobTech Taxonomy - Färdighet
definition: VVS, fartygserfarenhet
broader: Övriga specialiteter, sjöfart
related: KttZ Skc bMR

Clearing
type: Concept
in scheme: JobTech Taxonomy - Färdighet
definition: Clearing
broader: zmYu aAM TuF
related: aQpg E2T cWq

Systemförvaltning
type: Concept
in scheme: JobTech Taxonomy - Färdighet
definition: Systemförvaltning avser hantering och underhåll av IT-system som är i drift, vilket inkluderar både drift och förbättring av dessa system för att säkerställa deras funktionalitet och effektivitet. Kompetensen omfattar även ansvar för att den tekniska arkitekturen stödjer verksamhetens behov.
broader: zmYu aAM TuF
related: cBBa ngH fCx
related: DJh5 yyF hEM
related: eWiB mGP MjE
related: 4Jty HpK a3Q
related: UXKZ 3zZ ipB

Avtalsutformning/Kontraktsutformning
type: Concept
in scheme: JobTech Taxonomy - Färdighet
definition: Avtalsutformning/Kontraktsutformning avser processen att skapa juridiskt bindande avtal mellan parter, vilket inkluderar formulering av villkor och bestämmelser som reglerar ett överenskommet samarbete. Kompetensen innebär förståelse för relevanta lagar, riktlinjer och administrativa krav som styr avtalsprocessen.
alternative label: Avtalsutformning
alternative label: Kontraktsutformning
broader: zmYu aAM TuF
related: Y6yY SuR hVh
related: oXSW fbY XrY
related: 8A1f sxQ adT
related: Fu4x 7KG YgC
related: 8SPu K1k 5qR
related: Uw4n UB2 RCW
related: pf1K PTz frm
related: 48KE fDE ryL
related: vPP6 rsw dck
related: ajwx FvL YuY
related: GMDo DVo Yzh
related: br6a VVS V3y
related: 7mn2 kA9 ftp
related: Pz9M srJ Lc9
related: Fp7x Yqt bx9
related: 33Nt DSs YYA
related: dUuh wwa FGj
related: mZsb A1K Gec
related: eX3C MtJ nPA
related: wby2 mwq fWV
related: AuTi FEo j3R
related: cRmd 536 pT1
related: X1Ac Y9P PJo
related: FfMN Bw1 qYR
related: hZLv S5f jo2
related: DZVN v5g Fco
related: 3i4a Ufc qpp
related: sWzF 6pd Y6L
related: JfYV ZGg 6rm
related: 9QMD sZ3 ZjX
related: nNxJ YWy vR2
related: 9Mn4 PNA 7Yz
related: 85cq 6uK 4cK

VHDL, programmeringsspråk
type: Concept
in scheme: JobTech Taxonomy - Färdighet
definition: VHDL, programmeringsspråk
alternative label: VHDL
broader: Datorspråk
related: BAeH eg8 T2d
related: Fv7d YhP YmS
related: nDaB vdy eAy
related: D9SL mtn vGM
related: DJh5 yyF hEM
related: SPYW 7Z1 ShT
related: 4Jty HpK a3Q

Krematorieteknisk utbildning
type: Concept
in scheme: JobTech Taxonomy - Färdighet
definition: Krematorieteknisk utbildning är en eftergymnasial yrkesinriktad utbildning med inriktning mot krematorieteknik.
broader: Yrkesbevis/examen
related: R8bW rsJ b2G

Landsbygdsutveckling
type: Concept
in scheme: JobTech Taxonomy - Färdighet
definition: Landsbygdsutveckling
broader: zmYu aAM TuF
related: XurM DVs ggn
related: yXbD NTH ijE

Sjukvårdstolkning
type: Concept
in scheme: JobTech Taxonomy - Färdighet
definition: Sjukvårdstolkning
broader: zmYu aAM TuF
related: PQDm Z63 zst

Termoplaster, materialkunskap
type: Concept
in scheme: JobTech Taxonomy - Färdighet
definition: Termoplaster, materialkunskap
broader: zmYu aAM TuF
related: yPQ4 EaN Dtj

Turism- och konferenstjänster, produktkunskap
type: Concept
in scheme: JobTech Taxonomy - Färdighet
definition: Turism- och konferenstjänster, produktkunskap
broader: zmYu aAM TuF
related: oXSW fbY XrY
related: fdLf oPp wVw
related: 85cq 6uK 4cK

Packning
type: Concept
in scheme: JobTech Taxonomy - Färdighet
definition: Packning avser processen att fylla, tillsluta och förbereda produkter för distribution och försäljning, vilket innefattar aktiviteter som etikettering, paketering och sortering av varor. Kompetensen omfattar manuell hantering av förpackningar och produkternas säkerhet och kvalitet genom noggrannhet och uppmärksamhet på detaljer.
broader: zmYu aAM TuF
related: DxiF hTo b3X

Doktorsexamen, fysikämnen
type: Concept
in scheme: JobTech Taxonomy - Färdighet
definition: Doktorsexamen, fysikämnen
broader: Yrkesbevis/examen
related: Gm5j S2Y aTB
related: cYCo PxY zQd

Bekämpningsmedel
type: Concept
in scheme: JobTech Taxonomy - Färdighet
definition: Bekämpningsmedel
broader: zmYu aAM TuF
related: idjo 2Wr a3E
related: yXbD NTH ijE

Krisbearbetning, personalarbete
type: Concept
in scheme: JobTech Taxonomy - Färdighet
definition: Krisbearbetning, personalarbete
broader: zmYu aAM TuF
related: mNoS AN5 drn
related: Fp7x Yqt bx9
related: bjqk F3A 5Hk

Sjukdomar hos hund och katt, specialistkompetens för veterinärer
type: Concept
in scheme: JobTech Taxonomy - Färdighet
definition: En fördjupad specialistkompetens för veterinär inom sjukdomar hos hund och katt.
broader: vSJu K1R wk3
related: WL4E r4b ek4

ISDN-standard för digital telefoni
type: Concept
in scheme: JobTech Taxonomy - Färdighet
definition: ISDN-standard för digital telefoni
broader: zmYu aAM TuF
related: nDaB vdy eAy
related: fWrt sLg koW
related: 4Jty HpK a3Q

Garnfiske
type: Concept
in scheme: JobTech Taxonomy - Färdighet
definition: Garnfiske
broader: zmYu aAM TuF
related: Lm3Z gek GYc

Betonggjutning
type: Concept
in scheme: JobTech Taxonomy - Färdighet
definition: Betonggjutning avser processen att blanda och hälla betong för att skapa olika strukturer och former inom bygg- och konstruktion. Kompetensen inkluderar kunskap om materialens egenskaper, samt tekniker för formning, armering och efterbehandling av betongkonstruktioner.
broader: zmYu aAM TuF
related: q2Ge zrQ zJb
related: o31g CX1 qhQ

Inredningsarkitektexamen
type: Concept
in scheme: JobTech Taxonomy - Färdighet
definition: Inredningsarkitektexamen
broader: Yrkesbevis/examen
related: 41KB bfk 5jR

Administrativt arbete, fartygserfarenhet
type: Concept
in scheme: JobTech Taxonomy - Färdighet
definition: Administrativt arbete, fartygserfarenhet
broader: Övriga specialiteter, sjöfart
related: UjoW meY Zwt

Kokontroll
type: Concept
in scheme: JobTech Taxonomy - Färdighet
definition: Kokontroll
broader: zmYu aAM TuF
related: KYmy iqC xiQ

B - Begränsad auktorisation
type: Concept
in scheme: JobTech Taxonomy - Färdighet
definition: B - Begränsad auktorisation
broader: Elbehörigheter
related: MW1P GNJ 4F9
related: Rsoy sS6 6c4
related: df9D e6y 61z
related: e6nk AGp y28
related: nDaB vdy eAy
related: 4BsK q2C sCL
related: SPYW 7Z1 ShT
related: fLKb bJ3 69p
related: TrwQ RXT W8a
related: fWrt sLg koW
related: KttZ Skc bMR
related: 3UzE P8A 9sS
related: a75S eLg JWH
related: iHrC aRv fVm
related: L4hA SJP SFi
related: yyF7 jsW EeP

Galler, låsteknik
type: Concept
in scheme: JobTech Taxonomy - Färdighet
definition: Galler, låsteknik
broader: zmYu aAM TuF
related: e6nk AGp y28

Flygplansmontering
type: Concept
in scheme: JobTech Taxonomy - Färdighet
definition: Flygplansmontering avser processen att sätta samman olika komponenter och system i flygplan. Kompetensen innefattar kunskaper om tekniska detaljer och metoder för att montera flygplan enligt specifikationer och säkerhetsstandarder.
broader: zmYu aAM TuF
related: shkw ojo UL2

Konstfibertillverkning
type: Concept
in scheme: JobTech Taxonomy - Färdighet
definition: Konstfibertillverkning
broader: zmYu aAM TuF
related: skLS kpa Ui1

Medicinsk rätt
type: Concept
in scheme: JobTech Taxonomy - Färdighet
definition: Medicinsk rätt
broader: zmYu aAM TuF
related: q8wL kdi WaW
related: 6aak 8eh iwT

Försäljning, erfarenhet
type: Concept
in scheme: JobTech Taxonomy - Färdighet
definition: Försäljning, erfarenhet avser kunskap och färdighet i att genomföra försäljningsaktiviteter och interagera med kunder. Kompetensen omfattar förståelse för försäljningsprocesser, kundrelationer och marknadsdynamik.
broader: Yrkesövergripande kompetenser
related: oXSW fbY XrY
related: NCeZ rSk B4D
related: ieVp d5L rS9
related: xyW2 toA Skh

Glassfish Server, applikationsplattform
type: Concept
in scheme: JobTech Taxonomy - Färdighet
definition: Glassfish Server, applikationsplattform
alternative label: Glassfish Server
broader: Applikationsplattformar
related: BAeH eg8 T2d
related: D9SL mtn vGM
related: DJh5 yyF hEM
related: UxT1 tPF Kbg
related: 4Jty HpK a3Q
related: UXKZ 3zZ ipB
related: MYAz x9m 2LJ

Cembalo
type: Concept
in scheme: JobTech Taxonomy - Färdighet
definition: Cembalo
broader: wLYs CKS wK8
related: AWJF wqZ va9

Pigmentering
type: Concept
in scheme: JobTech Taxonomy - Färdighet
definition: Pigmentering
broader: zmYu aAM TuF
related: ezKk kss CiQ

Plast, konst
type: Concept
in scheme: JobTech Taxonomy - Färdighet
definition: Plast, konst
broader: zmYu aAM TuF
related: 34Tn BQQ tfo

Hening
type: Concept
in scheme: JobTech Taxonomy - Färdighet
definition: Hening
broader: zmYu aAM TuF
related: 4bxV 58E P9N

Fönstertillverkning
type: Concept
in scheme: JobTech Taxonomy - Färdighet
definition: Fönstertillverkning
broader: zmYu aAM TuF
related: 8ddv P8e iYz

Switchar, installation och underhåll
type: Concept
in scheme: JobTech Taxonomy - Färdighet
definition: Switchar, installation och underhåll
broader: Hårdvara
related: 1CX5 mZw Vcq
related: nDaB vdy eAy
related: VCpu 5EN bBt
related: fWrt sLg koW
related: 4Jty HpK a3Q
related: 13md uyV BNG

Forensiskt område vapen
type: Concept
in scheme: JobTech Taxonomy - Färdighet
definition: Kompetensen avser kunskaper om och tillämpning av metoder för analys av vapen inom brottsutredning. Det innefattaridentifiering, funktionskontroller och spårjämförelser på kulor och hylsor samt skjutavståndsbedömningar.
broader: zmYu aAM TuF
related: vPP6 rsw dck
related: e6nk AGp y28
related: rNcE Zno pD8
related: bExu 8gk azk

Bootstrap, ramverk
type: Concept
in scheme: JobTech Taxonomy - Färdighet
definition: Bootstrap, ramverk
broader: srsj GQb CE1
related: Fv7d YhP YmS
related: 8Bmh vtM zts
related: D9SL mtn vGM
related: DJh5 yyF hEM
related: 4Jty HpK a3Q
related: Mbt6 3ko DiD

Fartygsel
type: Concept
in scheme: JobTech Taxonomy - Färdighet
definition: Fartygsel
broader: Övriga specialiteter, sjöfart
related: Rsoy sS6 6c4
related: a75S eLg JWH

Offentlig förvaltning, erfarenhet
type: Concept
in scheme: JobTech Taxonomy - Färdighet
definition: Offentlig förvaltning, erfarenhet, avser kunskap och praktisk erfarenhet av att arbeta inom den offentliga sektorn och förståelse för dess struktur och processer. Denna kompetens inkluderar insikter i policyutveckling, ärendehandläggning och regelverk relaterade till offentlig verksamhet.
broader: zmYu aAM TuF
related: vPP6 rsw dck
related: oEmP NC1 sXE
related: nuXg Wjc JPd
related: U8HK Jdi GuC
related: ZQiZ 6Kd D3a
related: vCAb uuo ek5

Pitemål
type: Concept
in scheme: JobTech Taxonomy - Färdighet
definition: Pitemål
broader: Dialekt
related: iBUL s38 izZ

Spirituals
type: Concept
in scheme: JobTech Taxonomy - Färdighet
definition: Spirituals
broader: p1WM wCw LTd
related: AWJF wqZ va9

Beteendevetenskap
type: Concept
in scheme: JobTech Taxonomy - Färdighet
definition: Beteendevetenskap
broader: zmYu aAM TuF
related: sXgV QFg vpb

Kirurgisk vård, specialistområde för sjuksköterska
type: Concept
in scheme: JobTech Taxonomy - Färdighet
definition: En fördjupad specialistkompetens för sjuksköterska inom kirurgisk vård.
broader: Specialistområde för sjuksköterska
related: 6zAR EHM Kwj

Librettoläsning
type: Concept
in scheme: JobTech Taxonomy - Färdighet
definition: Librettoläsning
broader: zmYu aAM TuF
related: AWJF wqZ va9

Mästarbrev, installatör - inbrottslarm
type: Concept
in scheme: JobTech Taxonomy - Färdighet
definition: Mästarbrev, installatör - inbrottslarm
broader: Yrkesbevis/examen
related: fWrt sLg koW
related: 4Jty HpK a3Q

VVS, el, tele-Bentley Building ElectricalSystems
type: Concept
in scheme: JobTech Taxonomy - Färdighet
definition: VVS, el, tele-Bentley Building ElectricalSystems
broader: mTLu uo2 gq2
related: nDaB vdy eAy
related: SPYW 7Z1 ShT
related: 4Jty HpK a3Q

Optioner
type: Concept
in scheme: JobTech Taxonomy - Färdighet
definition: Optioner
broader: zmYu aAM TuF
related: aQpg E2T cWq
related: FfMN Bw1 qYR

Arbetsmiljöförskrifter vid byggnads- och anläggningsarbete
type: Concept
in scheme: JobTech Taxonomy - Färdighet
definition: Arbetsmiljöförskrifter vid byggnads- och anläggningsarbete riktar sig till alla som har ansvar för byggnads- och anläggningsarbete, även byggherrar. De innehåller bland annat regler om: - transport av material på byggplatser - takarbete - vägarbete - skyddsnät Källa www.arbetsmiljoverket.se
broader: zmYu aAM TuF
related: w6ud quG dgh
related: yXbD NTH ijE

Trycksakskalkylering
type: Concept
in scheme: JobTech Taxonomy - Färdighet
definition: Trycksakskalkylering
broader: zmYu aAM TuF
related: dUuh wwa FGj

Mögelsanering
type: Concept
in scheme: JobTech Taxonomy - Färdighet
definition: Mögelsanering
broader: zmYu aAM TuF
related: idjo 2Wr a3E
related: yXbD NTH ijE

Medicinjournalistik/Forskningsjournalistik
type: Concept
in scheme: JobTech Taxonomy - Färdighet
definition: Medicinjournalistik/Forskningsjournalistik avser journalistisk praktik som fokuserar på att rapportera om medicinska och vetenskapliga ämnen. Kompetensen inkluderar insamling och granskning av information samt förmåga att förmedla komplexa forskningsresultat och medicinska nyheter till allmänheten.
alternative label: Forskningsjournalistik
alternative label: Medicinjournalistik
broader: zmYu aAM TuF
related: SgNH hag n9D

Visual Studio, integrerad utvecklingsmiljö
type: Concept
in scheme: JobTech Taxonomy - Färdighet
definition: Visual Studio, integrerad utvecklingsmiljö
broader: Programmerings- och systemutvecklingsverktyg
related: D9SL mtn vGM
related: DJh5 yyF hEM
related: 4Jty HpK a3Q
related: UXKZ 3zZ ipB

Kvalitetskontroll
type: Concept
in scheme: JobTech Taxonomy - Färdighet
definition: Kompetensen avser kunskaper om och tillämpning av metoder för kvalitetskontroll inom organisationer. Det innefattar inspektioner, analys, testning och dokumentation av material, produkter, processer och tjänster.
broader: zmYu aAM TuF
related: mis4 feV uex
related: cBBa ngH fCx
related: v9nU 6Fw 4Qg
related: wCx8 rY3 XUT
related: 3jEy yuT aVo
related: rwpH 6RA XTT
related: Uw4n UB2 RCW
related: 3FP7 4Eg x8P
related: jv1x tpK 32p
related: 1G6H AuG qyy
related: K8yg U4C gkY
related: nDaB vdy eAy
related: 33Nt DSs YYA
related: SgAJ DW2 FN5
related: 9mJN VwW Xjg
related: shkw ojo UL2
related: SPYW 7Z1 ShT
related: dMVD VYy kgg
related: PRQn 9yw NJA
related: TrwQ RXT W8a
related: NnB3 eWH auo
related: bExu 8gk azk
related: L4hA SJP SFi
related: bXfo 4hb SXx
related: MYAz x9m 2LJ

Dykledarutbildning
type: Concept
in scheme: JobTech Taxonomy - Färdighet
definition: Dykledarutbildning
broader: Yrkesbevis/examen
related: DPPw 4wa AsH
related: EA6o N1N QtT

Pyramid, redovisningssystem
type: Concept
in scheme: JobTech Taxonomy - Färdighet
definition: Pyramid, redovisningssystem
alternative label: Pyramid
alternative label: Pyramidkunskaper
alternative label: Redovisningssystemet pyramid
broader: xSJR 1Kq pxB
related: eQ4M CNm ozj
related: iWcY mko rq2
related: q81z 3oD 1qu
related: ij8k EwC zyB
related: 4Jty HpK a3Q

Fastighetsekonomi
type: Concept
in scheme: JobTech Taxonomy - Färdighet
definition: Fastighetsekonomi är en specialiserad ekonomisk kompetens som fokuserar på fastigheters finansiella styrning, värdering och lönsamhetsanalys. Den omfattar budgetering, investeringskalkyler, hyresintäktsanalys, kassaflödeshantering, skatte- och momsregler samt fastighetsvärdering med metoder som kapitalvärdering och nyckeltal.
broader: zmYu aAM TuF
related: Y6yY SuR hVh
related: Uw4n UB2 RCW
related: GMDo DVo Yzh
related: q81z 3oD 1qu
related: U8HK Jdi GuC
related: cRmd 536 pT1

Djuptryck
type: Concept
in scheme: JobTech Taxonomy - Färdighet
definition: Djuptryck
broader: zmYu aAM TuF
related: 34Tn BQQ tfo
related: XeJB bkn mRn

Ljud-Apple Logic Pro
type: Concept
in scheme: JobTech Taxonomy - Färdighet
definition: Ljud-Apple Logic Pro
broader: Programvara för digitalt skapande
related: SgNH hag n9D
related: 4BsK q2C sCL
related: CkRH 4Qn iX3
related: 3J38 DNz YKK
related: PH2M uV4 r72
related: 4Jty HpK a3Q

Vårdplanering
type: Concept
in scheme: JobTech Taxonomy - Färdighet
definition: Vårdplanering avser processen att utveckla och strukturera individuella vårdstrategier för patienter, vilket inkluderar bedömning av behov, resurser och mål för vården. Denna kompetens omfattar samordning av insatser mellan olika vårdgivare och huvudmän för att säkerställa en integrerad och holistisk vård av patienten.
broader: zmYu aAM TuF
related: 2kLc pto DpV
related: 6zAR EHM Kwj

Mezzosopran
type: Concept
in scheme: JobTech Taxonomy - Färdighet
definition: Mezzosopran
broader: Sång
related: AWJF wqZ va9

Movie Magic
type: Concept
in scheme: JobTech Taxonomy - Färdighet
definition: Movie Magic
broader: Allmänna datakunskaper
related: rYSG 3WJ LmC
related: PH2M uV4 r72
related: 4Jty HpK a3Q

Sjökaptensexamen
type: Concept
in scheme: JobTech Taxonomy - Färdighet
definition: Sjökaptensexamen
broader: Yrkesbevis/examen
related: kZwz D8K bKs
related: kDnq Q98 sD3

Inköpsjuridik
type: Concept
in scheme: JobTech Taxonomy - Färdighet
definition: Inköpsjuridik
broader: zmYu aAM TuF
related: 33Nt DSs YYA
related: 85cq 6uK 4cK

Båtmotorer, reparationsvana
type: Concept
in scheme: JobTech Taxonomy - Färdighet
definition: Båtmotorer, reparationsvana, avser kunskap och färdighet i att underhålla och reparera båtmotorer. Kompetensen inkluderar analys av fel och utförande av nödvändiga reparationer för att säkerställa funktion och prestanda hos båtsystem.
broader: zmYu aAM TuF
related: Lzpv ofL 3H5

Husvagnar, produktkunskap
type: Concept
in scheme: JobTech Taxonomy - Färdighet
definition: Husvagnar, produktkunskap avser kunnande om olika typer och modeller av husvagnar, inklusive deras funktioner, specifikationer och användningsområden. Kompetensen omfattar även kunskaper om underhåll, säkerhet och tillbehör relaterade till husvagnar.
broader: zmYu aAM TuF
related: oXSW fbY XrY
related: YKL2 FCB 1yr
related: M47D MU2 dhS

Antikens arkeologi
type: Concept
in scheme: JobTech Taxonomy - Färdighet
definition: Antikens arkeologi
broader: zmYu aAM TuF
related: sXgV QFg vpb

Hålslipning
type: Concept
in scheme: JobTech Taxonomy - Färdighet
definition: Hålslipning
broader: zmYu aAM TuF
related: 4bxV 58E P9N

Funk
type: Concept
in scheme: JobTech Taxonomy - Färdighet
definition: Funk
broader: p1WM wCw LTd
related: AWJF wqZ va9

Mångkulturell förskola, erfarenhet/Mångkulturell skola, erfarenhet
type: Concept
in scheme: JobTech Taxonomy - Färdighet
definition: Mångkulturell förskola, erfarenhet/Mångkulturell skola, erfarenhet
alternative label: Mångkulturell förskola, erfarenhet
alternative label: Mångkulturell skola, erfarenhet
broader: zmYu aAM TuF
related: Hi9c iTe gHH
related: XW9L tA9 WaX

Cybersäkerhet, nätverk
type: Concept
in scheme: JobTech Taxonomy - Färdighet
definition: Cybersäkerhet, nätverk avser skyddet av datorsystem och nätverk mot intrång, skador och oauktoriserad åtkomst. Kompetensen omfattar åtgärder för att identifiera, analysera och hantera säkerhetsrisker samt implementera lösningar för att upprätthålla integritet och tillgänglighet av information och system.
alternative label: Network security
alternative label: Nätverkssäkerhet
broader: zmYu aAM TuF
related: BAeH eg8 T2d
related: 4Jty HpK a3Q
related: UXKZ 3zZ ipB

Affärsrätt
type: Concept
in scheme: JobTech Taxonomy - Färdighet
definition: Affärsrätt
broader: zmYu aAM TuF
related: q8wL kdi WaW
related: 6aak 8eh iwT

Marschmusik
type: Concept
in scheme: JobTech Taxonomy - Färdighet
definition: Marschmusik
broader: p1WM wCw LTd
related: AWJF wqZ va9

Assemblage
type: Concept
in scheme: JobTech Taxonomy - Färdighet
definition: Assemblage
broader: zmYu aAM TuF
related: 34Tn BQQ tfo

Mässdekoration
type: Concept
in scheme: JobTech Taxonomy - Färdighet
definition: Mässdekoration
broader: zmYu aAM TuF
related: CSUf ZVM a7Z

Laserskärning
type: Concept
in scheme: JobTech Taxonomy - Färdighet
definition: Laserskärning avser processen att använda en laser för att skära genom olika material med hög precision och hastighet. Denna kompetens involverar kunskap om laserutrustning, hantering av programvara för att styra skärprocessen samt förståelse för de fysiska och tekniska aspekterna av laserskärning för effektiv produktion.
broader: zmYu aAM TuF
related: vaEp iBS c5h
related: 4Jty HpK a3Q

Mäldberedning
type: Concept
in scheme: JobTech Taxonomy - Färdighet
definition: Mäldberedning
broader: zmYu aAM TuF
related: 1G6H AuG qyy

MS logo, programmeringsspråk
type: Concept
in scheme: JobTech Taxonomy - Färdighet
definition: MS logo, programmeringsspråk
alternative label: MS logo
broader: Datorspråk
related: BAeH eg8 T2d
related: Fv7d YhP YmS
related: D9SL mtn vGM
related: DJh5 yyF hEM
related: 4Jty HpK a3Q

Näringslära
type: Concept
in scheme: JobTech Taxonomy - Färdighet
definition: Näringslära
broader: zmYu aAM TuF
related: BStc SJh DKG
related: UjoW meY Zwt

Mensendieckpedagogik
type: Concept
in scheme: JobTech Taxonomy - Färdighet
definition: Mensendieckpedagogik
broader: zmYu aAM TuF
related: s7vU FhY L5Z

Fotvård/Pedikyr
type: Concept
in scheme: JobTech Taxonomy - Färdighet
definition: Fotvård/Pedikyr avser behandling av fötter för att åtgärda olika besvär, inklusive förhårdnader och nageltrång, samt att ge råd om egenvård och lämpliga hjälpmedel. Kompetensen omfattar medicinsk fotvård, vilket innebär en analys och behandling för att säkerställa fötternas hälsa.
alternative label: Fotvård
alternative label: Pedikyr
broader: zmYu aAM TuF
related: ezKk kss CiQ
related: HATH AfN RRz
related: xr7w N6Q QMA

Sportjournalistik
type: Concept
in scheme: JobTech Taxonomy - Färdighet
definition: Sportjournalistik
broader: zmYu aAM TuF
related: SgNH hag n9D

Biodrivmedel, utveckling
type: Concept
in scheme: JobTech Taxonomy - Färdighet
definition: Biodrivmedel, utveckling
broader: zmYu aAM TuF
related: qn2U dB9 Cmh
related: yXbD NTH ijE
related: PRQn 9yw NJA

Turnéteknik
type: Concept
in scheme: JobTech Taxonomy - Färdighet
definition: Turnéteknik avser kompetensen att planera, organisera och genomföra tekniska aspekter av turnéer inom underhållningsbranschen. Detta innefattar hantering av utrustning för ljud, ljus och scen, samt logistiska arrangemang för att säkerställa att produktioner genomförs smidigt och effektivt.
broader: zmYu aAM TuF
related: 4BsK q2C sCL
related: bwnk nv2 1cR
related: CkRH 4Qn iX3
related: 4Jty HpK a3Q

Sortering av byggavfall
type: Concept
in scheme: JobTech Taxonomy - Färdighet
definition: Sortering av byggavfall avser processen att kategorisera och separera olika typer av material som uppkommer vid bygg- och anläggningsprojekt för att underlätta återvinning och korrekt avfallshantering.
broader: zmYu aAM TuF
related: 3ZtN hhA SM7
related: bZ4J riZ zK6
related: V79C DD2 3Gj
related: 3g5x Tm7 8QH
related: QKvX v7r PNL
related: Y4j1 P17 wVA
related: q2Ge zrQ zJb
related: 9mJN VwW Xjg
related: yXbD NTH ijE
related: AD3U cFH rbe
related: NnB3 eWH auo
related: iHrC aRv fVm
related: bXfo 4hb SXx

Libanesiskt kök
type: Concept
in scheme: JobTech Taxonomy - Färdighet
definition: Libanesiskt kök
broader: zmYu aAM TuF
related: BStc SJh DKG

Smältning, ädelmetaller
type: Concept
in scheme: JobTech Taxonomy - Färdighet
definition: Smältning, ädelmetaller
broader: zmYu aAM TuF
related: nwSm phw sPo

Ljuddesign
type: Concept
in scheme: JobTech Taxonomy - Färdighet
definition: Ljuddesign
broader: zmYu aAM TuF
related: 4BsK q2C sCL
related: CkRH 4Qn iX3
related: 4Jty HpK a3Q

Kärnkemi
type: Concept
in scheme: JobTech Taxonomy - Färdighet
definition: Kärnkemi
broader: zmYu aAM TuF
related: eofS oZs RZi

Klarinett
type: Concept
in scheme: JobTech Taxonomy - Färdighet
definition: Klarinett
broader: wLYs CKS wK8
related: AWJF wqZ va9

Kött, fileteringsvana
type: Concept
in scheme: JobTech Taxonomy - Färdighet
definition: Kött, fileteringsvana
broader: zmYu aAM TuF
related: QqHf XKZ eyy

Samhällsplanering
type: Concept
in scheme: JobTech Taxonomy - Färdighet
definition: Samhällsplanering
broader: zmYu aAM TuF
related: GMDo DVo Yzh
related: thZP oR7 WrY
related: Pd51 xnr KCY
related: XeBP nMe pXx

Skogsingenjörsexamen
type: Concept
in scheme: JobTech Taxonomy - Färdighet
definition: Skogsingenjörsexamen
broader: Yrkesbevis/examen
related: yXbD NTH ijE
related: 9QMD sZ3 ZjX
related: 3LdB WEJ 8Ms

Legitimation som apotekare
type: Concept
in scheme: JobTech Taxonomy - Färdighet
definition: Legitimation som krävs för att kunna arbeta som apotekare i Sverige. Utfärdas av Socialstyrelsen.
broader: Yrkesbevis/examen
related: 4P8B LtK JgE
related: r1Gk 3EN bpw
related: TMsM oNw j6z

Elkraftbesiktning
type: Concept
in scheme: JobTech Taxonomy - Färdighet
definition: Elkraftbesiktning avser processen att inspektera och utvärdera elektrotekniska anläggningar och system för att säkerställa att de uppfyller gällande säkerhetsstandarder och funktionskrav. Detta inkluderar kontroll av installationer, drift och underhåll av elektrisk utrustning samt analyser av systemens prestanda och säkerhet.
broader: zmYu aAM TuF
related: nDaB vdy eAy
related: SPYW 7Z1 ShT

Pagespinner, HTML-editor
type: Concept
in scheme: JobTech Taxonomy - Färdighet
definition: Pagespinner, HTML-editor
alternative label: Pagespinner
broader: Programmerings- och systemutvecklingsverktyg
related: 8Bmh vtM zts
related: D9SL mtn vGM
related: 4Jty HpK a3Q
related: Mbt6 3ko DiD
related: MYAz x9m 2LJ

Dataanalys
type: Concept
in scheme: JobTech Taxonomy - Färdighet
definition: Dataanalys
broader: zmYu aAM TuF
related: jv1x tpK 32p
related: yXbD NTH ijE
related: WX67 Pfb WMN
related: PRQn 9yw NJA
related: e9FK VKh ahW
related: 4Jty HpK a3Q
related: AHmo qSf viN

Våtrumsbehörighet/BKR, GBR
type: Concept
in scheme: JobTech Taxonomy - Färdighet
definition: Våtrumsbehörighet/BKR, GBR
alternative label: BKR, GBR
alternative label: Våtrumsbehörighet
broader: s48H Sft DTn
related: NnB3 eWH auo

Psykiatrisk vård, specialistområde för sjuksköterska
type: Concept
in scheme: JobTech Taxonomy - Färdighet
definition: En fördjupad specialistkompetens för sjuksköterska inom psykiatrisk vård.
broader: Specialistområde för sjuksköterska
related: bEDv SL7 VrL

Citrix, integrationsplattform
type: Concept
in scheme: JobTech Taxonomy - Färdighet
definition: Citrix, integrationsplattform
alternative label: Citrix
alternative label: Citrixkompetens
alternative label: Citrixkunskaper
broader: Integrationsplattformar
related: BAeH eg8 T2d
related: 4Jty HpK a3Q
related: UXKZ 3zZ ipB

Hushållsmaskiner, servicevana
type: Concept
in scheme: JobTech Taxonomy - Färdighet
definition: Hushållsmaskiner, servicevana
broader: zmYu aAM TuF
related: a75S eLg JWH
related: yyF7 jsW EeP

Informationsmodellering
type: Concept
in scheme: JobTech Taxonomy - Färdighet
definition: Informationsmodellering avser processen att strukturera och organisera information på ett sätt som gör den lätt att förstå, hantera och använda inom olika system. Kompetensen innefattar skapandet av modeller som beskriver data och dess relationer samt identifiering av informationsbehov för att underlätta effektiv systemutveckling och analys.
broader: zmYu aAM TuF
related: DJh5 yyF hEM
related: 4Jty HpK a3Q
related: UXKZ 3zZ ipB

Betongskulptur
type: Concept
in scheme: JobTech Taxonomy - Färdighet
definition: Betongskulptur
broader: zmYu aAM TuF
related: 34Tn BQQ tfo

Etologi
type: Concept
in scheme: JobTech Taxonomy - Färdighet
definition: Etologi
broader: zmYu aAM TuF
related: XurM DVs ggn
related: 8q1B 5AR CEM
related: e9FK VKh ahW
related: WL4E r4b ek4
related: 3LdB WEJ 8Ms

Schemaläggning, hälso- och sjukvård
type: Concept
in scheme: JobTech Taxonomy - Färdighet
definition: Schemaläggning inom hälso- och sjukvård avser planenlig organisering av arbetsuppgifter och personalresurser för att säkerställa effektiv och kontinuerlig vård. Den omfattar fördelning av arbetstid och resurser för att möta patienternas behov samt optimera arbetsflöden inom vårdinrättningar.
broader: zmYu aAM TuF
related: NFUg y9y 1TY
related: bEDv SL7 VrL
related: 6eAB cbY i9T
related: PHJN fva yxs
related: jY19 knH MJp
related: nrVt xUL KdQ
related: LP4Z ABV gRm
related: 1tGC fXC mxX
related: cuaN Rj5 YCc
related: dyWo sDb MLQ
related: 3H17 ZZr BEc
related: tAJS JNb hDH
related: 6zAR EHM Kwj
related: Z8ci bBE tmx
related: vTgW pnr QMp

Programvara för digitalt skapande
type: Concept
in scheme: JobTech Taxonomy - Färdighet
top concept of: JobTech Taxonomy - Färdighet
definition: Programvara för digitalt skapande
narrower: QLab
narrower: Film/effekter-Autodesk Cleaner
narrower: 3D-grafik-McNeel Rhino 3D
narrower: jYGN rDK tM2
narrower: 3D-grafik-Carrara
narrower: Ljud-Steinberg Nuendo
narrower: Webbdesign-Adobe Dreamweaver
narrower: Ljud-Steinberg Cubase
narrower: jpcS H9h 7qK
narrower: 2D-grafik-Corel Paint Shop Pro
narrower: Film/redigering-Media 100
narrower: 3D-grafik-Newtek Lightwave 3D
narrower: Film/effekter-eyeon Fusion
narrower: wXRm Aq3 9D8
narrower: 3D-grafik-Autodesk 3ds Max
narrower: Ljud-Ableton Live
narrower: Ljud-Sound Forge
narrower: kmFW EKW yWf
narrower: 3D-grafik-Autodesk Maya
narrower: Ljud-Apple Logic Pro
narrower: nvXa KhJ VWE
narrower: vSqz 6Hj Jrg
narrower: puiy Nb9 yUF
narrower: 3D-grafik-Autodesk Softimage
narrower: Capture One
narrower: zxxJ VTR hpo
narrower: 3D-grafik-Smith Micro Anime Studio Pro
narrower: Manusprogram-Celtx
narrower: mVXq Xyf Hps
narrower: Webbdesign-Adobe Fireworks
narrower: Webbdesign-Wordpress
narrower: Layout-Adobe FrameMaker
narrower: Layout-QuarkXpress
narrower: pLyW JYJ TFq
narrower: 3D-grafik-caligari trueSpace
narrower: Film/redigering-DaVinci Resolve
narrower: vvYA pay Yhj
narrower: Webbdesign-Adobe Animate/Flash
narrower: xNyv PTi fSa
narrower: 3D-grafik-Autodesk MotionBuilder
narrower: Film/redigering-Adobe Premiere
narrower: 2D-grafik-CorelDRAW
narrower: Manusprogram-Screenwriter
narrower: 3D-grafik-ZBrush
narrower: Film/redigering-Apple Final Cut Pro
narrower: Ljud-SoundBooth
narrower: tfVd Bm6 Qza
narrower: Film/effekter-Motion
narrower: 2D-grafik-Corel Painter
narrower: 2D-grafik-GIMP
narrower: wWte 6Xd fmQ
narrower: paEM G5u oz6
narrower: qPMJ D7M au8
narrower: 2D-grafik-Canvas
narrower: Film/redigering-Lightworks
narrower: Manusprogram-Final Draft
narrower: 3D-grafik-Smith Micro Poser Pro
narrower: Film/effekter-The Foundry Nuke
narrower: Ljud-Audition
narrower: 3D-grafik-Autodesk Alias
narrower: 2D-grafik-Autodesk SketchBook Pro
narrower: 3D-grafik-Blender
narrower: r8Zw MZC SKk
narrower: 3D-grafik-Maxon Cinema 4D
narrower: Film/effekter-Autodesk Combustion
narrower: qYWH 9ba mjv
narrower: Ljud-Pro Tools
narrower: Layout-Adobe InDesign
narrower: qK2A 9oq zx6
narrower: yPZE 8g9 8BA
narrower: Ljud-Sony Creative Software ACID Pro
narrower: Film/redigering-Autodesk Smoke
narrower: Film/effekter- Autodesk Flint/Flame/Inferno

Solfilmsmontering
type: Concept
in scheme: JobTech Taxonomy - Färdighet
definition: Solfilmsmontering
broader: zmYu aAM TuF
related: dKUb KBP mw3
related: J17g Q2a 2u1
related: Kxm9 N3V shF

Vält
type: Concept
in scheme: JobTech Taxonomy - Färdighet
definition: Vält
broader: zmYu aAM TuF
related: 3ZtN hhA SM7
related: bZ4J riZ zK6

Materialkemi
type: Concept
in scheme: JobTech Taxonomy - Färdighet
definition: Materialkemi
broader: zmYu aAM TuF
related: qn2U dB9 Cmh
related: eofS oZs RZi

Transportledning, persontrafik
type: Concept
in scheme: JobTech Taxonomy - Färdighet
definition: Transportledning, persontrafik
broader: zmYu aAM TuF
related: 4Jty HpK a3Q
related: 957L kZK rHZ

IFC ACC/ICF Associate Certified Coach
type: Concept
in scheme: JobTech Taxonomy - Färdighet
definition: IFC ACC/ICF Associate Certified Coach
alternative label: ICF Associate Certified Coach
alternative label: IFC ACC
broader: s48H Sft DTn
related: Qo7p wjf gtv
related: vPP6 rsw dck
related: 1CX5 mZw Vcq
related: jJF3 qaQ Zsh
related: bjqk F3A 5Hk

Kem-tekniska artiklar
type: Concept
in scheme: JobTech Taxonomy - Färdighet
definition: Kem-tekniska artiklar
broader: zmYu aAM TuF
related: oXSW fbY XrY
related: YKL2 FCB 1yr
related: s1Qk o98 2o1
related: 85cq 6uK 4cK

Säljledning
type: Concept
in scheme: JobTech Taxonomy - Färdighet
definition: Säljledning
broader: zmYu aAM TuF
related: oXSW fbY XrY

Pedagogiskt ledarskap
type: Concept
in scheme: JobTech Taxonomy - Färdighet
definition: Pedagogiskt ledarskap
broader: zmYu aAM TuF
related: 8SPu K1k 5qR
related: 3FP7 4Eg x8P
related: coyZ Cyv Srw
related: NxXz fBh w7j
related: 7mn2 kA9 ftp
related: Fp7x Yqt bx9
related: z8di AqX GBr
related: g6eC Fwu B3J
related: 4GAs rKs 2Ne
related: uxst tkg zDh
related: X1Ac Y9P PJo
related: 3i4a Ufc qpp
related: nNxJ YWy vR2
related: 1uau t1u rDL

Paketeringsvana, livsmedel
type: Concept
in scheme: JobTech Taxonomy - Färdighet
definition: Paketeringsvana, livsmedel avser kompetens inom hantering och förpackning av livsmedelsprodukter för att säkerställa hållbarhet och kvalitet. Denna kompetens innefattar kunskaper om olika paketeringstekniker och -material samt föreskrifter som relaterar till livsmedelssäkerhet och märkning.
broader: zmYu aAM TuF
related: QqHf XKZ eyy
related: gJtZ EBc n2z

Militärmusik
type: Concept
in scheme: JobTech Taxonomy - Färdighet
definition: Militärmusik
broader: p1WM wCw LTd
related: AWJF wqZ va9

Norstedts Compact, redovisningssystem
type: Concept
in scheme: JobTech Taxonomy - Färdighet
definition: Norstedts Compact, redovisningssystem
alternative label: Norstedts Compact
broader: xSJR 1Kq pxB
related: eQ4M CNm ozj
related: q81z 3oD 1qu
related: ij8k EwC zyB
related: 4Jty HpK a3Q

Gesällbrev, modist
type: Concept
in scheme: JobTech Taxonomy - Färdighet
definition: Gesällbrev, modist
broader: Yrkesbevis/examen
related: mwVN oEH g9k

Betongpumpning, erfarenhet
type: Concept
in scheme: JobTech Taxonomy - Färdighet
definition: Betongpumpning, erfarenhet avser praktisk kunskap och färdighet att använda betongpumpar för att förflytta betong från en plats till en annan i bygg- och anläggningsprojekt.
broader: zmYu aAM TuF
related: q2Ge zrQ zJb
related: 9mJN VwW Xjg
related: 3MBw pDA P2F
related: AD3U cFH rbe

Fristråleblästring
type: Concept
in scheme: JobTech Taxonomy - Färdighet
definition: Fristråleblästring
broader: zmYu aAM TuF
related: idjo 2Wr a3E

Mästarbrev, väskmakare
type: Concept
in scheme: JobTech Taxonomy - Färdighet
definition: Mästarbrev, väskmakare
broader: Yrkesbevis/examen
related: vJQk YvC XB7

Radio
type: Concept
in scheme: JobTech Taxonomy - Färdighet
definition: Radio
broader: zmYu aAM TuF
related: zfve s6G tpc
related: rYSG 3WJ LmC

Skor
type: Concept
in scheme: JobTech Taxonomy - Färdighet
definition: Skor
broader: zmYu aAM TuF
related: oXSW fbY XrY
related: YKL2 FCB 1yr
related: 85cq 6uK 4cK

Geologisk tidsskala
type: Concept
in scheme: JobTech Taxonomy - Färdighet
definition: Geologisk tidsskala
alternative label: Geokronologi
broader: zmYu aAM TuF
related: V7Yz 4WV g4z

Järnkonstruktionsmontage
type: Concept
in scheme: JobTech Taxonomy - Färdighet
definition: Järnkonstruktionsmontage
broader: zmYu aAM TuF
related: TrwQ RXT W8a

Ortopedi, specialistkompetens för fysioterapeuter
type: Concept
in scheme: JobTech Taxonomy - Färdighet
definition: Ortopedi, specialistkompetens för fysioterapeuter
broader: Specialistinriktning inom fysioterapi
related: s7vU FhY L5Z

Grafiska gränssnitt/GUI
type: Concept
in scheme: JobTech Taxonomy - Färdighet
definition: Grafiska gränssnitt/GUI
alternative label: GUI
alternative label: Grafiska gränssnitt
broader: zmYu aAM TuF
related: Q5DF juj 8do
related: DJh5 yyF hEM
related: 4Jty HpK a3Q
related: UXKZ 3zZ ipB

Motionsidrott, ledarerfarenhet
type: Concept
in scheme: JobTech Taxonomy - Färdighet
definition: Motionsidrott, ledarerfarenhet avser erfarenhet av att leda och instruera individer inom motionsidrott. Denna kompetens omfattar kunskaper och färdigheter i att arrangera, planera och genomföra träningspass samt att motivera deltagare i deras idrottsliga aktiviteter.
broader: zmYu aAM TuF
related: EA6o N1N QtT

Visuell design
type: Concept
in scheme: JobTech Taxonomy - Färdighet
definition: Visuell design
broader: zmYu aAM TuF
related: UxT1 tPF Kbg
related: 4Jty HpK a3Q

Alfabetisk dataregistrering
type: Concept
in scheme: JobTech Taxonomy - Färdighet
definition: Alfabetisk dataregistrering
broader: zmYu aAM TuF
related: eQ4M CNm ozj
related: ZQTR hVC QhJ
related: MGk3 LvL AU2
related: pwRH MT1 8nR
related: 4Jty HpK a3Q

Karaktärsdans, undervisning
type: Concept
in scheme: JobTech Taxonomy - Färdighet
definition: Karaktärsdans, undervisning
broader: zmYu aAM TuF
related: mcRJ kq2 jFr

Månadsrapporter
type: Concept
in scheme: JobTech Taxonomy - Färdighet
definition: Månadsrapporter
broader: zmYu aAM TuF
related: Y6yY SuR hVh
related: Uw4n UB2 RCW
related: q81z 3oD 1qu
related: mZsb A1K Gec
related: cRmd 536 pT1

Konstnärlig vision, utforma
type: Concept
in scheme: JobTech Taxonomy - Färdighet
definition: Konstnärlig vision, utforma
broader: zmYu aAM TuF
related: iBUL s38 izZ
related: AWJF wqZ va9
related: 34Tn BQQ tfo
related: 4BsK q2C sCL
related: 1Nwn GYH wkH
related: zfve s6G tpc
related: xuSE mtB Mir
related: PF4H kQD zpL
related: rYSG 3WJ LmC
related: gmRr 7tt eHj

Västgötska
type: Concept
in scheme: JobTech Taxonomy - Färdighet
definition: Västgötska
broader: Dialekt
related: iBUL s38 izZ

AJAX, programmeringsspråk
type: Concept
in scheme: JobTech Taxonomy - Färdighet
definition: AJAX, programmeringsspråk
alternative label: AJAX
broader: Datorspråk
related: BAeH eg8 T2d
related: Fv7d YhP YmS
related: nDaB vdy eAy
related: D9SL mtn vGM
related: DJh5 yyF hEM
related: SPYW 7Z1 ShT
related: 4Jty HpK a3Q

cGXP
type: Concept
in scheme: JobTech Taxonomy - Färdighet
definition: cGXP
broader: Kvalitetssystem
related: XeBP nMe pXx

Diplomerad naturterapeut
type: Concept
in scheme: JobTech Taxonomy - Färdighet
definition: Diplomering inom naturterapi avser att man tillägnat sig kundskaper inom behandling genom naturterapi, enligt branschstandarder.
broader: s48H Sft DTn
related: F19Z oB6 pg3

Brandlarm
type: Concept
in scheme: JobTech Taxonomy - Färdighet
definition: Brandlarm
broader: zmYu aAM TuF
related: df9D e6y 61z
related: 4Jty HpK a3Q
related: iqZh 3yX i8n

Legitimation som fysioterapeut
type: Concept
in scheme: JobTech Taxonomy - Färdighet
definition: Legitimation som krävs för att kunna arbeta som fysioterapeut i Sverige. Utfärdas av Socialstyrelsen.
alternative label: Legitimation som sjukgymnast
broader: Yrkesbevis/examen
related: Uw64 cuc U3H
related: TPH4 2AM isT
related: s7vU FhY L5Z
related: 4P8B LtK JgE
related: r1Gk 3EN bpw
related: Z8ci bBE tmx

Begränsat fartygsbefäl klass VIII, inre fart
type: Concept
in scheme: JobTech Taxonomy - Färdighet
definition: Begränsat fartygsbefäl klass VIII, inre fart
broader: Behörigheter, sjöfart
related: kZwz D8K bKs
related: kDnq Q98 sD3

Snickeri, film/Snickeri, TV
type: Concept
in scheme: JobTech Taxonomy - Färdighet
definition: Snickeri, film/Snickeri, TV avser hantverkskompetensen att tillverka och reparera träprodukter för film- och televisionproduktioner. Denna kompetens omfattar både konstruktion av scenografi och anpassning av inredningar för att möta specifika estetiska och funktionella krav i visuell media.
alternative label: Snickeri, TV
alternative label: Snickeri, film
broader: zmYu aAM TuF
related: 9mJN VwW Xjg
related: 1Nwn GYH wkH

Rugby, instruktör/Rugby, tränare
type: Concept
in scheme: JobTech Taxonomy - Färdighet
definition: Rugby, instruktör/Rugby, tränare
alternative label: Rugby, instruktör
alternative label: Rugby, tränare
broader: Idrott/aktivitet
related: EA6o N1N QtT

Auktoriserad translator
type: Concept
in scheme: JobTech Taxonomy - Färdighet
definition: Auktoriserad translator
broader: Yrkesbevis/examen
related: PQDm Z63 zst

Ungdomspsykologi
type: Concept
in scheme: JobTech Taxonomy - Färdighet
definition: Ungdomspsykologi
broader: zmYu aAM TuF
related: VYeq GDF a2g

Bordsservering
type: Concept
in scheme: JobTech Taxonomy - Färdighet
definition: Bordsservering avser processen att servera mat och dryck till gäster på restauranger, hotell eller liknande verksamheter. Kompetensen omfattar uppgifter som att ta emot beställningar, servera rätter och drycker samt åtgärder för att säkerställa en hög servicenivå och en positiv upplevelse för gästerna.
broader: zmYu aAM TuF
related: UjoW meY Zwt
related: 1wqU Jhj amb
related: tPox ie4 X9X

Mediepedagogik
type: Concept
in scheme: JobTech Taxonomy - Färdighet
definition: Mediepedagogik avser att planera och genomföra utbildningar som stärker elevers och personals förmåga att använda och förstå digitala medier och informationsflöden. Vanliga arbetsuppgifter är att skapa och leda workshops, producera digitalt utbildningsmaterial samt handleda i källkritik och mediekunskap.
broader: zmYu aAM TuF
related: 1CX5 mZw Vcq

Skärande bearbetning
type: Concept
in scheme: JobTech Taxonomy - Färdighet
definition: Skärande bearbetning
broader: zmYu aAM TuF
related: VKKg e4t t46
related: vaEp iBS c5h

Relationsdatabaser
type: Concept
in scheme: JobTech Taxonomy - Färdighet
definition: Relationsdatabaser avser en typ av databas som organiserar data i tabeller där relationer mellan dessa tabeller definieras genom nycklar. Kompetensen innefattar förståelse för databasdesign, SQL-syntax och förmåga att hantera databasoperationer såsom skapande, läsning, uppdatering och radering av data.
broader: Databaser
related: BAeH eg8 T2d
related: cBBa ngH fCx
related: Fv7d YhP YmS
related: D9SL mtn vGM
related: DJh5 yyF hEM
related: 4Jty HpK a3Q
related: MYAz x9m 2LJ

Data och teknik, undervisning högskolenivå
type: Concept
in scheme: JobTech Taxonomy - Färdighet
definition: Data och teknik, undervisning högskolenivå
broader: Inriktning på högskolelärarkompetens
related: Gm5j S2Y aTB
related: NNK9 F1o pK5
related: cYCo PxY zQd
related: RPBE x5M cXX
related: 4Jty HpK a3Q
related: P7eS nP8 3dy

Bakteriologi
type: Concept
in scheme: JobTech Taxonomy - Färdighet
definition: Bakteriologi
broader: zmYu aAM TuF
related: Z2MZ eYc Lfv
related: dsK3 hkt zGy
related: e9FK VKh ahW

CAM-tillverkning
type: Concept
in scheme: JobTech Taxonomy - Färdighet
definition: CAM-tillverkning
broader: zmYu aAM TuF
related: K8yg U4C gkY
related: 4Jty HpK a3Q

B-foto
type: Concept
in scheme: JobTech Taxonomy - Färdighet
definition: B-foto
broader: zmYu aAM TuF
related: 4BsK q2C sCL
related: CkRH 4Qn iX3
related: 3J38 DNz YKK

VVS, el, tele-POINT VVS
type: Concept
in scheme: JobTech Taxonomy - Färdighet
definition: VVS, el, tele-POINT VVS
broader: mTLu uo2 gq2
related: K8yg U4C gkY
related: nDaB vdy eAy
related: SPYW 7Z1 ShT
related: PRQn 9yw NJA
related: 4Jty HpK a3Q

Yrkesbevis, PRYL
type: Concept
in scheme: JobTech Taxonomy - Färdighet
definition: Yrkesbevis som intygar kompetens inom städbranschen. Utfärdas av Svenska Special Certifieringar AB.
broader: Yrkesbevis/examen
related: Z6TY xDf Yup
related: yXbD NTH ijE
related: FtyZ Joo tB8

Torrlastfartyg
type: Concept
in scheme: JobTech Taxonomy - Färdighet
definition: Torrlastfartyg
broader: Övriga specialiteter, sjöfart
related: CbQK 7th Tyf
related: KttZ Skc bMR
related: kDnq Q98 sD3

Kriminalteknisk utbildning
type: Concept
in scheme: JobTech Taxonomy - Färdighet
definition: Kriminalteknisk utbildning
broader: Yrkesbevis/examen
related: rNcE Zno pD8
related: 4Jty HpK a3Q

Massakokning
type: Concept
in scheme: JobTech Taxonomy - Färdighet
definition: Massakokning avser den industriella processen för att framställa pappersmassa genom kemiska och mekaniska metoder. Kompetensen innefattar kunskap om och färdighet i att hantera och övervaka den utrustning och de processer som används för att koka och behandla råmaterial, vilket är avgörande för produktion av högkvalitativ pappersmassa.
broader: zmYu aAM TuF
related: 4obu LL6 RqJ

Trägravyr
type: Concept
in scheme: JobTech Taxonomy - Färdighet
definition: Trägravyr
broader: zmYu aAM TuF
related: e6nk AGp y28
related: aKdV u7V R5j

OpenCL, programmeringsspråk
type: Concept
in scheme: JobTech Taxonomy - Färdighet
definition: OpenCL, programmeringsspråk
alternative label: OpenCL
broader: Datorspråk
related: BAeH eg8 T2d
related: Fv7d YhP YmS
related: 8Bmh vtM zts
related: D9SL mtn vGM
related: DJh5 yyF hEM
related: SPYW 7Z1 ShT
related: 4Jty HpK a3Q
related: Mbt6 3ko DiD

Molnteknik
type: Concept
in scheme: JobTech Taxonomy - Färdighet
definition: Molnteknik avser kompetens inom design, implementering och förvaltning av molnbaserade lösningar och tjänster för IT-system. Detta innefattar utveckling av strategier för datalagring, applikationsutveckling och användning av resurser i molnet, såväl som säkerhet och integration med befintliga system.
broader: zmYu aAM TuF
related: VCpu 5EN bBt
related: DJh5 yyF hEM
related: 4Jty HpK a3Q
related: 13md uyV BNG
related: UXKZ 3zZ ipB
related: MYAz x9m 2LJ

Stamdragning
type: Concept
in scheme: JobTech Taxonomy - Färdighet
definition: Stamdragning
broader: zmYu aAM TuF
related: fLKb bJ3 69p

Vaktmästeri, hotell
type: Concept
in scheme: JobTech Taxonomy - Färdighet
definition: Vaktmästeri, hotell
broader: zmYu aAM TuF
related: 9DdK AZY ZNK

Smörgåsbord
type: Concept
in scheme: JobTech Taxonomy - Färdighet
definition: Smörgåsbord
broader: zmYu aAM TuF
related: BStc SJh DKG

Aptana Studio, HTML-editor
type: Concept
in scheme: JobTech Taxonomy - Färdighet
definition: Aptana Studio, HTML-editor
alternative label: Aptana Studio
broader: Programmerings- och systemutvecklingsverktyg
related: 8Bmh vtM zts
related: D9SL mtn vGM
related: 4Jty HpK a3Q
related: Mbt6 3ko DiD
related: MYAz x9m 2LJ

NetBeans, integrerad utvecklingsmiljö
type: Concept
in scheme: JobTech Taxonomy - Färdighet
definition: NetBeans, integrerad utvecklingsmiljö
alternative label: NetBeans
broader: Programmerings- och systemutvecklingsverktyg
related: D9SL mtn vGM
related: DJh5 yyF hEM
related: 4Jty HpK a3Q
related: MYAz x9m 2LJ

Remburs
type: Concept
in scheme: JobTech Taxonomy - Färdighet
definition: Remburs
broader: zmYu aAM TuF
related: Y6yY SuR hVh
related: Bbkh nrm 2J8
related: pTr9 RBT 9ur
related: FfMN Bw1 qYR

Plastreparationer
type: Concept
in scheme: JobTech Taxonomy - Färdighet
definition: Plastreparationer avser färdigheten att reparera skador på produkter och konstruktioner tillverkade av plastmaterial. Denna kompetens omfattar metoder för att återställa funktion och estetik på plastkomponenter som används inom olika branscher.
broader: zmYu aAM TuF
related: Lzpv ofL 3H5
related: dKUb KBP mw3
related: yPQ4 EaN Dtj
related: L4hA SJP SFi

Mästarbrev, bagare och konditor
type: Concept
in scheme: JobTech Taxonomy - Färdighet
definition: Mästarbrev, bagare och konditor är ett bevis på högsta kompetensnivå inom ett hantverksyrke där innehavaren har uppnått mästarnivå, oftast genom ett mästarprov och uppfyllande av samtliga krav enligt branschens regler. Utfärdas av Sveriges hantverksråd i samråd med aktuell branschorganisation.
broader: Yrkesbevis/examen
related: 5qT8 z9d 8rw

Texttelefon
type: Concept
in scheme: JobTech Taxonomy - Färdighet
definition: Texttelefon
broader: zmYu aAM TuF
related: 4aPu 2nd 8X6
related: kZwz D8K bKs
related: 4Jty HpK a3Q

Ytkemi
type: Concept
in scheme: JobTech Taxonomy - Färdighet
definition: Ytkemi
broader: zmYu aAM TuF
related: qn2U dB9 Cmh
related: bExu 8gk azk

MS Excel
type: Concept
in scheme: JobTech Taxonomy - Färdighet
definition: MS Excel
broader: Allmänna datakunskaper
related: eQ4M CNm ozj
related: Y6yY SuR hVh
related: Uw4n UB2 RCW
related: fdLf oPp wVw
related: vPP6 rsw dck
related: iWcY mko rq2
related: ZQTR hVC QhJ
related: br6a VVS V3y
related: 1CX5 mZw Vcq
related: L7eh ihX vM5
related: MGk3 LvL AU2
related: jJF3 qaQ Zsh
related: oEmP NC1 sXE
related: q81z 3oD 1qu
related: bjqk F3A 5Hk
related: H2Zj eL9 x28
related: dJXy Rpq a2u
related: pwRH MT1 8nR
related: cRmd 536 pT1
related: zKvJ GnC Szx
related: n6iX f2z XfE
related: DZVN v5g Fco
related: ij8k EwC zyB
related: JfYV ZGg 6rm
related: rYSG 3WJ LmC
related: vCAb uuo ek5
related: 4Jty HpK a3Q
related: p16X 44f rwZ
related: pok1 ipJ yzD

Områdesansvar, lantbruk
type: Concept
in scheme: JobTech Taxonomy - Färdighet
definition: Områdesansvar, lantbruk
broader: zmYu aAM TuF
related: 9QMD sZ3 ZjX

Mobilfotografering/Mobilfilmning
type: Concept
in scheme: JobTech Taxonomy - Färdighet
definition: Mobilfotografering/Mobilfilmning
alternative label: Mobilfilmning
alternative label: Mobilfotografering
broader: zmYu aAM TuF
related: 3J38 DNz YKK

Waldorfpedagogik, utbildning
type: Concept
in scheme: JobTech Taxonomy - Färdighet
definition: Waldorfpedagogik, utbildning
broader: zmYu aAM TuF
related: 2x2V UeL 6ke
related: 3FP7 4Eg x8P
related: 4KhP FxL uZ5
related: oQUQ D11 HPx
related: 5ek3 Cgq WeZ

Marknadsföring/PR
type: Concept
in scheme: JobTech Taxonomy - Färdighet
definition: Marknadsföring/PR avser strategiska och kreativa processer för att främja produkter, tjänster eller varumärken, samt kommunikativa insatser för att hantera relationer med olika intressenter. Kompetensen omfattar insamling och analys av marknadsdata, skapande av reklamkampanjer samt utveckling av kommunikationsstrategier för att påverka målgrupper positivt.
alternative label: Marknadsföring
alternative label: PR
broader: zmYu aAM TuF
related: SgNH hag n9D
related: dUuh wwa FGj
related: WX67 Pfb WMN
related: wby2 mwq fWV
related: zfve s6G tpc
related: nNxJ YWy vR2
related: 4Jty HpK a3Q

Landhockey, instruktör/Landhockey, tränare
type: Concept
in scheme: JobTech Taxonomy - Färdighet
definition: Landhockey, instruktör/Landhockey, tränare
alternative label: Landhockey, instruktör
alternative label: Landhockey, tränare
broader: Idrott/aktivitet
related: EA6o N1N QtT

QLab
type: Concept
in scheme: JobTech Taxonomy - Färdighet
definition: QLab
broader: Programvara för digitalt skapande
related: 4BsK q2C sCL
related: 4Jty HpK a3Q

Utställningsteknik
type: Concept
in scheme: JobTech Taxonomy - Färdighet
definition: Utställningsteknik
broader: zmYu aAM TuF
related: 4BsK q2C sCL
related: CkRH 4Qn iX3
related: 4Jty HpK a3Q

Lantmäteriteknik
type: Concept
in scheme: JobTech Taxonomy - Färdighet
definition: Lantmäteriteknik avser kompetens att mäta, kartlägga och analysera geografisk information med verktyg som GPS, totalstationer och GIS-system. Detta innefattar geodetiska mätningar, fastighetsindelning, 3D-modellering och hantering av geodata för samhällsplanering och infrastruktur.
broader: zmYu aAM TuF
related: GMDo DVo Yzh
related: ketV G9W GeR

Digital kartteknik
type: Concept
in scheme: JobTech Taxonomy - Färdighet
definition: Digital kartteknik
broader: zmYu aAM TuF
related: ketV G9W GeR
related: 4Jty HpK a3Q

Gestaltterapi
type: Concept
in scheme: JobTech Taxonomy - Färdighet
definition: Gestaltterapi
broader: zmYu aAM TuF
related: BWwk fYX S5B
related: UUQi UJ5 MSb
related: VYeq GDF a2g

Samordning/Granskning-Autodesk Navisworks Review
type: Concept
in scheme: JobTech Taxonomy - Färdighet
definition: Samordning/Granskning-Autodesk Navisworks Review
alternative label: Granskning-Autodesk Navisworks Review
alternative label: Samordning-Autodesk Navisworks Review
broader: mTLu uo2 gq2
related: 3jEy yuT aVo
related: thZP oR7 WrY
related: w6ud quG dgh
related: K8yg U4C gkY
related: nDaB vdy eAy
related: 33Nt DSs YYA
related: Pd51 xnr KCY
related: ketV G9W GeR
related: SPYW 7Z1 ShT
related: XeBP nMe pXx
related: PRQn 9yw NJA
related: ETAR ggZ Wuw
related: 41KB bfk 5jR
related: 4Jty HpK a3Q

IntelliJ, integrerad utvecklingsmiljö
type: Concept
in scheme: JobTech Taxonomy - Färdighet
definition: IntelliJ, integrerad utvecklingsmiljö
alternative label: IntelliJ
broader: Programmerings- och systemutvecklingsverktyg
related: D9SL mtn vGM
related: DJh5 yyF hEM
related: 4Jty HpK a3Q
related: MYAz x9m 2LJ

Styrkeledare räddningstjänst, erfarenhet
type: Concept
in scheme: JobTech Taxonomy - Färdighet
definition: Styrkeledare räddningstjänst, erfarenhet
broader: zmYu aAM TuF
related: ug5y o6z U3L

Företagsbiblioteksinriktning
type: Concept
in scheme: JobTech Taxonomy - Färdighet
definition: Företagsbiblioteksinriktning
broader: zmYu aAM TuF
related: wVfo Njx 1rB

Specialtransporter, körvana
type: Concept
in scheme: JobTech Taxonomy - Färdighet
definition: Specialtransporter, körvana avser erfarenhet och kompetens i att hantera och köra fordon som är anpassade förspecialtransporter av gods, vilket inkluderar känsliga eller otympliga laster. Denna körvana innefattar kunskap om säkerhetsprocedurer, förordningar samt körtekniker som är relevanta för att säkerställa en effektiv och säker transport av speciella och ofta tunga laster.
broader: zmYu aAM TuF
related: 3MBw pDA P2F

Följespot
type: Concept
in scheme: JobTech Taxonomy - Färdighet
definition: Följespot
broader: zmYu aAM TuF
related: 4BsK q2C sCL
related: CkRH 4Qn iX3

Cembalo, undervisning musikskola
type: Concept
in scheme: JobTech Taxonomy - Färdighet
definition: Cembalo, undervisning musikskola
broader: zmYu aAM TuF
related: mcRJ kq2 jFr

Förlagskunskap
type: Concept
in scheme: JobTech Taxonomy - Färdighet
definition: Förlagskunskap
broader: zmYu aAM TuF
related: SgNH hag n9D
related: zfve s6G tpc

SCCM, systemutvecklingsverktyg
type: Concept
in scheme: JobTech Taxonomy - Färdighet
definition: SCCM, systemutvecklingsverktyg
alternative label: SCCM
broader: Programmerings- och systemutvecklingsverktyg
related: DJh5 yyF hEM
related: 4Jty HpK a3Q
related: UXKZ 3zZ ipB

Rostskadereparationer
type: Concept
in scheme: JobTech Taxonomy - Färdighet
definition: Rostskadereparationer avser åtgärder för att återskapa metallytor som har drabbats av rostskador. Denna kompetens kräver kunskaper om inspektion, behandling och omlackering av skadade ytor för att säkerställa hållbarhet och funktionalitet.
broader: zmYu aAM TuF
related: Lzpv ofL 3H5
related: L4hA SJP SFi

Bilinspektörsutbildning
type: Concept
in scheme: JobTech Taxonomy - Färdighet
definition: Bilinspektörsutbildning är en yrkesinriktad eftergymnasial utbildning med inriktning mot fordonskontroll.
broader: Yrkesbevis/examen
related: nuXg Wjc JPd

Charkuterier, tillverkning
type: Concept
in scheme: JobTech Taxonomy - Färdighet
definition: Charkuterier, tillverkning avser processen för att producera charkuteri- och köttvaror genom olika bearbetningsmetoder som saltning, torkning och rökning. Kompetensen omfattar kunskaper om hantering av råvaror och tillverkningstekniker för att skapa hållbara och säkra livsmedel.
broader: zmYu aAM TuF
related: QqHf XKZ eyy

Reptiler
type: Concept
in scheme: JobTech Taxonomy - Färdighet
definition: Reptiler
broader: zmYu aAM TuF
related: Lrsj wRZ sFV
related: MSzH F2n Emb

Kopplingsteknik, utland
type: Concept
in scheme: JobTech Taxonomy - Färdighet
definition: Kopplingsteknik, utland
broader: zmYu aAM TuF
related: 4BsK q2C sCL
related: CkRH 4Qn iX3
related: 4Jty HpK a3Q

Vapengravyr
type: Concept
in scheme: JobTech Taxonomy - Färdighet
definition: Vapengravyr avser en teknisk konstform som inbegriper att skapa dekorationer och mönster på vapen genom graveringsmetoder. Kompetensen kräver precision och en djup förståelse för både design och de material som används inom vapentillverkning.
broader: zmYu aAM TuF
related: e6nk AGp y28

Trädfällning
type: Concept
in scheme: JobTech Taxonomy - Färdighet
definition: Trädfällning avser processen att ta bort träd från marken, vilket omfattar kunskap om tekniker för säker och effektiv fällning, samt hantering av verktyg och utrustning. Kompetensen innefattar även insikt om miljömässiga aspekter och riskhantering kopplade till trädfällning.
broader: zmYu aAM TuF
related: XBh3 Xrm C4R

Höghöjdsarbete
type: Concept
in scheme: JobTech Taxonomy - Färdighet
definition: Höghöjdsarbete avser arbeten som utförs på hög höjd, vilket kan inkludera jobb inom takläggning, ställningsbyggande och installation av utrustning. Kompetensen innefattar kunskap om säkerhetsföreskrifter och tekniker för att hantera risker relaterade till arbete på hög höjd.
broader: zmYu aAM TuF
related: dKUb KBP mw3
related: bZ4J riZ zK6
related: ug5y o6z U3L
related: 3g5x Tm7 8QH
related: idjo 2Wr a3E
related: Y4j1 P17 wVA
related: 9mJN VwW Xjg
related: SUfj 4D9 FNx
related: AD3U cFH rbe
related: TrwQ RXT W8a
related: fWrt sLg koW
related: KttZ Skc bMR
related: NnB3 eWH auo
related: L4hA SJP SFi
related: bXfo 4hb SXx

Utbildning inom okulär farmakologi
type: Concept
in scheme: JobTech Taxonomy - Färdighet
definition: Utbildning inom okulär farmakologi
broader: Yrkesbevis/examen
related: PUhV DVQ MM6

Montering av industrirobotar
type: Concept
in scheme: JobTech Taxonomy - Färdighet
definition: Montering av industrirobotar avser processen att sammanfoga och installera industriella robotar som används inom tillverkningssektorn. Kompetensen omfattar både teknisk kunskap om robotik och praktiska färdigheter i att hantera och koppla samman mekaniska och elektroniska komponenter.
broader: zmYu aAM TuF
related: Kxm9 N3V shF

Sprinklermontering
type: Concept
in scheme: JobTech Taxonomy - Färdighet
definition: Sprinklermontering
broader: zmYu aAM TuF
related: bZ4J riZ zK6
related: fLKb bJ3 69p

Personflygning av aktör i spel
type: Concept
in scheme: JobTech Taxonomy - Färdighet
definition: Personflygning av aktör i spel
broader: zmYu aAM TuF
related: 4BsK q2C sCL

Växtskydd
type: Concept
in scheme: JobTech Taxonomy - Färdighet
definition: Växtskydd
broader: zmYu aAM TuF
related: XBh3 Xrm C4R
related: XurM DVs ggn
related: yXbD NTH ijE
related: 2xQ4 4kh kTZ
related: k3R3 UkC nK2
related: RYCQ ogb uUY
related: 3LdB WEJ 8Ms

Blyinfattning
type: Concept
in scheme: JobTech Taxonomy - Färdighet
definition: Blyinfattning
broader: zmYu aAM TuF
related: J17g Q2a 2u1

Yrkeshögskoleutbildning, Flygtekniker
type: Concept
in scheme: JobTech Taxonomy - Färdighet
definition: Yrkeshögskoleutbildning, Flygtekniker är en yrkeshögskoleutbildning med inriktning för att arbeta med flygplansunderhåll.
broader: Yrkesutbildning
related: eRkT cTv H9v

Installation av EU-typgodkända gasapparater med maximal effekt över 100 kW
type: Concept
in scheme: JobTech Taxonomy - Färdighet
definition: Installation av EU-typgodkända gasapparater med maximal effekt över 100 kW
broader: s48H Sft DTn
related: KttZ Skc bMR

MS Word
type: Concept
in scheme: JobTech Taxonomy - Färdighet
definition: MS Word
broader: Allmänna datakunskaper
related: eQ4M CNm ozj
related: Y6yY SuR hVh
related: Uw4n UB2 RCW
related: fdLf oPp wVw
related: vPP6 rsw dck
related: iWcY mko rq2
related: ZQTR hVC QhJ
related: br6a VVS V3y
related: 1CX5 mZw Vcq
related: L7eh ihX vM5
related: MGk3 LvL AU2
related: jJF3 qaQ Zsh
related: oEmP NC1 sXE
related: bjqk F3A 5Hk
related: H2Zj eL9 x28
related: dJXy Rpq a2u
related: pwRH MT1 8nR
related: cRmd 536 pT1
related: zKvJ GnC Szx
related: n6iX f2z XfE
related: DZVN v5g Fco
related: ij8k EwC zyB
related: JfYV ZGg 6rm
related: vCAb uuo ek5
related: 4Jty HpK a3Q
related: p16X 44f rwZ
related: pok1 ipJ yzD

Lackbränning
type: Concept
in scheme: JobTech Taxonomy - Färdighet
definition: Lackbränning
broader: zmYu aAM TuF
related: dKUb KBP mw3

Hållfasthetsanalyser
type: Concept
in scheme: JobTech Taxonomy - Färdighet
definition: Hållfasthetsanalyser
broader: zmYu aAM TuF
related: thZP oR7 WrY
related: XeBP nMe pXx
related: 4Jty HpK a3Q

Byggnadsvaror
type: Concept
in scheme: JobTech Taxonomy - Färdighet
definition: Byggnadsvaror
broader: zmYu aAM TuF
related: oXSW fbY XrY
related: YKL2 FCB 1yr
related: 85cq 6uK 4cK

Ljussättning, dekoration
type: Concept
in scheme: JobTech Taxonomy - Färdighet
definition: Ljussättning, dekoration
broader: zmYu aAM TuF
related: 4BsK q2C sCL
related: CkRH 4Qn iX3

Ultraljudkontroll av metallprodukter
type: Concept
in scheme: JobTech Taxonomy - Färdighet
definition: Ultraljudkontroll av metallprodukter
broader: zmYu aAM TuF
related: 4Jty HpK a3Q
related: 4bxV 58E P9N

Systemformmontering
type: Concept
in scheme: JobTech Taxonomy - Färdighet
definition: Systemformmontering
broader: zmYu aAM TuF
related: q2Ge zrQ zJb

Gesällbrev, slöjdaryrket - trä
type: Concept
in scheme: JobTech Taxonomy - Färdighet
definition: Gesällbrev, slöjdaryrket - trä
broader: Yrkesbevis/examen
related: aKdV u7V R5j

Arkitekt-AutoCAD Revit Architecture Suite
type: Concept
in scheme: JobTech Taxonomy - Färdighet
definition: Arkitekt-AutoCAD Revit Architecture Suite
broader: mTLu uo2 gq2
related: thZP oR7 WrY
related: w6ud quG dgh
related: Pd51 xnr KCY
related: XeBP nMe pXx
related: ETAR ggZ Wuw
related: 41KB bfk 5jR
related: 4Jty HpK a3Q

Moderna språk, undervisning gymnasienivå
type: Concept
in scheme: JobTech Taxonomy - Färdighet
definition: Moderna språk, undervisning gymnasienivå
broader: Inriktning på lärarkompetens
related: 4KhP FxL uZ5

Natur- och kulturhänsyn - Dikesrensning/Skyddsdikning
type: Concept
in scheme: JobTech Taxonomy - Färdighet
definition: Natur- och kulturhänsyn - Dikesrensning/Skyddsdikning
broader: Yrkesbevis/examen
related: KwVo sQu G2e

Yrkesbevis, lastmaskiner
type: Concept
in scheme: JobTech Taxonomy - Färdighet
definition: Yrkesbevis, lastmaskiner
broader: Yrkesbevis/examen
related: 3ZtN hhA SM7

CoffeeScript, programmeringsspråk
type: Concept
in scheme: JobTech Taxonomy - Färdighet
definition: CoffeeScript, programmeringsspråk
broader: Datorspråk
related: BAeH eg8 T2d
related: cBBa ngH fCx
related: Q5DF juj 8do
related: D9SL mtn vGM
related: DJh5 yyF hEM
related: UxT1 tPF Kbg
related: UXKZ 3zZ ipB

Nätverksteknik
type: Concept
in scheme: JobTech Taxonomy - Färdighet
definition: Nätverksteknik avser kompetensområden relaterade till installation, konfiguration och underhåll av nätverksinfrastruktur, inklusive kommunikationsutrustning såsom brandväggar, routrar och switchar. Denna kompetens är grundläggande för att säkerställa effektiv och säker kommunikation inom IT-system, samt förvaltning av nätverkslösningar i olika miljöer.
broader: nHDU dpj R9H
related: 1CX5 mZw Vcq
related: VCpu 5EN bBt
related: 4Jty HpK a3Q
related: UXKZ 3zZ ipB

Mandolin, undervisning musikskola
type: Concept
in scheme: JobTech Taxonomy - Färdighet
definition: Mandolin, undervisning musikskola
broader: zmYu aAM TuF
related: mcRJ kq2 jFr

Tjänstgöring olje-och kemtankfartyg
type: Concept
in scheme: JobTech Taxonomy - Färdighet
definition: Tjänstgöring olje-och kemtankfartyg
alternative label: Tjänstgöring kemtankfartyg
alternative label: Tjänstgöring oljetankfartyg
broader: s48H Sft DTn
related: Rsoy sS6 6c4
related: kZwz D8K bKs
related: CbQK 7th Tyf
related: KttZ Skc bMR
related: kDnq Q98 sD3

FoxPro/xBase, programmeringsspråk
type: Concept
in scheme: JobTech Taxonomy - Färdighet
definition: FoxPro/xBase, programmeringsspråk
alternative label: FoxPro/xBase
broader: Datorspråk
related: BAeH eg8 T2d
related: Fv7d YhP YmS
related: D9SL mtn vGM
related: DJh5 yyF hEM
related: 4Jty HpK a3Q

Yrkesutbildning, Bygglovshandläggare
type: Concept
in scheme: JobTech Taxonomy - Färdighet
definition: Yrkesutbildning, Bygglovshandläggare är en yrkeshögskoleutbildning med inriktning mot arbete med bygglov.
broader: Yrkesutbildning
related: wCx8 rY3 XUT

Laminatpressning
type: Concept
in scheme: JobTech Taxonomy - Färdighet
definition: Laminatpressning
broader: zmYu aAM TuF
related: UdrS qzV P7i

Kärnbränslehantering
type: Concept
in scheme: JobTech Taxonomy - Färdighet
definition: Kärnbränslehantering
broader: zmYu aAM TuF
related: yXbD NTH ijE
related: KM7d Z6Y LCJ

Kinesiologi
type: Concept
in scheme: JobTech Taxonomy - Färdighet
definition: Kinesiologi avser en modern västerländsk fysiologi-, anatomi- och rörelselära. Kinesiologi inom behandling avser att påverka muskelspänningar i kroppen.
broader: zmYu aAM TuF
related: F19Z oB6 pg3

Handledarerfarenhet
type: Concept
in scheme: JobTech Taxonomy - Färdighet
definition: Handledarerfarenhet
broader: Yrkesövergripande kompetenser

Videofotografering
type: Concept
in scheme: JobTech Taxonomy - Färdighet
definition: Videofotografering
broader: zmYu aAM TuF
related: CkRH 4Qn iX3
related: 3J38 DNz YKK
related: 4Jty HpK a3Q

Toxikologi
type: Concept
in scheme: JobTech Taxonomy - Färdighet
definition: Toxikologi
broader: zmYu aAM TuF
related: Z2MZ eYc Lfv
related: puim 6PY DGj
related: rE1E m3d cx1
related: nuXg Wjc JPd
related: eofS oZs RZi
related: e9FK VKh ahW

Utbildning på röjsåg
type: Concept
in scheme: JobTech Taxonomy - Färdighet
definition: Utbildning på röjsåg avser kompetensen att effektivt och säkert använda röjsåg för olika arbetsuppgifter inom exempelvis trädgårdsskötsel och skogsbruk. Utbildningen innefattar kunskaper om utrustningens funktioner, säkerhetsåtgärder och korrekt hantering för att utföra röjning och underhåll av vegetation.
broader: Yrkesbevis/examen
related: XBh3 Xrm C4R
related: qouP wtb 93q
related: 2xQ4 4kh kTZ

Yrkesbevis, teleskopslastare
type: Concept
in scheme: JobTech Taxonomy - Färdighet
definition: Yrkesbevis, teleskopslastare
broader: Yrkesbevis/examen
related: 3ZtN hhA SM7

Gruppterapi
type: Concept
in scheme: JobTech Taxonomy - Färdighet
definition: Gruppterapi
broader: zmYu aAM TuF
related: UUQi UJ5 MSb
related: VYeq GDF a2g

Glasfibertrådtillverkning
type: Concept
in scheme: JobTech Taxonomy - Färdighet
definition: Glasfibertrådtillverkning
broader: zmYu aAM TuF
related: hxm6 xkr dHm

Förskollärarlegitimation
type: Concept
in scheme: JobTech Taxonomy - Färdighet
definition: Legitimation som krävs för att bli tillsvidareanställd och få sätta betyg som förskollärare i Sverige. Utfärdas av Skolverket.
broader: Yrkesbevis/examen
related: 3FP7 4Eg x8P
related: 4P8B LtK JgE
related: r1Gk 3EN bpw
related: 1uau t1u rDL
related: 5ek3 Cgq WeZ

Maskinskötsel, processindustri
type: Concept
in scheme: JobTech Taxonomy - Färdighet
definition: Maskinskötsel, processindustri avser kompetensen att sköta och övervaka driften av maskiner och anläggningar inom processindustrin, vilket inkluderar hantering av utrustning för produktion av olika material som betong och asfalt. Denna kompetens omfattar kunskap om processer, säkerhetsrutiner och underhåll av maskiner för att säkerställa en effektiv och säker produktion.
broader: zmYu aAM TuF
related: o31g CX1 qhQ

Högtryck
type: Concept
in scheme: JobTech Taxonomy - Färdighet
definition: Högtryck
broader: zmYu aAM TuF
related: 34Tn BQQ tfo

Kommunikationsstörningar, behandling
type: Concept
in scheme: JobTech Taxonomy - Färdighet
definition: Kommunikationsstörningar, behandling
broader: zmYu aAM TuF
related: pzch NRY 9ZF

Körsång
type: Concept
in scheme: JobTech Taxonomy - Färdighet
definition: Körsång
broader: Sång
related: AWJF wqZ va9

Ljudläggning
type: Concept
in scheme: JobTech Taxonomy - Färdighet
definition: Ljudläggning
broader: zmYu aAM TuF
related: 4BsK q2C sCL
related: 4Jty HpK a3Q

Lungsjukdomar, specialistkompetens för läkare
type: Concept
in scheme: JobTech Taxonomy - Färdighet
definition: Lungsjukdomar, specialistkompetens för läkare
broader: Specialistbevis för läkare
related: nu7c QuB KVQ

Verksamhetsledning, tillverkningsindustri
type: Concept
in scheme: JobTech Taxonomy - Färdighet
definition: Verksamhetsledning, tillverkningsindustri
broader: zmYu aAM TuF
related: pf1K PTz frm

Djurexperimentell metodik
type: Concept
in scheme: JobTech Taxonomy - Färdighet
definition: Djurexperimentell metodik
broader: zmYu aAM TuF
related: nu7c QuB KVQ
related: ek9W qqp XpF
related: seu9 VoQ VNo
related: gXqW s5Q ZjN

Storbygge
type: Concept
in scheme: JobTech Taxonomy - Färdighet
definition: Storbygge
broader: zmYu aAM TuF
related: bZ4J riZ zK6
related: V79C DD2 3Gj
related: QKvX v7r PNL
related: Y4j1 P17 wVA
related: q2Ge zrQ zJb
related: 9mJN VwW Xjg
related: AD3U cFH rbe
related: NnB3 eWH auo
related: iHrC aRv fVm

Emballering
type: Concept
in scheme: JobTech Taxonomy - Färdighet
definition: Emballering avser processen att fylla, tillsluta och förpacka produkter för distribution och försäljning. Den omfattar även aktiviteter som etikettering, packning och sortering av varor.
broader: zmYu aAM TuF
related: DxiF hTo b3X

Städvana, hotell
type: Concept
in scheme: JobTech Taxonomy - Färdighet
definition: Städvana, hotell
broader: Övriga specialiteter, sjöfart
related: Z6TY xDf Yup
related: tPox ie4 X9X
related: FtyZ Joo tB8

Gatu- och vägprojektering
type: Concept
in scheme: JobTech Taxonomy - Färdighet
definition: Gatu- och vägprojektering
broader: zmYu aAM TuF
related: vPP6 rsw dck
related: thZP oR7 WrY
related: XeBP nMe pXx
related: 4Jty HpK a3Q

Legitimation som djursjukskötare
type: Concept
in scheme: JobTech Taxonomy - Färdighet
definition: Legitimation som krävs för att kunna arbeta som djursjukskötare i Sverige. Utfärdas av Jorbruksverket.
broader: Yrkesbevis/examen
related: 8q1B 5AR CEM
related: yXbD NTH ijE
related: 4P8B LtK JgE
related: r1Gk 3EN bpw

Specialistbehörig inom neuropsykologi
type: Concept
in scheme: JobTech Taxonomy - Färdighet
definition: En specialistbehörighet och en fördjupad specialistkompetens för psykologer inom neuropsykologi.
broader: Specialistkompetens för psykologer
related: VYeq GDF a2g

Fiskerikontroll
type: Concept
in scheme: JobTech Taxonomy - Färdighet
definition: Fiskerikontroll syftar till att säkerställa att fiske sker lagligt, hållbart och i enlighet med gällande regler. Kontrollen innefattar uppföljning av fiskekvoter och fisketid, granskning av fångstrapporter och tillstånd, landningskontroller vid hamnar när fisk landas samt transportkontroller av fisk och fiskeriprodukter under transport. Kontroller kan utföras såväl till sjöss som i hamnar.
broader: zmYu aAM TuF
related: oEmP NC1 sXE

VVS, el, tele-AutoCAD Revit MEP Suite
type: Concept
in scheme: JobTech Taxonomy - Färdighet
definition: VVS, el, tele-AutoCAD Revit MEP Suite
broader: mTLu uo2 gq2
related: K8yg U4C gkY
related: nDaB vdy eAy
related: SPYW 7Z1 ShT
related: PRQn 9yw NJA
related: 4Jty HpK a3Q

Skeppsmätning
type: Concept
in scheme: JobTech Taxonomy - Färdighet
definition: Skeppsmätning
broader: zmYu aAM TuF
related: nuXg Wjc JPd

Elektronstrålesvetsning
type: Concept
in scheme: JobTech Taxonomy - Färdighet
definition: Elektronstrålesvetsning utförs genom att man med elektromagnetiska linser fokuserar en elektronstråle som accelereras till ungefär halva ljushastigheten och får smälta materialet som ska fogas samman. Källa: Svetskommissionen
broader: on11 B1f LEw
related: vaEp iBS c5h

Certifierad naturguide
type: Concept
in scheme: JobTech Taxonomy - Färdighet
definition: Certifierad naturguide är en certifiering som intygar att en naturguide har genomgått erkänd utbildning och uppnått kompetens inom området.
broader: Yrkesbevis/examen
related: A6X3 efC VNy

Servicearbete, elektronik
type: Concept
in scheme: JobTech Taxonomy - Färdighet
definition: Servicearbete, elektronik
broader: zmYu aAM TuF
related: nDaB vdy eAy

InstallShield, programmeringsverktyg
type: Concept
in scheme: JobTech Taxonomy - Färdighet
definition: InstallShield, programmeringsverktyg
alternative label: InstallShield
broader: Programmerings- och systemutvecklingsverktyg
related: D9SL mtn vGM
related: DJh5 yyF hEM
related: 4Jty HpK a3Q
related: MYAz x9m 2LJ

Mikrobiologi
type: Concept
in scheme: JobTech Taxonomy - Färdighet
definition: Mikrobiologi
broader: zmYu aAM TuF
related: Z2MZ eYc Lfv
related: dsK3 hkt zGy

Fotboll, instruktör/Fotboll, tränare
type: Concept
in scheme: JobTech Taxonomy - Färdighet
definition: Fotboll, instruktör/Fotboll, tränare
alternative label: Fotboll, instruktör
alternative label: Fotboll, tränare
broader: Idrott/aktivitet
related: EA6o N1N QtT

Present, hänvisningssystem
type: Concept
in scheme: JobTech Taxonomy - Färdighet
definition: Present, hänvisningssystem
broader: Hänvisningsdatorer
related: 4aPu 2nd 8X6
related: ByrL ANp UwV
related: 4Jty HpK a3Q

Fleroperationsmaskin
type: Concept
in scheme: JobTech Taxonomy - Färdighet
definition: Fleroperationsmaskin
broader: zmYu aAM TuF
related: vaEp iBS c5h
related: 4bxV 58E P9N

Mästarbrev, dekopör (intarsia – möbelsnickeri)
type: Concept
in scheme: JobTech Taxonomy - Färdighet
definition: Mästarbrev, dekopör (intarsia – möbelsnickeri)
broader: Yrkesbevis/examen
related: 34Tn BQQ tfo
related: 1Nwn GYH wkH

Centura, programmeringsspråk
type: Concept
in scheme: JobTech Taxonomy - Färdighet
definition: Centura, programmeringsspråk
alternative label: Centura
broader: Datorspråk
related: BAeH eg8 T2d
related: Fv7d YhP YmS
related: D9SL mtn vGM
related: DJh5 yyF hEM
related: 4Jty HpK a3Q

Digitala arbetssätt, erfarenhet
type: Concept
in scheme: JobTech Taxonomy - Färdighet
definition: Digitala arbetssätt, erfarenhet
broader: Yrkesövergripande kompetenser
related: 4Jty HpK a3Q

Strukturreparation, flyg
type: Concept
in scheme: JobTech Taxonomy - Färdighet
definition: Strukturreparation, flyg
broader: zmYu aAM TuF
related: iGTu bYL 2T7
related: eRkT cTv H9v

Satellitnavigering, biltransporter
type: Concept
in scheme: JobTech Taxonomy - Färdighet
definition: Satellitnavigering, biltransporter
broader: zmYu aAM TuF
related: 4Jty HpK a3Q
related: 957L kZK rHZ

Mästarbrev, billackerare
type: Concept
in scheme: JobTech Taxonomy - Färdighet
definition: Mästarbrev, billackerare
broader: Yrkesbevis/examen
related: dKUb KBP mw3

Djuruppfödning, lantbruk
type: Concept
in scheme: JobTech Taxonomy - Färdighet
definition: Djuruppfödning, lantbruk avser verksamhet där individer ansvarar för avel, uppfödning och skötsel av lantbrukets husdjur för olika produktioner såsom mjölk, kött och ägg. Denna kompetens omfattar även kunskap om djurens välfärd, foderhantering och vård av djurens livsmiljö.
broader: zmYu aAM TuF
related: KYmy iqC xiQ
related: yXbD NTH ijE
related: RYCQ ogb uUY

Barnskötarutbildning
type: Concept
in scheme: JobTech Taxonomy - Färdighet
definition: Barnskötarutbildning är en eftergymnasial yrkesinriktad utbildning med inriktning till barnskötare.
broader: Yrkesutbildning
related: Hi9c iTe gHH

Fastighetsförsäljning
type: Concept
in scheme: JobTech Taxonomy - Färdighet
definition: Fastighetsförsäljning
broader: zmYu aAM TuF
related: XurM DVs ggn
related: 3LdB WEJ 8Ms

Blues
type: Concept
in scheme: JobTech Taxonomy - Färdighet
definition: Blues
broader: p1WM wCw LTd
related: AWJF wqZ va9

Ridålackering
type: Concept
in scheme: JobTech Taxonomy - Färdighet
definition: Ridålackering
broader: zmYu aAM TuF
related: dKUb KBP mw3

Syskongrupp, erfarenhet
type: Concept
in scheme: JobTech Taxonomy - Färdighet
definition: Syskongrupp, erfarenhet
broader: zmYu aAM TuF
related: Hi9c iTe gHH

Pälstvätt
type: Concept
in scheme: JobTech Taxonomy - Färdighet
definition: Pälstvätt
broader: zmYu aAM TuF
related: 4DET dLf iB9

Specialistbevis för läkare
type: Concept
in scheme: JobTech Taxonomy - Färdighet
top concept of: JobTech Taxonomy - Färdighet
definition: Specialistbevis för läkare
narrower: Lungsjukdomar, specialistkompetens för läkare
narrower: Rehabiliteringsmedicin, specialistkompetens för läkare
narrower: tKnJ uPN MWj
narrower: nKjx 3Qa hrr
narrower: qW74 tCh otN
narrower: Neurologi, specialistkompetens för läkare
narrower: Öron-, näs- och halssjukdomar, specialistkompetens för läkare
narrower: Kärlkirurgi, specialistkompetens för läkare
narrower: swuN HVe o49
narrower: Barn- och ungdomsmedicin, specialistkompetens för läkare
narrower: tCDB MjS nqc
narrower: whay GSG FrR
narrower: Klinisk immunologi, specialistkompetens för läkare
narrower: Skolhälsovård, specialistkompetens för läkare
narrower: Transfusionsmedicin, specialistkompetens för läkare
narrower: Allergologi, specialistkompetens för läkare
narrower: oKVx a9U 72s
narrower: vKuL v4T JPX
narrower: Klinisk farmakologi, specialistkompetens för läkare
narrower: Barn- och ungdomsallergologi, specialistkompetens för läkare
narrower: zi7e S96 W9k
narrower: Klinisk genetik, specialistkompetens för läkare
narrower: kjzj jkC MHH
narrower: Kardiologi, specialistkompetens för läkare
narrower: tzLe diF ewV
narrower: Socialmedicin, specialistkompetens för läkare
narrower: sXoR gGY ycN
narrower: tCPN Bt2 cf8
narrower: Reumatologi, specialistkompetens för läkare
narrower: Klinisk neurofysiologi, specialistkompetens för läkare
narrower: xkXC w3J Qxe
narrower: Plastikkirurgi, specialistkompetens för läkare
narrower: Beroendemedicin, specialistkompetens för läkare
narrower: Klinisk kemi, specialistkompetens för läkare
narrower: Äldrepsykiatri, specialistkompetens för läkare
narrower: Röst- och talrubbningar, specialistkompetens för läkare
narrower: wcGF ouA knh
narrower: pLiE VzS 7Ph
narrower: tJRR YKX 68C
narrower: xoDp Uax PWL
narrower: qu4H C4Y uSR
narrower: Handkirurgi, specialistkompetens för läkare
narrower: Infektionssjukdomar, specialistkompetens för läkare
narrower: tU5y sQz FyB
narrower: Neonatologi, specialistkompetens för läkare
narrower: r2wX Ju8 U6x
narrower: Kirurgi, specialistkompetens för läkare
narrower: Klinisk fysiologi, specialistkompetens för läkare
narrower: jv2V UoY 8XH
narrower: Urologi, specialistkompetens för läkare
narrower: Medicinska njursjukdomar, specialistkompetens för läkare
narrower: pPsP j3t VeY
narrower: y9uS oYh 4Kr
narrower: Klinisk cytologi, specialistkompetens för läkare
narrower: Koagulations- och blödningsrubbningar, specialistkompetens för läkare
narrower: Barn- och ungdomskirurgi, specialistkompetens för läkare
narrower: Klinisk immunologi och transfusionsmedicin
narrower: Akutsjukvård, specialistkompetens för läkare
narrower: Barn- och ungdomsradiologi, specialistkompetens för läkare
narrower: wwZR EhP hiA
narrower: Företagshälsovård, specialistkompetens för läkare
narrower: Klinisk virologi, specialistkompetens för läkare
narrower: Hörselrubbningar, specialistkompetens för läkare
narrower: Vårdhygien, specialistkompetens för läkare
narrower: Klinisk mikrobiologi, specialistkompetens för läkare
narrower: Arbets- och miljömedicin, specialistkompetens för läkare
narrower: Gynekologisk onkologi, specialistkompetens för läkare
narrower: Barnonkologi, specialistkompetens för läkare
narrower: ndEm xsX eMP
narrower: Neurokirurgi, specialistkompetens för läkare
narrower: Ortopedi, specialistkompetens för läkare
narrower: Bild- och funktionsmedicin, specialistkompetens för läkare
narrower: Internmedicin, specialistkompetens för läkare
narrower: Medicinsk gastroenterologi och hepatologi, specialistkompetens för läkare
narrower: Barn- och ungdomspsykiatri, specialistkompetens för läkare

Scanning
type: Concept
in scheme: JobTech Taxonomy - Färdighet
definition: Scanning
broader: zmYu aAM TuF
related: Vfum e6B 7Bw
related: 4Jty HpK a3Q

Möbelrenovering
type: Concept
in scheme: JobTech Taxonomy - Färdighet
definition: Möbelrenovering
broader: zmYu aAM TuF
related: 34Tn BQQ tfo
related: 1Nwn GYH wkH

Dataundervisning
type: Concept
in scheme: JobTech Taxonomy - Färdighet
top concept of: JobTech Taxonomy - Färdighet
definition: Dataundervisning
narrower: Hemsideproduktion, undervisning
narrower: Konstruktionsprogram, undervisning
narrower: pTKH VFm xkk
narrower: Grafikprogram, undervisning
narrower: y3bL sR7 viK
narrower: kQVR Hbt KgR
narrower: Layoutprogram, undervisning
narrower: Databasanvändning, undervisning
narrower: Internetanvändning, undervisning
narrower: E-handel, undervisning/Elektronisk handel, undervisning
narrower: Ljudredigeringsprogram, undervisning/Videoredigeringsprogram, undervisning
narrower: Affärs- och redovisningssystem, undervisning
narrower: Presentationsprogram, undervisning
narrower: Databasadministration, undervisning
narrower: rKmC 3hR Af7
narrower: Datorarkitektur, undervisning
narrower: Datorkommunikation, undervisning
narrower: Kalkylprogram, undervisning
narrower: Operativsystem, undervisning

Civilrätt
type: Concept
in scheme: JobTech Taxonomy - Färdighet
definition: De regler som gäller privatpersoners och/eller företags inbördes förhållanden. Skadeståndsrätt, arvsrätt och fastighetsrätt är exempel på civilrätt. https://www.aklagare.se/ordlista/c/civilratt/
broader: zmYu aAM TuF
related: q8wL kdi WaW
related: zKvJ GnC Szx
related: qsJJ EYo fzA

3D-grafik-Autodesk 3ds Max
type: Concept
in scheme: JobTech Taxonomy - Färdighet
definition: 3D-grafik-Autodesk 3ds Max
broader: Programvara för digitalt skapande
related: 8Bmh vtM zts
related: 34Tn BQQ tfo
related: Q5DF juj 8do
related: 4Jty HpK a3Q
related: Mbt6 3ko DiD

Flygplanslastning
type: Concept
in scheme: JobTech Taxonomy - Färdighet
definition: Flygplanslastning avser kompetens relaterad till att lasta och lossa gods samt hantera bagage för flygplansoperationer. Denna kompetens innefattar även tankning av flygplan och en grundläggande förståelse för säkerhetsprocedurer och hantering av olika typer av gods.
broader: zmYu aAM TuF
related: bwnk nv2 1cR

Animering, konstnärlig
type: Concept
in scheme: JobTech Taxonomy - Färdighet
definition: Animering, konstnärlig
broader: zmYu aAM TuF
related: 4BsK q2C sCL
related: 4Jty HpK a3Q

Transporträtt
type: Concept
in scheme: JobTech Taxonomy - Färdighet
definition: Transporträtt
broader: zmYu aAM TuF
related: q8wL kdi WaW
related: 6aak 8eh iwT

Integrationsfrågor
type: Concept
in scheme: JobTech Taxonomy - Färdighet
definition: Integrationsfrågor
broader: zmYu aAM TuF
related: qVHD Hj5 PXh
related: n6iX f2z XfE
related: pok1 ipJ yzD

Perl-script, programmeringsspråk
type: Concept
in scheme: JobTech Taxonomy - Färdighet
definition: Perl-script, programmeringsspråk
alternative label: Perl-script
broader: Datorspråk
related: BAeH eg8 T2d
related: Fv7d YhP YmS
related: 8Bmh vtM zts
related: D9SL mtn vGM
related: DJh5 yyF hEM
related: 4Jty HpK a3Q
related: Mbt6 3ko DiD

Samhällskunskap, undervising gymnasienivå
type: Concept
in scheme: JobTech Taxonomy - Färdighet
definition: Samhällskunskap, undervising gymnasienivå
broader: Inriktning på lärarkompetens
related: 4KhP FxL uZ5

VVS, el, tele-POINT smart EL & TELE
type: Concept
in scheme: JobTech Taxonomy - Färdighet
definition: VVS, el, tele-POINT smart EL & TELE
broader: mTLu uo2 gq2
related: nDaB vdy eAy
related: SPYW 7Z1 ShT
related: 4Jty HpK a3Q

Kapabilitetsanalys
type: Concept
in scheme: JobTech Taxonomy - Färdighet
definition: Kapabilitetsanalys
broader: zmYu aAM TuF
related: Qo7p wjf gtv
related: vPP6 rsw dck
related: 4Jty HpK a3Q

Verksamhetsledning, bank
type: Concept
in scheme: JobTech Taxonomy - Färdighet
definition: Verksamhetsledning, bank
broader: zmYu aAM TuF
related: 3i4a Ufc qpp

Prekliniskt arbete
type: Concept
in scheme: JobTech Taxonomy - Färdighet
definition: Prekliniskt arbete
broader: zmYu aAM TuF
related: cuaN Rj5 YCc
related: 6zAR EHM Kwj

Verksamhetsledning, museum
type: Concept
in scheme: JobTech Taxonomy - Färdighet
definition: Verksamhetsledning, museum
broader: zmYu aAM TuF
related: 3i4a Ufc qpp

Verksamhetsledning, flygplats
type: Concept
in scheme: JobTech Taxonomy - Färdighet
definition: Verksamhetsledning, flygplats
broader: zmYu aAM TuF
related: 3i4a Ufc qpp

Avionik
type: Concept
in scheme: JobTech Taxonomy - Färdighet
definition: Avionik avser det system och de teknologier som används i flygplans- och helikoptersystem för att hantera kommunikation, navigering och övervakning av olika flygoperationer. Kompetensen innefattar kunskap om elektronik, programvara och datorsystem som är integrerade i luftfartyg, vilket är avgörande för deras funktion och säkerhet.
broader: zmYu aAM TuF
related: eRkT cTv H9v

Vulkanisering
type: Concept
in scheme: JobTech Taxonomy - Färdighet
definition: Vulkanisering
broader: zmYu aAM TuF
related: ENV6 BNa brP

DWDM, teletransmission
type: Concept
in scheme: JobTech Taxonomy - Färdighet
definition: DWDM, teletransmission
broader: Transportnätsystem
related: nDaB vdy eAy
related: SPYW 7Z1 ShT
related: 4Jty HpK a3Q

Vägunderhåll
type: Concept
in scheme: JobTech Taxonomy - Färdighet
definition: Vägunderhåll
broader: zmYu aAM TuF
related: bZ4J riZ zK6

Hydraulik
type: Concept
in scheme: JobTech Taxonomy - Färdighet
definition: Hydraulik är en teknisk disciplin som behandlar användningen av vätskor för att överföra kraft och rörelse i olika system. Den omfattar både teori och praktik, där konstruktion och drift av hydrauliska system är centrala moment.
broader: zmYu aAM TuF
related: Lzpv ofL 3H5
related: 7zKm 4NW eey
related: UdrS qzV P7i
related: K8yg U4C gkY
related: XeBP nMe pXx
related: PRQn 9yw NJA
related: fWrt sLg koW
related: KttZ Skc bMR

OpenOffice
type: Concept
in scheme: JobTech Taxonomy - Färdighet
definition: OpenOffice
broader: Allmänna datakunskaper
related: eQ4M CNm ozj
related: Y6yY SuR hVh
related: Uw4n UB2 RCW
related: fdLf oPp wVw
related: vPP6 rsw dck
related: iWcY mko rq2
related: ZQTR hVC QhJ
related: br6a VVS V3y
related: 1CX5 mZw Vcq
related: L7eh ihX vM5
related: MGk3 LvL AU2
related: jJF3 qaQ Zsh
related: oEmP NC1 sXE
related: bjqk F3A 5Hk
related: H2Zj eL9 x28
related: dJXy Rpq a2u
related: pwRH MT1 8nR
related: cRmd 536 pT1
related: zKvJ GnC Szx
related: n6iX f2z XfE
related: DZVN v5g Fco
related: ij8k EwC zyB
related: JfYV ZGg 6rm
related: vCAb uuo ek5
related: 4Jty HpK a3Q
related: p16X 44f rwZ
related: pok1 ipJ yzD

Primärvård
type: Concept
in scheme: JobTech Taxonomy - Färdighet
definition: Primärvård avser medicinsk bedömning och behandling, omvårdnad, förebyggande arbete och rehabilitering som inte kräver särskilda medicinska eller tekniska resurser eller någon annan särskild kompetens. Källa: Kunskapsguiden
broader: zmYu aAM TuF
related: ek9W qqp XpF
related: s7vU FhY L5Z
related: seu9 VoQ VNo
related: 7XXd 4St nit
related: VYeq GDF a2g
related: gXqW s5Q ZjN
related: Z8ci bBE tmx
related: oj4c P4b cja

Bromssystem, installation och underhåll
type: Concept
in scheme: JobTech Taxonomy - Färdighet
definition: Bromssystem, installation och underhåll
broader: zmYu aAM TuF
related: Lzpv ofL 3H5
related: a75S eLg JWH

Ständiga förbättringar/Lean
type: Concept
in scheme: JobTech Taxonomy - Färdighet
definition: Ständiga förbättringar/Lean är en arbetsmetod och filosofi som syftar till att optimera arbetsprocesser genom att eliminera slöseri och onödiga moment som inte skapar värde för kunden. Metoden fokuserar på att förbättra kvalitet och effektivitet, skapa bättre arbetsflöden och involvera alla medarbetare i kontinuerligt förbättringsarbete. Lean bygger på principer som att anpassa produktionen efter faktisk efterfrågan, minska väntetider, och skapa transparens i arbetsprocesser för snabbare beslutsfattande och problemlösning.
alternative label: Lean
alternative label: Ständiga förbättringar
broader: zmYu aAM TuF
related: mis4 feV uex
related: xm5G vGn iyk
related: v9nU 6Fw 4Qg
related: ENV6 BNa brP
related: 4obu LL6 RqJ
related: hxm6 xkr dHm
related: qn2U dB9 Cmh
related: mp2Y vyC RFV
related: 3jEy yuT aVo
related: rwpH 6RA XTT
related: rxmK wwM 1NA
related: Vfum e6B 7Bw
related: GMDo DVo Yzh
related: VKKg e4t t46
related: thZP oR7 WrY
related: UdrS qzV P7i
related: 1G6H AuG qyy
related: w6ud quG dgh
related: vaEp iBS c5h
related: K8yg U4C gkY
related: nDaB vdy eAy
related: 33Nt DSs YYA
related: yPQ4 EaN Dtj
related: yXbD NTH ijE
related: iZLB KpD LLo
related: ketV G9W GeR
related: SPYW 7Z1 ShT
related: XeBP nMe pXx
related: dMVD VYy kgg
related: PRQn 9yw NJA
related: UcNa inr snV
related: icae Y69 H8E
related: bExu 8gk azk

Budo, instruktör/Budo, tränare
type: Concept
in scheme: JobTech Taxonomy - Färdighet
definition: Budo, instruktör/Budo, tränare
alternative label: Budo, instruktör
alternative label: Budo, tränare
broader: Idrott/aktivitet
related: EA6o N1N QtT

Lantmästarexamen
type: Concept
in scheme: JobTech Taxonomy - Färdighet
definition: Lantmästarexamen är en yrkesexamen på högskolenivå kopplad till utbildning med inriktning mot lantmästare. Källa: UHR (Universitets- och högskolerådet)
broader: Yrkesbevis/examen
related: XBh3 Xrm C4R
related: XurM DVs ggn
related: KYmy iqC xiQ
related: 9QMD sZ3 ZjX
related: k3R3 UkC nK2
related: RYCQ ogb uUY

Biluthyrning
type: Concept
in scheme: JobTech Taxonomy - Färdighet
definition: Kompetensen innebär att hantera uthyrning av fordon till privatpersoner och företag. Det omfattar att ta emot bokningar, ge råd kring val av fordon och tilläggstjänster, upprätta hyresavtal, genomföra skadekontroller och hantera betalningar. Kompetensen innefattar även kundservice, administrativt arbete, grundläggande fordonskännedom samt hantering av returer och ibland enklare underhåll av fordon.
broader: zmYu aAM TuF
related: JnTF wXr 6Eh
related: M47D MU2 dhS

Musik, undervisning förskola
type: Concept
in scheme: JobTech Taxonomy - Färdighet
definition: Musik, undervisning förskola
broader: Inriktning på lärarkompetens
related: 5ek3 Cgq WeZ

Byggkonstruktion-Bentley Structural
type: Concept
in scheme: JobTech Taxonomy - Färdighet
definition: Byggkonstruktion-Bentley Structural
broader: mTLu uo2 gq2
related: thZP oR7 WrY
related: w6ud quG dgh
related: Pd51 xnr KCY
related: XeBP nMe pXx
related: ETAR ggZ Wuw
related: 41KB bfk 5jR
related: 4Jty HpK a3Q

Golvlackning
type: Concept
in scheme: JobTech Taxonomy - Färdighet
definition: Golvlackning
broader: zmYu aAM TuF
related: V79C DD2 3Gj

Äggsortering
type: Concept
in scheme: JobTech Taxonomy - Färdighet
definition: Äggsortering
broader: zmYu aAM TuF
related: KYmy iqC xiQ
related: 1EBv UzM ozQ

Sotning
type: Concept
in scheme: JobTech Taxonomy - Färdighet
definition: Sotning avser rengöring av rökgasvägar i eldstäder och skorstenar samt möjligheten att rengöra imkanaler och köksfläktar. Kompetensen innefattar kontroller av värmeanläggningar, samt genomförande av täthetsprövningar och rökgasanalyser.
broader: zmYu aAM TuF
related: SUfj 4D9 FNx

Jaktkontroll
type: Concept
in scheme: JobTech Taxonomy - Färdighet
definition: Jaktkontroll
broader: zmYu aAM TuF
related: rNcE Zno pD8

Internmedicin, specialistkompetens för läkare
type: Concept
in scheme: JobTech Taxonomy - Färdighet
definition: Internmedicin, specialistkompetens för läkare
broader: Specialistbevis för läkare
related: nu7c QuB KVQ

ADR-besiktning
type: Concept
in scheme: JobTech Taxonomy - Färdighet
definition: ADR-besiktning
broader: zmYu aAM TuF
related: puim 6PY DGj
related: nuXg Wjc JPd

Vårdnadsutredningar
type: Concept
in scheme: JobTech Taxonomy - Färdighet
definition: Vårdnadsutredningar
broader: zmYu aAM TuF
related: dJXy Rpq a2u
related: pok1 ipJ yzD

Östgötska
type: Concept
in scheme: JobTech Taxonomy - Färdighet
definition: Östgötska
broader: Dialekt
related: iBUL s38 izZ

Gasinstallationsledare
type: Concept
in scheme: JobTech Taxonomy - Färdighet
definition: Gasinstallationsledare
broader: s48H Sft DTn
related: fLKb bJ3 69p
related: KttZ Skc bMR

Linjetrafik, körning
type: Concept
in scheme: JobTech Taxonomy - Färdighet
definition: Linjetrafik, körning
broader: zmYu aAM TuF
related: FiDm 2S8 gx7

Maskinteknik
type: Concept
in scheme: JobTech Taxonomy - Färdighet
definition: Maskinteknik
broader: zmYu aAM TuF
related: PRQn 9yw NJA

Skeppsklarering
type: Concept
in scheme: JobTech Taxonomy - Färdighet
definition: Skeppsklarering avser processen att förbereda och hantera lasten för ett fartyg före avsegling, vilket innefattar upprättande av nödvändiga dokument och säkerställande av att alla regler och förordningar följs. Kompetensen inkluderar samordning med olika aktörer och myndigheter för att optimera frakt och säkerställa att uteräknade avgifter och tullar är korrekt beräknade.
broader: zmYu aAM TuF
related: AuTi FEo j3R
related: 4Jty HpK a3Q
related: 957L kZK rHZ

Fjäderspinning
type: Concept
in scheme: JobTech Taxonomy - Färdighet
definition: Fjäderspinning
broader: zmYu aAM TuF
related: vaEp iBS c5h

Kontorsartiklar
type: Concept
in scheme: JobTech Taxonomy - Färdighet
definition: Kontorsartiklar
broader: zmYu aAM TuF
related: oXSW fbY XrY
related: YKL2 FCB 1yr
related: 85cq 6uK 4cK

KYC-processer
type: Concept
in scheme: JobTech Taxonomy - Färdighet
definition: KYC-processer
broader: zmYu aAM TuF
related: Uw4n UB2 RCW

Praktisk ProjektStyrning/PPS
type: Concept
in scheme: JobTech Taxonomy - Färdighet
definition: Praktisk ProjektStyrning/PPS
alternative label: PPS
alternative label: Praktisk ProjektStyrning
broader: zmYu aAM TuF
related: cBBa ngH fCx
related: DJh5 yyF hEM
related: UxT1 tPF Kbg
related: UXKZ 3zZ ipB

Personlig skyddsutrustning
type: Concept
in scheme: JobTech Taxonomy - Färdighet
definition: Personlig skyddsutrustning är utrustning som används av en enskild person och som man har på sig eller håller som skydd. https://www.av.se/halsa-och-sakerhet/personlig-skyddsutrustning/
broader: zmYu aAM TuF
related: nuXg Wjc JPd
related: ayQ4 G3W A2w

Esperanto, cirkelledning
type: Concept
in scheme: JobTech Taxonomy - Färdighet
definition: Esperanto, cirkelledning
broader: zmYu aAM TuF
related: 1CX5 mZw Vcq

Bockning CNC
type: Concept
in scheme: JobTech Taxonomy - Färdighet
definition: Bockning CNC
broader: zmYu aAM TuF
related: vaEp iBS c5h
related: 4Jty HpK a3Q
related: L4hA SJP SFi

Servrar, installation och underhåll
type: Concept
in scheme: JobTech Taxonomy - Färdighet
definition: Servrar, installation och underhåll
broader: Hårdvara
related: fWrt sLg koW
related: 4Jty HpK a3Q
related: 13md uyV BNG

Stenarbete
type: Concept
in scheme: JobTech Taxonomy - Färdighet
definition: Stenarbete avser färdigheten att bearbeta, forma och sammanfoga olika typer av stenmaterial för att skapa strukturer eller produkter. Kompetensen innefattar tekniker för både manuellt och maskinellt arbete, såsom klyvning, huggninig, slipning och montering av sten.
broader: zmYu aAM TuF
related: o31g CX1 qhQ
related: vCBT Pnd 8UB

Reglerteknik
type: Concept
in scheme: JobTech Taxonomy - Färdighet
definition: Reglerteknik
broader: zmYu aAM TuF
related: K8yg U4C gkY
related: nDaB vdy eAy
related: PRQn 9yw NJA
related: 4Jty HpK a3Q

Delphi, programmeringsverktyg
type: Concept
in scheme: JobTech Taxonomy - Färdighet
definition: Delphi, programmeringsverktyg
alternative label: Borland delphi
alternative label: Delphi
broader: Programmerings- och systemutvecklingsverktyg
related: D9SL mtn vGM
related: DJh5 yyF hEM
related: 4Jty HpK a3Q
related: MYAz x9m 2LJ

Petrokemi
type: Concept
in scheme: JobTech Taxonomy - Färdighet
definition: Petrokemi
broader: zmYu aAM TuF
related: v9nU 6Fw 4Qg
related: qn2U dB9 Cmh
related: eofS oZs RZi
related: bExu 8gk azk

Behörighet för Befaren maskinpersonal
type: Concept
in scheme: JobTech Taxonomy - Färdighet
definition: Behörighet för Befaren maskinpersonal
broader: Behörigheter, sjöfart
related: KttZ Skc bMR

Receptionsvana
type: Concept
in scheme: JobTech Taxonomy - Färdighet
definition: Receptionsvana avser kunskap och färdighet nödvändiga för att bemanna en reception, vilket inkluderar att ta emot och välkomna besökare, samt att utföra administrativa uppgifter. Kompetensen omfattar också förmåga att kommunicera effektivt och ge information om verksamheten.
broader: zmYu aAM TuF
related: 2kLc pto DpV
related: eQ4M CNm ozj
related: ezKk kss CiQ
related: fdLf oPp wVw
related: TQkt eeK eNp
related: bYde Frc xcB
related: ZQTR hVC QhJ
related: 8q1B 5AR CEM
related: ByrL ANp UwV
related: zKvJ GnC Szx
related: rNcE Zno pD8
related: 4Jty HpK a3Q
related: iqZh 3yX i8n

Konkurrensrätt
type: Concept
in scheme: JobTech Taxonomy - Färdighet
definition: Konkurrensrätt
broader: zmYu aAM TuF
related: q8wL kdi WaW
related: br6a VVS V3y
related: 6aak 8eh iwT
related: DZVN v5g Fco
related: JfYV ZGg 6rm

Mörkrumsarbete
type: Concept
in scheme: JobTech Taxonomy - Färdighet
definition: Mörkrumsarbete avser processer och aktiviteter som utförs i en kontrollerad ljusmiljö, där exponering för ljus kan påverka material som fotografiska filmer och papper. Kompetensen omfattar kunskaper i tekniker för framkallning och bearbetning av fotografiska bilder, inklusive användning av kemikalier och utrustning som är nödvändiga för att säkerställa bildkvalitet och korrekt bildkomposition.
broader: zmYu aAM TuF
related: Vfum e6B 7Bw
related: 3J38 DNz YKK

Doro, telefonväxel
type: Concept
in scheme: JobTech Taxonomy - Färdighet
definition: Doro, telefonväxel
broader: Telefonväxlar
related: 4aPu 2nd 8X6
related: ByrL ANp UwV
related: 4Jty HpK a3Q

Gesällbrev, konstinramare
type: Concept
in scheme: JobTech Taxonomy - Färdighet
definition: Gesällbrev, konstinramare
broader: Yrkesbevis/examen
related: J17g Q2a 2u1

Behörig lösull
type: Concept
in scheme: JobTech Taxonomy - Färdighet
definition: Behörig lösull
broader: s48H Sft DTn
related: cGxX R9c kW1

Basic-MIRG
type: Concept
in scheme: JobTech Taxonomy - Färdighet
definition: Basic-MIRG
broader: zmYu aAM TuF
related: ug5y o6z U3L

Butiksstädning
type: Concept
in scheme: JobTech Taxonomy - Färdighet
definition: Butiksstädning
broader: zmYu aAM TuF
related: Z6TY xDf Yup

Textredigering
type: Concept
in scheme: JobTech Taxonomy - Färdighet
definition: Textredigering
broader: zmYu aAM TuF
related: SgNH hag n9D
related: zfve s6G tpc
related: k1Nx auG sNh

Alternerande stämledare, erfarenhet
type: Concept
in scheme: JobTech Taxonomy - Färdighet
definition: Alternerande stämledare, erfarenhet
broader: zmYu aAM TuF
related: AWJF wqZ va9

DSP, digitala signalprocessorer
type: Concept
in scheme: JobTech Taxonomy - Färdighet
definition: DSP, digitala signalprocessorer
broader: zmYu aAM TuF
related: nDaB vdy eAy
related: SPYW 7Z1 ShT
related: 4Jty HpK a3Q

Cellbiologi
type: Concept
in scheme: JobTech Taxonomy - Färdighet
definition: Cellbiologi
broader: zmYu aAM TuF
related: Z2MZ eYc Lfv
related: yXbD NTH ijE

Trådvalsning
type: Concept
in scheme: JobTech Taxonomy - Färdighet
definition: Trådvalsning
broader: zmYu aAM TuF
related: m8TS hdk pSf

Redaktionellt arbete
type: Concept
in scheme: JobTech Taxonomy - Färdighet
definition: Redaktionellt arbete
broader: zmYu aAM TuF
related: SgNH hag n9D
related: 4Jty HpK a3Q

Brandskyddsmålning
type: Concept
in scheme: JobTech Taxonomy - Färdighet
definition: Brandskyddsmålning innebär målning med brandskyddande färg på bärande och avskiljande byggnadsdelar i syfte att begränsa spridning av brand. Kompetensen innefattar kontroll och dokumentation.
broader: zmYu aAM TuF
related: AD3U cFH rbe

Kött, styckningsvana
type: Concept
in scheme: JobTech Taxonomy - Färdighet
definition: Kött, styckningsvana avser skicklighet i att bearbeta och stycka kött från olika djurslag. Kompetensen omfattar kunskaper om olika styckningsmetoder, köttkvalitet och hantering av köttprodukter.
broader: zmYu aAM TuF
related: QqHf XKZ eyy
related: Fp7x Yqt bx9
related: gJtZ EBc n2z

Guidning, museum
type: Concept
in scheme: JobTech Taxonomy - Färdighet
definition: Guidning, museum avser kompetens att leda besökare genom museer, där förmedling av kunskap och insikt om utställningar och samlingar ingår. Detta innefattar förmåga att skapa en engagerande och informativ upplevelse för besökare genom att dela historiska och kulturella perspektiv.
broader: zmYu aAM TuF
related: TQkt eeK eNp
related: Qbvf 6nd Esn

Havok Vision, fysikmotor
type: Concept
in scheme: JobTech Taxonomy - Färdighet
definition: Havok Vision, fysikmotor
broader: Spelmotorer
related: Q5DF juj 8do
related: 4Jty HpK a3Q
related: Mbt6 3ko DiD

Cykling, instruktör/Cykling, tränare
type: Concept
in scheme: JobTech Taxonomy - Färdighet
definition: Cykling, instruktör/Cykling, tränare
alternative label: Cykling, instruktör
alternative label: Cykling, tränare
broader: Idrott/aktivitet
related: EA6o N1N QtT

Ekonometri
type: Concept
in scheme: JobTech Taxonomy - Färdighet
definition: Ekonometri
broader: zmYu aAM TuF
related: jv1x tpK 32p
related: ZA1N Z2B nFQ
related: 4Jty HpK a3Q
related: WZCM nfS eAk

Egendoms- och avbrottsförsäkringar
type: Concept
in scheme: JobTech Taxonomy - Färdighet
definition: Egendoms- och avbrottsförsäkringar
broader: zmYu aAM TuF
related: Ru4W zn2 LEz
related: 9dLz BCK oDA

Matfotografering
type: Concept
in scheme: JobTech Taxonomy - Färdighet
definition: Matfotografering
broader: zmYu aAM TuF
related: 3J38 DNz YKK

Paraplymakeri
type: Concept
in scheme: JobTech Taxonomy - Färdighet
definition: Paraplymakeri
broader: zmYu aAM TuF
related: UZBj yDX Ctp

MAN
type: Concept
in scheme: JobTech Taxonomy - Färdighet
definition: MAN
broader: nHDU dpj R9H
related: 1CX5 mZw Vcq
related: VCpu 5EN bBt
related: DJh5 yyF hEM
related: fWrt sLg koW
related: 4Jty HpK a3Q
related: 13md uyV BNG

Sterilisering av medicinsk utrustning
type: Concept
in scheme: JobTech Taxonomy - Färdighet
definition: Sterilisering av medicinsk utrustning innebär rengöring, desinficering och sterilisering av instrument för att förhindra smittspridning och säkerställa en hygienisk vårdmiljö. Arbetet omfattar hantering av autoklaver, ultraljudstvätt och andra metoder, samt kontroll och dokumentation av processer. Kompetensen är viktig inom operationsavdelningar, tandvård och andra vårdmiljöer där sterila instrument krävs.
broader: zmYu aAM TuF
related: LP4Z ABV gRm
related: GiNX ESA AL1

Rördrivning
type: Concept
in scheme: JobTech Taxonomy - Färdighet
definition: Rördrivning
broader: zmYu aAM TuF
related: 7zKm 4NW eey

Verksamhetsledning, grundskola
type: Concept
in scheme: JobTech Taxonomy - Färdighet
definition: Verksamhetsledning, grundskola
broader: zmYu aAM TuF
related: z8di AqX GBr

Vetedegar, beredningsvana/Wienerdegar, beredningsvana
type: Concept
in scheme: JobTech Taxonomy - Färdighet
definition: Vetedegar, beredningsvana/Wienerdegar, beredningsvana
alternative label: Vetedegar, beredningsvana
alternative label: Wienerdegar, beredningsvana
broader: zmYu aAM TuF
related: kF59 fge kts

Medlemsvärvning
type: Concept
in scheme: JobTech Taxonomy - Färdighet
definition: Medlemsvärvning avser processen att rekrytera och värva nya medlemmar till organisationer eller föreningar. Kompetensen innefattar förmåga att kommunicera värdet av medlemskap och engagera potentiella medlemmar, vilket kan ske genom olika försäljningsmetoder, så som personlig kontakt, telefonförsäljning eller informationsdistribution vid evenemang.
broader: zmYu aAM TuF
related: eQ4M CNm ozj
related: PxXc 16t oZo
related: NCeZ rSk B4D
related: pwRH MT1 8nR

Lärplattformar, erfarenhet
type: Concept
in scheme: JobTech Taxonomy - Färdighet
definition: Lärplattformar, erfarenhet omfattar kunskaper och praktisk erfarenhet av att använda digitala lärplattformar för undervisning och utbildning. Detta inkluderar färdigheter i att navigera, administrera och interagera med olika funktioner i lärplattformar för att stödja lärande och pedagogiska processer.
broader: zmYu aAM TuF
related: 2x2V UeL 6ke
related: 3FP7 4Eg x8P
related: 1CX5 mZw Vcq
related: oEmP NC1 sXE
related: RPBE x5M cXX
related: 4KhP FxL uZ5
related: oQUQ D11 HPx
related: 4Jty HpK a3Q
related: 5ek3 Cgq WeZ

Orgel
type: Concept
in scheme: JobTech Taxonomy - Färdighet
definition: Orgel
broader: wLYs CKS wK8
related: AWJF wqZ va9

Logic, styr- och utvecklingsmodell
type: Concept
in scheme: JobTech Taxonomy - Färdighet
definition: Logic, styr- och utvecklingsmodell
alternative label: Logic
broader: Styr- och utvecklingsmodeller
related: cBBa ngH fCx
related: D9SL mtn vGM
related: DJh5 yyF hEM
related: UxT1 tPF Kbg
related: 4Jty HpK a3Q
related: UXKZ 3zZ ipB

Pulverlackering
type: Concept
in scheme: JobTech Taxonomy - Färdighet
definition: Pulverlackering avser en teknik för ytbehandling där pulverfärg appliceras på en yta för att ge en slitstark och hållbar yta. Denna kompetens innebär kunskap om och förmåga att hantera utrustning och processer för att applicera pulverlack på olika material och produkter.
broader: zmYu aAM TuF
related: dKUb KBP mw3

Gynekologisk onkologi, specialistkompetens för läkare
type: Concept
in scheme: JobTech Taxonomy - Färdighet
definition: Gynekologisk onkologi, specialistkompetens för läkare
broader: Specialistbevis för läkare
related: nu7c QuB KVQ

Hårdplastutbildning
type: Concept
in scheme: JobTech Taxonomy - Färdighet
definition: Hårdplastutbildning
broader: zmYu aAM TuF
related: dKUb KBP mw3

Mjölkmottagning
type: Concept
in scheme: JobTech Taxonomy - Färdighet
definition: Mjölkmottagning avser processen att ta emot och kontrollera mjölk vid anläggningar för vidare bearbetning. Kompetensen omfattar hantering av utrustning och system för att säkerställa mjölk kvalitet och följa relevanta standarder och föreskrifter.
broader: zmYu aAM TuF
related: yJk6 azD ywF

Kretskortsmontering
type: Concept
in scheme: JobTech Taxonomy - Färdighet
definition: Kretskortsmontering
broader: zmYu aAM TuF
related: SgAJ DW2 FN5
related: yXbD NTH ijE
related: fWrt sLg koW
related: 4Jty HpK a3Q

Djurslagsspecialisering, hund/Djurslagsspecialisering, katt
type: Concept
in scheme: JobTech Taxonomy - Färdighet
definition: Djurslagsspecialisering, hund/Djurslagsspecialisering, katt
alternative label: Djurslagsspecialisering, hund
alternative label: Djurslagsspecialisering, katt
broader: zmYu aAM TuF
related: WL4E r4b ek4

Hänvisningsdatorer
type: Concept
in scheme: JobTech Taxonomy - Färdighet
top concept of: JobTech Taxonomy - Färdighet
definition: Hänvisningsdatorer
narrower: Present, hänvisningssystem
narrower: TCMS, hänvisningssystem
narrower: HVD, hänvisningssystem
narrower: Vakans, hänvisningssystem
narrower: wJ4d rCr zdM
narrower: o8X2 cLi NFT
narrower: xHdj p3H 7QM
narrower: Telia Centrex, hänvisningssystem
narrower: zrcG eDZ mB7

Yrkesbevis, trappor och murar
type: Concept
in scheme: JobTech Taxonomy - Färdighet
definition: Yrkesbevis, trappor och murar
broader: Yrkesbevis/examen
related: XBh3 Xrm C4R
related: df9D e6y 61z

Motorbranschens certifikat
type: Concept
in scheme: JobTech Taxonomy - Färdighet
definition: Motorbranschens certifikat
broader: s48H Sft DTn
related: Lzpv ofL 3H5
related: dKUb KBP mw3
related: L4hA SJP SFi
related: bXfo 4hb SXx

X.400, kommunikationsprotokoll
type: Concept
in scheme: JobTech Taxonomy - Färdighet
definition: X.400, kommunikationsprotokoll
alternative label: X.400
broader: Kommunikationsprotokoll
related: BAeH eg8 T2d
related: cBBa ngH fCx
related: D9SL mtn vGM
related: VCpu 5EN bBt
related: fWrt sLg koW
related: 4Jty HpK a3Q
related: 13md uyV BNG
related: MYAz x9m 2LJ

Oracle Certified Professional/OCP
type: Concept
in scheme: JobTech Taxonomy - Färdighet
definition: Oracle Certified Professional/OCP
alternative label: OCP
alternative label: Oracle Certified Professional
broader: s48H Sft DTn
related: BAeH eg8 T2d
related: DJh5 yyF hEM
related: 4Jty HpK a3Q
related: UXKZ 3zZ ipB

Musikarrangemang
type: Concept
in scheme: JobTech Taxonomy - Färdighet
definition: Musikarrangemang
broader: zmYu aAM TuF
related: AWJF wqZ va9
related: gmRr 7tt eHj

Ångfartyg
type: Concept
in scheme: JobTech Taxonomy - Färdighet
definition: Ångfartyg
broader: Övriga specialiteter, sjöfart
related: Rsoy sS6 6c4

Teknikinformation
type: Concept
in scheme: JobTech Taxonomy - Färdighet
definition: Teknikinformation
broader: zmYu aAM TuF
related: SgNH hag n9D

Servicehus/Äldreboende
type: Concept
in scheme: JobTech Taxonomy - Färdighet
definition: Servicehus/Äldreboende
alternative label: Servicehus
alternative label: Äldreboende
broader: zmYu aAM TuF
related: jY19 knH MJp
related: tAJS JNb hDH

Golvslipning
type: Concept
in scheme: JobTech Taxonomy - Färdighet
definition: Golvslipning
broader: zmYu aAM TuF
related: V79C DD2 3Gj

Svensk skidlärarexamen, SLAO
type: Concept
in scheme: JobTech Taxonomy - Färdighet
definition: Svensk skidlärarexamen, SLAO är en examen på eftergymnasial nivå kopplad till utbildning med inriktning mot arbete som skidlärare.
broader: Yrkesbevis/examen
related: EA6o N1N QtT

Orkesterdirigering
type: Concept
in scheme: JobTech Taxonomy - Färdighet
definition: Orkesterdirigering
broader: zmYu aAM TuF
related: AWJF wqZ va9

Vattenkraftteknik
type: Concept
in scheme: JobTech Taxonomy - Färdighet
definition: Vattenkraftteknik
broader: zmYu aAM TuF
related: K8yg U4C gkY
related: yXbD NTH ijE
related: PRQn 9yw NJA

Isolering
type: Concept
in scheme: JobTech Taxonomy - Färdighet
definition: Isolering avser processen att använda material och tekniker för att minimera värmeförlust och ljudöverföring i byggnader, anläggningar och infrastrukturer. Kompetensen innebär att isolera värme-, ventilations- och sanitetsanläggningar samt att montera ytbeklädnad som skydd för isolering.
broader: zmYu aAM TuF
related: 3ZtN hhA SM7
related: bZ4J riZ zK6
related: VKKg e4t t46
related: q2Ge zrQ zJb
related: 9mJN VwW Xjg
related: yXbD NTH ijE
related: NnB3 eWH auo
related: cGxX R9c kW1

Software AG WebMethods, integrationsplattform
type: Concept
in scheme: JobTech Taxonomy - Färdighet
definition: Software AG WebMethods, integrationsplattform
alternative label: Software AG WebMethods
broader: Integrationsplattformar
related: BAeH eg8 T2d
related: cBBa ngH fCx
related: D9SL mtn vGM
related: DJh5 yyF hEM
related: 4Jty HpK a3Q
related: UXKZ 3zZ ipB
related: MYAz x9m 2LJ

Varmkök
type: Concept
in scheme: JobTech Taxonomy - Färdighet
definition: Varmkök
broader: zmYu aAM TuF
related: BStc SJh DKG

Hypertonivård
type: Concept
in scheme: JobTech Taxonomy - Färdighet
definition: Hypertonivård
broader: zmYu aAM TuF
related: Z8ci bBE tmx

Trumpet, undervisning musikskola
type: Concept
in scheme: JobTech Taxonomy - Färdighet
definition: Trumpet, undervisning musikskola
broader: zmYu aAM TuF
related: mcRJ kq2 jFr

Yrkesbevis, motorschaktvagn
type: Concept
in scheme: JobTech Taxonomy - Färdighet
definition: Yrkesbevis, motorschaktvagn
broader: Yrkesbevis/examen
related: 3ZtN hhA SM7

Smalltalk, programmeringsspråk
type: Concept
in scheme: JobTech Taxonomy - Färdighet
definition: Smalltalk, programmeringsspråk
alternative label: Smalltalk
broader: Datorspråk
related: BAeH eg8 T2d
related: Fv7d YhP YmS
related: D9SL mtn vGM
related: DJh5 yyF hEM
related: 4Jty HpK a3Q

Bikefit/Bikefitting
type: Concept
in scheme: JobTech Taxonomy - Färdighet
definition: Bikefit/Bikefitting
alternative label: Bikefit
alternative label: Bikefitting
broader: zmYu aAM TuF
related: Lzpv ofL 3H5
related: aWki 4uA adn

Dans, cirkelledning
type: Concept
in scheme: JobTech Taxonomy - Färdighet
definition: Dans, cirkelledning
broader: zmYu aAM TuF
related: 1CX5 mZw Vcq

Franska, cirkelledning
type: Concept
in scheme: JobTech Taxonomy - Färdighet
definition: Franska, cirkelledning
broader: zmYu aAM TuF
related: 1CX5 mZw Vcq

Tidskrifter, produktkunskap
type: Concept
in scheme: JobTech Taxonomy - Färdighet
definition: Tidskrifter, produktkunskap
broader: zmYu aAM TuF
related: JnTF wXr 6Eh
related: YKL2 FCB 1yr
related: s1Qk o98 2o1

Studioproduktion
type: Concept
in scheme: JobTech Taxonomy - Färdighet
definition: Studioproduktion
broader: zmYu aAM TuF
related: AWJF wqZ va9

Datalog, programmeringsspråk
type: Concept
in scheme: JobTech Taxonomy - Färdighet
definition: Datalog, programmeringsspråk
alternative label: Datalog
broader: Datorspråk
related: D9SL mtn vGM
related: DJh5 yyF hEM
related: UxT1 tPF Kbg
related: 4Jty HpK a3Q
related: UXKZ 3zZ ipB

Tornedalska
type: Concept
in scheme: JobTech Taxonomy - Färdighet
definition: Tornedalska
broader: Dialekt
related: iBUL s38 izZ

Offshore
type: Concept
in scheme: JobTech Taxonomy - Färdighet
definition: Offshore
broader: Övriga specialiteter, sjöfart
related: Rsoy sS6 6c4
related: CbQK 7th Tyf
related: KttZ Skc bMR
related: kDnq Q98 sD3
related: a75S eLg JWH

Transportledning, spårburen trafik
type: Concept
in scheme: JobTech Taxonomy - Färdighet
definition: Transportledning, spårburen trafik avser kompetens att planera, samordna och övervaka tågtrafik och spårbundna transporter över specifika geografiska områden. Detta inkluderar säkerställande av att tågtrafik följer fastställda tidsplaner och säkerhetsbestämmelser, vilket kräver insikt i trafikledningssystem och samverkan med olika aktörer inom transportsektorn.
broader: zmYu aAM TuF
related: nk6Z 5oD QoM
related: 4Jty HpK a3Q
related: 957L kZK rHZ

Medicinsk diagnostik
type: Concept
in scheme: JobTech Taxonomy - Färdighet
definition: Medicinsk diagnostik
broader: zmYu aAM TuF
related: wNrt Ysj WuT
related: nu7c QuB KVQ
related: seu9 VoQ VNo
related: bExu 8gk azk

Utbildningstolkning
type: Concept
in scheme: JobTech Taxonomy - Färdighet
definition: Utbildningstolkning
broader: zmYu aAM TuF
related: PQDm Z63 zst

Fysiologi
type: Concept
in scheme: JobTech Taxonomy - Färdighet
definition: Fysiologi
broader: zmYu aAM TuF
related: Z2MZ eYc Lfv
related: dsK3 hkt zGy
related: e9FK VKh ahW
related: bExu 8gk azk

Trafikteknik
type: Concept
in scheme: JobTech Taxonomy - Färdighet
definition: Trafikteknik
broader: zmYu aAM TuF
related: XeBP nMe pXx
related: ETAR ggZ Wuw

MS Access
type: Concept
in scheme: JobTech Taxonomy - Färdighet
definition: MS Access
broader: Allmänna datakunskaper
related: eQ4M CNm ozj
related: Y6yY SuR hVh
related: Uw4n UB2 RCW
related: fdLf oPp wVw
related: vPP6 rsw dck
related: iWcY mko rq2
related: ZQTR hVC QhJ
related: br6a VVS V3y
related: 1CX5 mZw Vcq
related: L7eh ihX vM5
related: MGk3 LvL AU2
related: jJF3 qaQ Zsh
related: oEmP NC1 sXE
related: bjqk F3A 5Hk
related: H2Zj eL9 x28
related: dJXy Rpq a2u
related: pwRH MT1 8nR
related: cRmd 536 pT1
related: zKvJ GnC Szx
related: n6iX f2z XfE
related: DZVN v5g Fco
related: ij8k EwC zyB
related: JfYV ZGg 6rm
related: vCAb uuo ek5
related: 4Jty HpK a3Q
related: p16X 44f rwZ
related: pok1 ipJ yzD

Dockspel, handdockor
type: Concept
in scheme: JobTech Taxonomy - Färdighet
definition: Dockspel, handdockor
broader: zmYu aAM TuF
related: iBUL s38 izZ

Fasadmurning
type: Concept
in scheme: JobTech Taxonomy - Färdighet
definition: Fasadmurning
broader: zmYu aAM TuF
related: NnB3 eWH auo

Kostnads- och intäktsanalys
type: Concept
in scheme: JobTech Taxonomy - Färdighet
definition: Kostnads- och intäktsanalys innebär systematisk bedömning av kostnader och intäkter för att stödja beslutsfattande inom organisationer. Denna kompetens innefattar insamling och analys av ekonomisk information, budgetering samt utvärdering av lönsamhet och effektivitet.
broader: zmYu aAM TuF
related: Y6yY SuR hVh
related: 8A1f sxQ adT
related: Uw4n UB2 RCW
related: 48KE fDE ryL
related: QG4f MCh vND
related: q81z 3oD 1qu
related: 33Nt DSs YYA
related: dUuh wwa FGj
related: mZsb A1K Gec
related: cRmd 536 pT1
related: FfMN Bw1 qYR
related: 4Jty HpK a3Q
related: 85cq 6uK 4cK

Ljud-Sound Forge
type: Concept
in scheme: JobTech Taxonomy - Färdighet
definition: Ljud-Sound Forge
broader: Programvara för digitalt skapande
related: SgNH hag n9D
related: 4BsK q2C sCL
related: CkRH 4Qn iX3
related: PH2M uV4 r72
related: 4Jty HpK a3Q

Modefrisyrer
type: Concept
in scheme: JobTech Taxonomy - Färdighet
definition: Modefrisyrer
broader: zmYu aAM TuF
related: mwVN oEH g9k
related: LyBp bY6 bZK

Orion, redovisningssystem
type: Concept
in scheme: JobTech Taxonomy - Färdighet
definition: Orion, redovisningssystem
alternative label: Orion
broader: xSJR 1Kq pxB
related: eQ4M CNm ozj
related: Y6yY SuR hVh
related: Uw4n UB2 RCW
related: iWcY mko rq2
related: q81z 3oD 1qu
related: cRmd 536 pT1
related: ij8k EwC zyB
related: 4Jty HpK a3Q

Gaturenhållning
type: Concept
in scheme: JobTech Taxonomy - Färdighet
definition: Gaturenhållning
broader: zmYu aAM TuF
related: X7HR rZK 4wj

Utmanande beteende, omsorgserfarenhet
type: Concept
in scheme: JobTech Taxonomy - Färdighet
definition: Utmanande beteende, omsorgserfarenhet
broader: zmYu aAM TuF
related: BWwk fYX S5B
related: sq3e WVv Fjd
related: jY19 knH MJp
related: 7pz9 eY9 D2s

Driftansvar, bioraffinaderi
type: Concept
in scheme: JobTech Taxonomy - Färdighet
definition: Driftansvar, bioraffinaderi
broader: zmYu aAM TuF
related: pf1K PTz frm

Trafikinformation
type: Concept
in scheme: JobTech Taxonomy - Färdighet
definition: Trafikinformation innebär att samla in, tolka och förmedla aktuell information om trafikläget till resenärer på stationen. Kompetensen omfattar att snabbt kunna ge tydliga besked om avgångar, ankomster, förseningar, byten och eventuella trafikstörningar. Trafikinformation innebär också att använda digitala system och utrustning för att inhämta och sprida information, samt att anpassa kommunikationen efter resenärers behov.
broader: zmYu aAM TuF
related: fdLf oPp wVw
related: s78G Zp2 dkq
related: UGgc Vm9 Bog

Salsa
type: Concept
in scheme: JobTech Taxonomy - Färdighet
definition: Salsa
broader: p1WM wCw LTd
related: AWJF wqZ va9

Brandbekämpningssystem
type: Concept
in scheme: JobTech Taxonomy - Färdighet
definition: Brandbekämpningssystem avser tekniska lösningar och metoder som används för att upptäcka, begränsa och släcka bränder. Kompetensen omfattar kunskap om olika typer av brandincidenter och de system som är utformade för att skydda människor och egendom från brandskador.
broader: zmYu aAM TuF
related: v9nU 6Fw 4Qg
related: wCx8 rY3 XUT
related: ug5y o6z U3L
related: thZP oR7 WrY
related: nuXg Wjc JPd
related: XeBP nMe pXx
related: AD3U cFH rbe

Medicinska kunskaper för vårdpersonal
type: Concept
in scheme: JobTech Taxonomy - Färdighet
definition: Medicinska kunskaper för vårdpersonal avser den teoretiska och praktiska kunskap som krävs för att ge vård och omsorg inom hälso- och sjukvården. Kompetensen omfattar förståelse för medicinska begrepp, kroppens funktioner och sjukdomstillstånd samt förmåga att utföra grundläggande hälso- och sjukvårdsuppgifter enligt föreskrifter och delegering.
broader: zmYu aAM TuF
related: jY19 knH MJp
related: LP4Z ABV gRm
related: 3H17 ZZr BEc
related: tAJS JNb hDH

Rostskyddsbehandling
type: Concept
in scheme: JobTech Taxonomy - Färdighet
definition: Rostskyddsbehandling avser metoder och processer för att skydda metallytor mot korrosion genom applicering av rostskyddande medel. Kompetensen omfattar kunskaper om olika typer av rostskyddsprodukter och tekniker för att säkerställa långvarigt skydd av metallkonstruktioner, särskilt i samband med fordonsvård och rekonditionering.
broader: zmYu aAM TuF
related: dKUb KBP mw3
related: FjdF H2e tAG

Management, organisation
type: Concept
in scheme: JobTech Taxonomy - Färdighet
definition: Management, organisation
broader: zmYu aAM TuF
related: Qo7p wjf gtv
related: vPP6 rsw dck

EASA-certifikat, kategori B1 (mekanik)
type: Concept
in scheme: JobTech Taxonomy - Färdighet
definition: EASA B1-certifikat är ett flygteknikerlicens för mekaniskt underhåll av flygplan, som ger behörighet att utfärda underhållsintyg för flygplanskroppen, motorer samt mekaniska och elektriska system. Certifikatet utfärdas av Transportstyrelsen.
broader: s48H Sft DTn
related: eRkT cTv H9v

Asbestsanering
type: Concept
in scheme: JobTech Taxonomy - Färdighet
definition: Asbestsanering avser åtgärder och processer för att identifiera, hantera och avlägsna asbest från byggnader och andra strukturer för att säkerställa en säker och hälsosam miljö. Kompetensen innebär kunskap om säkerhetsrutiner, verktyg och metoder som används för att effektivt sanera asbest och minimera riskerna för exponering.
broader: zmYu aAM TuF
related: idjo 2Wr a3E
related: yXbD NTH ijE

Arbetsledning boendeanläggning
type: Concept
in scheme: JobTech Taxonomy - Färdighet
definition: Arbetsledning på boendeanläggning avser bland annat att leda och samordna personal vid anläggningar som campingplatser, stugbyar och vandrarhem. I kompetensen ingår bemanning, schemaläggning, daglig drift och kvalitetsuppföljning.
broader: zmYu aAM TuF
related: bYde Frc xcB

Dans för yrkesdansare, undervisning
type: Concept
in scheme: JobTech Taxonomy - Färdighet
definition: Dans för yrkesdansare, undervisning
broader: Inriktning på lärarkompetens
related: 2x2V UeL 6ke
related: mcRJ kq2 jFr
related: 1CX5 mZw Vcq
related: 4KhP FxL uZ5

Sjöingenjör (behörighet)
type: Concept
in scheme: JobTech Taxonomy - Färdighet
definition: Behörigheten sjöingenjör är den högsta maskinbefälsbehörigheten och medför rätt att tjänstgöra i alla maskinbefälsbefattningar på alla svenska handelsfartyg. Behörigheten utfärdas av Transportstyrelsen
broader: Behörigheter, sjöfart
related: Rsoy sS6 6c4
related: nuXg Wjc JPd

Baninspektion
type: Concept
in scheme: JobTech Taxonomy - Färdighet
definition: Baninspektion
broader: zmYu aAM TuF
related: 957L kZK rHZ

Flygmekanik
type: Concept
in scheme: JobTech Taxonomy - Färdighet
definition: Flygmekanik avser studiet av de fysikaliska och tekniska principer som påverkar flygplans och helikoptrars rörelser och funktioner. Kompetensen omfattar analys av aerodynamik, strukturell integritet och flygmaskiners system för att säkerställa säker drift och prestanda.
broader: zmYu aAM TuF
related: K8yg U4C gkY
related: iGTu bYL 2T7
related: PRQn 9yw NJA
related: KttZ Skc bMR
related: eRkT cTv H9v

Skelettering
type: Concept
in scheme: JobTech Taxonomy - Färdighet
definition: Skelettering
broader: zmYu aAM TuF
related: e6nk AGp y28

Tenor
type: Concept
in scheme: JobTech Taxonomy - Färdighet
definition: Tenor
broader: Sång
related: AWJF wqZ va9

Kompetensintyg, ställarutbildning för formsprutare
type: Concept
in scheme: JobTech Taxonomy - Färdighet
definition: Kompetensintyg, ställarutbildning för formsprutare
broader: s48H Sft DTn
related: yPQ4 EaN Dtj
related: Kxm9 N3V shF

Atp-besiktning
type: Concept
in scheme: JobTech Taxonomy - Färdighet
definition: Atp-besiktning
broader: zmYu aAM TuF
related: Uw64 cuc U3H
related: puim 6PY DGj
related: nuXg Wjc JPd

Vattenskadebesiktning, privat
type: Concept
in scheme: JobTech Taxonomy - Färdighet
definition: Vattenskadebesiktning, privat
broader: zmYu aAM TuF
related: Ru4W zn2 LEz

Kosherkost
type: Concept
in scheme: JobTech Taxonomy - Färdighet
definition: Kosherkost
broader: zmYu aAM TuF
related: BStc SJh DKG

Måleri, konstkonservering
type: Concept
in scheme: JobTech Taxonomy - Färdighet
definition: Måleri, konstkonservering
broader: zmYu aAM TuF
related: 34Tn BQQ tfo

Smarta elnät
type: Concept
in scheme: JobTech Taxonomy - Färdighet
definition: Smarta elnät innebär digital och flexibel styrning av produktion, distribution, lagring och användningen av el, där huvuddelen av elen kommer från förnybara energikällor. Källa: ESCO, Energimyndigheten och www.vattenfall.se
broader: zmYu aAM TuF
related: MW1P GNJ 4F9
related: yXbD NTH ijE
related: SPYW 7Z1 ShT
related: 4Jty HpK a3Q
related: yyF7 jsW EeP

Bindvävsmassage
type: Concept
in scheme: JobTech Taxonomy - Färdighet
definition: Bindvävsmassage
broader: zmYu aAM TuF
related: uxHV KXc PKD

Ljusbord-eO
type: Concept
in scheme: JobTech Taxonomy - Färdighet
definition: Ljusbord-eO
broader: zmYu aAM TuF
related: 4BsK q2C sCL

Plastsvetsning
type: Concept
in scheme: JobTech Taxonomy - Färdighet
definition: Plastsvetsning avser tekniken att sammanfoga plastmaterial genom uppvärmning och tryck, vilket resulterar i en stark och hållbar fog. Denna kompetens är relevant inom flera industrier, inklusive tillverkning av plastprodukter och konstruktion av båtar, där plastsvetsning används för att skapa och reparera komponenter.
broader: on11 B1f LEw
related: HXzD qvt HV6
related: 7zKm 4NW eey
related: yPQ4 EaN Dtj

UNIX, operativsystem
type: Concept
in scheme: JobTech Taxonomy - Färdighet
definition: UNIX, operativsystem
alternative label: UNIX
broader: xAWr WYq JPP
related: BAeH eg8 T2d
related: cBBa ngH fCx
related: Fv7d YhP YmS
related: 1CX5 mZw Vcq
related: D9SL mtn vGM
related: VCpu 5EN bBt
related: DJh5 yyF hEM
related: 4Jty HpK a3Q
related: 13md uyV BNG
related: UXKZ 3zZ ipB
related: MYAz x9m 2LJ

Verksamhetsledning, motionshall
type: Concept
in scheme: JobTech Taxonomy - Färdighet
definition: Verksamhetsledning, motionshall
broader: zmYu aAM TuF
related: wby2 mwq fWV

Bränslesystem, installation och underhåll
type: Concept
in scheme: JobTech Taxonomy - Färdighet
definition: Bränslesystem, installation och underhåll
broader: zmYu aAM TuF
related: Lzpv ofL 3H5

Barn- och ungdomsradiologi, specialistkompetens för läkare
type: Concept
in scheme: JobTech Taxonomy - Färdighet
definition: Barn- och ungdomsradiologi, specialistkompetens för läkare
broader: Specialistbevis för läkare
related: nu7c QuB KVQ

Hydrografi
type: Concept
in scheme: JobTech Taxonomy - Färdighet
definition: Hydrografi
broader: zmYu aAM TuF
related: yXbD NTH ijE
related: ketV G9W GeR
related: V7Yz 4WV g4z

Schaktbil, körvana
type: Concept
in scheme: JobTech Taxonomy - Färdighet
definition: Schaktbil, körvana
broader: zmYu aAM TuF
related: 3MBw pDA P2F

Kartläggning av kostvanor
type: Concept
in scheme: JobTech Taxonomy - Färdighet
definition: Kartläggning av kostvanor
broader: zmYu aAM TuF
related: Pq5C SPC bRA

Husdjursskötsel
type: Concept
in scheme: JobTech Taxonomy - Färdighet
definition: Husdjursskötsel avser den kompetens som omfattar avel, uppfödning och skötsel av husdjur. Denna kompetens innefattar kunskaper och färdigheter för att säkerställa djurens välbefinnande och hälsa samt hantering av kost och utrymmen.
broader: zmYu aAM TuF
related: KYmy iqC xiQ
related: RYCQ ogb uUY
related: MSzH F2n Emb

Möbeldesign
type: Concept
in scheme: JobTech Taxonomy - Färdighet
definition: Möbeldesign
broader: zmYu aAM TuF
related: DqLe pH6 jyj

Naturled, preparering och underhåll
type: Concept
in scheme: JobTech Taxonomy - Färdighet
definition: Naturled, preparering och underhåll
broader: zmYu aAM TuF
related: XBh3 Xrm C4R
related: EA6o N1N QtT
related: df9D e6y 61z
related: C3422
related: C9629
related: C6113
related: ieVp d5L rS9
related: C5153

Fartygsbefäl klass VII, examen
type: Concept
in scheme: JobTech Taxonomy - Färdighet
definition: Fartygsbefäl klass VII, examen avser avklarad utbildning på eftergymnasial nivå med inriktning mot arbete som fartygsbefäl.
broader: s48H Sft DTn
related: CbQK 7th Tyf
related: Lm3Z gek GYc
related: FKCE Anf zGH
related: kDnq Q98 sD3
related: 957L kZK rHZ

Diplomerad fransstylist
type: Concept
in scheme: JobTech Taxonomy - Färdighet
definition: Diplomerad fransstylist visar på grundläggande färdigheter i fransförlängning. Certifiering utförs av SHSF godkänd utbildningsanordnare.
broader: s48H Sft DTn
related: ezKk kss CiQ

Pumpteknik
type: Concept
in scheme: JobTech Taxonomy - Färdighet
definition: Pumpteknik
broader: zmYu aAM TuF
related: K8yg U4C gkY
related: Cppd 9P7 HeR
related: PRQn 9yw NJA

Tillgänglighetsanpassning
type: Concept
in scheme: JobTech Taxonomy - Färdighet
definition: Tillgänglighetsanpassning
broader: zmYu aAM TuF
related: wCx8 rY3 XUT
related: TPH4 2AM isT

Scala, programmeringsspråk
type: Concept
in scheme: JobTech Taxonomy - Färdighet
definition: Scala, programmeringsspråk
alternative label: Scala
alternative label: Scalautveckling
broader: Datorspråk
related: BAeH eg8 T2d
related: Fv7d YhP YmS
related: D9SL mtn vGM
related: DJh5 yyF hEM
related: 4Jty HpK a3Q

Sjukhusmåltider
type: Concept
in scheme: JobTech Taxonomy - Färdighet
definition: Sjukhusmåltider avser planering och tillagning av näringsriktiga och smakfulla måltider för patienter på sjukhus. Denna kompetens innefattar kunskap om kostbehov relaterade till olika medicinska tillstånd samt riktlinjer för livsmedelssäkerhet och hygien.
broader: zmYu aAM TuF
related: Pq5C SPC bRA
related: X1Ac Y9P PJo
related: h324 DPT 7Tw

Sömnadsarbeten
type: Concept
in scheme: JobTech Taxonomy - Färdighet
definition: Sömnadsarbeten avser en kompetens inom textil- och konfektionsbranschen som handlar om att skapa och bearbeta plagg och textila produkter. Denna kompetens inkluderar färdigheter i att sy, ändra och laga kläder samt att arbeta med olika material för att uppfylla kunders specifika önskemål.
broader: zmYu aAM TuF
related: UZBj yDX Ctp
related: mwVN oEH g9k

Fastighetsbildning
type: Concept
in scheme: JobTech Taxonomy - Färdighet
definition: Fastighetsbildning är en juridisk och teknisk kompetens som handlar om att ändra fastigheters indelning och gränser enligt Fastighetsbildningslag (1970:988). Det inkluderar nybildning och ombildning av fastigheter genom åtgärder som avstyckning, klyvning, sammanläggning samt att servitut kan bildas, ändras eller upphävas. Kompetensen innebär också hantering av frågor kring gemensamhetsanläggningar och ledningsrätter.
broader: zmYu aAM TuF
related: wCx8 rY3 XUT
related: GMDo DVo Yzh
related: thZP oR7 WrY
related: Pd51 xnr KCY
related: zKvJ GnC Szx

Bohagstransporter, körvana
type: Concept
in scheme: JobTech Taxonomy - Färdighet
definition: Bohagstransporter, körvana, avser färdigheten att köra och hantera fordon som används för transport av bohag och personliga tillhörigheter. Kompetensen innefattar kunskap om transportregler och säkerhet samt förmåga att effektivt planera och genomföra transporter av möbler och andra hushållsföremål.
broader: zmYu aAM TuF
related: 3MBw pDA P2F
related: bwnk nv2 1cR

Specialistområde för sjuksköterska
type: Concept
in scheme: JobTech Taxonomy - Färdighet
top concept of: JobTech Taxonomy - Färdighet
definition: Specialistområde för sjuksköterska
narrower: Diabetesvård, specialistområde för sjuksköterska
narrower: Anestesisjukvård, specialistområde för sjuksköterska
narrower: Onkologisk vård, specialistområde för sjuksköterska
narrower: v97o t6r 1oN
narrower: Operationssjukvård, specialistområde för sjuksköterska
narrower: Distriktssköterskeutbildning
narrower: Infektionssjukdomar, specialistområde för sjuksköterska
narrower: Kirurgisk vård, specialistområde för sjuksköterska
narrower: ryxY Uwr pkw
narrower: Psykiatrisk vård, specialistområde för sjuksköterska
narrower: vS3s Vyr 8fn
narrower: yL7p NgY yKc
narrower: Ambulanssjukvård, specialistområde för sjuksköterska
narrower: Intensivvård, specialistområde för sjuksköterska
narrower: Neurosjukvård, specialistområde för sjuksköterska
narrower: Akutsjukvård, specialistområde för sjuksköterska
narrower: Demensvård, specialistområde för sjuksköterska
narrower: qkyH MC1 YKU
narrower: Hjärtsjukvård, specialistområde för sjuksköterska
narrower: Medicinsk vård, specialistområde för sjuksköterska

Endodonti/Rotbehandling, specialistkompetens för tandläkare
type: Concept
in scheme: JobTech Taxonomy - Färdighet
definition: Endodonti/Rotbehandling, specialistkompetens för tandläkare
alternative label: Endodonti
alternative label: Rotbehandling
broader: Specialistkompetens för tandläkare
related: HPxT fQJ zwT

Miljörapportering
type: Concept
in scheme: JobTech Taxonomy - Färdighet
definition: Miljörapportering
broader: zmYu aAM TuF
related: rE1E m3d cx1
related: yXbD NTH ijE

Biomedicin
type: Concept
in scheme: JobTech Taxonomy - Färdighet
definition: Biomedicin
broader: zmYu aAM TuF
related: dsK3 hkt zGy
related: 4Jty HpK a3Q

Akvariefiskar
type: Concept
in scheme: JobTech Taxonomy - Färdighet
definition: Akvariefiskar
broader: zmYu aAM TuF
related: c8r8 e4L gwj

Tunnplåtslageri
type: Concept
in scheme: JobTech Taxonomy - Färdighet
definition: Tunnplåtslageri avser kompetens inom tillverkning, montering och reparation av produkter och konstruktioner i tunnplåt. Kompetensen inkluderar även reparation av skador samt byte av plåtdetaljer på fordon och arbete med cisterner, samtliga uppgifter kräver kunskap om hantering av material såsom koppar, mässing och tenn.
broader: zmYu aAM TuF
related: L4hA SJP SFi

Spinett/Taffel
type: Concept
in scheme: JobTech Taxonomy - Färdighet
definition: Spinett/Taffel
alternative label: Spinett
alternative label: Taffel
broader: wLYs CKS wK8
related: AWJF wqZ va9

Kornett, undervisning musikskola
type: Concept
in scheme: JobTech Taxonomy - Färdighet
definition: Kornett, undervisning musikskola
broader: zmYu aAM TuF
related: mcRJ kq2 jFr

Grönytemaskiner, service och underhåll
type: Concept
in scheme: JobTech Taxonomy - Färdighet
definition: Grönytemaskiner, service och underhåll avser kompetensen att utföra service och underhåll på maskiner och utrustning som används för skötsel av grönområden. Detta innefattar bland annat inspektion, reparation och justering av traktorer, gräsklippare och andra grönytemaskiner för att säkerställa effektiv drift och lång livslängd på utrustningen.
broader: zmYu aAM TuF
related: XBh3 Xrm C4R

Enterprise JavaBeans, ramverk/EJB, ramverk
type: Concept
in scheme: JobTech Taxonomy - Färdighet
definition: Enterprise JavaBeans, ramverk/EJB, ramverk
alternative label: EJB, ramverk
alternative label: Enterprise JavaBeans, ramverk
broader: srsj GQb CE1
related: D9SL mtn vGM
related: DJh5 yyF hEM
related: UxT1 tPF Kbg
related: 4Jty HpK a3Q
related: UXKZ 3zZ ipB

Teknisk tjänst inom flyg, specialisering för officer
type: Concept
in scheme: JobTech Taxonomy - Färdighet
definition: Teknisk tjänst inom flyg, specialisering för officer
broader: zmYu aAM TuF
related: dhgR 9jk 95r
related: KiVA anS RJh

Maskinunderhåll, medicinteknisk utrustning
type: Concept
in scheme: JobTech Taxonomy - Färdighet
definition: Maskinunderhåll, medicinteknisk utrustning
broader: zmYu aAM TuF
related: rxmK wwM 1NA
related: Vfum e6B 7Bw

Cobol, programmeringsspråk
type: Concept
in scheme: JobTech Taxonomy - Färdighet
definition: Cobol, programmeringsspråk
alternative label: Cobol
alternative label: Cobolprogrammering
broader: Datorspråk
related: BAeH eg8 T2d
related: Fv7d YhP YmS
related: D9SL mtn vGM
related: DJh5 yyF hEM
related: 4Jty HpK a3Q

Solcellsinstallatör, certifierad
type: Concept
in scheme: JobTech Taxonomy - Färdighet
definition: Solcellsinstallatör, certifierad
broader: s48H Sft DTn
related: SgAJ DW2 FN5

CMAS Two Star Diver
type: Concept
in scheme: JobTech Taxonomy - Färdighet
definition: CMAS Two Star Diver
broader: s48H Sft DTn
related: DPPw 4wa AsH
related: EA6o N1N QtT

Reparation av stränginstrument
type: Concept
in scheme: JobTech Taxonomy - Färdighet
definition: Reparation av stränginstrument avser arbetet med att återställa och underhålla stränginstrument som gitarrer, fioler och cellos. Kompetensen inkluderar inklusive diagnos av skador, justering av strängar och delar samt utförande av nödvändiga reparationer för att säkerställa att instrumentet fungerar optimalt.
broader: zmYu aAM TuF
related: aKdV u7V R5j

Biologiskt laboratoriearbete
type: Concept
in scheme: JobTech Taxonomy - Färdighet
definition: Biologiskt laboratoriearbete avser en serie procedurer och tekniker inom biologi som genomförs i laboratoriemiljö för analys och forskning. Kompetensen omfattar hantering av biologiska prover, utrustning och olika laboratoriemetoder för att utföra experiment och undersökningar inom biologiska vetenskaper.
broader: zmYu aAM TuF
related: yXbD NTH ijE
related: GiNX ESA AL1
related: 4Jty HpK a3Q
related: bExu 8gk azk

Demonstrationsvana, livsmedel
type: Concept
in scheme: JobTech Taxonomy - Färdighet
definition: Demonstrationsvana, livsmedel
broader: zmYu aAM TuF
related: s1Qk o98 2o1
related: NCeZ rSk B4D

VA-anläggningsarbete
type: Concept
in scheme: JobTech Taxonomy - Färdighet
definition: VA-anläggningsarbete
broader: zmYu aAM TuF
related: bZ4J riZ zK6
related: yXbD NTH ijE
related: fLKb bJ3 69p

Akustiskt framförande
type: Concept
in scheme: JobTech Taxonomy - Färdighet
definition: Akustiskt framförande
broader: zmYu aAM TuF
related: AWJF wqZ va9

Local Interconnect Network, LIN
type: Concept
in scheme: JobTech Taxonomy - Färdighet
definition: Local Interconnect Network, LIN
alternative label: Local Interconnect Network
broader: Kommunikationsprotokoll
related: BAeH eg8 T2d
related: cBBa ngH fCx
related: D9SL mtn vGM
related: DJh5 yyF hEM
related: 4Jty HpK a3Q
related: 13md uyV BNG
related: UXKZ 3zZ ipB
related: MYAz x9m 2LJ

Avfallslagstiftning
type: Concept
in scheme: JobTech Taxonomy - Färdighet
definition: Avfallslagstiftning
broader: zmYu aAM TuF
related: Uw64 cuc U3H
related: puim 6PY DGj
related: X7HR rZK 4wj
related: rE1E m3d cx1
related: yXbD NTH ijE

Gesällbrev, skorstensfejare
type: Concept
in scheme: JobTech Taxonomy - Färdighet
definition: Gesällbrev, skorstensfejare
broader: Yrkesbevis/examen
related: SUfj 4D9 FNx

Svets Svart, certifikat
type: Concept
in scheme: JobTech Taxonomy - Färdighet
definition: Stumsvetsning och kälsvetsning av plåt och rör. Källa: Svetskommissionen
broader: Svets-/lödarmetoder med verifierad kunskap
related: vaEp iBS c5h
related: wQ1E Bzk ZyA

Färganalys
type: Concept
in scheme: JobTech Taxonomy - Färdighet
definition: Färganalys avser att bedöma och förstå färgers egenskaper, harmonier och påverkan på omgivningen. Kompetensen omfattar kunskap om färgteori, färguppfattning och tillämpning av färger i olika sammanhang för att uppnå önskade visuella effekter.
broader: zmYu aAM TuF
related: ezKk kss CiQ
related: Vfum e6B 7Bw
related: PF4H kQD zpL
related: xr7w N6Q QMA

Luta, undervisning musikskola
type: Concept
in scheme: JobTech Taxonomy - Färdighet
definition: Luta, undervisning musikskola
broader: zmYu aAM TuF
related: mcRJ kq2 jFr

Föreståndare, brandarliga och explosiva varor (LBE)
type: Concept
in scheme: JobTech Taxonomy - Färdighet
definition: Föreståndare, brandarliga och explosiva varor (LBE)
broader: s48H Sft DTn
related: KttZ Skc bMR

Slipning, konventionell maskin
type: Concept
in scheme: JobTech Taxonomy - Färdighet
definition: Slipning, konventionell maskin
broader: zmYu aAM TuF
related: VKKg e4t t46
related: vaEp iBS c5h
related: o31g CX1 qhQ
related: 4bxV 58E P9N

Hopsättning, metall
type: Concept
in scheme: JobTech Taxonomy - Färdighet
definition: Hopsättning, metall
broader: zmYu aAM TuF
related: Kxm9 N3V shF

Ugnsmurning
type: Concept
in scheme: JobTech Taxonomy - Färdighet
definition: Ugnsmurning
broader: zmYu aAM TuF
related: NnB3 eWH auo

Tågunderhåll
type: Concept
in scheme: JobTech Taxonomy - Färdighet
definition: Tågunderhåll
broader: zmYu aAM TuF
related: KttZ Skc bMR

Prosit/Raindance, redovisningssystem
type: Concept
in scheme: JobTech Taxonomy - Färdighet
definition: Prosit/Raindance, redovisningssystem
alternative label: Prosit, redovisningssystem
alternative label: Prosit/Raindance
alternative label: Raindance, redovisningssystem
broader: xSJR 1Kq pxB
related: eQ4M CNm ozj
related: q81z 3oD 1qu
related: ij8k EwC zyB
related: 4Jty HpK a3Q

Kemi, undervisning grundskolenivå
type: Concept
in scheme: JobTech Taxonomy - Färdighet
definition: Kemi, undervisning grundskolenivå
broader: Inriktning på lärarkompetens
related: oQUQ D11 HPx

Modellbygge
type: Concept
in scheme: JobTech Taxonomy - Färdighet
definition: Modellbygge
broader: zmYu aAM TuF
related: CSUf ZVM a7Z

Vattenkraftanläggning, underhåll
type: Concept
in scheme: JobTech Taxonomy - Färdighet
definition: Vattenkraftanläggning, underhåll, avser verksamheter som syftar till att säkerställa driftsäkerhet och effektivitet hos anläggningar som producerar elektricitet via vattenkraft. Kompetensen omfattar åtgärder för övervakning, reparation och service av maskiner och system inom vattenkraftverk.
broader: zmYu aAM TuF
related: Cppd 9P7 HeR

Folkbildningsarbete
type: Concept
in scheme: JobTech Taxonomy - Färdighet
definition: Folkbildningsarbete
broader: zmYu aAM TuF
related: 3FP7 4Eg x8P
related: z8di AqX GBr

Mobiltelefoner, reparationsvana
type: Concept
in scheme: JobTech Taxonomy - Färdighet
definition: Mobiltelefoner, reparationsvana, avser färdighet att utföra reparationer och underhåll av mobiltelefoner. Kompetensen omfattar kunskaper om mobiltelefoners konstruktion och funktion, samt erfarenhet av felsökning och reparationstekniker för att återställa en enhets prestanda.
broader: zmYu aAM TuF
related: SgAJ DW2 FN5
related: YKL2 FCB 1yr
related: fWrt sLg koW
related: 4Jty HpK a3Q

Meridian, telefonväxel
type: Concept
in scheme: JobTech Taxonomy - Färdighet
definition: Meridian, telefonväxel
broader: Telefonväxlar
related: 4aPu 2nd 8X6
related: ByrL ANp UwV
related: 4Jty HpK a3Q

VVS, el, tele-POINT Electrical
type: Concept
in scheme: JobTech Taxonomy - Färdighet
definition: VVS, el, tele-POINT Electrical
broader: mTLu uo2 gq2
related: nDaB vdy eAy
related: SPYW 7Z1 ShT
related: 4Jty HpK a3Q

Arbetsplattform, utbildningsbevis
type: Concept
in scheme: JobTech Taxonomy - Färdighet
definition: Arbetsplattform, utbildningsbevis
broader: s48H Sft DTn
related: dKUb KBP mw3

Barytonsaxofon
type: Concept
in scheme: JobTech Taxonomy - Färdighet
definition: Barytonsaxofon
broader: wLYs CKS wK8
related: AWJF wqZ va9

Wagnersång
type: Concept
in scheme: JobTech Taxonomy - Färdighet
definition: Wagnersång
broader: Sång
related: AWJF wqZ va9

Yrkesbevis, grävlastare/Yrkesbevis, grävmaskin
type: Concept
in scheme: JobTech Taxonomy - Färdighet
definition: Yrkesbevis, grävlastare/Yrkesbevis, grävmaskin
alternative label: Yrkesbevis, grävlastare
alternative label: Yrkesbevis, grävmaskin
broader: Yrkesbevis/examen
related: sX9n CWa KVC
related: 3ZtN hhA SM7
related: LEvM 7Hs w8i
related: f71c gjL RDq

Arkitekt-POINT smart Bygg
type: Concept
in scheme: JobTech Taxonomy - Färdighet
definition: Arkitekt-POINT smart Bygg
broader: mTLu uo2 gq2
related: thZP oR7 WrY
related: w6ud quG dgh
related: Pd51 xnr KCY
related: XeBP nMe pXx
related: ETAR ggZ Wuw
related: 41KB bfk 5jR
related: 4Jty HpK a3Q

Seismik, mätmetod
type: Concept
in scheme: JobTech Taxonomy - Färdighet
definition: Seismik, mätmetod
broader: zmYu aAM TuF
related: V7Yz 4WV g4z
related: 4Jty HpK a3Q

AL - Auktorisation lågspänning
type: Concept
in scheme: JobTech Taxonomy - Färdighet
definition: AL - Auktorisation lågspänning
broader: Elbehörigheter
related: MW1P GNJ 4F9
related: nDaB vdy eAy
related: SPYW 7Z1 ShT
related: fWrt sLg koW
related: a75S eLg JWH
related: yyF7 jsW EeP

Sovringsunderhåll
type: Concept
in scheme: JobTech Taxonomy - Färdighet
definition: Sovringsunderhåll
broader: zmYu aAM TuF
related: LEvM 7Hs w8i

Underkläder, mannekäng- och modellvana
type: Concept
in scheme: JobTech Taxonomy - Färdighet
definition: Underkläder, mannekäng- och modellvana
broader: zmYu aAM TuF
related: NCeZ rSk B4D

Kvartsdamm, grundutbildning
type: Concept
in scheme: JobTech Taxonomy - Färdighet
definition: Kvartsdamm, grundutbildning
broader: s48H Sft DTn
related: 7zKm 4NW eey
related: NnB3 eWH auo

SharePoint (MOSS), CMS
type: Concept
in scheme: JobTech Taxonomy - Färdighet
definition: SharePoint (MOSS), CMS/innehållshanteringssystem
alternative label: SharePoint (MOSS), innehållshanteringssystem
broader: jTAz uCP RNc
related: BAeH eg8 T2d
related: cBBa ngH fCx
related: Fv7d YhP YmS
related: vPP6 rsw dck
related: oEmP NC1 sXE
related: 4Jty HpK a3Q
related: MYAz x9m 2LJ

Processoptimering inom tillverkningsindustri
type: Concept
in scheme: JobTech Taxonomy - Färdighet
definition: Processoptimering inom tillverkningsindustri avser systematiska metoder och tekniker för att förbättra effektiviteten och produktiviteten i tillverkningsprocesser. Kompetensen innefattar analyser av befintliga processer, inkluderande identifiering av flaskhalsar och möjligheter för förbättring, samt implementering av förändringar för att maximera resursutnyttjande och minimera slöseri.
broader: zmYu aAM TuF
related: v9nU 6Fw 4Qg
related: qn2U dB9 Cmh
related: 33Nt DSs YYA
related: yPQ4 EaN Dtj
related: PRQn 9yw NJA

Forsränning, instruktör
type: Concept
in scheme: JobTech Taxonomy - Färdighet
definition: Forsränning, instruktör avser en kompetens som innebär att leda och undervisa i forsränning, en aktivitet som omfattar paddling på forsande vatten. Instruktörer inom denna kompetens ska besitta kunskap om säkerhetsrutiner, paddelteknik och vattenmiljö samt kunna bedöma och anpassa aktiviteter utifrån deltagarnas färdighetsnivå och erfarenhet.
broader: Idrott/aktivitet
related: EA6o N1N QtT
related: A6X3 efC VNy

Barnskor, tillverkning
type: Concept
in scheme: JobTech Taxonomy - Färdighet
definition: Barnskor, tillverkning
broader: zmYu aAM TuF
related: vJQk YvC XB7

Bild, undervisning gymnasienivå
type: Concept
in scheme: JobTech Taxonomy - Färdighet
definition: Bild, undervisning gymnasienivå
broader: Inriktning på lärarkompetens
related: 4KhP FxL uZ5

Djurvårdare nivå 3
type: Concept
in scheme: JobTech Taxonomy - Färdighet
definition: Djurvårdare 3 innebär kompetens att utföra arbete med skötsel och vård av djur och befogenhet för vissa medicinska moment.
broader: zmYu aAM TuF
related: Lrsj wRZ sFV
related: 8q1B 5AR CEM

Ishockey, instruktör/Ishockey, tränare
type: Concept
in scheme: JobTech Taxonomy - Färdighet
definition: Ishockey, instruktör/Ishockey, tränare
alternative label: Ishockey, instruktör
alternative label: Ishockey, tränare
broader: Idrott/aktivitet
related: EA6o N1N QtT

Arkivvetenskap
type: Concept
in scheme: JobTech Taxonomy - Färdighet
definition: Arkivvetenskap
broader: zmYu aAM TuF
related: wVfo Njx 1rB
related: 4Jty HpK a3Q

Folkrock
type: Concept
in scheme: JobTech Taxonomy - Färdighet
definition: Folkrock
broader: p1WM wCw LTd
related: AWJF wqZ va9

Ekonomiadministration
type: Concept
in scheme: JobTech Taxonomy - Färdighet
definition: Ekonomiadministration avser hantering av ekonomiska och administrativa processer inom en organisation, vilket innefattar registrering, sammanställning och bearbetning av data relaterad till ekonomiska transaktioner. Kompetensen omfattar även kontroll och upprättande av underlag för fakturor samt bokföring av in- och utbetalningar.
broader: zmYu aAM TuF
related: L7eh ihX vM5
related: oEmP NC1 sXE
related: FfMN Bw1 qYR
related: ij8k EwC zyB
related: vCAb uuo ek5

X.500, kommunikationsprotokoll
type: Concept
in scheme: JobTech Taxonomy - Färdighet
definition: X.500, kommunikationsprotokoll
alternative label: X.500
broader: Kommunikationsprotokoll
related: BAeH eg8 T2d
related: cBBa ngH fCx
related: D9SL mtn vGM
related: VCpu 5EN bBt
related: fWrt sLg koW
related: 4Jty HpK a3Q
related: 13md uyV BNG
related: MYAz x9m 2LJ

Snöskoterled, preparering och underhåll
type: Concept
in scheme: JobTech Taxonomy - Färdighet
definition: Snöskoterled, preparering och underhåll avser kompetensen att skapa och bibehålla snöskoterleder genom snöröjning och eventuell isläggning, samt lastning och transport av snö. Denna kompetens innefattar kunskap om leders utformning, underhåll och säkerhetsaspekter för att säkerställa säkra och framkomliga rutter för snöskotrar.
broader: zmYu aAM TuF
related: XBh3 Xrm C4R
related: EA6o N1N QtT
related: df9D e6y 61z
related: C3422
related: C9629
related: C6113
related: ieVp d5L rS9
related: C5153

Byggnadsingenjörsutbildning
type: Concept
in scheme: JobTech Taxonomy - Färdighet
definition: Byggnadsingenjörsutbildning är en utbildning på universitet/högskola eller yrkeshögskola med inriktning mot byggprojektering och byggproduktion.
broader: Yrkesbevis/examen
related: thZP oR7 WrY

Områdesansvar, trafikfrågor
type: Concept
in scheme: JobTech Taxonomy - Färdighet
definition: Områdesansvar, trafikfrågor
broader: zmYu aAM TuF
related: nNxJ YWy vR2

Vedugnsbakning
type: Concept
in scheme: JobTech Taxonomy - Färdighet
definition: Vedugnsbakning avser processen att baka bröd och andra livsmedel i en vedeldad ugn, vilket ger en särskild smak och textur. Kompetensen omfattar kunskaper om temperaturhantering, vedval och bakningstekniker för att uppnå önskade resultat i det färdiga bageriet.
broader: zmYu aAM TuF
related: a8gg ktU w8V

Afroamerikansk musik, undervisningsvana
type: Concept
in scheme: JobTech Taxonomy - Färdighet
definition: Afroamerikansk musik, undervisningsvana
broader: zmYu aAM TuF
related: mcRJ kq2 jFr

Företagsanalys
type: Concept
in scheme: JobTech Taxonomy - Färdighet
definition: Företagsanalys
broader: zmYu aAM TuF
related: Y6yY SuR hVh
related: Bbkh nrm 2J8
related: pTr9 RBT 9ur
related: FfMN Bw1 qYR
related: 3i4a Ufc qpp
related: 9Mn4 PNA 7Yz

Yrkesutbildning, Bilskadereparatör
type: Concept
in scheme: JobTech Taxonomy - Färdighet
definition: Yrkesutbildning, Bilskadereparatör
broader: Yrkesutbildning
related: L4hA SJP SFi

Radiolänksystem
type: Concept
in scheme: JobTech Taxonomy - Färdighet
definition: Radiolänksystem
broader: zmYu aAM TuF
related: nDaB vdy eAy
related: SPYW 7Z1 ShT
related: 4Jty HpK a3Q

Slöjd, undervisning
type: Concept
in scheme: JobTech Taxonomy - Färdighet
definition: Slöjd, undervisning
broader: Inriktning på lärarkompetens
related: oQUQ D11 HPx

Gesällbrev, juvelfattare
type: Concept
in scheme: JobTech Taxonomy - Färdighet
definition: Gesällbrev, juvelfattare är ett bevis på att en hantverkare har genomgått utbildning och avlagt de delprov som krävs inom det specifika hantverksyrket, och därigenom uppnått ett erkännande av färdigheter och kompetens inom yrket. Utfärdas av Sveriges hantverksråd i samråd med aktuell branschorganisation
broader: Yrkesbevis/examen
related: nwSm phw sPo

Programplanering, radio
type: Concept
in scheme: JobTech Taxonomy - Färdighet
definition: Programplanering, radio
broader: zmYu aAM TuF
related: SgNH hag n9D

Prepressarbete
type: Concept
in scheme: JobTech Taxonomy - Färdighet
definition: Prepressarbete avser processen av att förbereda och bearbeta material för tryck, vilket innefattar mottagning, kvalitetsbedömning, anpassning och justering av innehållet. Kompetensen är central för att säkerställa att tryckmaterial uppfyller de tekniska och kvalitativa kraven innan produktionen inleds, vilket kan inkludera arbete med olika filformat och trycktekniker.
broader: zmYu aAM TuF
related: XeJB bkn mRn
related: 4Jty HpK a3Q
related: LeQV umf wUS

Gaffeltruck
type: Concept
in scheme: JobTech Taxonomy - Färdighet
definition: Gaffeltruck avser en typ av industrialt fordon som används för att lyfta och transportera tunga laster. Kompetensen innefattar kunskap om säker hantering, körning och underhåll av gaffeltruckar för att utföra lastning och lossning effektivt.
broader: zmYu aAM TuF
related: KwVo sQu G2e
related: MrcX RDn N53

Solskyddsmontage
type: Concept
in scheme: JobTech Taxonomy - Färdighet
definition: Solskyddsmontage avser installation av solskyddssystem såsom persienner, markiser och andra typer av solskydd. Kompetensen innefattar kunskaper om monteringsmetoder och användning av verktyg för att säkerställa korrekt och säker installation av dessa produkter.
broader: zmYu aAM TuF
related: Kxm9 N3V shF

Microsoft Certified Trainer/MCT
type: Concept
in scheme: JobTech Taxonomy - Färdighet
definition: Microsoft Certified Trainer/MCT
alternative label: MCT
alternative label: Microsoft Certified Trainer
broader: s48H Sft DTn
related: 1CX5 mZw Vcq

Bouzouki
type: Concept
in scheme: JobTech Taxonomy - Färdighet
definition: Bouzouki
broader: wLYs CKS wK8
related: AWJF wqZ va9

Elinstallation, nybyggnad
type: Concept
in scheme: JobTech Taxonomy - Färdighet
definition: Elinstallation, nybyggnad avser kompetensen att installera elektriska system i nya byggnader, vilket inkluderar dragning av kablar, installation av elcentraler och säkerställande av att alla installationer uppfyller gällande säkerhetsstandarder och föreskrifter. Denna kompetens innefattar både praktiska färdigheter och teoretisk kunskap om elteknik.
broader: zmYu aAM TuF
related: SgAJ DW2 FN5
related: a75S eLg JWH
related: yyF7 jsW EeP

Forumspel/Värderingsövningar
type: Concept
in scheme: JobTech Taxonomy - Färdighet
definition: Forumspel/Värderingsövningar
alternative label: Forumspel
alternative label: Värderingsövningar
broader: zmYu aAM TuF
related: iBUL s38 izZ

Miljöskydd, sjöfart
type: Concept
in scheme: JobTech Taxonomy - Färdighet
definition: Miljöskydd, sjöfart
broader: zmYu aAM TuF
related: Rsoy sS6 6c4
related: yXbD NTH ijE
related: PRQn 9yw NJA
related: KttZ Skc bMR
related: kDnq Q98 sD3

Magasinsarbete vid museum
type: Concept
in scheme: JobTech Taxonomy - Färdighet
definition: Magasinsarbete vid museum
broader: zmYu aAM TuF
related: Qbvf 6nd Esn

Presskontakter, vana
type: Concept
in scheme: JobTech Taxonomy - Färdighet
definition: Presskontakter, vana
broader: zmYu aAM TuF
related: x9mo 1VH Rps
related: qVHD Hj5 PXh
related: womV SEj CAH
related: NQTS fou E6u
related: Fu4x 7KG YgC
related: mNoS AN5 drn
related: 8SPu K1k 5qR
related: pf1K PTz frm
related: ajwx FvL YuY
related: coyZ Cyv Srw
related: QG4f MCh vND
related: NxXz fBh w7j
related: SgNH hag n9D
related: 7mn2 kA9 ftp
related: Pz9M srJ Lc9
related: z8di AqX GBr
related: g6eC Fwu B3J
related: ddGt fEH 432
related: bjqk F3A 5Hk
related: eWiB mGP MjE
related: mZsb A1K Gec
related: eX3C MtJ nPA
related: 4GAs rKs 2Ne
related: wby2 mwq fWV
related: uxst tkg zDh
related: X1Ac Y9P PJo
related: hZLv S5f jo2
related: mpuA s56 Hsy
related: 3i4a Ufc qpp
related: sWzF 6pd Y6L
related: k1Nx auG sNh
related: 9QMD sZ3 ZjX
related: nNxJ YWy vR2
related: 1uau t1u rDL
related: 9Mn4 PNA 7Yz

MS Power Point
type: Concept
in scheme: JobTech Taxonomy - Färdighet
definition: MS Power Point
broader: Allmänna datakunskaper
related: eQ4M CNm ozj
related: Y6yY SuR hVh
related: Uw4n UB2 RCW
related: fdLf oPp wVw
related: vPP6 rsw dck
related: iWcY mko rq2
related: ZQTR hVC QhJ
related: br6a VVS V3y
related: 1CX5 mZw Vcq
related: L7eh ihX vM5
related: MGk3 LvL AU2
related: jJF3 qaQ Zsh
related: oEmP NC1 sXE
related: bjqk F3A 5Hk
related: H2Zj eL9 x28
related: dJXy Rpq a2u
related: pwRH MT1 8nR
related: cRmd 536 pT1
related: zKvJ GnC Szx
related: n6iX f2z XfE
related: DZVN v5g Fco
related: ij8k EwC zyB
related: JfYV ZGg 6rm
related: vCAb uuo ek5
related: 4Jty HpK a3Q
related: p16X 44f rwZ
related: pok1 ipJ yzD

Mästarbrev, konstgjutare
type: Concept
in scheme: JobTech Taxonomy - Färdighet
definition: Mästarbrev, konstgjutare
broader: Yrkesbevis/examen
related: J9Vz JxJ Bji

Orientalisk dans
type: Concept
in scheme: JobTech Taxonomy - Färdighet
definition: Orientalisk dans
broader: Dans
related: gmRr 7tt eHj

Sjukdomar hos små idisslare, specialistkompetens för veterinärer
type: Concept
in scheme: JobTech Taxonomy - Färdighet
definition: En fördjupad specialistkompetens för veterinär inom sjukdomar hos små idisslare.
broader: vSJu K1R wk3
related: WL4E r4b ek4

Certifikat enl köldmedieförordningen Kategori IV
type: Concept
in scheme: JobTech Taxonomy - Färdighet
definition: Certifikat enl köldmedieförordningen Kategori IV
broader: s48H Sft DTn
related: df9D e6y 61z
related: KttZ Skc bMR
related: 3UzE P8A 9sS

Tir-besiktning
type: Concept
in scheme: JobTech Taxonomy - Färdighet
definition: Tir-besiktning
broader: zmYu aAM TuF
related: nuXg Wjc JPd

Försäljningsstatistik
type: Concept
in scheme: JobTech Taxonomy - Färdighet
definition: Kompetensen avser kunskaper om och tillämpning av metoder för insamling, analys och rapportering av försäljningsdata inom försäljningsverksamhet. Det innefattar uppföljning av nyckeltal som omsättning, volym, konverteringsgrad och marknadstrender för att stödja beslutsfattande och optimera försäljningsstrategier.
broader: zmYu aAM TuF
related: Pz9M srJ Lc9
related: dUuh wwa FGj
related: WX67 Pfb WMN
related: 4Jty HpK a3Q

Redaktionsledning, film
type: Concept
in scheme: JobTech Taxonomy - Färdighet
definition: Redaktionsledning, film
broader: zmYu aAM TuF
related: 3i4a Ufc qpp

Coaching/Coachning
type: Concept
in scheme: JobTech Taxonomy - Färdighet
definition: Coaching/Coachning avser en metod för att stödja individer i att nå sina personliga eller professionella mål genom strukturerade samtal och reflektion. Kompetensen omfattar förmåga att lyssna aktivt, ställa kraftfulla frågor och ge feedback för att underlätta individers lärande och utveckling.
alternative label: Coaching
alternative label: Coachning
broader: zmYu aAM TuF
related: FpPP jqK xzT
related: EA6o N1N QtT
related: 1CX5 mZw Vcq
related: fsnw ZCu v2U
related: jJF3 qaQ Zsh
related: bjqk F3A 5Hk
related: UUQi UJ5 MSb
related: VYeq GDF a2g

Optisk kontroll av metallprodukter
type: Concept
in scheme: JobTech Taxonomy - Färdighet
definition: Optisk kontroll av metallprodukter
broader: zmYu aAM TuF
related: 4bxV 58E P9N

Yrkesutbildning, bantekniker
type: Concept
in scheme: JobTech Taxonomy - Färdighet
definition: Genomgången och godkänd utbildning till bantekniker genom någon av branschen godkänd utbildningsanordnare.
broader: Yrkesutbildning
related: bZ4J riZ zK6

Teknik, undervisning gymnasienivå
type: Concept
in scheme: JobTech Taxonomy - Färdighet
definition: Teknik, undervisning gymnasienivå
broader: Inriktning på lärarkompetens
related: 4KhP FxL uZ5

Trädgårdsskötsel, cirkelledning
type: Concept
in scheme: JobTech Taxonomy - Färdighet
definition: Trädgårdsskötsel, cirkelledning
broader: zmYu aAM TuF
related: 1CX5 mZw Vcq
related: yXbD NTH ijE

Lösningsfokuserat arbetssätt
type: Concept
in scheme: JobTech Taxonomy - Färdighet
definition: Lösningsfokuserat arbetssätt
broader: zmYu aAM TuF
related: BWwk fYX S5B
related: fsnw ZCu v2U
related: 5uP5 Ugw aVE

Dataskärning, glas
type: Concept
in scheme: JobTech Taxonomy - Färdighet
definition: Dataskärning, glas
broader: zmYu aAM TuF
related: J17g Q2a 2u1

Optoelektronik
type: Concept
in scheme: JobTech Taxonomy - Färdighet
definition: Optoelektronik
broader: Elektronikkompetenser
related: nDaB vdy eAy
related: SPYW 7Z1 ShT
related: fWrt sLg koW
related: 4Jty HpK a3Q

Gröna ytor
type: Concept
in scheme: JobTech Taxonomy - Färdighet
definition: Gröna ytor
broader: zmYu aAM TuF
related: XBh3 Xrm C4R
related: 3ZtN hhA SM7
related: bZ4J riZ zK6
related: yXbD NTH ijE

Basic-SAR
type: Concept
in scheme: JobTech Taxonomy - Färdighet
definition: Basic-SAR
broader: Behörigheter, sjöfart
related: kZwz D8K bKs

Gesällbrev, väskmakare
type: Concept
in scheme: JobTech Taxonomy - Färdighet
definition: Gesällbrev, väskmakare
broader: Yrkesbevis/examen
related: vJQk YvC XB7

Rikssvenska
type: Concept
in scheme: JobTech Taxonomy - Färdighet
definition: Rikssvenska
broader: Dialekt
related: iBUL s38 izZ

Ortopedskor, tillverkning
type: Concept
in scheme: JobTech Taxonomy - Färdighet
definition: Ortopedskor, tillverkning
broader: zmYu aAM TuF
related: vJQk YvC XB7

Tatueringar
type: Concept
in scheme: JobTech Taxonomy - Färdighet
definition: Tatueringar avser processen att applicera permanent färg på huden genom att göra små punkter i huden med hjälp av en speciell nål och bläck. Kompetensen innefattar kunskap om hudens anatomi, användning av utrustning och desinfektionsmetoder samt förståelse för hygienregler.
broader: zmYu aAM TuF
related: ezKk kss CiQ
related: xuSE mtB Mir

Freinetpedagogik, utbildning
type: Concept
in scheme: JobTech Taxonomy - Färdighet
definition: Freinetpedagogik, utbildning
broader: zmYu aAM TuF
related: 2x2V UeL 6ke
related: 3FP7 4Eg x8P
related: 4KhP FxL uZ5
related: oQUQ D11 HPx
related: 5ek3 Cgq WeZ

Behörighetsbevis enligt FSD 5115, behörighetsklass G
type: Concept
in scheme: JobTech Taxonomy - Färdighet
definition: Behörighetsbevis enligt FSD 5115, behörighetsklass G
broader: s48H Sft DTn
related: SgAJ DW2 FN5
related: Kxm9 N3V shF
related: shkw ojo UL2

Philips, telefonväxel
type: Concept
in scheme: JobTech Taxonomy - Färdighet
definition: Philips, telefonväxel
broader: Telefonväxlar
related: 4aPu 2nd 8X6
related: ByrL ANp UwV
related: 4Jty HpK a3Q

Orientering, instruktör/Orientering, tränare
type: Concept
in scheme: JobTech Taxonomy - Färdighet
definition: Orientering, instruktör/Orientering, tränare
alternative label: Orientering, instruktör
alternative label: Orientering, tränare
broader: Idrott/aktivitet
related: EA6o N1N QtT

Konditionstestning
type: Concept
in scheme: JobTech Taxonomy - Färdighet
definition: Konditionstestning
broader: zmYu aAM TuF
related: FpPP jqK xzT
related: aA2Z 9XX R1v

Kolonialvaror
type: Concept
in scheme: JobTech Taxonomy - Färdighet
definition: Kolonialvaror
broader: zmYu aAM TuF
related: oXSW fbY XrY

Sjöpolisutbildning
type: Concept
in scheme: JobTech Taxonomy - Färdighet
definition: Sjöpolisutbildning
broader: Yrkesbevis/examen
related: rNcE Zno pD8

Timring
type: Concept
in scheme: JobTech Taxonomy - Färdighet
definition: Timring
broader: zmYu aAM TuF
related: 9mJN VwW Xjg

Teknisk akustik
type: Concept
in scheme: JobTech Taxonomy - Färdighet
definition: Teknisk akustik omfattar metodutveckling och modellering av alstring, utbredning och upplevelse av ljud och vibrationer. Tillämpningar sker främst inom sektorerna fordon, boendemiljö och industriella processer. Källa: Lulea tekniska universitet, www.ltu.se
broader: zmYu aAM TuF
related: mp2Y vyC RFV
related: yXbD NTH ijE
related: 4Jty HpK a3Q

Prospekteringsborrning
type: Concept
in scheme: JobTech Taxonomy - Färdighet
definition: Prospekteringsborrning
broader: zmYu aAM TuF
related: 7zKm 4NW eey

Flismaskinskötsel, skogsbruk
type: Concept
in scheme: JobTech Taxonomy - Färdighet
definition: Flismaskinskötsel, skogsbruk
broader: zmYu aAM TuF
related: KwVo sQu G2e

Områdesansvar, polisiära frågor
type: Concept
in scheme: JobTech Taxonomy - Färdighet
definition: Områdesansvar, polisiära frågor
broader: zmYu aAM TuF
related: ddGt fEH 432
related: sWzF 6pd Y6L

Elbussar, reparationsvana
type: Concept
in scheme: JobTech Taxonomy - Färdighet
definition: Elbussar, reparationsvana avser kompetensen att analysera fel och utföra underhåll och reparationer på elbussar. Denna färdighet involverar förståelse för elsystem, drivlinor och komponenter specifika för elbussar.
broader: zmYu aAM TuF
related: Lzpv ofL 3H5

Patientkommunikation
type: Concept
in scheme: JobTech Taxonomy - Färdighet
definition: Patientkommunikation. Källa: Socialstyrelsen.
broader: zmYu aAM TuF
related: HPxT fQJ zwT
related: NFUg y9y 1TY
related: nu7c QuB KVQ
related: bEDv SL7 VrL
related: 6eAB cbY i9T
related: ek9W qqp XpF
related: PHJN fva yxs
related: seu9 VoQ VNo
related: jY19 knH MJp
related: nrVt xUL KdQ
related: LP4Z ABV gRm
related: 1tGC fXC mxX
related: cuaN Rj5 YCc
related: dyWo sDb MLQ
related: tAJS JNb hDH
related: gXqW s5Q ZjN
related: 6zAR EHM Kwj
related: Z8ci bBE tmx

Omvärldsbevakning
type: Concept
in scheme: JobTech Taxonomy - Färdighet
definition: Omvärldsbevakning avser systematisk insamling och analys av information om externa faktorer och förändringar som påverkar en organisation eller sektor. Kompetensen omfattar färdigheter för att identifiera, utvärdera och rapportera om trender, konkurrens och samhällsförhållanden som kan ha betydelse för strategiska beslut.
broader: Yrkesövergripande kompetenser

Fårstyckning
type: Concept
in scheme: JobTech Taxonomy - Färdighet
definition: Fårstyckning avser processen för nedskärning och styckning av fårkött till olika detaljer för försäljning och konsumtion. Kompetensen omfattar kännedom om de anatomiska delarna av får samt färdigheter i att hantera verktyg och utrustning som används vid styckning.
broader: zmYu aAM TuF
related: QqHf XKZ eyy

Cip-rengöring
type: Concept
in scheme: JobTech Taxonomy - Färdighet
definition: Cip-rengöring
broader: zmYu aAM TuF
related: yXbD NTH ijE
related: icae Y69 H8E

Ergonomiska produkter
type: Concept
in scheme: JobTech Taxonomy - Färdighet
definition: Ergonomiska produkter
broader: zmYu aAM TuF
related: oXSW fbY XrY
related: Uw64 cuc U3H

Parakrobatik
type: Concept
in scheme: JobTech Taxonomy - Färdighet
definition: Parakrobatik
broader: zmYu aAM TuF
related: xuSE mtB Mir

Tillverkningsindustri-Pro/ENGINEER
type: Concept
in scheme: JobTech Taxonomy - Färdighet
definition: Tillverkningsindustri-Pro/ENGINEER
broader: mTLu uo2 gq2
related: mis4 feV uex
related: xm5G vGn iyk
related: mp2Y vyC RFV
related: 3jEy yuT aVo
related: rwpH 6RA XTT
related: K8yg U4C gkY
related: PRQn 9yw NJA
related: 4Jty HpK a3Q

Underhållsplaneringssystem
type: Concept
in scheme: JobTech Taxonomy - Färdighet
definition: Underhållsplaneringssystem avser en struktur och metodik för att systematiskt planera och hantera underhåll av tekniska system och utrustningar. Kompetensen innefattar användning av programvara och verktyg för att optimera resurser, schemalägga underhållsåtgärder och säkerställa att system fungerar effektivt över tid.
broader: zmYu aAM TuF
related: cBBa ngH fCx
related: nDaB vdy eAy
related: 33Nt DSs YYA
related: SPYW 7Z1 ShT
related: 4Jty HpK a3Q
related: MYAz x9m 2LJ

Social hållbarhet
type: Concept
in scheme: JobTech Taxonomy - Färdighet
definition: Social hållbarhet
broader: zmYu aAM TuF
related: bjqk F3A 5Hk
related: yXbD NTH ijE

Passivhusbyggare, certifierad
type: Concept
in scheme: JobTech Taxonomy - Färdighet
definition: Passivhusbyggare, certifierad
broader: s48H Sft DTn
related: thZP oR7 WrY
related: w6ud quG dgh
related: yXbD NTH ijE
related: AD3U cFH rbe
related: fLKb bJ3 69p
related: yyF7 jsW EeP

Trädgårdsteknik
type: Concept
in scheme: JobTech Taxonomy - Färdighet
definition: Trädgårdsteknik avser kunskap och färdigheter relaterade till anläggning och underhåll av utomhusmiljöer såsom parker, trädgårdar och gröna områden. Kompetensen omfattar även aspekter av växtval, jordbearbetning, bevattning och skötsel av växter, samt design och estetiska överväganden i landskapsutformning.
broader: zmYu aAM TuF
related: XBh3 Xrm C4R
related: XurM DVs ggn
related: 2xQ4 4kh kTZ
related: ETAR ggZ Wuw

Produktionsledning, gruva
type: Concept
in scheme: JobTech Taxonomy - Färdighet
definition: Produktionsledning, gruva
broader: zmYu aAM TuF
related: 7mn2 kA9 ftp
related: 4Jty HpK a3Q

Barnonkologi, specialistkompetens för läkare
type: Concept
in scheme: JobTech Taxonomy - Färdighet
definition: Barnonkologi, specialistkompetens för läkare
broader: Specialistbevis för läkare
related: nu7c QuB KVQ

Utbildningsbevis, säker vatten
type: Concept
in scheme: JobTech Taxonomy - Färdighet
definition: Säker Vattens branschlegitimation styrker kompetens inom säkra vatteninstallationer. Alla VVS-montörer, arbetsledare och lärlingar som arbetar med VVS-installationer och är anställda på ett auktoriserat VVS-företag ska ha branschlegitimation. Källa: https://www.sakervatten.se/auktorisation/vvs-foretag/branschlegitimation
broader: s48H Sft DTn
related: fLKb bJ3 69p

TIBCO, integrationsplattform
type: Concept
in scheme: JobTech Taxonomy - Färdighet
definition: TIBCO, integrationsplattform
broader: Integrationsplattformar
related: BAeH eg8 T2d
related: cBBa ngH fCx
related: D9SL mtn vGM
related: DJh5 yyF hEM
related: 4Jty HpK a3Q
related: UXKZ 3zZ ipB
related: MYAz x9m 2LJ

Legitimation som tandhygienist
type: Concept
in scheme: JobTech Taxonomy - Färdighet
definition: Legitimation som krävs för att kunna arbeta som tandhygienist i Sverige. Utfärdas av Socialstyrelsen.
broader: Yrkesbevis/examen
related: 4P8B LtK JgE
related: r1Gk 3EN bpw
related: 4F9o Jzv Pwz

Ekonomi, undervisning högskolenivå
type: Concept
in scheme: JobTech Taxonomy - Färdighet
definition: Ekonomi, undervisning högskolenivå
broader: Inriktning på högskolelärarkompetens
related: Gm5j S2Y aTB
related: NNK9 F1o pK5
related: cYCo PxY zQd
related: RPBE x5M cXX
related: P7eS nP8 3dy

Sexologi
type: Concept
in scheme: JobTech Taxonomy - Färdighet
definition: Sexologi
broader: zmYu aAM TuF
related: UUQi UJ5 MSb
related: VYeq GDF a2g

Plastverktyg, tillverkning
type: Concept
in scheme: JobTech Taxonomy - Färdighet
definition: Plastverktyg, tillverkning
broader: zmYu aAM TuF
related: MSnK 3Z8 4qA

Intellektuell funktionsnedsättning/IF, omsorgserfarenhet
type: Concept
in scheme: JobTech Taxonomy - Färdighet
definition: Intellektuell funktionsnedsättning, omsorgserfarenhet avser kunskap och praktisk erfarenhet kring hur man ger vård och stöd till personer med intellektuell funktionsnedsättning. Denna kompetens inkluderar insikter om individuella behov, anpassade omsorgsmetoder och samarbete med andra professioner som verkar inom området.
alternative label: Intellektuell funktionsnedsättning, omsorgserfarenhet, IF, omsorgserfarenhet
broader: zmYu aAM TuF
related: BWwk fYX S5B
related: Hi9c iTe gHH
related: sq3e WVv Fjd
related: jY19 knH MJp
related: 7pz9 eY9 D2s
related: tAJS JNb hDH

Djuphålsborrning
type: Concept
in scheme: JobTech Taxonomy - Färdighet
definition: Djuphålsborrning
broader: zmYu aAM TuF
related: 7zKm 4NW eey

Intervjuvana, på stan-intervjuer
type: Concept
in scheme: JobTech Taxonomy - Färdighet
definition: Intervjuvana, på stan-intervjuer, refererar till kompetensen att genomföra intervjuer med allmänheten i offentliga utrymmen för att samla in data eller information. Denna kompetens innefattar förmåga att engagera personer snabbt, ställa relevanta frågor samt hantera och registrera svar på ett strukturerat sätt.
broader: zmYu aAM TuF
related: PxXc 16t oZo
related: 83wV GJa vMd

Parkplanering
type: Concept
in scheme: JobTech Taxonomy - Färdighet
definition: Parkplanering
broader: zmYu aAM TuF
related: yXbD NTH ijE
related: Pd51 xnr KCY
related: ETAR ggZ Wuw

Motorsport, professionell utövning
type: Concept
in scheme: JobTech Taxonomy - Färdighet
definition: Motorsport, professionell utövning
broader: Idrott/aktivitet
related: AwXA EM4 71n

Gesällbrev, nagelterapeut
type: Concept
in scheme: JobTech Taxonomy - Färdighet
definition: Gesällbrev, nagelterapeut
broader: Yrkesbevis/examen
related: ezKk kss CiQ

Ångloksreparationer
type: Concept
in scheme: JobTech Taxonomy - Färdighet
definition: Ångloksreparationer
broader: zmYu aAM TuF
related: KttZ Skc bMR

Barn- och ungdomsidrott, ledarerfarenhet
type: Concept
in scheme: JobTech Taxonomy - Färdighet
definition: Barn- och ungdomsidrott, ledarerfarenhet avser kompetens att planera och leda idrottsaktiviteter för barn och ungdomar i olika sammanhang. Denna kompetens omfattar förmåga att skapa en trygg och motiverande miljö, samt att anpassa träning efter deltagarnas behov och nivåer.
broader: zmYu aAM TuF
related: EA6o N1N QtT
related: aA2Z 9XX R1v

Bockning, konventionell maskin
type: Concept
in scheme: JobTech Taxonomy - Färdighet
definition: Bockning, konventionell maskin
broader: zmYu aAM TuF
related: vaEp iBS c5h
related: L4hA SJP SFi

Sågande skärning
type: Concept
in scheme: JobTech Taxonomy - Färdighet
definition: Sågande skärning
broader: zmYu aAM TuF
related: q2Ge zrQ zJb

Hälsokost
type: Concept
in scheme: JobTech Taxonomy - Färdighet
definition: Hälsokost
broader: zmYu aAM TuF
related: oXSW fbY XrY
related: YKL2 FCB 1yr
related: s1Qk o98 2o1
related: 85cq 6uK 4cK

Inläsningsvana
type: Concept
in scheme: JobTech Taxonomy - Färdighet
definition: Inläsningsvana
broader: zmYu aAM TuF
related: xuSE mtB Mir

Dim sum
type: Concept
in scheme: JobTech Taxonomy - Färdighet
definition: Dim sum
broader: zmYu aAM TuF
related: BStc SJh DKG

UML, programmeringsspråk
type: Concept
in scheme: JobTech Taxonomy - Färdighet
definition: UML, programmeringsspråk
alternative label: UML
broader: Datorspråk
related: BAeH eg8 T2d
related: Fv7d YhP YmS
related: D9SL mtn vGM
related: DJh5 yyF hEM
related: 4Jty HpK a3Q

Oförstörande provning: Virvelstömsprovning (ET)
type: Concept
in scheme: JobTech Taxonomy - Färdighet
definition: Oförstörande provning: Virvelstömsprovning (ET)
broader: zmYu aAM TuF
related: Lzpv ofL 3H5
related: K8yg U4C gkY
related: iGTu bYL 2T7
related: eRkT cTv H9v

Traumavård
type: Concept
in scheme: JobTech Taxonomy - Färdighet
definition: Traumavård
broader: zmYu aAM TuF
related: PHJN fva yxs
related: dyWo sDb MLQ

X2000-tågsreparationer
type: Concept
in scheme: JobTech Taxonomy - Färdighet
definition: X2000-tågsreparationer
broader: zmYu aAM TuF
related: KttZ Skc bMR

Utställning
type: Concept
in scheme: JobTech Taxonomy - Färdighet
definition: Utställning
broader: zmYu aAM TuF
related: 34Tn BQQ tfo
related: 3J38 DNz YKK
related: CSUf ZVM a7Z

SABRE, resebokningssystem
type: Concept
in scheme: JobTech Taxonomy - Färdighet
definition: SABRE, resebokningssystem, avser ett datoriserat system för hantering och bokning av reseprodukter såsom flygbiljetter och hotell.
alternative label: SABRE
broader: kRoQ fPR 8oK
related: fdLf oPp wVw
related: 4Jty HpK a3Q

Fridans, undervisning
type: Concept
in scheme: JobTech Taxonomy - Färdighet
definition: Fridans, undervisning
broader: zmYu aAM TuF
related: mcRJ kq2 jFr

Indonesiskt kök
type: Concept
in scheme: JobTech Taxonomy - Färdighet
definition: Indonesiskt kök
broader: zmYu aAM TuF
related: BStc SJh DKG

Krishantering, kurs
type: Concept
in scheme: JobTech Taxonomy - Färdighet
definition: Krishantering, kurs
broader: s48H Sft DTn
related: Rsoy sS6 6c4
related: kDnq Q98 sD3

Bioriskhantering för laboratorier
type: Concept
in scheme: JobTech Taxonomy - Färdighet
definition: Bioriskhantering för laboratorier avser processer för att identifiera, bedöma, kontrollera och övervaka de risker som är förknippade med farligt biologiskt material som kan finnas på laboratorier och andra liknande verksamheter. Källa: www.sis.se
broader: zmYu aAM TuF
related: wNrt Ysj WuT
related: Z2MZ eYc Lfv
related: yXbD NTH ijE

Mästarbrev, duodji
type: Concept
in scheme: JobTech Taxonomy - Färdighet
definition: Mästarbrev, duodji
broader: Yrkesbevis/examen
related: 1CX5 mZw Vcq
related: aKdV u7V R5j

Specialpedagogexamen
type: Concept
in scheme: JobTech Taxonomy - Färdighet
definition: Specialpedagogexamen är en examen på högskolenivå kopplad till utbildning med inriktning mot specialpedagog.
broader: Yrkesbevis/examen
related: 3FP7 4Eg x8P

Scala, affärssystem
type: Concept
in scheme: JobTech Taxonomy - Färdighet
definition: Scala, affärssystem
alternative label: Affärssystemet scala
alternative label: Scala
broader: xSJR 1Kq pxB
related: eQ4M CNm ozj
related: iWcY mko rq2
related: q81z 3oD 1qu
related: ij8k EwC zyB
related: 4Jty HpK a3Q

RUP, utvecklingsprocessbeskrivning
type: Concept
in scheme: JobTech Taxonomy - Färdighet
definition: RUP, utvecklingsprocessbeskrivning
alternative label: RUP
broader: Styr- och utvecklingsmodeller
related: cBBa ngH fCx
related: DJh5 yyF hEM
related: 4Jty HpK a3Q
related: UXKZ 3zZ ipB

Militäridrott och mångkamp, instruktör/Militäridrott och mångkamp, tränare
type: Concept
in scheme: JobTech Taxonomy - Färdighet
definition: Militäridrott och mångkamp, instruktör/Militäridrott och mångkamp, tränare
alternative label: Militäridrott och mångkamp, instruktör
alternative label: Militäridrott och mångkamp, tränare
broader: Idrott/aktivitet
related: EA6o N1N QtT

Butiksinspektion
type: Concept
in scheme: JobTech Taxonomy - Färdighet
definition: Butiksinspektion
broader: zmYu aAM TuF
related: ayQ4 G3W A2w

Kopplingsansvarig, järnväg
type: Concept
in scheme: JobTech Taxonomy - Färdighet
definition: Kopplingsansvarig, järnväg
broader: Yrkesbevis/examen
related: MW1P GNJ 4F9

Arbetspsykologi
type: Concept
in scheme: JobTech Taxonomy - Färdighet
definition: Arbetspsykologi
broader: zmYu aAM TuF
related: VYeq GDF a2g
related: 9Mn4 PNA 7Yz

Kostekonomi
type: Concept
in scheme: JobTech Taxonomy - Färdighet
definition: Kostekonomi avser kunskap och metodik kring hantering och analys av kostnader inom matproduktion och distribution, inklusive planering och budgetering av matresurser. Den innefattar även strategier för att optimera resursanvändning och minimera avfall i storhushållsverksamheter.
broader: zmYu aAM TuF
related: X1Ac Y9P PJo
related: h324 DPT 7Tw

Hälsopedagogik
type: Concept
in scheme: JobTech Taxonomy - Färdighet
definition: Hälsopedagogik
broader: zmYu aAM TuF
related: FpPP jqK xzT

The Seven Quality Control Tools/7QC
type: Concept
in scheme: JobTech Taxonomy - Färdighet
definition: The Seven Quality Control Tools/7QC
alternative label: 7QC
alternative label: The Seven Quality Control Tools
broader: Kvalitetsverktyg
related: Qo7p wjf gtv
related: vPP6 rsw dck
related: dMVD VYy kgg

Brevsortering
type: Concept
in scheme: JobTech Taxonomy - Färdighet
definition: Brevsortering avser processen att sortera och organisera post för distribution, vilket innefattar både manuell och maskinell sortering av brev, tidskrifter och direktreklam.
broader: zmYu aAM TuF
related: gaBh 1vR tNE

Begreppsanalys
type: Concept
in scheme: JobTech Taxonomy - Färdighet
definition: Begreppsanalys
broader: zmYu aAM TuF
related: Qo7p wjf gtv
related: vPP6 rsw dck

Teamcity, systemutvecklingsverktyg
type: Concept
in scheme: JobTech Taxonomy - Färdighet
definition: Teamcity, systemutvecklingsverktyg
alternative label: Teamcity
broader: Programmerings- och systemutvecklingsverktyg
related: D9SL mtn vGM
related: 4Jty HpK a3Q

Sällskapsdans, undervisning
type: Concept
in scheme: JobTech Taxonomy - Färdighet
definition: Sällskapsdans, undervisning
broader: zmYu aAM TuF
related: mcRJ kq2 jFr

Reklamteckning
type: Concept
in scheme: JobTech Taxonomy - Färdighet
definition: Reklamteckning
broader: zmYu aAM TuF
related: CSUf ZVM a7Z

Hämtning och lämning av personbilar
type: Concept
in scheme: JobTech Taxonomy - Färdighet
definition: Hämtning och lämning av personbilar avser transport av fordon där en förare ansvarar för att hämta upp och lämna tillbaka personbilar. Kompetensen omfattar kunskaper om körning och hantering av olika typer av personbilar.
broader: zmYu aAM TuF
related: P7Ay ooF pri

Humaniora och teologi, undervisning högskolenivå
type: Concept
in scheme: JobTech Taxonomy - Färdighet
definition: Humaniora och teologi, undervisning högskolenivå
broader: Inriktning på högskolelärarkompetens
related: Gm5j S2Y aTB
related: NNK9 F1o pK5
related: cYCo PxY zQd
related: RPBE x5M cXX
related: P7eS nP8 3dy

Öppenvårdsapotek
type: Concept
in scheme: JobTech Taxonomy - Färdighet
definition: Öppenvårdsapotek avser verksamhet som bedrivs av apotek som är tillgängliga för allmänheten och erbjuder receptbelagda och receptfria läkemedel, samt egenvårdsprodukter. I öppenvårdsapotek utförs även rådgivning kring läkemedel och hälsa, i en miljö där patienter kan få stöd i sina hälsobehov.
broader: zmYu aAM TuF
related: 41Az ioZ rmH
related: TMsM oNw j6z
related: XjcN 5LT bWx

Musik, cirkelledning
type: Concept
in scheme: JobTech Taxonomy - Färdighet
definition: Musik, cirkelledning
broader: zmYu aAM TuF
related: 1CX5 mZw Vcq

Ekonomisk terminologi
type: Concept
in scheme: JobTech Taxonomy - Färdighet
definition: Ekonomisk terminologi
broader: zmYu aAM TuF
related: PQDm Z63 zst

Konverteringsteknik
type: Concept
in scheme: JobTech Taxonomy - Färdighet
definition: Konverteringsteknik
broader: zmYu aAM TuF
related: 4BsK q2C sCL
related: CkRH 4Qn iX3
related: 4Jty HpK a3Q

Yrkesbevis, Transportledare inom avfallshantering och återvinning
type: Concept
in scheme: JobTech Taxonomy - Färdighet
definition: Yrkesbevis, transportledare avfallshantering och återvinning
broader: Yrkesbevis/examen
related: yXbD NTH ijE
related: 957L kZK rHZ

Mentaliseringsbaserad terapi/MBT
type: Concept
in scheme: JobTech Taxonomy - Färdighet
definition: Mentaliseringsbaserad terapi/MBT
alternative label: MBT
alternative label: Mentaliseringsbaserad terapi
broader: zmYu aAM TuF
related: UUQi UJ5 MSb
related: VYeq GDF a2g

Legitimation som läkare
type: Concept
in scheme: JobTech Taxonomy - Färdighet
definition: Legitimation som krävs för att kunna arbeta som läkare i Sverige. Utfärdas av Socialstyrelsen.
broader: Yrkesbevis/examen
related: nu7c QuB KVQ
related: seu9 VoQ VNo
related: 4P8B LtK JgE
related: r1Gk 3EN bpw
related: gXqW s5Q ZjN
related: Z8ci bBE tmx

Nibbling
type: Concept
in scheme: JobTech Taxonomy - Färdighet
definition: Nibbling
broader: zmYu aAM TuF
related: vaEp iBS c5h
related: L4hA SJP SFi
related: bXfo 4hb SXx

Pyramid, affärssystem
type: Concept
in scheme: JobTech Taxonomy - Färdighet
definition: Pyramid, affärssystem
alternative label: Pyramid
alternative label: Pyramidkunskaper
alternative label: Redovisningssystemet pyramid
broader: xSJR 1Kq pxB
related: eQ4M CNm ozj
related: iWcY mko rq2
related: q81z 3oD 1qu
related: ij8k EwC zyB
related: 4Jty HpK a3Q

Tillverkning av trummor
type: Concept
in scheme: JobTech Taxonomy - Färdighet
definition: Tillverkning av trummor avser processen för att skapa och konstruera trummor, inklusive typiska steg såsom formgivning, val av material och sammanfogning av delar. Kompetensen innefattar tekniska kunskaper samt hantverksmässiga färdigheter för att producera funktionella och ljudmässigt kvalitativa musikinstrument.
broader: zmYu aAM TuF
related: aKdV u7V R5j

Användarsupport, hårdvara
type: Concept
in scheme: JobTech Taxonomy - Färdighet
definition: Användarsupport, hårdvara avser kompetens i att ge teknisk support och hjälp i samband med hårdvarurelaterade frågor och problem. Kompetensen omfattar felsökning av enheter, installation av hårdvara och support för användare i olika tekniska miljöer.
broader: zmYu aAM TuF
related: hmaC cfi UKg
related: df9D e6y 61z
related: 1CX5 mZw Vcq
related: fWrt sLg koW
related: 4Jty HpK a3Q
related: 13md uyV BNG

Teleteknik
type: Concept
in scheme: JobTech Taxonomy - Färdighet
definition: Teleteknik
broader: zmYu aAM TuF
related: nDaB vdy eAy
related: 4BsK q2C sCL
related: 4Jty HpK a3Q

Skogsinventering
type: Concept
in scheme: JobTech Taxonomy - Färdighet
definition: Skogsinventering
broader: zmYu aAM TuF
related: yXbD NTH ijE
related: 9QMD sZ3 ZjX
related: 3LdB WEJ 8Ms

Gaslasthantering, behörighet
type: Concept
in scheme: JobTech Taxonomy - Färdighet
definition: Gaslasthantering, behörighet
broader: Behörigheter, sjöfart
related: Rsoy sS6 6c4
related: kZwz D8K bKs
related: kDnq Q98 sD3

Fisk och skaldjur
type: Concept
in scheme: JobTech Taxonomy - Färdighet
definition: Fisk och skaldjur
broader: zmYu aAM TuF
related: BStc SJh DKG

Flexotryck
type: Concept
in scheme: JobTech Taxonomy - Färdighet
definition: Flexotryck
broader: zmYu aAM TuF
related: XeJB bkn mRn

GPGPU, grafikkortsprogrammering
type: Concept
in scheme: JobTech Taxonomy - Färdighet
definition: GPGPU, grafikkortsprogrammering
broader: zmYu aAM TuF
related: Q5DF juj 8do
related: DJh5 yyF hEM
related: 4Jty HpK a3Q

Samhällsvetenskap, undervisning högskolenivå
type: Concept
in scheme: JobTech Taxonomy - Färdighet
definition: Samhällsvetenskap, undervisning högskolenivå
broader: Inriktning på högskolelärarkompetens
related: Gm5j S2Y aTB
related: NNK9 F1o pK5
related: cYCo PxY zQd
related: RPBE x5M cXX
related: P7eS nP8 3dy

Fysik, undervisning grundskolenivå
type: Concept
in scheme: JobTech Taxonomy - Färdighet
definition: Fysik, undervisning grundskolenivå
broader: Inriktning på lärarkompetens
related: oQUQ D11 HPx

Elgenererings- och distributionssystem
type: Concept
in scheme: JobTech Taxonomy - Färdighet
definition: Elgenererings- och distributionssystem
broader: zmYu aAM TuF
related: nDaB vdy eAy
related: yXbD NTH ijE
related: SPYW 7Z1 ShT

Etnologi
type: Concept
in scheme: JobTech Taxonomy - Färdighet
definition: Etnologi
broader: zmYu aAM TuF
related: wVfo Njx 1rB
related: sXgV QFg vpb
related: Qbvf 6nd Esn

Köksmontering
type: Concept
in scheme: JobTech Taxonomy - Färdighet
definition: Köksmontering avser processen att installera och montera kökselement såsom skåp, bänkskivor, vitvaror och andra tillbehör i ett kök. Kompetensen innefattar kunskap om både konstruktion och designaspekter för att säkerställa en funktionell och estetiskt tilltalande kökslösning.
broader: zmYu aAM TuF
related: 8ddv P8e iYz
related: 9mJN VwW Xjg

Genealogi
type: Concept
in scheme: JobTech Taxonomy - Färdighet
definition: Genealogi
broader: zmYu aAM TuF
related: sXgV QFg vpb

Områdesansvar, hälso- och sjukvård
type: Concept
in scheme: JobTech Taxonomy - Färdighet
definition: Områdesansvar, hälso- och sjukvård
broader: zmYu aAM TuF
related: womV SEj CAH

Ackumulatorskötsel
type: Concept
in scheme: JobTech Taxonomy - Färdighet
definition: Ackumulatorskötsel
broader: zmYu aAM TuF
related: SgAJ DW2 FN5

COM, distribuerad objektteknik/DCOM, distribuerad objektteknik
type: Concept
in scheme: JobTech Taxonomy - Färdighet
definition: COM, distribuerad objektteknik/DCOM, distribuerad objektteknik
alternative label: COM, distribuerad objektteknik
alternative label: DCOM, distribuerad objektteknik
broader: zmYu aAM TuF
related: DJh5 yyF hEM
related: 4Jty HpK a3Q

Mjukvaruutveckling
type: Concept
in scheme: JobTech Taxonomy - Färdighet
definition: Mjukvaruutveckling avser processen att analysera, designa och skapa programvara och applikationer som körs på datorer och andra elektroniska enheter. Denna kompetens omfattar olika steg i utvecklingscykeln, inklusive kravinsamling, kodning, testning och underhåll av mjukvara för att säkerställa funktionalitet och effektivitet.
broader: zmYu aAM TuF
related: nDaB vdy eAy
related: DJh5 yyF hEM
related: SPYW 7Z1 ShT
related: 4Jty HpK a3Q

Lönerevision
type: Concept
in scheme: JobTech Taxonomy - Färdighet
definition: Lönerevision
broader: zmYu aAM TuF
related: Y6yY SuR hVh
related: mNoS AN5 drn
related: Uw4n UB2 RCW
related: bjqk F3A 5Hk
related: cRmd 536 pT1

Gesällbrev, bilsadelmakare
type: Concept
in scheme: JobTech Taxonomy - Färdighet
definition: Gesällbrev, bilsadelmakare är ett bevis på att en hantverkare har genomgått utbildning och avlagt de delprov som krävs inom det specifika hantverksyrket, och därigenom uppnått ett erkännande av färdigheter och kompetens inom yrket. Utfärdas av Sveriges hantverksråd i samråd med aktuell branschorganisation.
broader: Yrkesbevis/examen
related: vJQk YvC XB7
related: vhUJ LyD XWc

Gesällbrev, målare
type: Concept
in scheme: JobTech Taxonomy - Färdighet
definition: Gesällbrev, målare
broader: Yrkesbevis/examen
related: QKvX v7r PNL

Lantbruksvaror, produktkunskap
type: Concept
in scheme: JobTech Taxonomy - Färdighet
definition: Lantbruksvaror, produktkunskap, avser djupgående förståelse av olika typer av lantbruksprodukter, deras egenskaper, användningsområden och marknadstrender. Kompetensen innefattar även kännedom om hur produkter kan anpassas för olika kundbehov och tillsammans med relevant information hjälpa till i säljprocessen.
broader: zmYu aAM TuF
related: oXSW fbY XrY
related: YKL2 FCB 1yr

Diskning, laboratorium
type: Concept
in scheme: JobTech Taxonomy - Färdighet
definition: Kompetensen diskning i laboratorium innebär att rengöra, desinficera och sterilisera laboratorieutrustning såsom glasvaror, instrument och behållare enligt fastställda rutiner. Arbetet syftar till att säkerställa en ren och kontrollerad miljö för analyser och experiment, samt att förebygga kontaminering. Det kan även innefatta hantering av disk- och steriliseringsutrustning, sortering av material samt efterlevnad av hygien-, säkerhets- och avfallshanteringsföreskrifter.
broader: zmYu aAM TuF
related: tPox ie4 X9X
related: GiNX ESA AL1

Industriell ekonomi
type: Concept
in scheme: JobTech Taxonomy - Färdighet
definition: Industriell ekonomi
broader: zmYu aAM TuF
related: PRQn 9yw NJA

Tråddragningsteknik
type: Concept
in scheme: JobTech Taxonomy - Färdighet
definition: Tråddragningsteknik
broader: zmYu aAM TuF
related: 3jEy yuT aVo
related: rwpH 6RA XTT

Reklamtjänster, produktkunskap
type: Concept
in scheme: JobTech Taxonomy - Färdighet
definition: Reklamtjänster, produktkunskap
broader: zmYu aAM TuF
related: oXSW fbY XrY
related: 85cq 6uK 4cK

Yrkesdiplom, maskinmekaniker
type: Concept
in scheme: JobTech Taxonomy - Färdighet
definition: Yrkesdiplom, maskinmekaniker
broader: s48H Sft DTn
related: KttZ Skc bMR

Frisörkemi
type: Concept
in scheme: JobTech Taxonomy - Färdighet
definition: Frisörkemi avser kemisk-tekniska kunskaper om frisörprodukter som omfattas av regler för kosmetiska produkter. Detta inkluderar behandlingsprodukter som schampo, hårfärg och stylingprodukter, och dessa kunskaper är grundläggande för att säkerställa korrekt och säker användning enligt branschstandarder.
broader: zmYu aAM TuF
related: LyBp bY6 bZK

Trädgårdsskötsel
type: Concept
in scheme: JobTech Taxonomy - Färdighet
definition: Trädgårdsskötsel avser aktiviteter för att vårda och underhålla trädgårdar och grönytor. Kompetensen inkluderar kunskaper om växtvård, jordbearbetning och olika odlingstekniker för att skapa och bevara en hälsosam och estetiskt tilltalande miljö.
broader: zmYu aAM TuF
related: XBh3 Xrm C4R
related: df9D e6y 61z
related: yXbD NTH ijE
related: 2xQ4 4kh kTZ

MXML, programmeringsspråk
type: Concept
in scheme: JobTech Taxonomy - Färdighet
definition: MXML, programmeringsspråk
alternative label: MXML
broader: Datorspråk
related: BAeH eg8 T2d
related: Fv7d YhP YmS
related: nDaB vdy eAy
related: D9SL mtn vGM
related: DJh5 yyF hEM
related: SPYW 7Z1 ShT
related: 4Jty HpK a3Q

Skådespelaransvar
type: Concept
in scheme: JobTech Taxonomy - Färdighet
definition: Skådespelaransvar
broader: zmYu aAM TuF
related: rYSG 3WJ LmC
related: PH2M uV4 r72

Linskarvsprängning (sprängningsteknik)
type: Concept
in scheme: JobTech Taxonomy - Färdighet
definition: Linskarvsprängning (sprängningsteknik)
broader: xKbn JBn EPE
related: sX9n CWa KVC
related: MW1P GNJ 4F9

Teknisk dokumentation
type: Concept
in scheme: JobTech Taxonomy - Färdighet
definition: Kompetensen teknisk dokumentation avser förmåga att skapa, strukturera och hantera tydlig information om tekniska produkter eller system, såsom manualer, instruktioner och specifikationer. Det handlar om att översätta komplex teknik till pedagogiskt innehåll för användare eller tekniker, samt att säkerställa att dokumentationen uppfyller lagkrav och standarder.
broader: zmYu aAM TuF
related: Lzpv ofL 3H5
related: mis4 feV uex
related: DPPw 4wa AsH
related: xm5G vGn iyk
related: dKUb KBP mw3
related: mp2Y vyC RFV
related: rwpH 6RA XTT
related: MW1P GNJ 4F9
related: df9D e6y 61z
related: K8yg U4C gkY
related: SgNH hag n9D
related: nDaB vdy eAy
related: 33Nt DSs YYA
related: SgAJ DW2 FN5
related: SPYW 7Z1 ShT
related: 9DdK AZY ZNK
related: PRQn 9yw NJA
related: fWrt sLg koW
related: 3UzE P8A 9sS
related: a75S eLg JWH
related: GC7L Yw7 Mfo
related: 4Jty HpK a3Q
related: cGxX R9c kW1
related: yyF7 jsW EeP

ARPA
type: Concept
in scheme: JobTech Taxonomy - Färdighet
definition: ARPA
broader: s48H Sft DTn
related: kZwz D8K bKs

CNC-programmering, Maho
type: Concept
in scheme: JobTech Taxonomy - Färdighet
definition: CNC-programmering, Maho
broader: Programmering, CNC-styrsystem
related: vaEp iBS c5h
related: 4Jty HpK a3Q

Motorsågskörkort Nivå B
type: Concept
in scheme: JobTech Taxonomy - Färdighet
definition: Motorsågskörkort Nivå B Källa: skogsstyrelsen.se
broader: Yrkesbevis/examen
related: XBh3 Xrm C4R
related: qouP wtb 93q
related: 2xQ4 4kh kTZ

Utrikesjournalistik
type: Concept
in scheme: JobTech Taxonomy - Färdighet
definition: Utrikesjournalistik
broader: zmYu aAM TuF
related: SgNH hag n9D

Testrail, systemutvecklingsverktyg
type: Concept
in scheme: JobTech Taxonomy - Färdighet
definition: Testrail, systemutvecklingsverktyg
alternative label: Testrail
broader: Programmerings- och systemutvecklingsverktyg
related: D9SL mtn vGM
related: 4Jty HpK a3Q

Specialistbehörig inom arbets- och organisationspsykologi
type: Concept
in scheme: JobTech Taxonomy - Färdighet
definition: En specialistbehörighet och en fördjupad specialistkompetens för psykologer inom arbets- och organisationspsykologi.
broader: Specialistkompetens för psykologer
related: VYeq GDF a2g

Terrängparkdesign
type: Concept
in scheme: JobTech Taxonomy - Färdighet
definition: Terrängparkdesign
broader: zmYu aAM TuF
related: EA6o N1N QtT
related: C3422
related: C2162
related: ETAR ggZ Wuw

Teknisk tjänst inom marin, specialisering för officer
type: Concept
in scheme: JobTech Taxonomy - Färdighet
definition: Teknisk tjänst inom marin, specialisering för officer
broader: zmYu aAM TuF
related: dhgR 9jk 95r
related: KiVA anS RJh

Konsumentvägledning
type: Concept
in scheme: JobTech Taxonomy - Färdighet
definition: Konsumentvägledning
broader: zmYu aAM TuF
related: vPP6 rsw dck
related: yXbD NTH ijE

Rational Performance Tester, systemutvecklingsverktyg
type: Concept
in scheme: JobTech Taxonomy - Färdighet
definition: Rational Performance Tester, systemutvecklingsverktyg
alternative label: Rational Performance Tester
broader: Programmerings- och systemutvecklingsverktyg
related: D9SL mtn vGM
related: DJh5 yyF hEM
related: 4Jty HpK a3Q
related: MYAz x9m 2LJ

Livsmedelstillverkning
type: Concept
in scheme: JobTech Taxonomy - Färdighet
definition: Livsmedelstillverkning avser processen för att producera livsmedel utifrån råvaror, vilket omfattar olika teknologiska och hantverksmässiga metoder för att bearbeta och förädla dessa råvaror till färdiga produkter. Kompetensen innefattar kunskaper om hygieniska riktlinjer, regler kring livsmedelssäkerhet samt hantering av maskiner och utrustning som används i tillverkningen av livsmedel.
broader: zmYu aAM TuF
related: yJk6 azD ywF
related: QqHf XKZ eyy
related: kF59 fge kts
related: icae Y69 H8E
related: gJtZ EBc n2z

Verksamhetsledning, städföretag
type: Concept
in scheme: JobTech Taxonomy - Färdighet
definition: Verksamhetsledning, städföretag
broader: zmYu aAM TuF
related: 3i4a Ufc qpp

Domarfunktion, idrott
type: Concept
in scheme: JobTech Taxonomy - Färdighet
definition: Domarfunktion, idrott avser den kompetens som krävs för att döma och övervaka idrottstävlingar och garantera att regler och regelverk följs under dessa. Denna kompetens innefattar kunskap om specifika idrottsregler, förmåga att fatta snabba beslut samt att säkerställa rättvisa och integritet i tävlingssammanhang.
broader: zmYu aAM TuF
related: EA6o N1N QtT
related: AwXA EM4 71n

Parodontologi/Tandlossningssjukdomar, specialistkompetens för tandläkare
type: Concept
in scheme: JobTech Taxonomy - Färdighet
definition: Parodontologi/Tandlossningssjukdomar, specialistkompetens för tandläkare
alternative label: Parodontologi
alternative label: Tandlossningssjukdomar
broader: Specialistkompetens för tandläkare
related: HPxT fQJ zwT

Processtyrning
type: Concept
in scheme: JobTech Taxonomy - Färdighet
definition: Processtyrning avser förmågan att övervaka och kontrollera produktionsprocesser för att säkerställa effektivitet och kvalitet inom industriella sammanhang. Kompetensen innebär kunskap om tekniska system, analyser av processdata och implementering av förbättringsåtgärder för att optimera produktionen.
broader: zmYu aAM TuF
related: v9nU 6Fw 4Qg
related: 4obu LL6 RqJ
related: Qo7p wjf gtv
related: qn2U dB9 Cmh
related: vPP6 rsw dck
related: 4Jty HpK a3Q
related: bExu 8gk azk

Kost- och nutritionsbehandling
type: Concept
in scheme: JobTech Taxonomy - Färdighet
definition: Kost- och nutritionsbehandling
broader: zmYu aAM TuF
related: Z2MZ eYc Lfv
related: Pq5C SPC bRA

Installation, konstnärlig
type: Concept
in scheme: JobTech Taxonomy - Färdighet
definition: Installation, konstnärlig
broader: zmYu aAM TuF
related: 34Tn BQQ tfo

AI-verktyg för bildredigering
type: Concept
in scheme: JobTech Taxonomy - Färdighet
definition: AI-användning vid bildredigering innebär att använda artificiell intelligens och maskininlärningsbaserade verktyg för att effektivisera och förbättra arbetsmoment inom digital bildbehandling. Kompetensen omfattar färdighet i att hantera programvaror som automatiserar delar av retusch, friläggning, bakgrundsgenerering, bildförbättring och restaurering. Den innefattar även förståelse för verktygens kapacitet och begränsningar, samt förmåga att kombinera AI-stödda funktioner med manuell bearbetning för att uppnå högkvalitativa visuella resultat. AI-teknik används både i specialiserade bildredigeringsprogram och i webbaserade plattformar, och är vanligt förekommande i produktionsmiljöer med höga volymer, som e-handel och reklam.
broader: zmYu aAM TuF
related: 8Bmh vtM zts
related: 34Tn BQQ tfo
related: SgNH hag n9D
related: 3J38 DNz YKK

Multicrew Cooperation/MCC
type: Concept
in scheme: JobTech Taxonomy - Färdighet
definition: Multicrew Cooperation/MCC
alternative label: MCC
alternative label: Multicrew Cooperation
broader: s48H Sft DTn
related: 7n3y FTE qSe

Ytmontering
type: Concept
in scheme: JobTech Taxonomy - Färdighet
definition: Ytmontering
broader: zmYu aAM TuF
related: SgAJ DW2 FN5
related: 4Jty HpK a3Q

Tapetsering, möbler
type: Concept
in scheme: JobTech Taxonomy - Färdighet
definition: Tapetsering, möbler avser kunskap och färdigheter i att stoppa och klä möbler med textilier och andra material. Denna kompetens innefattar både en förståelse för olika typer av material och tekniker samt förmåga att skapa estetiskt tilltalande och funktionella möbellösningar.
broader: zmYu aAM TuF
related: vhUJ LyD XWc

Offertframtagning
type: Concept
in scheme: JobTech Taxonomy - Färdighet
definition: Offertframtagning avser processen att samla in information, analysera kostnader och skapa en strukturerad presentation av erbjudanden till kunder. Kompetensen innefattar kunskaper om prissättning, produkt- eller tjänstespecifikationer samt förmåga att svara mot kunders behov och krav.
broader: zmYu aAM TuF
related: oXSW fbY XrY
related: 8A1f sxQ adT
related: 48KE fDE ryL
related: dUuh wwa FGj
related: WX67 Pfb WMN
related: XeBP nMe pXx

Research, rekrytering
type: Concept
in scheme: JobTech Taxonomy - Färdighet
definition: Research, rekrytering
broader: zmYu aAM TuF
related: bjqk F3A 5Hk

Mästarbrev, träbildhuggare
type: Concept
in scheme: JobTech Taxonomy - Färdighet
definition: Mästarbrev, träbildhuggare
broader: Yrkesbevis/examen
related: 1Nwn GYH wkH

Stora däggdjur, konservering
type: Concept
in scheme: JobTech Taxonomy - Färdighet
definition: Stora däggdjur, konservering
broader: zmYu aAM TuF
related: 34Tn BQQ tfo

Kantavtagning
type: Concept
in scheme: JobTech Taxonomy - Färdighet
definition: Kantavtagning
broader: zmYu aAM TuF
related: hxm6 xkr dHm

Motorsågskörkort Nivå A
type: Concept
in scheme: JobTech Taxonomy - Färdighet
definition: Motorsågskörkort Nivå A. Källa: skogsstyrelsen.se
broader: Yrkesbevis/examen
related: XBh3 Xrm C4R
related: qouP wtb 93q
related: 2xQ4 4kh kTZ

Skorstensinstallation
type: Concept
in scheme: JobTech Taxonomy - Färdighet
definition: Skorstensinstallation avser kompetens att installera och underhålla skorstenssystem i byggnader, vilket omfattar kunskaper om normer och säkerhetsstandarder relaterade till eldstäder och rökkanaler. Denna kompetens inbegriper även förmåga att arbeta med olika material och metoder för att säkerställa korrekt funktion och säkerhet hos installationssystemen.
broader: zmYu aAM TuF
related: HXzD qvt HV6

Facklig organisation
type: Concept
in scheme: JobTech Taxonomy - Färdighet
definition: Facklig organisation
broader: zmYu aAM TuF
related: vPP6 rsw dck

Processvana
type: Concept
in scheme: JobTech Taxonomy - Färdighet
definition: Processvana
broader: zmYu aAM TuF
related: br6a VVS V3y
related: zKvJ GnC Szx
related: DZVN v5g Fco
related: JfYV ZGg 6rm

Bostadsfotografering
type: Concept
in scheme: JobTech Taxonomy - Färdighet
definition: Bostadsfotografering
broader: zmYu aAM TuF
related: Fghp zje WA8
related: 3J38 DNz YKK

UX strategi
type: Concept
in scheme: JobTech Taxonomy - Färdighet
definition: UX strategi
broader: zmYu aAM TuF
related: D9SL mtn vGM
related: UxT1 tPF Kbg
related: 4Jty HpK a3Q

Komfortkylning
type: Concept
in scheme: JobTech Taxonomy - Färdighet
definition: Komfortkylning
broader: zmYu aAM TuF
related: fLKb bJ3 69p

Arbetsrehabilitering för personer med funktionsnedsättning
type: Concept
in scheme: JobTech Taxonomy - Färdighet
definition: Arbetsrehabilitering för personer med funktionsnedsättning är en målinriktad process som syftar till att återställa eller bibehålla arbetsförmåga genom anpassade insatser. Den fokuserar på att kartlägga individens behov, anpassa arbetsuppgifter, arbetstid och miljö, samt erbjuda arbetsträning, stödpersoner och samordning mellan aktörer som Försäkringskassan, arbetsgivare, Arbetsförmedlingen och hälso- och sjukvård.
broader: zmYu aAM TuF
related: fsnw ZCu v2U
related: pok1 ipJ yzD

Reumatologi, specialistkompetens för läkare
type: Concept
in scheme: JobTech Taxonomy - Färdighet
definition: Reumatologi, specialistkompetens för läkare
broader: Specialistbevis för läkare
related: nu7c QuB KVQ

Proteser
type: Concept
in scheme: JobTech Taxonomy - Färdighet
definition: Kompetens inom proteser innebär förmåga att utforma, tillverka och anpassa individuella proteser utifrån patienters behov. Kompetensen innefattar att arbeta med olika material och tekniker, göra avtryck eller digitala modeller samt säkerställa funktion och estetik. Det innefattar även kunskap om justering, uppföljning och dokumentation samt förmåga att samarbeta med andra yrkesgrupper inom vården.
broader: zmYu aAM TuF
related: 39yB xPQ ozd

Digital gestaltning
type: Concept
in scheme: JobTech Taxonomy - Färdighet
definition: Digital gestaltning
broader: zmYu aAM TuF
related: 34Tn BQQ tfo
related: Pd51 xnr KCY
related: ETAR ggZ Wuw
related: 41KB bfk 5jR
related: 4Jty HpK a3Q

Våt- och torrsugning
type: Concept
in scheme: JobTech Taxonomy - Färdighet
definition: Våt- och torrsugning
broader: zmYu aAM TuF
related: Z6TY xDf Yup

Intervjuvana, telefonintervjuer
type: Concept
in scheme: JobTech Taxonomy - Färdighet
definition: Intervjuvana, telefonintervjuer innebär kompetens i att genomföra intervjuer över telefon för att samla in data, åsikter eller information från respondenter. Denna kompetens omfattar förmåga att ställa relevanta frågor, lyssna aktivt och hantera svar för olika typer av undersökningar, såsom marknads-, samhälls- och opinionsundersökningar.
broader: zmYu aAM TuF
related: PxXc 16t oZo
related: 83wV GJa vMd

Skogsmaskiner, reparationsvana
type: Concept
in scheme: JobTech Taxonomy - Färdighet
definition: Skogsmaskiner, reparationsvana avser kompetensen att analysera fel och utföra underhåll samt reparationer på olika typer av skogsmaskiner. Denna färdighet omfattar kunskaper om maskinens tekniska system och apparater, vilket möjliggör effektivt arbete med drift och funktionalitet.
broader: zmYu aAM TuF
related: Lzpv ofL 3H5

Pensioner, personaladministration
type: Concept
in scheme: JobTech Taxonomy - Färdighet
definition: Pensioner, personaladministration
broader: zmYu aAM TuF
related: mNoS AN5 drn
related: L7eh ihX vM5
related: bjqk F3A 5Hk
related: ij8k EwC zyB

AFIS, grundutbildning
type: Concept
in scheme: JobTech Taxonomy - Färdighet
definition: AFIS, grundutbildning
broader: Yrkesbevis/examen
related: 957L kZK rHZ

Kretskonstruktion
type: Concept
in scheme: JobTech Taxonomy - Färdighet
definition: Kretskonstruktion
broader: zmYu aAM TuF
related: nDaB vdy eAy
related: SPYW 7Z1 ShT
related: 4Jty HpK a3Q

Eldistributionsnät, underhållsvana
type: Concept
in scheme: JobTech Taxonomy - Färdighet
definition: Eldistributionsnät, underhållsvana
broader: zmYu aAM TuF
related: MW1P GNJ 4F9

Sterilisering, laboratoriematerial
type: Concept
in scheme: JobTech Taxonomy - Färdighet
definition: Kompetensen sterilisering av laboratoriematerial innebär att avlägsna eller avdöda mikroorganismer från utrustning och material för att säkerställa en kontaminationsfri arbetsmiljö. Arbetet omfattar användning av metoder som autoklavering, torrsterilisering eller kemisk sterilisering, samt kontroll och dokumentation av att steriliseringen uppnått rätt effekt.
broader: zmYu aAM TuF
related: LP4Z ABV gRm
related: tPox ie4 X9X
related: GiNX ESA AL1

Tennis, instruktör/Tennis, tränare
type: Concept
in scheme: JobTech Taxonomy - Färdighet
definition: Tennis, instruktör/Tennis, tränare
alternative label: Tennis, instruktör
alternative label: Tennis, tränare
broader: Idrott/aktivitet
related: EA6o N1N QtT

Soul
type: Concept
in scheme: JobTech Taxonomy - Färdighet
definition: Soul
broader: p1WM wCw LTd
related: AWJF wqZ va9

Inriktning klinisk histopatologi
type: Concept
in scheme: JobTech Taxonomy - Färdighet
definition: Inriktning klinisk histopatologi
broader: zmYu aAM TuF
related: wNrt Ysj WuT

User experience (UX)
type: Concept
in scheme: JobTech Taxonomy - Färdighet
definition: User experience (UX)
broader: zmYu aAM TuF
related: UxT1 tPF Kbg
related: 4Jty HpK a3Q

Produktionsledning, tillverkning
type: Concept
in scheme: JobTech Taxonomy - Färdighet
definition: Produktionsledning inom tillverkning innebär att planera, organisera och styra produktionskedjan för att uppnå effektivitet, kvalitet och lönsamhet.
broader: zmYu aAM TuF
related: mis4 feV uex
related: v9nU 6Fw 4Qg
related: mp2Y vyC RFV
related: pf1K PTz frm
related: K8yg U4C gkY
related: nDaB vdy eAy
related: SPYW 7Z1 ShT
related: dMVD VYy kgg
related: PRQn 9yw NJA
related: 4Jty HpK a3Q

Konvertering av papper
type: Concept
in scheme: JobTech Taxonomy - Färdighet
definition: Konvertering av papper
broader: zmYu aAM TuF
related: iZLB KpD LLo

Webbutveckling
type: Concept
in scheme: JobTech Taxonomy - Färdighet
definition: Webbutveckling avser processen att skapa och underhålla webbplatsers struktur, design, och funktionalitet, vilket inkluderar både front-end och back-end utveckling. Kompetensen omfattar användning av olika programmeringsspråk och verktyg för att bygga interaktiva och användarvänliga webblösningar.
broader: zmYu aAM TuF
related: Fv7d YhP YmS
related: SgNH hag n9D
related: DJh5 yyF hEM
related: UxT1 tPF Kbg
related: 4Jty HpK a3Q
related: Mbt6 3ko DiD
related: UXKZ 3zZ ipB

Kolvmakeri
type: Concept
in scheme: JobTech Taxonomy - Färdighet
definition: Kolvmakeri
broader: zmYu aAM TuF
related: e6nk AGp y28

Verksamhetsledning, djursjukhus
type: Concept
in scheme: JobTech Taxonomy - Färdighet
definition: Verksamhetsledning, djursjukhus
broader: zmYu aAM TuF
related: WL4E r4b ek4

Botanik
type: Concept
in scheme: JobTech Taxonomy - Färdighet
definition: Botanik
broader: zmYu aAM TuF
related: yXbD NTH ijE
related: e9FK VKh ahW

Utbildningsintyg, hjullastare, godshantering
type: Concept
in scheme: JobTech Taxonomy - Färdighet
definition: Utbildningsintyg för hjullastare godshantering. Källa: TYA (Transportfackens Yrkes- och Arbetsmiljönämnd)
broader: Yrkesbevis/examen
related: SZ7Q 2zF nFy
related: WhBn FAp ZNW
related: kLyY rwr aJr
related: 3MBw pDA P2F
related: MrcX RDn N53
related: bwnk nv2 1cR

Facilitera workshops
type: Concept
in scheme: JobTech Taxonomy - Färdighet
definition: Facilitera workshops
broader: zmYu aAM TuF
related: UxT1 tPF Kbg
related: 4Jty HpK a3Q

Läkemedelskemi
type: Concept
in scheme: JobTech Taxonomy - Färdighet
definition: Läkemedelskemi
broader: zmYu aAM TuF
related: eofS oZs RZi

Dokumentation, industriell tillverkning
type: Concept
in scheme: JobTech Taxonomy - Färdighet
definition: Dokumentation, industriell tillverkning, avser insamling, registrering och hantering av information relaterad till tillverkningsprocesser och produkter. Kompetensen omfattar förmåga att skapa och underhålla dokument som beskriver specifikationer, arbetsmetoder, kvalitetsstandarder och säkerhetsprotokoll inom industrin.
broader: zmYu aAM TuF
related: yJk6 azD ywF
related: YiQw N87 zLU
related: ENV6 BNa brP
related: hxm6 xkr dHm
related: rxmK wwM 1NA
related: Vfum e6B 7Bw
related: pf1K PTz frm
related: VKKg e4t t46
related: vaEp iBS c5h
related: K8yg U4C gkY
related: yPQ4 EaN Dtj
related: kF59 fge kts
related: iZLB KpD LLo
related: wQ1E Bzk ZyA
related: Kxm9 N3V shF
related: shkw ojo UL2
related: o31g CX1 qhQ
related: 4DET dLf iB9
related: skLS kpa Ui1
related: dMVD VYy kgg
related: aU9p ekE Fqf
related: QEBd qHu vGr
related: KttZ Skc bMR
related: icae Y69 H8E
related: gJtZ EBc n2z
related: AUs8 M5f dLt

Ljudredigering
type: Concept
in scheme: JobTech Taxonomy - Färdighet
definition: Ljudredigering
broader: zmYu aAM TuF
related: SgNH hag n9D
related: 4BsK q2C sCL
related: CkRH 4Qn iX3
related: 4Jty HpK a3Q

Tillverkningsindustri-CATIA
type: Concept
in scheme: JobTech Taxonomy - Färdighet
definition: Tillverkningsindustri-CATIA
broader: mTLu uo2 gq2
related: mis4 feV uex
related: xm5G vGn iyk
related: mp2Y vyC RFV
related: 3jEy yuT aVo
related: rwpH 6RA XTT
related: K8yg U4C gkY
related: PRQn 9yw NJA
related: 4Jty HpK a3Q

Ekonomisk sociologi
type: Concept
in scheme: JobTech Taxonomy - Färdighet
definition: Ekonomisk sociologi
broader: zmYu aAM TuF
related: sXgV QFg vpb

Snöskottning
type: Concept
in scheme: JobTech Taxonomy - Färdighet
definition: Snöskottning avser processen att avlägsna snö från ytor såsom vägar, gångbanor och parkeringsplatser för att säkerställa framkomlighet och säkerhet under vintermånaderna. Kompetensen innefattar användning av verktyg och maskiner för effektiv snöhantering och kräver kännedom om snö- och isförhållanden.
broader: zmYu aAM TuF
related: df9D e6y 61z
related: X7HR rZK 4wj
related: ieVp d5L rS9

Inkontinenshjälpmedel
type: Concept
in scheme: JobTech Taxonomy - Färdighet
definition: Inkontinenshjälpmedel
broader: zmYu aAM TuF
related: 6eAB cbY i9T
related: 7XXd 4St nit
related: Z8ci bBE tmx
related: oj4c P4b cja

3G-teknik
type: Concept
in scheme: JobTech Taxonomy - Färdighet
definition: 3G-teknik
broader: Mobiltelefonsystem
related: nDaB vdy eAy
related: DJh5 yyF hEM
related: SPYW 7Z1 ShT
related: fWrt sLg koW
related: 4Jty HpK a3Q
related: UXKZ 3zZ ipB

Orgelvård
type: Concept
in scheme: JobTech Taxonomy - Färdighet
definition: Orgelvård avser kompetens inom underhåll och reparation av orglar, vilket inkluderar stämning, justering av mekanik och rengöring av instrumentet för att säkerställa dess funktion och ljudkvalitet. Denna kompetens kräver kunskap om både den tekniska och akustiska aspekten av orgelbyggnad och -underhåll.
broader: zmYu aAM TuF
related: aKdV u7V R5j

Verksamhetsledning, utbildningsföretag
type: Concept
in scheme: JobTech Taxonomy - Färdighet
definition: Verksamhetsledning, utbildningsföretag
broader: zmYu aAM TuF
related: g6eC Fwu B3J

Fordonsvärdering
type: Concept
in scheme: JobTech Taxonomy - Färdighet
definition: Fordonsvärdering avser processen att bedöma och fastställa värdet på fordon, inklusive personbilar och kommersiella fordon. Denna kompetens innefattar kunskaper om marknadsförhållanden, tekniska specifikationer och faktorer som påverkar fordonets skick och värde.
broader: zmYu aAM TuF
related: Ru4W zn2 LEz
related: dUuh wwa FGj

Fysiologi, medicintekniskt område ingenjör
type: Concept
in scheme: JobTech Taxonomy - Färdighet
definition: Fysiologi, medicintekniskt område ingenjör
broader: zmYu aAM TuF
related: GC7L Yw7 Mfo

Röstteknik/Talteknik
type: Concept
in scheme: JobTech Taxonomy - Färdighet
definition: Röstteknik/Talteknik
alternative label: Röstteknik
alternative label: Talteknik
broader: zmYu aAM TuF
related: iBUL s38 izZ
related: pzch NRY 9ZF

Fritidshem
type: Concept
in scheme: JobTech Taxonomy - Färdighet
definition: Fritidshem
broader: zmYu aAM TuF
related: XW9L tA9 WaX
related: aA2Z 9XX R1v

Isoleringsglas, monteringsvana
type: Concept
in scheme: JobTech Taxonomy - Färdighet
definition: Isoleringsglas, monteringsvana
broader: zmYu aAM TuF
related: J17g Q2a 2u1

Bankrätt
type: Concept
in scheme: JobTech Taxonomy - Färdighet
definition: Bankrätt
broader: zmYu aAM TuF
related: q8wL kdi WaW
related: br6a VVS V3y
related: 6aak 8eh iwT
related: DZVN v5g Fco

Mobiltelefonsystem
type: Concept
in scheme: JobTech Taxonomy - Färdighet
top concept of: JobTech Taxonomy - Färdighet
definition: Mobiltelefonsystem
narrower: 5G-teknik
narrower: D-AMPS-system
narrower: UMTS-system
narrower: CDMA-system
narrower: pPbn WWG Wn8
narrower: 3G-teknik
narrower: oXfK 8B1 NBD
narrower: EDGE-system
narrower: WCDMA-system

Redigering, spelfilm
type: Concept
in scheme: JobTech Taxonomy - Färdighet
definition: Redigering, spelfilm
broader: zmYu aAM TuF
related: 4BsK q2C sCL
related: CkRH 4Qn iX3
related: 4Jty HpK a3Q

Cobolt-krom, specialisering tandteknik
type: Concept
in scheme: JobTech Taxonomy - Färdighet
definition: Cobolt-krom, specialisering tandteknik
broader: zmYu aAM TuF
related: 39yB xPQ ozd

Sparsam körning
type: Concept
in scheme: JobTech Taxonomy - Färdighet
definition: Sparsam körning innebär till exempel att: - köra med rätt lufttryck i däcken - hålla hastighetsgränserna - ta bort takräcke och takbox när de inte behövs - köra med så hög växel som möjligt - använda luftkonditionering sparsamt - använda motorvärmare vid låga utetemperaturer Källa: www.transportstyrelsen.se och www.naturskyddsforeningen.se
alternative label: EcoDrivning
broader: zmYu aAM TuF
related: 3ZtN hhA SM7
related: FiDm 2S8 gx7
related: yXbD NTH ijE
related: 3MBw pDA P2F
related: P7Ay ooF pri

Slakt, erfarenhet
type: Concept
in scheme: JobTech Taxonomy - Färdighet
definition: Slakt, erfarenhet
broader: zmYu aAM TuF
related: Lrsj wRZ sFV
related: QqHf XKZ eyy

Barnjournalistik/Ungdomsjournalistik
type: Concept
in scheme: JobTech Taxonomy - Färdighet
definition: Barnjournalistik/Ungdomsjournalistik
alternative label: Barnjournalistik
alternative label: Ungdomsjournalistik
broader: zmYu aAM TuF
related: SgNH hag n9D

Handskrifttolkning
type: Concept
in scheme: JobTech Taxonomy - Färdighet
definition: Handskrifttolkning
broader: zmYu aAM TuF
related: PQDm Z63 zst

Avbytarverksamhet
type: Concept
in scheme: JobTech Taxonomy - Färdighet
definition: Avbytarverksamhet
broader: zmYu aAM TuF
related: KYmy iqC xiQ

Försäljningsvana, telefonförsäljning
type: Concept
in scheme: JobTech Taxonomy - Färdighet
definition: Försäljningsvana, telefonförsäljning avser erfarenhet och färdigheter inom att sälja produkter och tjänster via telefon. Kompetensen omfattar förmåga att kommunicera effektivt, engagera kunder och upprätthålla relationer genom telefonkontakt.
broader: zmYu aAM TuF
related: oXSW fbY XrY
related: Ru4W zn2 LEz
related: PxXc 16t oZo
related: dUuh wwa FGj
related: YKL2 FCB 1yr
related: pwRH MT1 8nR
related: 9dLz BCK oDA
related: 83wV GJa vMd
related: p16X 44f rwZ

Direktreklam
type: Concept
in scheme: JobTech Taxonomy - Färdighet
definition: Direktreklam
broader: zmYu aAM TuF
related: k1Nx auG sNh

DXC, teletransmission
type: Concept
in scheme: JobTech Taxonomy - Färdighet
definition: DXC, teletransmission
broader: Transportnätsystem
related: nDaB vdy eAy
related: SPYW 7Z1 ShT
related: 4Jty HpK a3Q

Arbetsmiljörätt
type: Concept
in scheme: JobTech Taxonomy - Färdighet
definition: Arbetsmiljörätt
broader: zmYu aAM TuF
related: Uw64 cuc U3H

Tankoperativ kurs, gas
type: Concept
in scheme: JobTech Taxonomy - Färdighet
definition: Tankoperativ kurs, gas
broader: s48H Sft DTn
related: Rsoy sS6 6c4
related: kZwz D8K bKs
related: kDnq Q98 sD3

Affärssystem, produktkunskap
type: Concept
in scheme: JobTech Taxonomy - Färdighet
definition: Affärssystem, produktkunskap
broader: zmYu aAM TuF
related: oXSW fbY XrY
related: 4Jty HpK a3Q

Avtalsförsäkringar
type: Concept
in scheme: JobTech Taxonomy - Färdighet
definition: Avtalsförsäkringar
broader: zmYu aAM TuF
related: Ru4W zn2 LEz
related: 9dLz BCK oDA

Legitimation som psykolog
type: Concept
in scheme: JobTech Taxonomy - Färdighet
definition: Legitimation som krävs för att kunna arbeta som psykolog i Sverige. Utfärdas av Socialstyrelsen.
broader: Yrkesbevis/examen
related: 4P8B LtK JgE
related: r1Gk 3EN bpw
related: VYeq GDF a2g

AIS
type: Concept
in scheme: JobTech Taxonomy - Färdighet
definition: AIS
broader: s48H Sft DTn
related: kZwz D8K bKs

MS Publisher
type: Concept
in scheme: JobTech Taxonomy - Färdighet
definition: MS Publisher
broader: Allmänna datakunskaper
related: eQ4M CNm ozj
related: Y6yY SuR hVh
related: Uw4n UB2 RCW
related: fdLf oPp wVw
related: vPP6 rsw dck
related: iWcY mko rq2
related: ZQTR hVC QhJ
related: br6a VVS V3y
related: 1CX5 mZw Vcq
related: L7eh ihX vM5
related: MGk3 LvL AU2
related: jJF3 qaQ Zsh
related: oEmP NC1 sXE
related: bjqk F3A 5Hk
related: H2Zj eL9 x28
related: dJXy Rpq a2u
related: pwRH MT1 8nR
related: cRmd 536 pT1
related: zKvJ GnC Szx
related: n6iX f2z XfE
related: DZVN v5g Fco
related: ij8k EwC zyB
related: JfYV ZGg 6rm
related: vCAb uuo ek5
related: 4Jty HpK a3Q
related: p16X 44f rwZ
related: pok1 ipJ yzD

Diplomerad homeopat
type: Concept
in scheme: JobTech Taxonomy - Färdighet
definition: Diplomering avser att man genomgått en utbildning och uppvisat kunskaper enligt branschstandarder.
broader: s48H Sft DTn
related: F19Z oB6 pg3

Områdesansvar, ambassadverksamhet
type: Concept
in scheme: JobTech Taxonomy - Färdighet
definition: Områdesansvar, ambassadverksamhet
broader: zmYu aAM TuF
related: ddGt fEH 432
related: X1Ac Y9P PJo

Legitimation som optiker
type: Concept
in scheme: JobTech Taxonomy - Färdighet
definition: Legitimation som krävs för att kunna arbeta som optiker i Sverige. Utfärdas av Socialstyrelsen.
broader: Yrkesbevis/examen
related: PUhV DVQ MM6
related: 4P8B LtK JgE
related: r1Gk 3EN bpw

Instruktörsutbildning
type: Concept
in scheme: JobTech Taxonomy - Färdighet
definition: Instruktörsutbildning är en yrkesutbildning med inriktning mot att arbeta som tränare inom hälsa och idrott.
broader: Yrkesbevis/examen
related: EA6o N1N QtT

Glasögonslipning
type: Concept
in scheme: JobTech Taxonomy - Färdighet
definition: Glasögonslipning
broader: zmYu aAM TuF
related: hxm6 xkr dHm
related: YKL2 FCB 1yr

Biometri/Biostatistik
type: Concept
in scheme: JobTech Taxonomy - Färdighet
definition: Biometri/Biostatistik
alternative label: Biometri
alternative label: Biostatistik
broader: zmYu aAM TuF
related: jv1x tpK 32p
related: 4Jty HpK a3Q

Yrkesbevis grundläggningsmaskin
type: Concept
in scheme: JobTech Taxonomy - Färdighet
definition: Yrkesbevis grundläggningsmaskin visar att yrkesarbetaren har, för branschen och yrket i fråga, en godkänd yrkesteoretisk utbildning och en godkänd praktisk utbildning. Yrkesbeviset utfärdas av BYN eller TYA
broader: Yrkesbevis/examen
related: 3ZtN hhA SM7

Sjukhuslaboratoriearbete
type: Concept
in scheme: JobTech Taxonomy - Färdighet
definition: Sjukhuslaboratoriearbete avser de uppgifter och aktiviteter som utförs inom sjukhuslaboratorier för att analysera prover och stödja diagnostik. Kompetensen kan inkludera arbete med olika diagnostiska tester, hantering av laboratorieutrustning samt säkerställande av korrekt provhantering och analysprotokoll.
broader: zmYu aAM TuF
related: GiNX ESA AL1
related: 4Jty HpK a3Q

Doktorsexamen, psykologiämnen
type: Concept
in scheme: JobTech Taxonomy - Färdighet
definition: Doktorsexamen, psykologiämnen
broader: Yrkesbevis/examen
related: Gm5j S2Y aTB
related: cYCo PxY zQd

Dekormålning, scen
type: Concept
in scheme: JobTech Taxonomy - Färdighet
definition: Dekormålning, scen
broader: zmYu aAM TuF
related: CSUf ZVM a7Z

Film/effekter-eyeon Fusion
type: Concept
in scheme: JobTech Taxonomy - Färdighet
definition: Film/effekter-eyeon Fusion
alternative label: Film-eyeon Fusion
alternative label: effekter-eyeon Fusion
broader: Programvara för digitalt skapande
related: 8Bmh vtM zts
related: 4BsK q2C sCL
related: CkRH 4Qn iX3
related: 3J38 DNz YKK
related: PH2M uV4 r72
related: 4Jty HpK a3Q

Vitec Express
type: Concept
in scheme: JobTech Taxonomy - Färdighet
definition: Vitec Express är ett mäklarsystem som används för att hantera bostadsobjekt, visningar och kundkontakter inom fastighetsförmedling. Programvaran möjliggör automatiska uppdateringar av objektsinformation på webbplatser och underlättar administration av visningar, intresseanmälningar och budhantering.
broader: zmYu aAM TuF
related: p16X 44f rwZ

CNC-programmering, Siemens
type: Concept
in scheme: JobTech Taxonomy - Färdighet
definition: CNC-programmering, Siemens
broader: Programmering, CNC-styrsystem
related: vaEp iBS c5h
related: 4Jty HpK a3Q

Distribution, paketbil
type: Concept
in scheme: JobTech Taxonomy - Färdighet
definition: Distribution, paketbil avser kompetensen att köra paketbilar för att transportera varor till kunder. Detta innebär både praktiska färdigheter i bilkörning och kunskap om rutiner för lastning och lossning av paket, samt hantering av leveransdokumentation.
broader: zmYu aAM TuF
related: gaBh 1vR tNE
related: P7Ay ooF pri

Test planning
type: Concept
in scheme: JobTech Taxonomy - Färdighet
definition: Test planning
broader: zmYu aAM TuF
related: D9SL mtn vGM
related: UxT1 tPF Kbg
related: 4Jty HpK a3Q

Styrketräning, instruktör
type: Concept
in scheme: JobTech Taxonomy - Färdighet
definition: Styrketräning, instruktör, avser kompetensen att leda och undervisa i styrketräning, vilket inkluderar utveckling av träningsprogram och säkerställande av korrekt teknik och säkerhet under träning. Instruktörer ska ha kunskaper om muskelgruppers funktion och effektiva träningsmetoder för att stödja olika mål hos deltagare, från nybörjare till avancerade utövare.
broader: Idrott/aktivitet
related: EA6o N1N QtT

Certifikat, IPC-specialist på IPC/WHMA-A-620
type: Concept
in scheme: JobTech Taxonomy - Färdighet
definition: Certifikat, IPC-specialist på IPC/WHMA-A-620
broader: s48H Sft DTn
related: SgAJ DW2 FN5
related: Kxm9 N3V shF
related: shkw ojo UL2

Folkrörelsearbete
type: Concept
in scheme: JobTech Taxonomy - Färdighet
definition: Folkrörelsearbete
broader: zmYu aAM TuF
related: vPP6 rsw dck

Fartygsbefäl klass VI, inre fart (behörighet)
type: Concept
in scheme: JobTech Taxonomy - Färdighet
definition: Fartygsbefäl klass VI, inre fart (behörighet)
broader: Behörigheter, sjöfart
related: kZwz D8K bKs
related: kDnq Q98 sD3

Verksamhetsledning, spel/vadhållning/lotteri
type: Concept
in scheme: JobTech Taxonomy - Färdighet
definition: Verksamhetsledning, spel/vadhållning/lotteri
broader: zmYu aAM TuF
related: NQTS fou E6u
related: 4Jty HpK a3Q

Genetik
type: Concept
in scheme: JobTech Taxonomy - Färdighet
definition: Genetik
broader: zmYu aAM TuF
related: Z2MZ eYc Lfv
related: dsK3 hkt zGy
related: e9FK VKh ahW

Missbruksproblematik, kunskap om
type: Concept
in scheme: JobTech Taxonomy - Färdighet
definition: Missbruksproblematik, kunskap om
broader: zmYu aAM TuF
related: dJXy Rpq a2u
related: n6iX f2z XfE
related: wzeq No2 LF1
related: pok1 ipJ yzD

House
type: Concept
in scheme: JobTech Taxonomy - Färdighet
definition: House
broader: p1WM wCw LTd
related: AWJF wqZ va9

Storformatskopiering
type: Concept
in scheme: JobTech Taxonomy - Färdighet
definition: Storformatskopiering
broader: zmYu aAM TuF
related: Vfum e6B 7Bw

Prodis, logistiksystem
type: Concept
in scheme: JobTech Taxonomy - Färdighet
definition: Prodis, logistiksystem
broader: m7Aj ZBk 1m8
related: xm5G vGn iyk
related: AuTi FEo j3R
related: 4Jty HpK a3Q

Hållfasthetsberäkningar
type: Concept
in scheme: JobTech Taxonomy - Färdighet
definition: Hållfasthetsberäkningar
broader: zmYu aAM TuF
related: K8yg U4C gkY
related: PRQn 9yw NJA
related: 4Jty HpK a3Q

Kännedom om hästars anatomi
type: Concept
in scheme: JobTech Taxonomy - Färdighet
definition: Kännedom om hästars anatomi
broader: zmYu aAM TuF
related: KYmy iqC xiQ

Nivåmätningssystem
type: Concept
in scheme: JobTech Taxonomy - Färdighet
definition: Nivåmätningssystem
broader: zmYu aAM TuF
related: nDaB vdy eAy
related: SPYW 7Z1 ShT

Doktorsexamen, historisk-filosofiska ämnen
type: Concept
in scheme: JobTech Taxonomy - Färdighet
definition: Doktorsexamen, historisk-filosofiska ämnen
broader: Yrkesbevis/examen
related: Gm5j S2Y aTB
related: cYCo PxY zQd

Hållbar vattenanvändning
type: Concept
in scheme: JobTech Taxonomy - Färdighet
definition: Hållbar vattenanvändning
broader: zmYu aAM TuF
related: v9nU 6Fw 4Qg
related: XurM DVs ggn
related: pf1K PTz frm
related: thZP oR7 WrY
related: w6ud quG dgh
related: yXbD NTH ijE
related: Cppd 9P7 HeR
related: XeBP nMe pXx
related: fLKb bJ3 69p
related: 4Jty HpK a3Q

Materialkunskap
type: Concept
in scheme: JobTech Taxonomy - Färdighet
top concept of: JobTech Taxonomy - Färdighet
definition: Materialkunskap
narrower: zwi4 rDc YJ7
narrower: Nickel, materialkunskap
narrower: Stålplåt, materialkunskap
narrower: x8oG RJN 9pb
narrower: Olegerat stål, materialkunskap svets
narrower: Titan och andra speciella materia, materialkunskap svets
narrower: Rostfritt stål, materialkunskap
narrower: Kopparlegeringar, materialkunskap svets
narrower: Aluminium, materialkunskap
narrower: Koppar, materialkunskap
narrower: Rostfria stål och andra legerade stål, materialkunskap svets

Maskinskötsel, trä- och pappersindustri
type: Concept
in scheme: JobTech Taxonomy - Färdighet
definition: Maskinskötsel, trä- och pappersindustri avser kompetens inom drift och underhåll av maskiner i trä- och pappersindustrin. Denna kompetens innefattar inställning och övervakning av maskiner för bearbetning av trä och tillverkning av pappersprodukter, vilket inkluderar bearbetningsmaskiner och processutrustning.
broader: zmYu aAM TuF
related: VKKg e4t t46
related: UdrS qzV P7i
related: 1G6H AuG qyy
related: iZLB KpD LLo
related: AUs8 M5f dLt

Mynt
type: Concept
in scheme: JobTech Taxonomy - Färdighet
definition: Mynt
broader: zmYu aAM TuF
related: JAFv ZaP tDG

Budtransporter
type: Concept
in scheme: JobTech Taxonomy - Färdighet
definition: Budtransporter avser transport av varor och paket med hjälp av olika typer av fordon, såsom budbilar och motorcyklar, för att säkerställa snabb och effektivleverans. Kompetensen omfattar planering av rutter, hantering av leveranser och säkerställande av att gods transporteras på ett säkert sätt.
broader: zmYu aAM TuF
related: ffz2 2n3 R7g
related: P7Ay ooF pri

Golvläggning
type: Concept
in scheme: JobTech Taxonomy - Färdighet
definition: Golvläggning
broader: zmYu aAM TuF
related: V79C DD2 3Gj

Stylingprodukter
type: Concept
in scheme: JobTech Taxonomy - Färdighet
definition: Stylingprodukter
broader: zmYu aAM TuF
related: mwVN oEH g9k
related: LyBp bY6 bZK

Drupal, CMS
type: Concept
in scheme: JobTech Taxonomy - Färdighet
definition: Drupal, CMS/innehållshanteringssystem
alternative label: Drupal, innehållshanteringssystem
broader: jTAz uCP RNc
related: BAeH eg8 T2d
related: cBBa ngH fCx
related: Fv7d YhP YmS
related: vPP6 rsw dck
related: oEmP NC1 sXE
related: 4Jty HpK a3Q
related: MYAz x9m 2LJ

Verkstadsteknik
type: Concept
in scheme: JobTech Taxonomy - Färdighet
definition: Verkstadsteknik avser den kompetens som innefattar kunskap och färdigheter relaterade till tillverkning, bearbetning och montering av olika verkstadskomponenter och maskiner. Detta kan inkludera hantering av både manuella och automatiserade verktyg samt processer inom metallbearbetning och materialhantering.
broader: zmYu aAM TuF
related: Lzpv ofL 3H5
related: dKUb KBP mw3
related: hxm6 xkr dHm
related: VKKg e4t t46
related: MSnK 3Z8 4qA
related: vaEp iBS c5h
related: K8yg U4C gkY
related: wQ1E Bzk ZyA
related: shkw ojo UL2
related: dMVD VYy kgg
related: J9Vz JxJ Bji
related: aU9p ekE Fqf
related: TrwQ RXT W8a
related: L4hA SJP SFi
related: 4bxV 58E P9N
related: bXfo 4hb SXx

Seismologi/Jordrörelser
type: Concept
in scheme: JobTech Taxonomy - Färdighet
definition: Seismologi/Jordrörelser
alternative label: Jordrörelser
alternative label: Seismologi
broader: zmYu aAM TuF
related: V7Yz 4WV g4z
related: 4Jty HpK a3Q

Gruppträning
type: Concept
in scheme: JobTech Taxonomy - Färdighet
definition: Gruppträning består av en grupp med personer som tränar tillsammans med en instruktör som ansvarar för passets upplägg och ibland musik.
broader: zmYu aAM TuF
related: EA6o N1N QtT

Robotsvetsning
type: Concept
in scheme: JobTech Taxonomy - Färdighet
definition: Robotsvetsning avser användning av robotar för att utföra svetsning av metallkonstruktioner. Det involverar programmering och drift av automatiserade system för att säkerställa precision och effektivitet i svetsningsprocesser.
broader: on11 B1f LEw
related: vaEp iBS c5h

FrontPage, HTML-editor
type: Concept
in scheme: JobTech Taxonomy - Färdighet
definition: FrontPage, HTML-editor
alternative label: FrontPage
broader: Programmerings- och systemutvecklingsverktyg
related: 8Bmh vtM zts
related: D9SL mtn vGM
related: 4Jty HpK a3Q
related: Mbt6 3ko DiD
related: MYAz x9m 2LJ

Fågelsanering
type: Concept
in scheme: JobTech Taxonomy - Färdighet
definition: Fågelsanering
broader: zmYu aAM TuF
related: idjo 2Wr a3E
related: yXbD NTH ijE

Områdesansvar, turism
type: Concept
in scheme: JobTech Taxonomy - Färdighet
definition: Områdesansvar, turism
broader: zmYu aAM TuF
related: wby2 mwq fWV
related: X1Ac Y9P PJo

Weblogic Server, applikationsplattform
type: Concept
in scheme: JobTech Taxonomy - Färdighet
definition: Weblogic Server, applikationsplattform
alternative label: Weblogic Server
broader: Applikationsplattformar
related: BAeH eg8 T2d
related: D9SL mtn vGM
related: DJh5 yyF hEM
related: UxT1 tPF Kbg
related: 4Jty HpK a3Q
related: UXKZ 3zZ ipB
related: MYAz x9m 2LJ

Jordbruksekonomi
type: Concept
in scheme: JobTech Taxonomy - Färdighet
definition: Jordbruksekonomi
broader: zmYu aAM TuF
related: WZCM nfS eAk

Integration testing
type: Concept
in scheme: JobTech Taxonomy - Färdighet
definition: Integration testing
broader: zmYu aAM TuF
related: D9SL mtn vGM
related: UxT1 tPF Kbg
related: 4Jty HpK a3Q

Fönsterputsning
type: Concept
in scheme: JobTech Taxonomy - Färdighet
definition: Fönsterputsning avser processen att rengöra och polera glasytor för att säkerställa klar sikt och estetiskt tilltalande utseende. Kompetensen kan innefatta tekniker och metoder för att ta bort smuts, fläckar och kontaminering från fönster och andra glasytor.
broader: zmYu aAM TuF
related: Z6TY xDf Yup
related: FjdF H2e tAG

Företagsvärdering
type: Concept
in scheme: JobTech Taxonomy - Färdighet
definition: Företagsvärdering
broader: zmYu aAM TuF
related: Y6yY SuR hVh
related: q81z 3oD 1qu
related: mZsb A1K Gec
related: cRmd 536 pT1
related: FfMN Bw1 qYR

Förarbevis för snöskoter
type: Concept
in scheme: JobTech Taxonomy - Färdighet
definition: Förarbevis för snöskoter avser den erfordrade dokumentation som intygar att individen har genomgått utbildning och uppfyller de krav som ställs för att köra snöskoter på offentliga vägar och i terräng. Enligt Transportstyrelsen är det nödvändigt att ha förarbevis för snöskoter för att säkerställa en säker och ansvarsfull användning av fordonet.
broader: Yrkesbevis/examen
related: 3ZtN hhA SM7
related: ieVp d5L rS9

Globala målen
type: Concept
in scheme: JobTech Taxonomy - Färdighet
definition: Den 25 september 2015 antog FN:s medlemsländer Agenda 2030, en universell agenda för hållbar utveckling som innehåller sjutton globala mål som ska uppnås till år 2030. Globala målen har i sin tur 169 delmål och drygt 230 globala indikatorer för hur arbetet ska genomföras och följas upp. Globala målen och Agenda 2030 är den mest ambitiösa överenskommelsen för hållbar utveckling som världens ledare någonsin har antagit. I begreppet hållbar utveckling integreras de tre dimensionerna av hållbarhet: social, ekonomisk och miljömässig. Källa: www.globalamalen.se
broader: zmYu aAM TuF
related: vPP6 rsw dck
related: QG4f MCh vND
related: yXbD NTH ijE

Elprodukter/Teleprodukter/Elektronikprodukter
type: Concept
in scheme: JobTech Taxonomy - Färdighet
definition: Elprodukter/Teleprodukter/Elektronikprodukter
alternative label: Elektronikprodukter
alternative label: Elprodukter
alternative label: Teleprodukter
broader: zmYu aAM TuF
related: oXSW fbY XrY
related: JAFv ZaP tDG
related: YKL2 FCB 1yr
related: 4Jty HpK a3Q
related: 85cq 6uK 4cK

Avsyning inom industriell tillverkning
type: Concept
in scheme: JobTech Taxonomy - Färdighet
definition: Avsyning inom industriell tillverkning avser processen att noggrant inspektera och bedöma färdiga produkter eller komponenter för att säkerställa att de uppfyller kvalitetsstandarder och specifikationer innan de går vidare i produktionskedjan. Denna kompetens innefattar att identifiera eventuella defekter eller avvikelser, vilket kan påverka produktens funktion och kvalitet.
broader: zmYu aAM TuF
related: YiQw N87 zLU
related: AUs8 M5f dLt

Charterreseförsäljning
type: Concept
in scheme: JobTech Taxonomy - Färdighet
definition: Charterreseförsäljning avser processen att förmedla och sälja charterresor till kunder. Denna kompetens omfattar att ge information om resmål, logi och evenemang, samt att boka biljetter och arrangera resplaner för resenärer.
broader: oLM7 u3d yJ5
related: fdLf oPp wVw

Operativsystem, undervisning
type: Concept
in scheme: JobTech Taxonomy - Färdighet
definition: Operativsystem, undervisning
broader: Dataundervisning
related: 1CX5 mZw Vcq
related: 4Jty HpK a3Q

Talteater
type: Concept
in scheme: JobTech Taxonomy - Färdighet
definition: Talteater
broader: zmYu aAM TuF
related: iBUL s38 izZ

Tegelbruksarbete
type: Concept
in scheme: JobTech Taxonomy - Färdighet
definition: Tegelbruksarbete
broader: zmYu aAM TuF
related: hxm6 xkr dHm

Yrkesutbildning, processoperatör inom textilindustri
type: Concept
in scheme: JobTech Taxonomy - Färdighet
definition: Yrkesutbildning, processoperatör inom textilindustri är en yrkeshögskoleutbildning med inriktning till processoperatör inom textilindustri.
broader: Yrkesutbildning
related: skLS kpa Ui1

Yrkesbevis, dykarskötare i anläggningsarbete
type: Concept
in scheme: JobTech Taxonomy - Färdighet
definition: Yrkesbevis, dykarskötare i anläggningsarbete
broader: Yrkesbevis/examen
related: DPPw 4wa AsH

Materialkunskap, VVS
type: Concept
in scheme: JobTech Taxonomy - Färdighet
definition: Materialkunskap, VVS
broader: zmYu aAM TuF
related: thZP oR7 WrY
related: w6ud quG dgh
related: XeBP nMe pXx
related: fLKb bJ3 69p
related: 3UzE P8A 9sS
related: cGxX R9c kW1

MPLAB, utvecklingsmiljö
type: Concept
in scheme: JobTech Taxonomy - Färdighet
definition: MPLAB, utvecklingsmiljö
alternative label: MPLAB
broader: zmYu aAM TuF
related: K8yg U4C gkY
related: nDaB vdy eAy
related: SPYW 7Z1 ShT
related: PRQn 9yw NJA
related: 4Jty HpK a3Q

Sun Certified Java Developer
type: Concept
in scheme: JobTech Taxonomy - Färdighet
definition: Sun Certified Java Developer
broader: s48H Sft DTn
related: BAeH eg8 T2d
related: 4Jty HpK a3Q

Lågstadielärarexamen
type: Concept
in scheme: JobTech Taxonomy - Färdighet
definition: Lågstadielärarexamen
broader: Yrkesbevis/examen
related: oQUQ D11 HPx

Ljud-Steinberg Nuendo
type: Concept
in scheme: JobTech Taxonomy - Färdighet
definition: Ljud-Steinberg Nuendo
broader: Programvara för digitalt skapande
related: SgNH hag n9D
related: 4BsK q2C sCL
related: CkRH 4Qn iX3
related: 3J38 DNz YKK
related: PH2M uV4 r72
related: 4Jty HpK a3Q

Inredning, monteringsvana
type: Concept
in scheme: JobTech Taxonomy - Färdighet
definition: Inredning, monteringsvana
broader: zmYu aAM TuF
related: 9mJN VwW Xjg
related: 1Nwn GYH wkH

Viola
type: Concept
in scheme: JobTech Taxonomy - Färdighet
definition: Viola
broader: wLYs CKS wK8
related: AWJF wqZ va9

Etiopati
type: Concept
in scheme: JobTech Taxonomy - Färdighet
definition: Etiopati
broader: zmYu aAM TuF
related: F19Z oB6 pg3

Hjulinställning
type: Concept
in scheme: JobTech Taxonomy - Färdighet
definition: Hjulinställning
broader: zmYu aAM TuF
related: Lzpv ofL 3H5

A la carte
type: Concept
in scheme: JobTech Taxonomy - Färdighet
definition: A la carte avser en metod inom restaurangbranschen där gäster kan välja rätter individuellt från en meny i stället för att få en förbestämd måltid. Denna kompetens omfattar kunskaper om menyplanering, måltidsförberedelser och upplysning om de olika rätternas ingredienser och tillagningsmetoder.
broader: zmYu aAM TuF
related: BStc SJh DKG
related: XGyi i4B ME7

Hållbara transporter
type: Concept
in scheme: JobTech Taxonomy - Färdighet
definition: Hållbara transporter
broader: zmYu aAM TuF
related: xm5G vGn iyk
related: Fu4x 7KG YgC
related: Pz9M srJ Lc9
related: 33Nt DSs YYA
related: yXbD NTH ijE
related: AuTi FEo j3R
related: X1Ac Y9P PJo
related: nNxJ YWy vR2
related: 957L kZK rHZ

Projektplanering
type: Concept
in scheme: JobTech Taxonomy - Färdighet
definition: Projektplanering avser processen för att definiera, schemalägga och resurshantera aktiviteter inom ett projekt för att säkerställa att målen uppnås effektivt och i tid. Denna kompetens innefattar analys av projektkrav, tidsramar och resursallokering för att optimera arbetsflödet och minimera risker.
broader: zmYu aAM TuF
related: mis4 feV uex
related: xm5G vGn iyk
related: v9nU 6Fw 4Qg
related: wNrt Ysj WuT
related: qn2U dB9 Cmh
related: 8Bmh vtM zts
related: mp2Y vyC RFV
related: 3jEy yuT aVo
related: rwpH 6RA XTT
related: 48KE fDE ryL
related: thZP oR7 WrY
related: K8yg U4C gkY
related: nDaB vdy eAy
related: 33Nt DSs YYA
related: DJh5 yyF hEM
related: Pd51 xnr KCY
related: SPYW 7Z1 ShT
related: XeBP nMe pXx
related: PRQn 9yw NJA
related: ETAR ggZ Wuw
related: 41KB bfk 5jR
related: GC7L Yw7 Mfo
related: Mbt6 3ko DiD

Vakans, hänvisningssystem
type: Concept
in scheme: JobTech Taxonomy - Färdighet
definition: Vakans, hänvisningssystem
broader: Hänvisningsdatorer
related: 4aPu 2nd 8X6
related: ByrL ANp UwV
related: 4Jty HpK a3Q

Datorer och kringutrustning
type: Concept
in scheme: JobTech Taxonomy - Färdighet
definition: Datorer och kringutrustning
broader: zmYu aAM TuF
related: oXSW fbY XrY
related: YKL2 FCB 1yr
related: M47D MU2 dhS
related: 4Jty HpK a3Q
related: 85cq 6uK 4cK

Tillverkningsindustri-CADDS 5 classic
type: Concept
in scheme: JobTech Taxonomy - Färdighet
definition: Tillverkningsindustri-CADDS 5 classic
broader: mTLu uo2 gq2
related: mis4 feV uex
related: xm5G vGn iyk
related: mp2Y vyC RFV
related: 3jEy yuT aVo
related: rwpH 6RA XTT
related: K8yg U4C gkY
related: PRQn 9yw NJA
related: 4Jty HpK a3Q

VVS- och fastighetsinriktning, undervisning
type: Concept
in scheme: JobTech Taxonomy - Färdighet
definition: VVS- och fastighetsinriktning, undervisning
broader: Inriktning på lärarkompetens
related: 2x2V UeL 6ke

Kontorsflyttning
type: Concept
in scheme: JobTech Taxonomy - Färdighet
definition: Kontorsflyttning
broader: zmYu aAM TuF
related: bwnk nv2 1cR

Slipning, CNC
type: Concept
in scheme: JobTech Taxonomy - Färdighet
definition: Slipning, CNC
broader: zmYu aAM TuF
related: VKKg e4t t46
related: vaEp iBS c5h
related: 4Jty HpK a3Q
related: 4bxV 58E P9N

Apache Struts, programmeringsverktyg
type: Concept
in scheme: JobTech Taxonomy - Färdighet
definition: Apache Struts, programmeringsverktyg
alternative label: Apache Struts
broader: Programmerings- och systemutvecklingsverktyg
related: D9SL mtn vGM
related: DJh5 yyF hEM
related: 4Jty HpK a3Q
related: MYAz x9m 2LJ

Demensvård, specialistområde för sjuksköterska
type: Concept
in scheme: JobTech Taxonomy - Färdighet
definition: En fördjupad specialistkompetens för sjuksköterska inom demensvård.
broader: Specialistområde för sjuksköterska
related: 6eAB cbY i9T

Personalutveckling
type: Concept
in scheme: JobTech Taxonomy - Färdighet
definition: Personalutveckling
broader: zmYu aAM TuF
related: NQTS fou E6u
related: Qo7p wjf gtv
related: Fu4x 7KG YgC
related: mNoS AN5 drn
related: pf1K PTz frm
related: vPP6 rsw dck
related: 1CX5 mZw Vcq
related: 7mn2 kA9 ftp
related: Fp7x Yqt bx9
related: bjqk F3A 5Hk
related: wby2 mwq fWV

Materialprovning
type: Concept
in scheme: JobTech Taxonomy - Färdighet
definition: Materialprovning avser tekniska metoder och procedurer för att undersöka och analysera material, vilket säkerställer att de uppfyller specifika krav och standarder. Denna kompetens omfattar bland annat mekaniska, kemiska och fysikaliska tester för att utvärdera materialens egenskaper och hållbarhet.
broader: zmYu aAM TuF
related: v9nU 6Fw 4Qg
related: 3jEy yuT aVo
related: rwpH 6RA XTT
related: XeBP nMe pXx
related: KttZ Skc bMR
related: 4Jty HpK a3Q
related: bExu 8gk azk

Nöjesparksarbete
type: Concept
in scheme: JobTech Taxonomy - Färdighet
definition: Nöjesparksarbete avser arbete inom nöjesparker där anställda utför olika uppgifter för att säkerställa en trygg och njutbar upplevelse för besökare. Kompetensen kan omfatta flera olika roller och ansvarsområden, inklusive åkattraktioner, kundservice och hantering av parkens faciliteter.
broader: zmYu aAM TuF
related: ieVp d5L rS9

Dragspel
type: Concept
in scheme: JobTech Taxonomy - Färdighet
definition: Dragspel
broader: wLYs CKS wK8
related: AWJF wqZ va9

Trafikundervisning, bil
type: Concept
in scheme: JobTech Taxonomy - Färdighet
definition: Trafikundervisning, bil
broader: zmYu aAM TuF
related: nuXg Wjc JPd
related: yVZH zHh 6fG

Pia, resebokningssystem
type: Concept
in scheme: JobTech Taxonomy - Färdighet
definition: Pia, resebokningssystem
alternative label: Pia
broader: kRoQ fPR 8oK
related: fdLf oPp wVw
related: 4Jty HpK a3Q

IFU-diplom, försäkringsmäklare
type: Concept
in scheme: JobTech Taxonomy - Färdighet
definition: IFU-diplom, försäkringsmäklare
broader: Yrkesbevis/examen
related: 9dLz BCK oDA

Dietkost
type: Concept
in scheme: JobTech Taxonomy - Färdighet
definition: Dietkost
broader: zmYu aAM TuF
related: BStc SJh DKG
related: XGyi i4B ME7
related: h324 DPT 7Tw

Växthusodling
type: Concept
in scheme: JobTech Taxonomy - Färdighet
definition: Växthusodling avser en metod för odling av växter i kontrollerade miljöer som växthus, vilket möjliggör en optimerad tillväxt genom att reglera faktorer som temperatur, ljus och fuktighet. Kompetensen innefattar kunskaper om växtbiologi, odlingstekniker samt hantering av skadegörare och sjukdomar för att säkerställa hög kvalitet och avkastning på odlade växter.
broader: zmYu aAM TuF
related: XBh3 Xrm C4R
related: XurM DVs ggn
related: yXbD NTH ijE
related: 2xQ4 4kh kTZ
related: k3R3 UkC nK2

Socialmedicin, specialistkompetens för läkare
type: Concept
in scheme: JobTech Taxonomy - Färdighet
definition: Socialmedicin, specialistkompetens för läkare
broader: Specialistbevis för läkare
related: nu7c QuB KVQ

SAP Sybase, databashanterare
type: Concept
in scheme: JobTech Taxonomy - Färdighet
definition: SAP Sybase, databashanterare
alternative label: SAP Sybase
broader: Databaser
related: BAeH eg8 T2d
related: cBBa ngH fCx
related: Fv7d YhP YmS
related: D9SL mtn vGM
related: DJh5 yyF hEM
related: 4Jty HpK a3Q
related: MYAz x9m 2LJ

Klinisk kemi, specialistkompetens för läkare
type: Concept
in scheme: JobTech Taxonomy - Färdighet
definition: Klinisk kemi, specialistkompetens för läkare
broader: Specialistbevis för läkare
related: nu7c QuB KVQ

Energiproduktion, förnyelsebar
type: Concept
in scheme: JobTech Taxonomy - Färdighet
definition: Energiproduktion, förnyelsebar
broader: zmYu aAM TuF
related: XurM DVs ggn
related: nDaB vdy eAy
related: rE1E m3d cx1
related: yXbD NTH ijE
related: Cppd 9P7 HeR
related: PRQn 9yw NJA
related: 3LdB WEJ 8Ms

Liftmekanikerutbildning
type: Concept
in scheme: JobTech Taxonomy - Färdighet
definition: Liftmekanikerutbildning är en eftergymnasial yrkesutbildning med inriktning mot reparation och underhåll av skidliftar.
broader: s48H Sft DTn
related: XYzP 5Tn 7Ep

Ekonomijournalistik
type: Concept
in scheme: JobTech Taxonomy - Färdighet
definition: Ekonomijournalistik
broader: zmYu aAM TuF
related: SgNH hag n9D

Ockarina
type: Concept
in scheme: JobTech Taxonomy - Färdighet
definition: Ockarina
broader: wLYs CKS wK8
related: AWJF wqZ va9

Kvalitetssäkring och produktionsplanering inom textilindustri
type: Concept
in scheme: JobTech Taxonomy - Färdighet
definition: Kvalitetssäkring och produktionsplanering inom textilindustri avser processen att säkerställa att textilprodukter uppfyller föreskrivna kvalitetsstandarder och att produktionsflöden är effektiva och välorganiserade. Kompetensen omfattar analysering av kvalitetskriterier, övervakning av tillverkningsprocesser samt planering av produktionsscheman för att optimera resursanvändning och minska slöseri.
broader: zmYu aAM TuF
related: mwVN oEH g9k

Arbetsmiljöingenjörsutbildning
type: Concept
in scheme: JobTech Taxonomy - Färdighet
definition: Arbetsmiljöingenjörsutbildning
broader: Yrkesbevis/examen
related: Uw64 cuc U3H

Eclipse, integrerad utvecklingsmiljö
type: Concept
in scheme: JobTech Taxonomy - Färdighet
definition: Eclipse, integrerad utvecklingsmiljö
alternative label: Eclipse
alternative label: Eclipseutveckling
broader: Programmerings- och systemutvecklingsverktyg
related: D9SL mtn vGM
related: DJh5 yyF hEM
related: 4Jty HpK a3Q
related: MYAz x9m 2LJ

Godsvagnsreparationer
type: Concept
in scheme: JobTech Taxonomy - Färdighet
definition: Godsvagnsreparation
broader: zmYu aAM TuF
related: KttZ Skc bMR

EAC-certifierad European Treeworker
type: Concept
in scheme: JobTech Taxonomy - Färdighet
definition: EAC-certifierad European Treeworker
broader: s48H Sft DTn
related: XBh3 Xrm C4R

Xcode, integrerad utvecklingsmiljö
type: Concept
in scheme: JobTech Taxonomy - Färdighet
definition: Xcode, integrerad utvecklingsmiljö
alternative label: Xcode
broader: Programmerings- och systemutvecklingsverktyg
related: DJh5 yyF hEM
related: 4Jty HpK a3Q

Isskulptur
type: Concept
in scheme: JobTech Taxonomy - Färdighet
definition: Isskulptur
broader: zmYu aAM TuF
related: 34Tn BQQ tfo

Pressfotografering
type: Concept
in scheme: JobTech Taxonomy - Färdighet
definition: Pressfotografering
broader: zmYu aAM TuF
related: 3J38 DNz YKK

Trummor
type: Concept
in scheme: JobTech Taxonomy - Färdighet
definition: Trummor
broader: wLYs CKS wK8
related: AWJF wqZ va9

Fastighetsrätt
type: Concept
in scheme: JobTech Taxonomy - Färdighet
definition: Fastighetsrätt avser kompetensen att hantera juridiska frågor kring fastigheters ägande, överlåtelse och nyttjanderätt. Den omfattar upprättande och tolkning av avtal som köpekontrakt, hyres- och arrendeavtal, servitut samt hantering av expropriation, gränstvister och myndighetsärenden. Viktiga lagar som ingår är jordabalken, plan- och bygglagen samt fastighetsbildningslagen.
broader: zmYu aAM TuF
related: q8wL kdi WaW
related: GMDo DVo Yzh
related: thZP oR7 WrY
related: br6a VVS V3y
related: Fghp zje WA8
related: U8HK Jdi GuC
related: XeBP nMe pXx
related: zKvJ GnC Szx
related: 6aak 8eh iwT
related: DZVN v5g Fco
related: JfYV ZGg 6rm

Vattenanalyser
type: Concept
in scheme: JobTech Taxonomy - Färdighet
definition: Vattenanalyser
broader: zmYu aAM TuF
related: c8r8 e4L gwj
related: Z2MZ eYc Lfv
related: rE1E m3d cx1
related: yXbD NTH ijE
related: Cppd 9P7 HeR
related: e9FK VKh ahW

Cash management
type: Concept
in scheme: JobTech Taxonomy - Färdighet
definition: Cash management
broader: zmYu aAM TuF
related: Y6yY SuR hVh
related: Bbkh nrm 2J8
related: Uw4n UB2 RCW
related: pTr9 RBT 9ur
related: mZsb A1K Gec
related: cRmd 536 pT1
related: FfMN Bw1 qYR

Sjukdomar hos häst, specialistkompetens för veterinärer
type: Concept
in scheme: JobTech Taxonomy - Färdighet
definition: En fördjupad specialistkompetens för veterinär inom sjukdomar hos häst.
broader: vSJu K1R wk3
related: WL4E r4b ek4

Stansverktyg, tillverkning
type: Concept
in scheme: JobTech Taxonomy - Färdighet
definition: Stansverktyg, tillverkning
broader: zmYu aAM TuF
related: MSnK 3Z8 4qA

Fönsterrenovering
type: Concept
in scheme: JobTech Taxonomy - Färdighet
definition: Fönsterrenovering
broader: zmYu aAM TuF
related: J17g Q2a 2u1
related: QKvX v7r PNL
related: 9mJN VwW Xjg
related: 1Nwn GYH wkH

Livsmedelsmikrobiologi
type: Concept
in scheme: JobTech Taxonomy - Färdighet
definition: Livsmedelsmikrobiologi avser studiet av mikroorganismer som påverkar livsmedelssäkerhet, kvalitet och hållbarhet. Kompetensen inkluderar kunskap om vilka mikroorganismer som förekommer i livsmedel och deras effekter, samt metoder för att upptäcka och kontrollera dessa i livsmedelsproduktionsprocessen.
broader: zmYu aAM TuF
related: v9nU 6Fw 4Qg
related: yXbD NTH ijE
related: dAu7 VyL hsy

Omvårdnadsplanering
type: Concept
in scheme: JobTech Taxonomy - Färdighet
definition: Omvårdnadsplanering
broader: zmYu aAM TuF
related: 6eAB cbY i9T
related: 7XXd 4St nit
related: jY19 knH MJp
related: nrVt xUL KdQ
related: LP4Z ABV gRm
related: cuaN Rj5 YCc
related: 6zAR EHM Kwj
related: Z8ci bBE tmx
related: oj4c P4b cja

Klinisk mikrobiologi, specialistkompetens för läkare
type: Concept
in scheme: JobTech Taxonomy - Färdighet
definition: Klinisk mikrobiologi, specialistkompetens för läkare
broader: Specialistbevis för läkare
related: nu7c QuB KVQ

Vinlista, planeringsvana
type: Concept
in scheme: JobTech Taxonomy - Färdighet
definition: Vinlista, planeringsvana
broader: zmYu aAM TuF
related: UjoW meY Zwt

Doktorsexamen, vårdvetenskap och omvårdnadsämnen
type: Concept
in scheme: JobTech Taxonomy - Färdighet
definition: Doktorsexamen, vårdvetenskap och omvårdnadsämnen
broader: Yrkesbevis/examen
related: Gm5j S2Y aTB
related: cYCo PxY zQd

Client, programmering/Server, programmering
type: Concept
in scheme: JobTech Taxonomy - Färdighet
definition: Client, programmering/Server, programmering
alternative label: Client, programmering
alternative label: Server, programmering
broader: zmYu aAM TuF
related: DJh5 yyF hEM
related: 4Jty HpK a3Q

Masker, tillverkning/Masker, spelning med
type: Concept
in scheme: JobTech Taxonomy - Färdighet
definition: Masker, tillverkning/Masker, spelning med
alternative label: Masker, spelning med
alternative label: Masker, tillverkning
broader: zmYu aAM TuF
related: iBUL s38 izZ

Etiopiskt kök
type: Concept
in scheme: JobTech Taxonomy - Färdighet
definition: Etiopiskt kök
broader: zmYu aAM TuF
related: BStc SJh DKG

Stuntkoordinering
type: Concept
in scheme: JobTech Taxonomy - Färdighet
definition: Stuntkoordinering
broader: zmYu aAM TuF
related: rYSG 3WJ LmC
related: PH2M uV4 r72

Bildväv
type: Concept
in scheme: JobTech Taxonomy - Färdighet
definition: Bildväv
broader: zmYu aAM TuF
related: 34Tn BQQ tfo

Protes, specialisering tandteknik
type: Concept
in scheme: JobTech Taxonomy - Färdighet
definition: Protes, specialisering tandteknik
broader: zmYu aAM TuF
related: 39yB xPQ ozd

Radiokonstruktion
type: Concept
in scheme: JobTech Taxonomy - Färdighet
definition: Radiokonstruktion
broader: zmYu aAM TuF
related: nDaB vdy eAy
related: SPYW 7Z1 ShT

Maskinbefäl klass IV (behörighet)
type: Concept
in scheme: JobTech Taxonomy - Färdighet
definition: Maskinbefäl klass IV (behörighet)
broader: Behörigheter, sjöfart
related: Rsoy sS6 6c4

Basala hygienrutiner inom hälso- och sjukvård
type: Concept
in scheme: JobTech Taxonomy - Färdighet
definition: Källa: Socialstyrelsen
broader: zmYu aAM TuF
related: NFUg y9y 1TY
related: bEDv SL7 VrL
related: 6eAB cbY i9T
related: PHJN fva yxs
related: jY19 knH MJp
related: nrVt xUL KdQ
related: LP4Z ABV gRm
related: 1tGC fXC mxX
related: cuaN Rj5 YCc
related: dyWo sDb MLQ
related: 3H17 ZZr BEc
related: tAJS JNb hDH
related: 6zAR EHM Kwj
related: Z8ci bBE tmx
related: vTgW pnr QMp

IT-pedagogik
type: Concept
in scheme: JobTech Taxonomy - Färdighet
definition: IT-pedagogik innebär kompetens inom att använda och integrera digitala verktyg och teknik i undervisningen på ett pedagogiskt sätt. Det handlar om att stödja och handleda lärare och elever i användning av IKT (informations- och kommunikationsteknik), utveckla digitala lärmiljöer och bidra till att höja den digitala kompetensen inom utbildningsorganisationen.
broader: zmYu aAM TuF
related: 1CX5 mZw Vcq

Analys/Beräkning-WIN-Statik
type: Concept
in scheme: JobTech Taxonomy - Färdighet
definition: Analys/Beräkning-WIN-Statik
alternative label: Analys-WIN-Statik
alternative label: Beräkning-WIN-Statik
broader: mTLu uo2 gq2
related: thZP oR7 WrY
related: K8yg U4C gkY
related: Pd51 xnr KCY
related: XeBP nMe pXx
related: PRQn 9yw NJA
related: ETAR ggZ Wuw
related: 41KB bfk 5jR
related: 4Jty HpK a3Q

Företagsöverlåtelser
type: Concept
in scheme: JobTech Taxonomy - Färdighet
definition: Företagsöverlåtelser
broader: zmYu aAM TuF
related: Y6yY SuR hVh
related: Uw4n UB2 RCW
related: q81z 3oD 1qu
related: cRmd 536 pT1
related: FfMN Bw1 qYR

Visual Basic.NET, programmeringsspråk
type: Concept
in scheme: JobTech Taxonomy - Färdighet
definition: Visual Basic.NET, programmeringsspråk
alternative label: Visual Basic.NET
broader: Datorspråk
related: BAeH eg8 T2d
related: Fv7d YhP YmS
related: D9SL mtn vGM
related: DJh5 yyF hEM
related: 4Jty HpK a3Q

Hörselmätningar
type: Concept
in scheme: JobTech Taxonomy - Färdighet
definition: Hörselmätningar
broader: zmYu aAM TuF
related: pzch NRY 9ZF
related: 39yB xPQ ozd
related: 4Jty HpK a3Q

Specialpedagogik
type: Concept
in scheme: JobTech Taxonomy - Färdighet
definition: Specialpedagogik
broader: Inriktning på lärarkompetens
related: 2x2V UeL 6ke
related: 3FP7 4Eg x8P
related: 4KhP FxL uZ5
related: oQUQ D11 HPx
related: 5ek3 Cgq WeZ

Gesällbrev, smides-/konstsmidesyrket
type: Concept
in scheme: JobTech Taxonomy - Färdighet
definition: Gesällbrev, smides-/konstsmidesyrket är ett bevis på att en hantverkare har genomgått utbildning och avlagt de delprov som krävs inom det specifika hantverksyrket, och därigenom uppnått ett erkännande av färdigheter och kompetens inom yrket. Utfärdas av Sveriges hantverksråd i samråd med aktuell branschorganisation.
broader: Yrkesbevis/examen
related: 34Tn BQQ tfo
related: q8Ho 3Xw sHq

Frikyrklig funktionärsutbildning
type: Concept
in scheme: JobTech Taxonomy - Färdighet
definition: Frikyrklig funktionärsutbildning
broader: Yrkesbevis/examen
related: aA2Z 9XX R1v

Nätverk, övervakning
type: Concept
in scheme: JobTech Taxonomy - Färdighet
definition: Nätverk, övervakning
broader: zmYu aAM TuF
related: 4Jty HpK a3Q
related: 13md uyV BNG

Inbrottslarm, reparationsvana
type: Concept
in scheme: JobTech Taxonomy - Färdighet
definition: Inbrottslarm, reparationsvana
broader: zmYu aAM TuF
related: fWrt sLg koW
related: 4Jty HpK a3Q

Maskinunderhåll, lantbruksmaskiner
type: Concept
in scheme: JobTech Taxonomy - Färdighet
definition: Maskinunderhåll, lantbruksmaskiner avser kompetens som omfattar underhåll och reparation av olika typer av lantbruksmaskiner för att säkerställa deras funktionalitet och livslängd. Denna kompetens inkluderar kunskaper om maskinens konstruktion, ofta förekommande problem och metoder för åtgärdande av dessa, samt vikten av regelbundet underhåll för att förebygga driftstopp.
broader: zmYu aAM TuF
related: KwVo sQu G2e

Certifikat, köldmedieförordningen Kategori III
type: Concept
in scheme: JobTech Taxonomy - Färdighet
definition: Certifikat, köldmedieförordningen Kategori III
broader: s48H Sft DTn
related: X7HR rZK 4wj
related: fLKb bJ3 69p
related: 3UzE P8A 9sS

Underhållskontroll av tak och fasader
type: Concept
in scheme: JobTech Taxonomy - Färdighet
definition: Underhållskontroll av tak och fasader
broader: zmYu aAM TuF
related: L4hA SJP SFi
related: bXfo 4hb SXx

Påfyllningsservice
type: Concept
in scheme: JobTech Taxonomy - Färdighet
definition: Påfyllningsservice
broader: zmYu aAM TuF
related: bwnk nv2 1cR

Vagrant, miljökonfigurering
type: Concept
in scheme: JobTech Taxonomy - Färdighet
definition: Vagrant, miljökonfigurering
broader: Programmerings- och systemutvecklingsverktyg
related: BAeH eg8 T2d
related: cBBa ngH fCx
related: Q5DF juj 8do
related: D9SL mtn vGM
related: DJh5 yyF hEM
related: UxT1 tPF Kbg
related: 4Jty HpK a3Q
related: UXKZ 3zZ ipB

Lärarexamen-fritidshem, grundskolans tidigare år
type: Concept
in scheme: JobTech Taxonomy - Färdighet
definition: Lärarexamen-fritidshem, grundskolans tidigare år
broader: Yrkesbevis/examen
related: 5ek3 Cgq WeZ

Biståndsbedömning
type: Concept
in scheme: JobTech Taxonomy - Färdighet
definition: Biståndsbedömning
broader: zmYu aAM TuF
related: 5uP5 Ugw aVE

Prolog, programmeringsspråk
type: Concept
in scheme: JobTech Taxonomy - Färdighet
definition: Prolog, programmeringsspråk
alternative label: Prolog
broader: Datorspråk
related: BAeH eg8 T2d
related: Fv7d YhP YmS
related: D9SL mtn vGM
related: DJh5 yyF hEM
related: 4Jty HpK a3Q

Sjömansskola, däck
type: Concept
in scheme: JobTech Taxonomy - Färdighet
definition: Sjömansskola, däck
broader: s48H Sft DTn
related: CbQK 7th Tyf

Läkarsekreterarutbildning
type: Concept
in scheme: JobTech Taxonomy - Färdighet
definition: Läkarsekreterarutbildning
broader: Yrkesbevis/examen
related: 2kLc pto DpV

Lös mask
type: Concept
in scheme: JobTech Taxonomy - Färdighet
definition: Lös mask
broader: zmYu aAM TuF
related: ezKk kss CiQ

Microblästring
type: Concept
in scheme: JobTech Taxonomy - Färdighet
definition: Microblästring
broader: zmYu aAM TuF
related: idjo 2Wr a3E

Auktoriserad teckenspråkstolk
type: Concept
in scheme: JobTech Taxonomy - Färdighet
definition: Auktoriserad teckenspråkstolk
broader: Yrkesbevis/examen
related: PQDm Z63 zst

Marinkemi
type: Concept
in scheme: JobTech Taxonomy - Färdighet
definition: Marinkemi
broader: zmYu aAM TuF
related: eofS oZs RZi

Regi, musikal
type: Concept
in scheme: JobTech Taxonomy - Färdighet
definition: Regi, musikal
broader: zmYu aAM TuF
related: rYSG 3WJ LmC

Hörselskadade, funktionshindersfrågor
type: Concept
in scheme: JobTech Taxonomy - Färdighet
definition: Hörselskadade, funktionshindersfrågor
broader: zmYu aAM TuF
related: vPP6 rsw dck

BWR-teknik (kärnkraft)
type: Concept
in scheme: JobTech Taxonomy - Färdighet
definition: BWR-teknik (kärnkraft)
broader: zmYu aAM TuF
related: K8yg U4C gkY

Inbrottslarm, skötselvana
type: Concept
in scheme: JobTech Taxonomy - Färdighet
definition: Inbrottslarm, skötselvana
broader: zmYu aAM TuF
related: 4Jty HpK a3Q
related: iqZh 3yX i8n

Navigation, cirkelledning
type: Concept
in scheme: JobTech Taxonomy - Färdighet
definition: Navigation, cirkelledning
broader: zmYu aAM TuF
related: 1CX5 mZw Vcq

Hopsättning, papp-textil
type: Concept
in scheme: JobTech Taxonomy - Färdighet
definition: Hopsättning, papp-textil
broader: zmYu aAM TuF
related: HXzD qvt HV6

Fusion
type: Concept
in scheme: JobTech Taxonomy - Färdighet
definition: Fusion
broader: p1WM wCw LTd
related: AWJF wqZ va9

Ystning, manuell
type: Concept
in scheme: JobTech Taxonomy - Färdighet
definition: Ystning, manuell
broader: zmYu aAM TuF
related: yJk6 azD ywF

Wysiwug
type: Concept
in scheme: JobTech Taxonomy - Färdighet
definition: Wysiwug
broader: zmYu aAM TuF
related: 4BsK q2C sCL
related: 4Jty HpK a3Q

Interventionell röntgen/Radiologi
type: Concept
in scheme: JobTech Taxonomy - Färdighet
definition: Interventionell röntgen/Radiologi
alternative label: Interventionell röntgen
alternative label: Radiologi
broader: zmYu aAM TuF
related: 1tGC fXC mxX
related: GC7L Yw7 Mfo
related: 4Jty HpK a3Q

Justering av gitarrer
type: Concept
in scheme: JobTech Taxonomy - Färdighet
definition: Justering av gitarrer avser processen att anpassa och finjustera gitarrers delar för att förbättra instrumentets spelbarhet och ljudkvalitet. Detta kan inkludera justering av stränghöjd, intonation, greppbräda och stall, samt underhåll av mekaniska delar för att säkerställa optimal funktion och prestanda.
broader: zmYu aAM TuF
related: aKdV u7V R5j

Rättspsykiatrisk inriktning, psykolog
type: Concept
in scheme: JobTech Taxonomy - Färdighet
definition: Rättspsykiatrisk inriktning, psykolog
broader: zmYu aAM TuF
related: VYeq GDF a2g

Barn och ungdomar med behov av särskilt stöd
type: Concept
in scheme: JobTech Taxonomy - Färdighet
definition: Barn och ungdomar med behov av särskilt stöd avser individer som har olika typer av svårigheter eller funktionsnedsättningar som påverkar deras möjlighet att delta i utbildning och sociala sammanhang. Denna kompetens omfattar insatser och strategier för att identifiera, förstå och stödja dessa individers unika behov samt skapa inkluderande och anpassade miljöer för deras utveckling.
broader: zmYu aAM TuF
related: Hi9c iTe gHH
related: XW9L tA9 WaX
related: oQUQ D11 HPx
related: 5ek3 Cgq WeZ

Högspänningsbrytare, underhåll
type: Concept
in scheme: JobTech Taxonomy - Färdighet
definition: Högspänningsbrytare, underhåll
broader: zmYu aAM TuF
related: MW1P GNJ 4F9

Nätskärning
type: Concept
in scheme: JobTech Taxonomy - Färdighet
definition: Nätskärning
broader: zmYu aAM TuF
related: e6nk AGp y28

Utbildningsintyg, fordonsmonterad kran
type: Concept
in scheme: JobTech Taxonomy - Färdighet
definition: Utbildningsintyg, fordonsmonterad kran
broader: Yrkesbevis/examen
related: 3MBw pDA P2F

Hisscertifikat
type: Concept
in scheme: JobTech Taxonomy - Färdighet
definition: Hisscertifikat
broader: s48H Sft DTn
related: a75S eLg JWH

Certifikat Specialicerad Hudterapeut
type: Concept
in scheme: JobTech Taxonomy - Färdighet
definition: Certifikat Specialicerad Hudterapeut
broader: s48H Sft DTn
related: xr7w N6Q QMA

Skatter och avgifter, personaladministration
type: Concept
in scheme: JobTech Taxonomy - Färdighet
definition: Skatter och avgifter, personaladministration
broader: zmYu aAM TuF
related: mNoS AN5 drn
related: L7eh ihX vM5
related: Fp7x Yqt bx9
related: bjqk F3A 5Hk

Fartygsplåtslagning
type: Concept
in scheme: JobTech Taxonomy - Färdighet
definition: Fartygsplåtslagning avser kompetens inom tillverkning och montering av plåtdetaljer för fartygsbyggnad och reparation. Detta omfattar arbete med grovplåtsmaterial och kräver specialiserad kunskap om konstruktionstekniker och metallbearbetning.
broader: zmYu aAM TuF
related: TrwQ RXT W8a

Läs- och skrivsvårigheter, behandling/Dyslexi, behandling
type: Concept
in scheme: JobTech Taxonomy - Färdighet
definition: Läs- och skrivsvårigheter, behandling/Dyslexi, behandling
alternative label: Dyslexi, behandling
alternative label: Läs- och skrivsvårigheter, behandling
broader: zmYu aAM TuF
related: pzch NRY 9ZF

Arbetsgivarorganisation
type: Concept
in scheme: JobTech Taxonomy - Färdighet
definition: Arbetsgivarorganisation
broader: zmYu aAM TuF
related: vPP6 rsw dck

ML, programmeringsspråk
type: Concept
in scheme: JobTech Taxonomy - Färdighet
definition: ML, programmeringsspråk
alternative label: ML
broader: Datorspråk
related: BAeH eg8 T2d
related: Fv7d YhP YmS
related: D9SL mtn vGM
related: DJh5 yyF hEM
related: 4Jty HpK a3Q

Sulning
type: Concept
in scheme: JobTech Taxonomy - Färdighet
definition: Sulning är yrkeskompetensen att uföra sulning, omsulning, slitsulning och klackning av skor.
broader: zmYu aAM TuF
related: vJQk YvC XB7

Bild och form, förskola-skolbarnomsorg
type: Concept
in scheme: JobTech Taxonomy - Färdighet
definition: Bild och form, förskola-skolbarnomsorg
broader: zmYu aAM TuF
related: Hi9c iTe gHH

Tillsyningsman vid växling och spärrfärd
type: Concept
in scheme: JobTech Taxonomy - Färdighet
definition: Tillsyningsman vid växling och spärrfärd
broader: s48H Sft DTn
related: nk6Z 5oD QoM

Trafikundervisning, buss
type: Concept
in scheme: JobTech Taxonomy - Färdighet
definition: Trafikundervisning, buss
broader: zmYu aAM TuF
related: nuXg Wjc JPd
related: yVZH zHh 6fG

Drönarkort, drönaroperatör, öppen kategori
type: Concept
in scheme: JobTech Taxonomy - Färdighet
definition: Drönarkort, drönaroperatör, öppen kategori
broader: s48H Sft DTn
related: C3153
related: 7n3y FTE qSe
related: 4Jty HpK a3Q

Dockspel, stavdockor
type: Concept
in scheme: JobTech Taxonomy - Färdighet
definition: Dockspel, stavdockor
broader: zmYu aAM TuF
related: iBUL s38 izZ

Mandolin
type: Concept
in scheme: JobTech Taxonomy - Färdighet
definition: Mandolin
broader: wLYs CKS wK8
related: AWJF wqZ va9

Förpackningsteknik
type: Concept
in scheme: JobTech Taxonomy - Färdighet
definition: Förpackningsteknik
broader: zmYu aAM TuF
related: mis4 feV uex
related: yXbD NTH ijE

Växtodling, trädgård
type: Concept
in scheme: JobTech Taxonomy - Färdighet
definition: Växtodling, trädgård avser verksamhet inom odling och skötsel av växter inom olika miljöer, såsom trädgårdar, parker och växthus. Kompetensen omfattar kunskaper om växtbiologi, jordbrukstekniker och skötselmetoder för att optimera växttillväxt och produktion, och är relevant för yrkeskategorier som trädgårdsanläggare och trädgårdsodlare.
broader: zmYu aAM TuF
related: XBh3 Xrm C4R
related: XurM DVs ggn
related: yXbD NTH ijE
related: 2xQ4 4kh kTZ

Ljud-SoundBooth
type: Concept
in scheme: JobTech Taxonomy - Färdighet
definition: Ljud-SoundBooth
broader: Programvara för digitalt skapande
related: SgNH hag n9D
related: 4BsK q2C sCL
related: CkRH 4Qn iX3
related: 3J38 DNz YKK
related: PH2M uV4 r72
related: 4Jty HpK a3Q

Codeblocks, utvecklingsmiljö
type: Concept
in scheme: JobTech Taxonomy - Färdighet
definition: Codeblocks, utvecklingsmiljö
alternative label: Codeblocks
broader: zmYu aAM TuF
related: K8yg U4C gkY
related: nDaB vdy eAy
related: SPYW 7Z1 ShT
related: PRQn 9yw NJA
related: 4Jty HpK a3Q

Ljudteknik, scenproduktion
type: Concept
in scheme: JobTech Taxonomy - Färdighet
definition: Ljudteknik, scenproduktion
broader: zmYu aAM TuF
related: 4BsK q2C sCL
related: CkRH 4Qn iX3
related: 4Jty HpK a3Q

Bygg- och fastighetsekonomi
type: Concept
in scheme: JobTech Taxonomy - Färdighet
definition: Bygg- och fastighetsekonomi
broader: zmYu aAM TuF
related: GMDo DVo Yzh

Kost- och näringsrådgivning
type: Concept
in scheme: JobTech Taxonomy - Färdighet
definition: Kost- och näringsrådgivning
broader: zmYu aAM TuF
related: F19Z oB6 pg3

Apparatteknik
type: Concept
in scheme: JobTech Taxonomy - Färdighet
definition: Apparatteknik
broader: zmYu aAM TuF
related: v9nU 6Fw 4Qg
related: qn2U dB9 Cmh

EPiServer, CMS
type: Concept
in scheme: JobTech Taxonomy - Färdighet
definition: EPiServer, CMS/innehållshanteringssystem
alternative label: EPiServer, innehållshanteringssystem
broader: jTAz uCP RNc
related: BAeH eg8 T2d
related: cBBa ngH fCx
related: Fv7d YhP YmS
related: vPP6 rsw dck
related: SgNH hag n9D
related: oEmP NC1 sXE
related: zfve s6G tpc
related: k1Nx auG sNh
related: 4Jty HpK a3Q
related: MYAz x9m 2LJ

Utbildning till räddningsledare
type: Concept
in scheme: JobTech Taxonomy - Färdighet
definition: Utbildning till räddningsledare är en eftergymnasial yrkesinriktad utbildning mot räddningsledning inom räddningstjänsten.
broader: Yrkesbevis/examen
related: wCx8 rY3 XUT
related: ug5y o6z U3L

Planeringsarkitektexamen
type: Concept
in scheme: JobTech Taxonomy - Färdighet
definition: Planeringsarkitektexamen
broader: Yrkesbevis/examen
related: Pd51 xnr KCY

Gesällbrev, pälssömmare
type: Concept
in scheme: JobTech Taxonomy - Färdighet
definition: Gesällbrev, pälssömmare är ett bevis på att en hantverkare har genomgått utbildning och avlagt de delprov som krävs inom det specifika hantverksyrket, och därigenom uppnått ett erkännande av färdigheter och kompetens inom yrket. Utfärdas av Sveriges hantverksråd i samråd med aktuell branschorganisation.
broader: Yrkesbevis/examen
related: mwVN oEH g9k

Autismspektrumtillstånd, specialpedagogik/AST, specialpedagogik
type: Concept
in scheme: JobTech Taxonomy - Färdighet
definition: Autismspektrumtillstånd, specialpedagogik/AST, specialpedagogik
alternative label: AST, specialpedagogik
alternative label: Autismspektrumtillstånd, specialpedagogik
broader: zmYu aAM TuF
related: 3FP7 4Eg x8P

Lastbilsmonterad kran > 18 ton/m
type: Concept
in scheme: JobTech Taxonomy - Färdighet
definition: Lastbilsmonterad kran > 18 ton/m
broader: zmYu aAM TuF
related: 3MBw pDA P2F

Stålplåt, materialkunskap
type: Concept
in scheme: JobTech Taxonomy - Färdighet
definition: Stålplåt, materialkunskap
broader: Materialkunskap
related: L4hA SJP SFi
related: bXfo 4hb SXx

XSD, programmeringsspråk
type: Concept
in scheme: JobTech Taxonomy - Färdighet
definition: XSD, programmeringsspråk
alternative label: XSD
broader: Datorspråk
related: BAeH eg8 T2d
related: Fv7d YhP YmS
related: D9SL mtn vGM
related: DJh5 yyF hEM
related: 4Jty HpK a3Q

Jeeves, affärssystem
type: Concept
in scheme: JobTech Taxonomy - Färdighet
definition: Jeeves, affärssystem
alternative label: Jeeves
alternative label: Jeeveskunskaper
broader: xSJR 1Kq pxB
related: eQ4M CNm ozj
related: Y6yY SuR hVh
related: Uw4n UB2 RCW
related: iWcY mko rq2
related: q81z 3oD 1qu
related: cRmd 536 pT1
related: ij8k EwC zyB
related: 4Jty HpK a3Q

Perukdesign
type: Concept
in scheme: JobTech Taxonomy - Färdighet
definition: Perukdesign
broader: zmYu aAM TuF
related: mwVN oEH g9k
related: LyBp bY6 bZK

Ridkunskap
type: Concept
in scheme: JobTech Taxonomy - Färdighet
definition: Ridkunskap
broader: zmYu aAM TuF
related: iBUL s38 izZ
related: KYmy iqC xiQ

Rope access
type: Concept
in scheme: JobTech Taxonomy - Färdighet
definition: Rope access som också kallas tillkomstteknik, reparbete eller industriell klättring är en arbetsmetod där man med linor tar sig till och arbetar på höga eller svårtillgängliga platser.
broader: zmYu aAM TuF
related: 3g5x Tm7 8QH
related: MW1P GNJ 4F9
related: QKvX v7r PNL
related: Y4j1 P17 wVA
related: FjdF H2e tAG
related: bXfo 4hb SXx

Köksvana, fartygserfarenhet
type: Concept
in scheme: JobTech Taxonomy - Färdighet
definition: Köksvana, fartygserfarenhet
broader: Övriga specialiteter, sjöfart
related: UjoW meY Zwt

Geografiskt informationssystem/GIS
type: Concept
in scheme: JobTech Taxonomy - Färdighet
definition: Geografiskt informationssystem (GIS) är ett datorbaserat ramverk för att samla in, lagra, analysera och visualisera data kopplade till geografiska platser. GIS kombinerar kartinformation med attributdata i lager för rumslig analys av mönster, spridning och samband, vilket möjliggör avancerade beräkningar som riskanalyser, ruttoptimering och miljömodellering. Tekniken används brett inom skogsbruk för inventering, stadsplanering, miljöövervakning och transport, till exempel för att visualisera skogliga resurser eller fastighetsvärden genom satellitdata och fältmätningar.
alternative label: GIS
alternative label: Geografiskt informationssystem
broader: zmYu aAM TuF
related: XurM DVs ggn
related: rwpH 6RA XTT
related: GMDo DVo Yzh
related: thZP oR7 WrY
related: w6ud quG dgh
related: DJh5 yyF hEM
related: yXbD NTH ijE
related: Pd51 xnr KCY
related: ketV G9W GeR
related: XeBP nMe pXx
related: ETAR ggZ Wuw
related: 41KB bfk 5jR
related: V7Yz 4WV g4z
related: 9QMD sZ3 ZjX
related: e9FK VKh ahW
related: 4Jty HpK a3Q
related: 3LdB WEJ 8Ms
related: UXKZ 3zZ ipB

Trafikverkepts förarprövarutbildning
type: Concept
in scheme: JobTech Taxonomy - Färdighet
definition: Trafikverkets förarprövarutbildning är en yrkesutbildning med inriktning till förarprövare/trafikinspektör.
broader: Yrkesbevis/examen
related: nuXg Wjc JPd

Diamantborrning
type: Concept
in scheme: JobTech Taxonomy - Färdighet
definition: Diamantborrning
broader: zmYu aAM TuF
related: 7zKm 4NW eey

Bildlärarexamen
type: Concept
in scheme: JobTech Taxonomy - Färdighet
definition: Bildlärarexamen
broader: Yrkesbevis/examen
related: 2x2V UeL 6ke
related: 4KhP FxL uZ5
related: oQUQ D11 HPx

Klimatdeklaration
type: Concept
in scheme: JobTech Taxonomy - Färdighet
definition: Lagen om klimatdeklaration innebär att byggherrar måste redovisa den klimatpåverkan som uppstår under byggskedet. Kommunen ansvarar för att kontrollera att en klimatdeklaration upprättats innan man meddelar slutbesked enligt plan- och bygglagen. Boverket har tillsyn över att uppgifterna i klimatdeklarationen uppfyller reglerna. Källa www.boverket.se
broader: zmYu aAM TuF
related: xm5G vGn iyk
related: thZP oR7 WrY
related: yXbD NTH ijE
related: U8HK Jdi GuC
related: 41KB bfk 5jR

Klassisk grekiska, språk och kultur, undervisning på gymnasienivå
type: Concept
in scheme: JobTech Taxonomy - Färdighet
definition: Klassisk grekiska, språk och kultur, undervisning på gymnasienivå
broader: Inriktning på lärarkompetens
related: 4KhP FxL uZ5

Kostproduktion
type: Concept
in scheme: JobTech Taxonomy - Färdighet
definition: Kostproduktion
broader: zmYu aAM TuF
related: Z2MZ eYc Lfv
related: Pq5C SPC bRA

Behörighet Brunnsborrare (B)
type: Concept
in scheme: JobTech Taxonomy - Färdighet
definition: Behörighet Brunnsborrare (B)
broader: s48H Sft DTn
related: 7zKm 4NW eey

ITIL Cabability modules
type: Concept
in scheme: JobTech Taxonomy - Färdighet
definition: ITIL Cabability modules
broader: zmYu aAM TuF
related: BAeH eg8 T2d
related: 4Jty HpK a3Q

Ortopediska skor, utformning
type: Concept
in scheme: JobTech Taxonomy - Färdighet
definition: Ortopediska skor, utformning, avser processen att designa och skapa specialanpassade skor för personer med specifika fotsjukdomar eller deformiteter. Denna kompetens omfattar kunskap om anatomiska principer för att säkerställa att skorna ger rätt stöd och komfort.
broader: zmYu aAM TuF
related: 39yB xPQ ozd
related: vJQk YvC XB7

Rekryteringsadministration
type: Concept
in scheme: JobTech Taxonomy - Färdighet
definition: Rekryteringsadministration avser hantering av processerna kopplade till rekrytering av personal samt administration relaterad till anställning och personalresurser. Denna kompetens omfattar även planering och organisering av rekryteringsaktiviteter samt samordning med andra HR-funktioner inom organisationen.
broader: zmYu aAM TuF
related: L7eh ihX vM5
related: bjqk F3A 5Hk
related: H2Zj eL9 x28

Kalvslakt
type: Concept
in scheme: JobTech Taxonomy - Färdighet
definition: Kalvslakt avser processen att avliva kalvar och bereda för användning i livsmedelsproduktion. Denna kompetens omfattar kunskap om slaktmetoder, hälsokontroller av djur samt hantering av köttprodukter för att säkerställa livsmedelssäkerhet och kvalitet.
broader: zmYu aAM TuF
related: QqHf XKZ eyy

Funktionsnedsättning, vårderfarenhet
type: Concept
in scheme: JobTech Taxonomy - Färdighet
definition: Funktionsnedsättning, vårderfarenhet
broader: zmYu aAM TuF
related: 6eAB cbY i9T
related: jY19 knH MJp

Driftansvar, VA
type: Concept
in scheme: JobTech Taxonomy - Färdighet
definition: Driftansvar, VA
broader: zmYu aAM TuF
related: pf1K PTz frm
related: yXbD NTH ijE
related: XeBP nMe pXx

Karaktärsdans
type: Concept
in scheme: JobTech Taxonomy - Färdighet
definition: Karaktärsdans
broader: Dans
related: gmRr 7tt eHj

Redaktionsledning, radio
type: Concept
in scheme: JobTech Taxonomy - Färdighet
definition: Redaktionsledning, radio
broader: zmYu aAM TuF
related: 3i4a Ufc qpp

Finansiella analyser
type: Concept
in scheme: JobTech Taxonomy - Färdighet
definition: Finansiella analyser
broader: zmYu aAM TuF
related: Uw4n UB2 RCW
related: q81z 3oD 1qu
related: cRmd 536 pT1
related: 4Jty HpK a3Q

Specialpedagogexamen inriktning komplicerad inlärning
type: Concept
in scheme: JobTech Taxonomy - Färdighet
definition: Specialpedagogexamen inriktning komplicerad inlärning är en examen på högskolenivå kopplad till utbildning för specialpedagog med inriktning komplicerad inlärning.
broader: Yrkesbevis/examen
related: 3FP7 4Eg x8P

Undertaksmontering
type: Concept
in scheme: JobTech Taxonomy - Färdighet
definition: Undertaksmontering
broader: zmYu aAM TuF
related: 3g5x Tm7 8QH

Osteopatexamen
type: Concept
in scheme: JobTech Taxonomy - Färdighet
definition: Osteopatexamen är en examen på högskolenivå kopplad till utbildning med inriktning mot osteopat.
broader: Yrkesbevis/examen
related: aWki 4uA adn

Tecken som stöd/TSS
type: Concept
in scheme: JobTech Taxonomy - Färdighet
definition: Tecken som stöd/TSS
broader: zmYu aAM TuF
related: mcRJ kq2 jFr
related: Hi9c iTe gHH
related: XW9L tA9 WaX
related: 4KhP FxL uZ5
related: oQUQ D11 HPx
related: 5ek3 Cgq WeZ

Maskinskötsel, kemisk-teknisk industri
type: Concept
in scheme: JobTech Taxonomy - Färdighet
definition: Maskinskötsel inom kemisk-teknisk industri avser kompetens att styra och övervaka maskiner och utrustningar som används för att bearbeta kemiska ämnen och framställa olika produkter inom den kemiska industrin. Kompetensen omfattar operativt arbete med processer som krossning, blandning, destillering och filtrering för att säkerställa effektiv och säker drift av anläggningar.
broader: zmYu aAM TuF
related: rxmK wwM 1NA
related: Vfum e6B 7Bw
related: QEBd qHu vGr
related: 4Jty HpK a3Q

Fiol
type: Concept
in scheme: JobTech Taxonomy - Färdighet
definition: Fiol
broader: wLYs CKS wK8
related: AWJF wqZ va9

Utbildningsbevis enligt TLP 10 för truckförare
type: Concept
in scheme: JobTech Taxonomy - Färdighet
definition: Utbildningsbevis för truckförare enligt läroplan TLP 10 (2011-). Källa: TYA (Transportfackens Yrkes- och Arbetsmiljönämnd)
broader: s48H Sft DTn
related: SZ7Q 2zF nFy
related: XBh3 Xrm C4R
related: WhBn FAp ZNW
related: kLyY rwr aJr
related: CbQK 7th Tyf
related: 2xQ4 4kh kTZ
related: MrcX RDn N53
related: bwnk nv2 1cR
related: KttZ Skc bMR

Sanitetsteknik
type: Concept
in scheme: JobTech Taxonomy - Färdighet
definition: Sanitetsteknik
broader: zmYu aAM TuF
related: df9D e6y 61z
related: thZP oR7 WrY
related: K8yg U4C gkY
related: fLKb bJ3 69p

Sten, konstkonservering
type: Concept
in scheme: JobTech Taxonomy - Färdighet
definition: Sten, konstkonservering
broader: zmYu aAM TuF
related: 34Tn BQQ tfo

Certifiering i oral medicin
type: Concept
in scheme: JobTech Taxonomy - Färdighet
definition: Certifiering i oral medicin
broader: s48H Sft DTn
related: HPxT fQJ zwT

Barn- och ungdomspsykiatri, specialistkompetens för läkare
type: Concept
in scheme: JobTech Taxonomy - Färdighet
definition: Barn- och ungdomspsykiatri, specialistkompetens för läkare
broader: Specialistbevis för läkare
related: nu7c QuB KVQ

Mästarbrev, frisör
type: Concept
in scheme: JobTech Taxonomy - Färdighet
definition: Mästarbrev, frisör
broader: Yrkesbevis/examen
related: mwVN oEH g9k
related: LyBp bY6 bZK

Naturvärdesinventering
type: Concept
in scheme: JobTech Taxonomy - Färdighet
definition: Naturvärdesinventering
broader: zmYu aAM TuF
related: e9FK VKh ahW

Teckenspråk för hörande, undervisning
type: Concept
in scheme: JobTech Taxonomy - Färdighet
definition: Teckenspråk för hörande, undervisning
broader: zmYu aAM TuF
related: mcRJ kq2 jFr
related: 4KhP FxL uZ5
related: oQUQ D11 HPx

Scrum, systemutvecklingsmetod
type: Concept
in scheme: JobTech Taxonomy - Färdighet
definition: Scrum, systemutvecklingsmetod
alternative label: Scrum
broader: Programmerings- och systemutvecklingsverktyg
related: D9SL mtn vGM
related: DJh5 yyF hEM
related: 4Jty HpK a3Q
related: UXKZ 3zZ ipB
related: MYAz x9m 2LJ

Sandblästring
type: Concept
in scheme: JobTech Taxonomy - Färdighet
definition: Sandblästring avser en teknik för att rengöra och förbereda ytor genom att blästra dem med sand eller andra abrasiva material för att avlägsna smuts, rost eller gamla beläggningar. Kompetensen innebär kännedom om utrustning och metodik för att säkerställa effektiv och säker tillämpning inom exempelvis saneringsarbete.
broader: zmYu aAM TuF
related: dKUb KBP mw3
related: idjo 2Wr a3E

Provhantering
type: Concept
in scheme: JobTech Taxonomy - Färdighet
definition: Samla in och hantera prover.
broader: zmYu aAM TuF
related: 2kLc pto DpV

Kompensationsodling
type: Concept
in scheme: JobTech Taxonomy - Färdighet
definition: Kompensationsodling
broader: zmYu aAM TuF
related: c8r8 e4L gwj

Materialstyrning
type: Concept
in scheme: JobTech Taxonomy - Färdighet
definition: Materialstyrning
broader: zmYu aAM TuF
related: xm5G vGn iyk
related: mp2Y vyC RFV

Visual InterDev, programmeringsverktyg
type: Concept
in scheme: JobTech Taxonomy - Färdighet
definition: Visual InterDev, programmeringsverktyg
alternative label: Visual InterDev
broader: Programmerings- och systemutvecklingsverktyg
related: D9SL mtn vGM
related: DJh5 yyF hEM
related: 4Jty HpK a3Q
related: MYAz x9m 2LJ

Bildbyråarbete
type: Concept
in scheme: JobTech Taxonomy - Färdighet
definition: Bildbyråarbete
broader: zmYu aAM TuF
related: 3J38 DNz YKK

BASIC, programmeringsspråk
type: Concept
in scheme: JobTech Taxonomy - Färdighet
definition: BASIC, programmeringsspråk
alternative label: BASIC
broader: Datorspråk
related: BAeH eg8 T2d
related: Fv7d YhP YmS
related: D9SL mtn vGM
related: DJh5 yyF hEM
related: 4Jty HpK a3Q

Eventarrangemang
type: Concept
in scheme: JobTech Taxonomy - Färdighet
definition: Eventarrangemang
broader: zmYu aAM TuF
related: 48KE fDE ryL

Filmning, TV-produktion
type: Concept
in scheme: JobTech Taxonomy - Färdighet
definition: Filmning, TV-produktion
broader: zmYu aAM TuF
related: 4BsK q2C sCL
related: CkRH 4Qn iX3
related: 3J38 DNz YKK
related: 4Jty HpK a3Q

Truck- och entreprenadmaskiner, reparationsvana
type: Concept
in scheme: JobTech Taxonomy - Färdighet
definition: Truck- och entreprenadmaskiner, reparationsvana avser kunskaper och färdigheter som krävs för att analysera, underhålla och reparera olika typer av truckar och entreprenadmaskiner. Kompetensen innefattar även hantering av reservdelar och utförande av service på dessa maskiner för att säkerställa deras funktionalitet och driftssäkerhet.
broader: zmYu aAM TuF
related: Lzpv ofL 3H5

Gång och vandring, instruktör
type: Concept
in scheme: JobTech Taxonomy - Färdighet
definition: Gång och vandring, instruktör
broader: Idrott/aktivitet
related: EA6o N1N QtT

Juridisk terminologi
type: Concept
in scheme: JobTech Taxonomy - Färdighet
definition: Juridisk terminologi
broader: zmYu aAM TuF
related: eQ4M CNm ozj
related: PQDm Z63 zst
related: zKvJ GnC Szx

Yrkesutbildning, tågtekniker
type: Concept
in scheme: JobTech Taxonomy - Färdighet
definition: Yrkesutbildning, tågtekniker är en yrkeshögskoleutbildning med inriktning till tågtekniker.
broader: Yrkesutbildning
related: KttZ Skc bMR

SVEA, styr- och utvecklingsmodell
type: Concept
in scheme: JobTech Taxonomy - Färdighet
definition: SVEA, styr- och utvecklingsmodell
alternative label: SVEA
broader: Styr- och utvecklingsmodeller
related: cBBa ngH fCx
related: D9SL mtn vGM
related: DJh5 yyF hEM
related: UxT1 tPF Kbg
related: 4Jty HpK a3Q
related: UXKZ 3zZ ipB

Hållbar upphandling
type: Concept
in scheme: JobTech Taxonomy - Färdighet
definition: Hållbar upphandling avser att använda upphandling som ett styrmedel, till exempel för att: - bidra till hållbar utveckling - minimera miljöpåverkan - främja social hållbarhet och inkludering - främja ekonomisk hållbarhet Källa: Upphandlingsmyndigheten
broader: zmYu aAM TuF
related: yXbD NTH ijE
related: 85cq 6uK 4cK

Hållbart byggande och förvaltning
type: Concept
in scheme: JobTech Taxonomy - Färdighet
definition: Hållbart avser alla hållbarhetsaspekter; ekologisk, ekonomisk och social. Ekologiska aspekter innebär bland annat att - använda livscykelperspektiv vid bedömningen av byggnadens miljöpåverkan - ta hänsyn till ekosystemtjänster i byggande och förvaltning och klimatanpassa byggnader - effektiv, resurssparande och miljöanpassad användning av naturresurser - att främst förnybara energikällor används - hållbar och enkel avfallshantering Ekonomiska aspekter innebär bland annat att - bostäder kan byggas till rimliga kostnader och samtidigt hushålla naturresurser - en cirkulär ekonomi för resurseffektiva och giftfria kretslopp Sociala aspekter innebär bland annat att - byggnader ska vara tillgängliga och användbara för personer med nedsatt rörelse- och orienteringsförmåga - att människor inte utsätts för skadliga luftföroreningar, kemiska ämnen, ljudnivåer, radonhalter eller andra oacceptabla hälso- eller säkerhetsrisker - den byggda miljön ska ge en god och hälsosam livsmiljö och ge skönhetsupplevelser och trevnad, för detta är grönska och olika ekosystemtjänster viktiga Källa: www.boverket.se
broader: zmYu aAM TuF
related: thZP oR7 WrY
related: w6ud quG dgh
related: yXbD NTH ijE
related: U8HK Jdi GuC
related: XeBP nMe pXx
related: 41KB bfk 5jR

Verksamhetsledning, tvätteri
type: Concept
in scheme: JobTech Taxonomy - Färdighet
definition: Verksamhetsledning, tvätteri
broader: zmYu aAM TuF
related: uxst tkg zDh

Herrkläder, skrädderi
type: Concept
in scheme: JobTech Taxonomy - Färdighet
definition: Herrkläder, skrädderi avser kompetens som innefattar design, tillverkning och anpassning av herrkläder, där skräddare och ateljésömmerskor skapar klädesplagg utifrån specifika kundönskemål. Kompetensen inkluderar framtagning av modeller och mönster samt skärning av tyg och andra material för att tillverka kläder och utföra ändringar eller reparationer av befintliga plagg.
broader: zmYu aAM TuF
related: mwVN oEH g9k

Besiktningsbehörighet för ventilation/OVK
type: Concept
in scheme: JobTech Taxonomy - Färdighet
definition: Besiktningsbehörighet för ventilation/OVK
alternative label: Besiktningsbehörighet för ventilation
alternative label: OVK
broader: s48H Sft DTn
related: df9D e6y 61z
related: idjo 2Wr a3E
related: K8yg U4C gkY
related: nuXg Wjc JPd
related: SUfj 4D9 FNx
related: Cppd 9P7 HeR
related: fLKb bJ3 69p
related: fWrt sLg koW

Statistisk Processtyrning/SPS
type: Concept
in scheme: JobTech Taxonomy - Färdighet
definition: Statistisk Processtyrning/SPS
alternative label: SPS
alternative label: Statistisk Processtyrning
broader: Kvalitetsverktyg
related: v9nU 6Fw 4Qg
related: Qo7p wjf gtv
related: vPP6 rsw dck
related: dMVD VYy kgg

Takplåtmontering
type: Concept
in scheme: JobTech Taxonomy - Färdighet
definition: Takplåtmontering
broader: zmYu aAM TuF
related: L4hA SJP SFi
related: bXfo 4hb SXx

Kundvagnsuppsamling
type: Concept
in scheme: JobTech Taxonomy - Färdighet
definition: Kundvagnsuppsamling
broader: zmYu aAM TuF
related: ieVp d5L rS9

Audionomexamen
type: Concept
in scheme: JobTech Taxonomy - Färdighet
definition: Audionomexamenär en yrkesexamen på högskolenivå kopplad till utbildning med inriktning mot audionom. Källa: UHR (Universitets- och högskolerådet)
broader: Yrkesbevis/examen
related: pzch NRY 9ZF

Elschema-ELPROCAD
type: Concept
in scheme: JobTech Taxonomy - Färdighet
definition: Elschema-ELPROCAD
broader: mTLu uo2 gq2
related: nDaB vdy eAy
related: SPYW 7Z1 ShT
related: 4Jty HpK a3Q

Installation och byte av vattenmätare
type: Concept
in scheme: JobTech Taxonomy - Färdighet
definition: Installation och byte av vattenmätare avser åtgärder kopplade till att installera, byta ut och underhålla vattenmätare för att säkerställa korrekt mätning av vattenförbrukning. Kompetensen omfattar tekniska kunskaper om vattenmätare och erfarenhet av relevanta installationsmetoder enligt gällande standarder och föreskrifter.
broader: zmYu aAM TuF
related: HXzD qvt HV6

Yrkesbevis, Chaufför – renhållningsbil inom avfallshantering och återvinning
type: Concept
in scheme: JobTech Taxonomy - Färdighet
definition: Yrkesbevis, Chaufför – renhållningsbil inom avfallshantering och återvinning, avser fördjupade kunskaper och färdigheter i yrkesrollen enligt branschstandard. Kompetensbevis utfärdas av Sobona
broader: s48H Sft DTn
related: X7HR rZK 4wj
related: yXbD NTH ijE
related: 3MBw pDA P2F

Livesändning
type: Concept
in scheme: JobTech Taxonomy - Färdighet
definition: Livesändning
alternative label: Direktsändning
broader: zmYu aAM TuF
related: 4BsK q2C sCL
related: xuSE mtB Mir
related: 3J38 DNz YKK
related: PH2M uV4 r72
related: 4Jty HpK a3Q

Pappersrullning
type: Concept
in scheme: JobTech Taxonomy - Färdighet
definition: Pappersrullning
broader: zmYu aAM TuF
related: 1G6H AuG qyy

Landstingskommunal förvaltning
type: Concept
in scheme: JobTech Taxonomy - Färdighet
definition: Landstingskommunal förvaltning
broader: zmYu aAM TuF
related: qVHD Hj5 PXh
related: wCx8 rY3 XUT
related: 8SPu K1k 5qR
related: ajwx FvL YuY
related: coyZ Cyv Srw
related: thZP oR7 WrY
related: NxXz fBh w7j
related: br6a VVS V3y
related: z8di AqX GBr
related: ddGt fEH 432
related: 4GAs rKs 2Ne
related: uxst tkg zDh
related: X1Ac Y9P PJo
related: mpuA s56 Hsy
related: sWzF 6pd Y6L
related: JfYV ZGg 6rm
related: 1uau t1u rDL

Bronsålderns arkeologi
type: Concept
in scheme: JobTech Taxonomy - Färdighet
definition: Bronsålderns arkeologi
broader: zmYu aAM TuF
related: sXgV QFg vpb

Kemisk fysik
type: Concept
in scheme: JobTech Taxonomy - Färdighet
definition: Kemisk fysik
broader: zmYu aAM TuF
related: KM7d Z6Y LCJ

Materialplanering, anläggning
type: Concept
in scheme: JobTech Taxonomy - Färdighet
definition: Materialplanering, anläggning
broader: zmYu aAM TuF
related: DPPw 4wa AsH
related: XBh3 Xrm C4R
related: 3ZtN hhA SM7
related: bZ4J riZ zK6
related: thZP oR7 WrY
related: w6ud quG dgh
related: 7mn2 kA9 ftp
related: XeBP nMe pXx
related: AD3U cFH rbe
related: iHrC aRv fVm

Systemutveckling
type: Concept
in scheme: JobTech Taxonomy - Färdighet
definition: Systemutveckling avser processen att analysera, designa, utveckla och implementera IT-system och mjukvarulösningar. Denna kompetens inkluderar en förståelse för programmering, systemarkitektur och användarcentrerad design för att skapa effektiva och användarvänliga digitala lösningar.
broader: zmYu aAM TuF
related: cBBa ngH fCx
related: vPP6 rsw dck
related: DJh5 yyF hEM
related: eWiB mGP MjE
related: 4Jty HpK a3Q
related: MYAz x9m 2LJ

Fortnox, affärssystem
type: Concept
in scheme: JobTech Taxonomy - Färdighet
definition: Fortnox, affärssystem
alternative label: Fortnox
broader: xSJR 1Kq pxB
related: eQ4M CNm ozj
related: iWcY mko rq2
related: q81z 3oD 1qu
related: ij8k EwC zyB
related: 4Jty HpK a3Q

Fartygsstabilitet
type: Concept
in scheme: JobTech Taxonomy - Färdighet
definition: Fartygsstabilitet
broader: Övriga specialiteter, sjöfart
related: Rsoy sS6 6c4
related: kDnq Q98 sD3

Maskdesign/Perukdesign, Film/TV
type: Concept
in scheme: JobTech Taxonomy - Färdighet
definition: Skapa/designa masker och peruker för film- och tv-produktioner.
alternative label: Maskdesign Film
alternative label: Maskdesign TV
alternative label: Perukdesign Film
alternative label: Perukdesign TV
broader: zmYu aAM TuF
related: ezKk kss CiQ

Djursjukvård
type: Concept
in scheme: JobTech Taxonomy - Färdighet
definition: Djursjukvård
broader: zmYu aAM TuF
related: 8q1B 5AR CEM
related: KYmy iqC xiQ
related: yXbD NTH ijE
related: MSzH F2n Emb

Energikartläggning
type: Concept
in scheme: JobTech Taxonomy - Färdighet
definition: Energikartläggning avser systematisk insamling och analys av data om energianvändning inom en organisation eller anläggning för att identifiera energibesparande åtgärder och effektiviseringar. Denna kompetens innefattar både tekniska och analytiska färdigheter för att bedöma energiflöden och föreslå förbättringar med hänsyn till både ekonomi och miljöpåverkan.
broader: zmYu aAM TuF
related: wCx8 rY3 XUT
related: K8yg U4C gkY
related: yXbD NTH ijE
related: PRQn 9yw NJA

Mönsterkonstruktion-Gerber
type: Concept
in scheme: JobTech Taxonomy - Färdighet
definition: Mönsterkonstruktion-Gerber avser en teknik inom mönsterkonstruktion som använder datorbaserade system för att skapa och modifiera mönster för klädesplagg. Denna kompetens inkluderar förståelse för material, mått och passform samt förmåga att använda programvara för att generera exakta mönster som underlättar tillverkningen av kläder och konfektionsprodukter.
broader: mTLu uo2 gq2
related: mwVN oEH g9k
related: 4Jty HpK a3Q

Konstpedagogik
type: Concept
in scheme: JobTech Taxonomy - Färdighet
definition: Konstpedagogik
broader: zmYu aAM TuF
related: mcRJ kq2 jFr

Virkesmärkning
type: Concept
in scheme: JobTech Taxonomy - Färdighet
definition: Virkesmärkning
broader: zmYu aAM TuF
related: qouP wtb 93q

Belysningsteknik
type: Concept
in scheme: JobTech Taxonomy - Färdighet
definition: Belysningsteknik
broader: zmYu aAM TuF
related: nDaB vdy eAy
related: yXbD NTH ijE
related: SPYW 7Z1 ShT

Fritidspedagogexamen
type: Concept
in scheme: JobTech Taxonomy - Färdighet
definition: Fritidspedagogexamen
broader: Yrkesbevis/examen
related: CFW8 eBa NaV

Tillståndshandläggning
type: Concept
in scheme: JobTech Taxonomy - Färdighet
definition: Tillståndshandläggning avser processen för att granska och besluta om ansökningar om olika typer av tillstånd och licenser inom offentlig sektor och vissa privata verksamheter. Denna kompetens omfattar kunskap om gällande lagar och regler, samt förmåga att utvärdera fakta och underlag för att fatta informerade beslut i ärenden som rör tillståndsgivning.
broader: zmYu aAM TuF
related: vPP6 rsw dck
related: nuXg Wjc JPd

Konstfotografering/Föremålsfotografering
type: Concept
in scheme: JobTech Taxonomy - Färdighet
definition: Konstfotografering/Föremålsfotografering
alternative label: Föremålsfotografering
alternative label: Konstfotografering
broader: zmYu aAM TuF
related: 3J38 DNz YKK
related: 4Jty HpK a3Q

Områdesansvar, omsorg
type: Concept
in scheme: JobTech Taxonomy - Färdighet
definition: Områdesansvar, omsorg
broader: zmYu aAM TuF
related: NxXz fBh w7j

Attributmakeri
type: Concept
in scheme: JobTech Taxonomy - Färdighet
definition: Attributmakeri avser processen att skapa och hantera attribut som används inom scenproduktion, särskilt i samband med teater och film. Kompetensen innefattar att säkerställa att rätt föremål och detaljer finns på plats i enlighet med manus och regissörens vision.
broader: zmYu aAM TuF
related: 1Nwn GYH wkH
related: PH2M uV4 r72

TV-produktion
type: Concept
in scheme: JobTech Taxonomy - Färdighet
definition: TV-produktion
broader: zmYu aAM TuF
related: SgNH hag n9D

Flerfärgstryck (rena grundfärger)
type: Concept
in scheme: JobTech Taxonomy - Färdighet
definition: Flerfärgstryck (rena grundfärger)
broader: zmYu aAM TuF
related: XeJB bkn mRn

Ljudteknik, TV-produktion
type: Concept
in scheme: JobTech Taxonomy - Färdighet
definition: Ljudteknik, TV-produktion
broader: zmYu aAM TuF
related: 4BsK q2C sCL
related: CkRH 4Qn iX3
related: 4Jty HpK a3Q

Klinisk virologi, specialistkompetens för läkare
type: Concept
in scheme: JobTech Taxonomy - Färdighet
definition: Klinisk virologi, specialistkompetens för läkare
broader: Specialistbevis för läkare
related: nu7c QuB KVQ

Klinisk cytologi, specialistkompetens för läkare
type: Concept
in scheme: JobTech Taxonomy - Färdighet
definition: Klinisk cytologi, specialistkompetens för läkare
broader: Specialistbevis för läkare
related: nu7c QuB KVQ

JavaScript, programmeringsspråk
type: Concept
in scheme: JobTech Taxonomy - Färdighet
definition: JavaScript, programmeringsspråk
alternative label: Javascript
alternative label: Javascript-kompetens
alternative label: Javascript-kunskap
alternative label: Javascript-utveckling
alternative label: Javascriptkompetens
alternative label: Javascriptkunskap
alternative label: Javascriptutveckling
broader: Datorspråk
related: BAeH eg8 T2d
related: Fv7d YhP YmS
related: 8Bmh vtM zts
related: D9SL mtn vGM
related: DJh5 yyF hEM
related: 4Jty HpK a3Q
related: Mbt6 3ko DiD

Utrikeshandel
type: Concept
in scheme: JobTech Taxonomy - Färdighet
definition: Utrikeshandel
broader: zmYu aAM TuF
related: WZCM nfS eAk

Socialmedicinsk funktionsnedsättning, arbetsrehabilitering
type: Concept
in scheme: JobTech Taxonomy - Färdighet
definition: Socialmedicinsk funktionsnedsättning, arbetsrehabilitering
broader: zmYu aAM TuF
related: fsnw ZCu v2U
related: pok1 ipJ yzD

MS Project
type: Concept
in scheme: JobTech Taxonomy - Färdighet
definition: MS Project
broader: Allmänna datakunskaper
related: eQ4M CNm ozj
related: Y6yY SuR hVh
related: Uw4n UB2 RCW
related: fdLf oPp wVw
related: vPP6 rsw dck
related: iWcY mko rq2
related: ZQTR hVC QhJ
related: br6a VVS V3y
related: 1CX5 mZw Vcq
related: L7eh ihX vM5
related: MGk3 LvL AU2
related: jJF3 qaQ Zsh
related: oEmP NC1 sXE
related: bjqk F3A 5Hk
related: H2Zj eL9 x28
related: dJXy Rpq a2u
related: pwRH MT1 8nR
related: cRmd 536 pT1
related: zKvJ GnC Szx
related: n6iX f2z XfE
related: DZVN v5g Fco
related: ij8k EwC zyB
related: JfYV ZGg 6rm
related: vCAb uuo ek5
related: 4Jty HpK a3Q
related: p16X 44f rwZ
related: pok1 ipJ yzD

DP Operator's certificate
type: Concept
in scheme: JobTech Taxonomy - Färdighet
definition: DP Operator's certificate
broader: s48H Sft DTn
related: kZwz D8K bKs
related: kDnq Q98 sD3

IBM Cloud, molnplattform
type: Concept
in scheme: JobTech Taxonomy - Färdighet
definition: IBM Cloud, molnplattform
broader: Applikationsplattformar
related: DJh5 yyF hEM
related: 4Jty HpK a3Q
related: UXKZ 3zZ ipB

Brandisolering, stålbalkar
type: Concept
in scheme: JobTech Taxonomy - Färdighet
definition: Brandisolering, stålbalkar innebär åtgärder och metoder för att skydda stålbalkar mot brandpåverkan för att minska risken för strukturella skador vid brand. Kompetensen omfattar kunskap om olika typer av brandisolering och materialförhållanden som påverkar effektiviteten av brandisoleringen.
broader: zmYu aAM TuF
related: dKUb KBP mw3
related: yXbD NTH ijE
related: AD3U cFH rbe

Google Cloud Platform, molnplattform
type: Concept
in scheme: JobTech Taxonomy - Färdighet
definition: Google Cloud Platform, molnplattform, avser en uppsättning tjänster och verktyg tillgängliga via molnet för att bygga, lagra och hantera applikationer och data.
alternative label: GCP
broader: Applikationsplattformar
related: VCpu 5EN bBt
related: DJh5 yyF hEM
related: 4Jty HpK a3Q
related: UXKZ 3zZ ipB

Egen spelmotor
type: Concept
in scheme: JobTech Taxonomy - Färdighet
definition: Egen spelmotor
broader: Spelmotorer
related: Q5DF juj 8do
related: 4Jty HpK a3Q
related: Mbt6 3ko DiD

Djurtransporter
type: Concept
in scheme: JobTech Taxonomy - Färdighet
definition: Djurtransporter
broader: zmYu aAM TuF
related: KYmy iqC xiQ
related: RYCQ ogb uUY
related: MSzH F2n Emb

Körning av materialhanterare
type: Concept
in scheme: JobTech Taxonomy - Färdighet
definition: Körning av materialhanterare avser färdigheten att hantera och driva maskiner avsedda för materialhantering, såsom gaffeltruckar och skjutstativtruckar, i olika miljöer där effektiv vertikal och horisontell transport av material och varor är nödvändig. Kompetensen omfattar kunskaper om maskinens funktioner och säkerhetsföreskrifter samt förmåga att utföra arbete på ett korrekt och ansvarsfullt sätt.
broader: zmYu aAM TuF
related: X7HR rZK 4wj

Advanced-MIRG
type: Concept
in scheme: JobTech Taxonomy - Färdighet
definition: Advanced-MIRG
broader: zmYu aAM TuF
related: ug5y o6z U3L

Polymerkemi
type: Concept
in scheme: JobTech Taxonomy - Färdighet
definition: Polymerkemi
broader: zmYu aAM TuF
related: v9nU 6Fw 4Qg
related: qn2U dB9 Cmh
related: eofS oZs RZi

Högre Certifikat inom inköp och logistik
type: Concept
in scheme: JobTech Taxonomy - Färdighet
definition: Högre Certifikat inom inköp och logistik
broader: s48H Sft DTn
related: xm5G vGn iyk
related: nNxJ YWy vR2

HBTQI-kompetens
type: Concept
in scheme: JobTech Taxonomy - Färdighet
definition: HBTQI-kompetens
broader: zmYu aAM TuF
related: sXgV QFg vpb

Konkursförvaltning
type: Concept
in scheme: JobTech Taxonomy - Färdighet
definition: Konkursförvaltning
broader: zmYu aAM TuF
related: q8wL kdi WaW
related: br6a VVS V3y
related: 6aak 8eh iwT
related: DZVN v5g Fco
related: JfYV ZGg 6rm

Planfräsning
type: Concept
in scheme: JobTech Taxonomy - Färdighet
definition: Planfräsning
broader: zmYu aAM TuF
related: vaEp iBS c5h

Sitar
type: Concept
in scheme: JobTech Taxonomy - Färdighet
definition: Sitar
broader: wLYs CKS wK8
related: AWJF wqZ va9

Inredningsvana, kontor
type: Concept
in scheme: JobTech Taxonomy - Färdighet
definition: Inredningsvana, kontor
broader: zmYu aAM TuF
related: 41KB bfk 5jR
related: CSUf ZVM a7Z

Hetvattencentral, underhåll
type: Concept
in scheme: JobTech Taxonomy - Färdighet
definition: Hetvattencentral, underhåll
broader: zmYu aAM TuF
related: Cppd 9P7 HeR

Familjebehandling/Nätverksarbete
type: Concept
in scheme: JobTech Taxonomy - Färdighet
definition: Familjebehandling/Nätverksarbete
alternative label: Familjebehandling
alternative label: Nätverksarbete
broader: zmYu aAM TuF
related: BWwk fYX S5B
related: dJXy Rpq a2u
related: pok1 ipJ yzD

Försäljningsvana, exportförsäljning
type: Concept
in scheme: JobTech Taxonomy - Färdighet
definition: Försäljningsvana, exportförsäljning
broader: zmYu aAM TuF
related: oXSW fbY XrY
related: AuTi FEo j3R

Skogsrådgivning
type: Concept
in scheme: JobTech Taxonomy - Färdighet
definition: Skogsrådgivning är kompetensen att ge skräddarsydd vägledning till skogsägare för att optimera skogens ekonomiska avkastning, hållbar skötsel och långsiktig förvaltning. Det omfattar utveckling av skogsstrategier, rådgivning kring avverkning, virkesförsäljning, naturvårdsåtgärder och efterlevnad av lagar samt upphandling av tjänster. Rådgivaren analyserar skogsbruksplaner, värderar fastigheter, leder utbildningar och stöttar i beslutsfattande kring virkesmarknad, skogsskötsel och hållbarhetsmål.
broader: zmYu aAM TuF
related: yXbD NTH ijE
related: 3LdB WEJ 8Ms

Ventilationsisolering
type: Concept
in scheme: JobTech Taxonomy - Färdighet
definition: Ventilationsisolering
broader: zmYu aAM TuF
related: yXbD NTH ijE
related: fLKb bJ3 69p
related: cGxX R9c kW1
related: bXfo 4hb SXx

Resebokning
type: Concept
in scheme: JobTech Taxonomy - Färdighet
definition: Resebokning innebär förmåga att självständigt och effektivt planera, boka och hantera resor för individer eller grupper. Det innefattar att välja lämpliga transportmedel, boka flyg, tågresor, hotell och eventuella transferlösningar samt att säkerställa att resan följer företagets eller organisationens riktlinjer och budget.
broader: zmYu aAM TuF
related: vCAb uuo ek5

Lantbrevbäring
type: Concept
in scheme: JobTech Taxonomy - Färdighet
definition: Lantbrevbäring avser kompetensen att förbereda och distribuera post i lantortsmiljöer, vilket innefattar hantering av brev, tidskrifter och direktreklam.
broader: zmYu aAM TuF
related: gaBh 1vR tNE

Asktillverkning
type: Concept
in scheme: JobTech Taxonomy - Färdighet
definition: Asktillverkning
broader: zmYu aAM TuF
related: mPzg 93F QEv

Emballage/Förpackningar
type: Concept
in scheme: JobTech Taxonomy - Färdighet
definition: Emballage/Förpackningar
alternative label: Emballage
alternative label: Förpackningar
broader: zmYu aAM TuF
related: oXSW fbY XrY
related: 85cq 6uK 4cK

Partiturläsning
type: Concept
in scheme: JobTech Taxonomy - Färdighet
definition: Partiturläsning
broader: zmYu aAM TuF
related: iBUL s38 izZ
related: AWJF wqZ va9
related: 4BsK q2C sCL
related: xuSE mtB Mir
related: PH2M uV4 r72
related: gmRr 7tt eHj

Planteringsmaskin
type: Concept
in scheme: JobTech Taxonomy - Färdighet
definition: Planteringsmaskin
broader: zmYu aAM TuF
related: KwVo sQu G2e
related: yXbD NTH ijE

Cross-cutting (sköta och underhålla utrustning)
type: Concept
in scheme: JobTech Taxonomy - Färdighet
definition: Cross-cutting (sköta och underhålla utrustning)
broader: zmYu aAM TuF
related: hxm6 xkr dHm

Områdesansvar, lantmäteri
type: Concept
in scheme: JobTech Taxonomy - Färdighet
definition: Områdesansvar, lantmäteri
broader: zmYu aAM TuF
related: 8SPu K1k 5qR

UV-strålning
type: Concept
in scheme: JobTech Taxonomy - Färdighet
definition: UV-strålning
broader: zmYu aAM TuF
related: rE1E m3d cx1

DHTML, programmeringsspråk
type: Concept
in scheme: JobTech Taxonomy - Färdighet
definition: DHTML, programmeringsspråk
alternative label: DHTML
broader: Datorspråk
related: BAeH eg8 T2d
related: Fv7d YhP YmS
related: 8Bmh vtM zts
related: D9SL mtn vGM
related: DJh5 yyF hEM
related: 4Jty HpK a3Q
related: Mbt6 3ko DiD

AZ-204: Developing Solutions for Microsoft Azure
type: Concept
in scheme: JobTech Taxonomy - Färdighet
definition: AZ-204: Developing Solutions for Microsoft Azure
broader: s48H Sft DTn
related: VCpu 5EN bBt
related: DJh5 yyF hEM
related: 4Jty HpK a3Q
related: UXKZ 3zZ ipB
related: MYAz x9m 2LJ

Swing
type: Concept
in scheme: JobTech Taxonomy - Färdighet
definition: Swing
broader: p1WM wCw LTd
related: AWJF wqZ va9

Kapitalförvaltning
type: Concept
in scheme: JobTech Taxonomy - Färdighet
definition: Kapitalförvaltning
broader: zmYu aAM TuF
related: Bbkh nrm 2J8
related: pTr9 RBT 9ur
related: mZsb A1K Gec
related: 9Mn4 PNA 7Yz

Balalajka
type: Concept
in scheme: JobTech Taxonomy - Färdighet
definition: Balalajka
broader: wLYs CKS wK8
related: AWJF wqZ va9

Marknadsföring/Marknadskommunikation
type: Concept
in scheme: JobTech Taxonomy - Färdighet
definition: Marknadsföring/Marknadskommunikation avser aktiviteter som syftar till att främja, informera och kommunicera erbjudanden till målgrupper för att nå affärsmål. Kompetensen omfattar insikter och strategier för att förstå marknadsdynamik, målgruppers behov samt utformning och genomförande av kampanjer och kommunikationsplaner.
alternative label: Marknadsföring
alternative label: Marknadskommunikation
broader: zmYu aAM TuF
related: SgNH hag n9D
related: Pz9M srJ Lc9
related: dUuh wwa FGj
related: WX67 Pfb WMN
related: mpuA s56 Hsy
related: 4Jty HpK a3Q
related: p16X 44f rwZ

Altsaxofon
type: Concept
in scheme: JobTech Taxonomy - Färdighet
definition: Altsaxofon
broader: wLYs CKS wK8
related: AWJF wqZ va9

Livsmedelsteknik
type: Concept
in scheme: JobTech Taxonomy - Färdighet
definition: Livsmedelsteknik
broader: zmYu aAM TuF
related: v9nU 6Fw 4Qg
related: puim 6PY DGj
related: yXbD NTH ijE
related: 4Jty HpK a3Q

Electronic Data Capture/EDC
type: Concept
in scheme: JobTech Taxonomy - Färdighet
definition: Electronic Data Capture/EDC
alternative label: EDC
alternative label: Electronic Data Capture
broader: Allmänna datakunskaper
related: wNrt Ysj WuT
related: Z2MZ eYc Lfv
related: dsK3 hkt zGy
related: GC7L Yw7 Mfo
related: 4Jty HpK a3Q

Hunddagis
type: Concept
in scheme: JobTech Taxonomy - Färdighet
definition: Hunddagis
broader: zmYu aAM TuF
related: MSzH F2n Emb

Fusing, ihopsmältning av glasspill
type: Concept
in scheme: JobTech Taxonomy - Färdighet
definition: Fusing, ihopsmältning av glasspill
broader: zmYu aAM TuF
related: J17g Q2a 2u1

Rational Manual Tester, systemutvecklingsverktyg
type: Concept
in scheme: JobTech Taxonomy - Färdighet
definition: Rational Manual Tester, systemutvecklingsverktyg
alternative label: Rational Manual Tester
broader: Programmerings- och systemutvecklingsverktyg
related: D9SL mtn vGM
related: DJh5 yyF hEM
related: 4Jty HpK a3Q
related: MYAz x9m 2LJ

Utbildningsbevis, VVS-montör
type: Concept
in scheme: JobTech Taxonomy - Färdighet
definition: Utbildningsbevis, VVS-montör
broader: Yrkesbevis/examen
related: fLKb bJ3 69p

Mental träning
type: Concept
in scheme: JobTech Taxonomy - Färdighet
definition: Mental träning
broader: zmYu aAM TuF
related: UUQi UJ5 MSb
related: VYeq GDF a2g

Träskulptur
type: Concept
in scheme: JobTech Taxonomy - Färdighet
definition: Träskulptur
broader: zmYu aAM TuF
related: 34Tn BQQ tfo

Isoleringsteknik
type: Concept
in scheme: JobTech Taxonomy - Färdighet
definition: Isoleringsteknik
broader: zmYu aAM TuF
related: K8yg U4C gkY
related: nuXg Wjc JPd
related: yXbD NTH ijE

Termomekanik
type: Concept
in scheme: JobTech Taxonomy - Färdighet
definition: Termomekanik
broader: zmYu aAM TuF
related: K8yg U4C gkY
related: PRQn 9yw NJA

Virologi
type: Concept
in scheme: JobTech Taxonomy - Färdighet
definition: Virologi
broader: zmYu aAM TuF
related: Z2MZ eYc Lfv
related: dsK3 hkt zGy

Visual Studio Code, integrerad utvecklingsmiljö
type: Concept
in scheme: JobTech Taxonomy - Färdighet
definition: Visual Studio Code, integrerad utvecklingsmiljö
broader: Programmerings- och systemutvecklingsverktyg
related: D9SL mtn vGM
related: DJh5 yyF hEM
related: 4Jty HpK a3Q
related: UXKZ 3zZ ipB

Djurtransporter, körvana
type: Concept
in scheme: JobTech Taxonomy - Färdighet
definition: Djurtransporter, körvana avser färdighet att köra fordon som används för transport av djur under olika förhållanden. Kompetensen innefattar kunskap om säker hantering av djur samt de föreskrifter och krav som reglerar djurtransport.
broader: zmYu aAM TuF
related: 3MBw pDA P2F

3D-grafik-Autodesk Softimage
type: Concept
in scheme: JobTech Taxonomy - Färdighet
definition: 3D-grafik-Autodesk Softimage
broader: Programvara för digitalt skapande
related: 8Bmh vtM zts
related: 34Tn BQQ tfo
related: Q5DF juj 8do
related: 4Jty HpK a3Q
related: LeQV umf wUS
related: Mbt6 3ko DiD

Föredragande i kvalitetsråd
type: Concept
in scheme: JobTech Taxonomy - Färdighet
definition: Föredragande i kvalitetsråd
broader: zmYu aAM TuF
related: Qo7p wjf gtv

Akupressur
type: Concept
in scheme: JobTech Taxonomy - Färdighet
definition: Akupressur är en behandlingsmetod där tryck appliceras med fingrar, händer eller andra verktyg på specifika punkter på kroppen. Metoden bygger på samma principer som akupunktur men utan nålar. Syftet är att stimulera kroppens funktioner, minska spänningar och lindra olika besvär genom att påverka kroppens energiflöde och främja balans.
broader: zmYu aAM TuF
related: F19Z oB6 pg3

OB-produktion
type: Concept
in scheme: JobTech Taxonomy - Färdighet
definition: OB-produktion
broader: zmYu aAM TuF
related: 4BsK q2C sCL
related: CkRH 4Qn iX3
related: PH2M uV4 r72

Jämställdhetsfrågor, personalarbete
type: Concept
in scheme: JobTech Taxonomy - Färdighet
definition: Jämställdhetsfrågor, personalarbete
broader: zmYu aAM TuF
related: mNoS AN5 drn
related: Fp7x Yqt bx9
related: bjqk F3A 5Hk

Timmertransporter, körvana
type: Concept
in scheme: JobTech Taxonomy - Färdighet
definition: Timmertransporter, körvana
broader: zmYu aAM TuF
related: 3MBw pDA P2F

Hälsoekonomi
type: Concept
in scheme: JobTech Taxonomy - Färdighet
definition: Hälsoekonomi
broader: zmYu aAM TuF
related: WZCM nfS eAk

Optik, produktkunskap
type: Concept
in scheme: JobTech Taxonomy - Färdighet
definition: Optik, produktkunskap avser kunskap om olika optiska produkter och deras användning, inklusive glasögon, kontaktlinser och andra synhjälpmedel. Denna kompetens innefattar förståelse för produktens egenskaper, effektiv rådgivning till kunder samt insikter kring anpassningar och installationer av dessa hjälpmedel.
broader: zmYu aAM TuF
related: YKL2 FCB 1yr
related: PUhV DVQ MM6
related: AQrL tTu Wbg

Industrifotografering
type: Concept
in scheme: JobTech Taxonomy - Färdighet
definition: Industrifotografering
broader: zmYu aAM TuF
related: 3J38 DNz YKK

Solenergisystem
type: Concept
in scheme: JobTech Taxonomy - Färdighet
definition: Solenergisystem avser implementering och hantering av teknologier som omvandlar solens strålar till energi för olika användningsområden, inklusive elektrisk produktion och uppvärmning. Kompetensen omfattar kunskaper om systemdesign, installation och underhåll av solenergiutrustning och relaterade komponenter, inklusive solpaneler och omvandlare.
broader: zmYu aAM TuF
related: wCx8 rY3 XUT
related: yXbD NTH ijE
related: PRQn 9yw NJA

Elschema-PCB Design
type: Concept
in scheme: JobTech Taxonomy - Färdighet
definition: Elschema-PCB Design
broader: mTLu uo2 gq2
related: nDaB vdy eAy
related: SPYW 7Z1 ShT
related: 4Jty HpK a3Q

Handels- och administrationsinriktning, undervisning
type: Concept
in scheme: JobTech Taxonomy - Färdighet
definition: Handels- och administrationsinriktning, undervisning
broader: Inriktning på lärarkompetens
related: 2x2V UeL 6ke

Internationell rätt
type: Concept
in scheme: JobTech Taxonomy - Färdighet
definition: Internationell rätt
broader: zmYu aAM TuF
related: q8wL kdi WaW
related: br6a VVS V3y
related: 6aak 8eh iwT
related: DZVN v5g Fco
related: JfYV ZGg 6rm

Gesällbrev, möbelsnickare
type: Concept
in scheme: JobTech Taxonomy - Färdighet
definition: Gesällbrev, möbelsnickare är ett bevis på att en hantverkare har genomgått utbildning och avlagt de delprov som krävs inom det specifika hantverksyrket, och därigenom uppnått ett erkännande av färdigheter och kompetens inom yrket. Utfärdas av Sveriges hantverksråd i samråd med aktuell branschorganisation.
broader: Yrkesbevis/examen
related: 1Nwn GYH wkH

Pizzeria
type: Concept
in scheme: JobTech Taxonomy - Färdighet
definition: Pizzeria
broader: zmYu aAM TuF
related: a8gg ktU w8V

Hogia skatt, redovisningssystem
type: Concept
in scheme: JobTech Taxonomy - Färdighet
definition: Hogia skatt, redovisningssystem
alternative label: Hogia skatt
broader: xSJR 1Kq pxB
related: eQ4M CNm ozj
related: q81z 3oD 1qu
related: ij8k EwC zyB
related: 4Jty HpK a3Q

Bioteknik
type: Concept
in scheme: JobTech Taxonomy - Färdighet
definition: Bioteknik är ett samlingsbegrepp för användning av mikro-, cell- och molekylärbiologiska metoder för tekniska ändamål, exempelvis framställning av läkemedel, produktion av livsmedel och rening av avloppsvatten.
broader: zmYu aAM TuF
related: v9nU 6Fw 4Qg
related: XurM DVs ggn
related: Z2MZ eYc Lfv
related: qn2U dB9 Cmh
related: dsK3 hkt zGy
related: GC7L Yw7 Mfo
related: 4Jty HpK a3Q
related: bExu 8gk azk
related: 3LdB WEJ 8Ms

Inseminering
type: Concept
in scheme: JobTech Taxonomy - Färdighet
definition: Inseminering avser processen att befrukta en hona genom artificiell insemination, där spermier förs in i honor för att möjliggöra fertilisering. Kompetensen innefattar kunskaper om reproduktion, befruktningsmetoder och hantering av djur under insemineringsprocedurer, ofta kopplad till uppfödare och skötare av lantbrukets husdjur.
broader: zmYu aAM TuF
related: KYmy iqC xiQ

Betongsprutning
type: Concept
in scheme: JobTech Taxonomy - Färdighet
definition: Betongsprutning
broader: zmYu aAM TuF
related: sX9n CWa KVC
related: f71c gjL RDq

Analys/Beräkning-Autodesk Robot Structural Analysis
type: Concept
in scheme: JobTech Taxonomy - Färdighet
definition: Analys/Beräkning-Autodesk Robot Structural Analysis
alternative label: Analys-Autodesk Robot Structural Analysis
alternative label: Beräkning-Autodesk Robot Structural Analysis
broader: mTLu uo2 gq2
related: thZP oR7 WrY
related: K8yg U4C gkY
related: Pd51 xnr KCY
related: XeBP nMe pXx
related: PRQn 9yw NJA
related: ETAR ggZ Wuw
related: 41KB bfk 5jR
related: 4Jty HpK a3Q

Presentartiklar/Reklamartiklar
type: Concept
in scheme: JobTech Taxonomy - Färdighet
definition: Presentartiklar/Reklamartiklar
alternative label: Presentartiklar
alternative label: Reklamartiklar
broader: zmYu aAM TuF
related: oXSW fbY XrY
related: YKL2 FCB 1yr
related: 85cq 6uK 4cK

Antenner, installationsvana
type: Concept
in scheme: JobTech Taxonomy - Färdighet
definition: Antenner, installationsvana
broader: zmYu aAM TuF
related: fWrt sLg koW
related: 4Jty HpK a3Q

Kyrkans barnverksamhet
type: Concept
in scheme: JobTech Taxonomy - Färdighet
definition: Kyrkans barnverksamhet avser aktiviteter och program som riktar sig till barn inom kyrkliga sammanhang, med fokus på att stödja deras utveckling och andliga tillväxt. Kompetensen omfattar planering, organisering och ledning av verksamheter som syftar till att engagera barn i kyrkans liv och gemenskap.
broader: zmYu aAM TuF
related: aA2Z 9XX R1v

Exploratory testing/Utforskande testning
type: Concept
in scheme: JobTech Taxonomy - Färdighet
definition: Exploratory testing/Utforskande testning
alternative label: Exploratory testing
alternative label: Utforskande testning
broader: zmYu aAM TuF
related: D9SL mtn vGM
related: UxT1 tPF Kbg
related: 4Jty HpK a3Q

Förarbevis, skotare
type: Concept
in scheme: JobTech Taxonomy - Färdighet
definition: Förarbevis, skotare avser den certifiering som krävs för att lagligt köra skotare i skogsbruk. Kompetensen innebär kunskaper och färdigheter relaterade till säker och effektiv hantering av skotare, vilket inkluderar förståelse för maskinens funktion och säkerhetsföreskrifter.
broader: Yrkesbevis/examen
related: KwVo sQu G2e

Fjärranalys
type: Concept
in scheme: JobTech Taxonomy - Färdighet
definition: Fjärranalys
broader: zmYu aAM TuF
related: GMDo DVo Yzh
related: ketV G9W GeR
related: 4Jty HpK a3Q

Klinisk immunologi och transfusionsmedicin
type: Concept
in scheme: JobTech Taxonomy - Färdighet
definition: Klinisk immunologi och transfusionsmedicin
broader: Specialistbevis för läkare
related: nu7c QuB KVQ

Lärarexamen-förskola och grundskolans tidigare år
type: Concept
in scheme: JobTech Taxonomy - Färdighet
definition: Lärarexamen-förskola och grundskolans tidigare år
broader: Yrkesbevis/examen
related: 5ek3 Cgq WeZ

Reggae
type: Concept
in scheme: JobTech Taxonomy - Färdighet
definition: Reggae
broader: p1WM wCw LTd
related: AWJF wqZ va9

Restaurangkök
type: Concept
in scheme: JobTech Taxonomy - Färdighet
definition: Restaurangkök avser den strukturerade och organiserade miljön för matlagning och tillagning inom restaurangbranschen. Kompetensen innefattar kunskap om köksorganisation, hygienstandarder och kulinariska tekniker för att säkerställa effektiv matproduktion och kvalitetssäkring.
broader: zmYu aAM TuF
related: BStc SJh DKG
related: a8gg ktU w8V
related: tPox ie4 X9X
related: XGyi i4B ME7
related: h324 DPT 7Tw

Externredovisning
type: Concept
in scheme: JobTech Taxonomy - Färdighet
definition: Externredovisning
broader: zmYu aAM TuF
related: eQ4M CNm ozj
related: Y6yY SuR hVh
related: Uw4n UB2 RCW
related: q81z 3oD 1qu
related: cRmd 536 pT1
related: ij8k EwC zyB

Mediepedagogik, utbildad inom
type: Concept
in scheme: JobTech Taxonomy - Färdighet
definition: Mediepedagogik, utbildad inom
broader: Yrkesbevis/examen
related: 1CX5 mZw Vcq

Social- och försäkringstolkning
type: Concept
in scheme: JobTech Taxonomy - Färdighet
definition: Social- och försäkringstolkning
broader: zmYu aAM TuF
related: PQDm Z63 zst

Emaljbränning
type: Concept
in scheme: JobTech Taxonomy - Färdighet
definition: Emaljbränning avser en teknik inom ytbehandling där emalj appliceras och bränns in på produkter för att skapa en hållbar och estetiskt tilltalande yta. Kompetensen omfattar kunskaper om material, temperaturkontroller och bränningsprocesser för att uppnå önskade resultat.
broader: zmYu aAM TuF
related: dKUb KBP mw3
related: aKdV u7V R5j

Ekotoxikologi
type: Concept
in scheme: JobTech Taxonomy - Färdighet
definition: Ekotoxikologi
broader: zmYu aAM TuF
related: dsK3 hkt zGy

Hälsokrav vid livsmedelshantering
type: Concept
in scheme: JobTech Taxonomy - Färdighet
definition: Hälsokrav vid livsmedelshantering avser de specifika regler och riktlinjer som syftar till att säkerställa hygien och säkerhet vid hantering av livsmedel. Kompetensen omfattar kunskaper om hälsoaspekter som är nödvändiga för att undvika kontaminering och livsmedelsburna sjukdomar.
broader: zmYu aAM TuF
related: BStc SJh DKG
related: JnTF wXr 6Eh
related: QqHf XKZ eyy
related: puim 6PY DGj
related: kF59 fge kts
related: yXbD NTH ijE
related: UjoW meY Zwt
related: s1Qk o98 2o1
related: a8gg ktU w8V
related: 1wqU Jhj amb
related: tPox ie4 X9X
related: icae Y69 H8E
related: gJtZ EBc n2z

Provianteringsvana, fartygskök
type: Concept
in scheme: JobTech Taxonomy - Färdighet
definition: Provianteringsvana, fartygskök
broader: Övriga specialiteter, sjöfart
related: BStc SJh DKG
related: XGyi i4B ME7
related: h324 DPT 7Tw

Yrkesutbildning, trädgårdsmästare
type: Concept
in scheme: JobTech Taxonomy - Färdighet
definition: Yrkesutbildning, trädgårdsmästare är en yrkeshögskoleutbildning eller eftergymnasial utbildning med inriktning till trädgårdsmästare.
broader: Yrkesutbildning
related: XBh3 Xrm C4R
related: 2xQ4 4kh kTZ
related: 9QMD sZ3 ZjX

Fysisk arbetsmiljö och ergonomi
type: Concept
in scheme: JobTech Taxonomy - Färdighet
definition: Fysisk arbetsmiljö och ergonomi
broader: zmYu aAM TuF
related: Qo7p wjf gtv
related: mNoS AN5 drn
related: Uw64 cuc U3H
related: vPP6 rsw dck
related: bjqk F3A 5Hk
related: s7vU FhY L5Z
related: nuXg Wjc JPd
related: yXbD NTH ijE

Kosmologi
type: Concept
in scheme: JobTech Taxonomy - Färdighet
definition: Kosmologi
broader: zmYu aAM TuF
related: KM7d Z6Y LCJ

Föräldrautbildning
type: Concept
in scheme: JobTech Taxonomy - Färdighet
definition: Föräldrautbildning
broader: zmYu aAM TuF
related: 7XXd 4St nit

Capture One
type: Concept
in scheme: JobTech Taxonomy - Färdighet
definition: Capture One
broader: Programvara för digitalt skapande
related: 4BsK q2C sCL
related: 3J38 DNz YKK
related: 4Jty HpK a3Q

Posering för konstnär
type: Concept
in scheme: JobTech Taxonomy - Färdighet
definition: Posering för konstnär
broader: zmYu aAM TuF
related: NCeZ rSk B4D

Bostad med särskild service
type: Concept
in scheme: JobTech Taxonomy - Färdighet
definition: Bostad med särskild service
broader: zmYu aAM TuF
related: BWwk fYX S5B
related: sq3e WVv Fjd
related: jY19 knH MJp
related: 7pz9 eY9 D2s
related: 5uP5 Ugw aVE

Illustration
type: Concept
in scheme: JobTech Taxonomy - Färdighet
definition: Illustration
broader: zmYu aAM TuF
related: 8Bmh vtM zts
related: 34Tn BQQ tfo
related: SgNH hag n9D
related: 4BsK q2C sCL
related: PH2M uV4 r72
related: Mbt6 3ko DiD

TouchPoint Plus, telefonväxel
type: Concept
in scheme: JobTech Taxonomy - Färdighet
definition: TouchPoint Plus, telefonväxel
broader: Telefonväxlar
related: 4aPu 2nd 8X6
related: ByrL ANp UwV
related: 4Jty HpK a3Q

Fordonsinriktning-godshantering, undervisning
type: Concept
in scheme: JobTech Taxonomy - Färdighet
definition: Fordonsinriktning-godshantering, undervisning
broader: Inriktning på lärarkompetens
related: 2x2V UeL 6ke

Putsning, konventionell maskin
type: Concept
in scheme: JobTech Taxonomy - Färdighet
definition: Putsning, konventionell maskin
broader: zmYu aAM TuF
related: VKKg e4t t46

Luftledningsarbeten
type: Concept
in scheme: JobTech Taxonomy - Färdighet
definition: Luftledningsarbeten
broader: zmYu aAM TuF
related: MW1P GNJ 4F9

Arkitekt-Bentley Architecture
type: Concept
in scheme: JobTech Taxonomy - Färdighet
definition: Arkitekt-Bentley Architecture
broader: mTLu uo2 gq2
related: thZP oR7 WrY
related: w6ud quG dgh
related: Pd51 xnr KCY
related: XeBP nMe pXx
related: ETAR ggZ Wuw
related: 41KB bfk 5jR
related: 4Jty HpK a3Q

Minnesotamodellen
type: Concept
in scheme: JobTech Taxonomy - Färdighet
definition: Minnesotamodellen
broader: zmYu aAM TuF
related: BWwk fYX S5B

Certifikat enl köldmedieförordningen Kategori V
type: Concept
in scheme: JobTech Taxonomy - Färdighet
definition: Certifikat enl köldmedieförordningen Kategori V
broader: s48H Sft DTn
related: Lzpv ofL 3H5
related: df9D e6y 61z
related: KttZ Skc bMR
related: 3UzE P8A 9sS

Tunnbindning
type: Concept
in scheme: JobTech Taxonomy - Färdighet
definition: Tunnbindning
broader: zmYu aAM TuF
related: 1Nwn GYH wkH

Besiktningar av linjenät
type: Concept
in scheme: JobTech Taxonomy - Färdighet
definition: Besiktningar av linjenät
broader: zmYu aAM TuF
related: MW1P GNJ 4F9
related: Cppd 9P7 HeR

Motiverande samtal (MI)
type: Concept
in scheme: JobTech Taxonomy - Färdighet
definition: Motiverande samtal (MI) är en evidensbaserad samtalsmetodik som syftar till att stärka en persons egen motivation och åtagande för förändring. Metoden bygger på ett empatiskt och lyhört förhållningssätt där samtalsledaren hjälper individen att utforska sina tankar, känslor och ambivalenser inför förändring utan att argumentera eller förespråka egen agenda. Fokus är på att framkalla så kallat "förändringsprat" genom öppna frågor, återkoppling och bekräftelse av individens styrkor och intentioner.
broader: zmYu aAM TuF
related: FpPP jqK xzT
related: BWwk fYX S5B
related: hgAg gLr YGg

Beläggningsarbete
type: Concept
in scheme: JobTech Taxonomy - Färdighet
definition: Beläggningsarbete
broader: zmYu aAM TuF
related: bZ4J riZ zK6

Postproduktion
type: Concept
in scheme: JobTech Taxonomy - Färdighet
definition: Postproduktion
broader: zmYu aAM TuF
related: rYSG 3WJ LmC

Landskapsarkitektexamen
type: Concept
in scheme: JobTech Taxonomy - Färdighet
definition: Landskapsarkitektexamen
broader: Yrkesbevis/examen
related: ETAR ggZ Wuw

Digital bildbearbetning
type: Concept
in scheme: JobTech Taxonomy - Färdighet
definition: Digital bildbearbetning avser processen att manipulera och förbättra digitala bilder genom olika tekniker och program. Kompetensen innefattar kunskap om bildredigeringsprogram, förståelse för färgkorrigering och komposition samt förmåga att skapa visuellt tilltalande resultat.
broader: zmYu aAM TuF
related: Vfum e6B 7Bw
related: XeJB bkn mRn
related: CkRH 4Qn iX3
related: 3J38 DNz YKK
related: 4Jty HpK a3Q
related: LeQV umf wUS

D-truckar
type: Concept
in scheme: JobTech Taxonomy - Färdighet
definition: D-truckar
broader: zmYu aAM TuF
related: WhBn FAp ZNW
related: kLyY rwr aJr
related: MrcX RDn N53

Industrisanering
type: Concept
in scheme: JobTech Taxonomy - Färdighet
definition: Industrisanering
broader: zmYu aAM TuF
related: idjo 2Wr a3E
related: yXbD NTH ijE

Mediastrategi
type: Concept
in scheme: JobTech Taxonomy - Färdighet
definition: Mediastrategi
broader: zmYu aAM TuF
related: Qo7p wjf gtv
related: vPP6 rsw dck
related: Pz9M srJ Lc9
related: WX67 Pfb WMN
related: k1Nx auG sNh
related: 4Jty HpK a3Q

Skadeutredningar
type: Concept
in scheme: JobTech Taxonomy - Färdighet
definition: Skadeutredningar
broader: zmYu aAM TuF
related: thZP oR7 WrY
related: w6ud quG dgh

Maskinskötsel, skinn- och läderindustri
type: Concept
in scheme: JobTech Taxonomy - Färdighet
definition: Maskinskötsel, skinn- och läderindustri avser hantering och drift av maskiner som används inom skinn- och läderbearbetning. Kompetensen omfattar arbetsuppgifter som att dela, färga och ytbehandla skinn samt övervaka maskiner för tillverkning av läderprodukter.
broader: zmYu aAM TuF
related: skLS kpa Ui1

Instrumentteknik
type: Concept
in scheme: JobTech Taxonomy - Färdighet
definition: Instrumentteknik avser kompetens inom områden som hantering, installation och underhåll av mät- och reglersystem samt processinstrument. Denna kompetens omfattar både praktiska och teoretiska kunskaper om teknik och utrustning som används för att säkerställa korrekt funktion och prestanda inom olika industriella sammanhang.
broader: zmYu aAM TuF
related: 4obu LL6 RqJ
related: e6nk AGp y28
related: UdrS qzV P7i
related: 1G6H AuG qyy
related: fWrt sLg koW
related: 4Jty HpK a3Q

Lavinteknikerutbildning
type: Concept
in scheme: JobTech Taxonomy - Färdighet
definition: Lavinteknikerutbildning
broader: Yrkesbevis/examen
related: A6X3 efC VNy
related: nuXg Wjc JPd
related: ayQ4 G3W A2w

Advanced SAR
type: Concept
in scheme: JobTech Taxonomy - Färdighet
definition: Advanced SAR
broader: s48H Sft DTn
related: kZwz D8K bKs

Modefotografering
type: Concept
in scheme: JobTech Taxonomy - Färdighet
definition: Modefotografering
broader: zmYu aAM TuF
related: 3J38 DNz YKK

Gesällbrev, hattmakare
type: Concept
in scheme: JobTech Taxonomy - Färdighet
definition: Gesällbrev, hattmakare är ett bevis på att en hantverkare har genomgått utbildning och avlagt de delprov som krävs inom det specifika hantverksyrket, och därigenom uppnått ett erkännande av färdigheter och kompetens inom yrket. Utfärdas av Sveriges hantverksråd i samråd med aktuell branschorganisation.
broader: Yrkesbevis/examen
related: mwVN oEH g9k

Stuksvetsning
type: Concept
in scheme: JobTech Taxonomy - Färdighet
definition: Metoden används vid sammansvetsning av tråd eller stång. Ändarna pressas mot varandra och då strömmen passerar gör övergångsmotståndet att temperaturen blir så hög att metallen övergår i ett plastiskt tillstånd och kan pressas samman. Källa: Svetskommissionen
broader: on11 B1f LEw
related: vaEp iBS c5h
related: wQ1E Bzk ZyA

Svarvning, konventionell maskin
type: Concept
in scheme: JobTech Taxonomy - Färdighet
definition: Svarvning, konventionell maskin avser en bearbetningsteknik där material av avsevärd storlek förvandlas till detaljer med hjälp av en svarv. Kompetensen omfattar kunskap om inställning, drift och övervakning av konventionella svarvar samt förståelse för skärverktygens egenskaper och materialens beteende under bearbetning.
broader: zmYu aAM TuF
related: VKKg e4t t46
related: vaEp iBS c5h
related: yPQ4 EaN Dtj
related: o31g CX1 qhQ
related: KttZ Skc bMR

Växter, inventering
type: Concept
in scheme: JobTech Taxonomy - Färdighet
definition: Växter, inventering
broader: zmYu aAM TuF
related: XBh3 Xrm C4R
related: XurM DVs ggn
related: yXbD NTH ijE
related: dsK3 hkt zGy
related: e9FK VKh ahW

Övergreppsproblematik, behandlingserfarenhet/Incest, behandlingserfarenhet
type: Concept
in scheme: JobTech Taxonomy - Färdighet
definition: Övergreppsproblematik, behandlingserfarenhet/Incest, behandlingserfarenhet
alternative label: Incest, behandlingserfarenhet
alternative label: Övergreppsproblematik, behandlingserfarenhet
broader: zmYu aAM TuF
related: UUQi UJ5 MSb
related: VYeq GDF a2g

Ortopedisk manuell terapi (OMT), specialistkompetens för fysioterapeuter
type: Concept
in scheme: JobTech Taxonomy - Färdighet
definition: Ortopedisk manuell terapi (OMT), specialistkompetens för fysioterapeuter
broader: Specialistinriktning inom fysioterapi
related: s7vU FhY L5Z

Barn- och ungdomskirurgi, specialistkompetens för läkare
type: Concept
in scheme: JobTech Taxonomy - Färdighet
definition: Barn- och ungdomskirurgi, specialistkompetens för läkare
broader: Specialistbevis för läkare
related: nu7c QuB KVQ

Sug- och spolbil, körvana
type: Concept
in scheme: JobTech Taxonomy - Färdighet
definition: Sug- och spolbil, körvana
broader: zmYu aAM TuF
related: 3MBw pDA P2F

Ljudteknik, livemusik
type: Concept
in scheme: JobTech Taxonomy - Färdighet
definition: Ljudteknik, livemusik
broader: zmYu aAM TuF
related: 4BsK q2C sCL
related: CkRH 4Qn iX3
related: 4Jty HpK a3Q

Slagverksinstrument, undervisning musikskola
type: Concept
in scheme: JobTech Taxonomy - Färdighet
definition: Slagverksinstrument, undervisning musikskola
broader: zmYu aAM TuF
related: mcRJ kq2 jFr

Spansk dans
type: Concept
in scheme: JobTech Taxonomy - Färdighet
definition: Spansk dans
broader: Dans
related: gmRr 7tt eHj

Hushållsmaskiner/Vitvaror
type: Concept
in scheme: JobTech Taxonomy - Färdighet
definition: Hushållsmaskiner/Vitvaror
alternative label: Hushållsmaskiner
alternative label: Vitvaror
broader: zmYu aAM TuF
related: oXSW fbY XrY
related: df9D e6y 61z
related: YKL2 FCB 1yr
related: 85cq 6uK 4cK

Fuktskador
type: Concept
in scheme: JobTech Taxonomy - Färdighet
definition: Kompetens inom fuktskador innebär att ha specialiserade kunskaper i att identifiera, mäta och hantera fukt- och vattenskador i byggnader.
broader: zmYu aAM TuF
related: wCx8 rY3 XUT

Kemi, undervisning gymnasienivå
type: Concept
in scheme: JobTech Taxonomy - Färdighet
definition: Kemi, undervisning gymnasienivå
broader: Inriktning på lärarkompetens
related: 4KhP FxL uZ5

Dumper, körvana
type: Concept
in scheme: JobTech Taxonomy - Färdighet
definition: Dumper, körvana
broader: zmYu aAM TuF
related: 3MBw pDA P2F

ADR, tank
type: Concept
in scheme: JobTech Taxonomy - Färdighet
definition: ADR, tank, avser specialutbildning som krävs för transport av tanktransport av farligt gods enligt internationella och nationella regler.
broader: s48H Sft DTn
related: SZ7Q 2zF nFy
related: yXbD NTH ijE
related: 3MBw pDA P2F
related: bwnk nv2 1cR

Brandfogning
type: Concept
in scheme: JobTech Taxonomy - Färdighet
definition: Brandfogning avser tekniken att skapa fogar som är beständiga mot brand och har relevans inom bygg- och anläggningsbranschen. Kompetensen innefattar kunskap om material och metoder som säkerställer att brandmotståndet uppfyller aktuella byggnormer och säkerhetsstandarder.
broader: zmYu aAM TuF
related: dKUb KBP mw3
related: AD3U cFH rbe

Wise Installation Express, programmeringsverktyg
type: Concept
in scheme: JobTech Taxonomy - Färdighet
definition: Wise Installation Express, programmeringsverktyg
alternative label: Wise Installation Express
broader: Programmerings- och systemutvecklingsverktyg
related: D9SL mtn vGM
related: DJh5 yyF hEM
related: 4Jty HpK a3Q
related: MYAz x9m 2LJ

Flygledarcertifikat
type: Concept
in scheme: JobTech Taxonomy - Färdighet
definition: För att arbeta som flygledare i Sverige krävs ett flygledarcertifikat (ATCO-licens) som utfärdas av Transportstyrelsen.
alternative label: FL-certifikat
broader: s48H Sft DTn
related: yct8 Pun DWd
related: 4Jty HpK a3Q

Pediatrik, specialistkompetens för fysioterapeuter
type: Concept
in scheme: JobTech Taxonomy - Färdighet
definition: Pediatrik, specialistkompetens för fysioterapeuter
broader: Specialistinriktning inom fysioterapi
related: s7vU FhY L5Z

Områdesansvar, tullfrågor
type: Concept
in scheme: JobTech Taxonomy - Färdighet
definition: Områdesansvar, tullfrågor
broader: zmYu aAM TuF
related: sWzF 6pd Y6L

Flygteknikutbildning
type: Concept
in scheme: JobTech Taxonomy - Färdighet
definition: Flygteknikutbildning är en gymnasial yrkesutbildning mot flygteknik och underhåll.
broader: Yrkesutbildning
related: nuXg Wjc JPd
related: iGTu bYL 2T7

Samordning av flyktingmottagning
type: Concept
in scheme: JobTech Taxonomy - Färdighet
definition: Samordning av flyktingmottagning
broader: zmYu aAM TuF
related: pok1 ipJ yzD

Datorstyrda borranläggningar
type: Concept
in scheme: JobTech Taxonomy - Färdighet
definition: Datorstyrda borranläggningar
broader: zmYu aAM TuF
related: 7zKm 4NW eey
related: 4Jty HpK a3Q

Arbetsmarknadstolkning
type: Concept
in scheme: JobTech Taxonomy - Färdighet
definition: Arbetsmarknadstolkning
broader: zmYu aAM TuF
related: PQDm Z63 zst

Utbildningstjänster, produktkunskap
type: Concept
in scheme: JobTech Taxonomy - Färdighet
definition: Utbildningstjänster, produktkunskap
broader: zmYu aAM TuF
related: oXSW fbY XrY

Avtalsrätt
type: Concept
in scheme: JobTech Taxonomy - Färdighet
definition: Avtalsrätt
broader: zmYu aAM TuF
related: q8wL kdi WaW
related: mp2Y vyC RFV
related: br6a VVS V3y
related: bjqk F3A 5Hk
related: zKvJ GnC Szx
related: 6aak 8eh iwT
related: DZVN v5g Fco
related: JfYV ZGg 6rm

Färgbalans
type: Concept
in scheme: JobTech Taxonomy - Färdighet
definition: Färgbalans
broader: zmYu aAM TuF
related: Vfum e6B 7Bw
related: 4BsK q2C sCL
related: CkRH 4Qn iX3
related: 3J38 DNz YKK
related: 4Jty HpK a3Q

Mekanikkonstruktion
type: Concept
in scheme: JobTech Taxonomy - Färdighet
definition: Mekanikkonstruktion
broader: zmYu aAM TuF
related: K8yg U4C gkY
related: PRQn 9yw NJA

Punktskrift
type: Concept
in scheme: JobTech Taxonomy - Färdighet
definition: Punktskrift
broader: zmYu aAM TuF
related: eQ4M CNm ozj

Luftvärdighetsbestämmelser
type: Concept
in scheme: JobTech Taxonomy - Färdighet
definition: Luftvärdighetsbestämmelser avser kunskap om nationella och internationella bestämmelser som rör de skick luftfartyg behöver för att få flyga. Källa: Transportstyrelsen
broader: zmYu aAM TuF
related: nuXg Wjc JPd
related: iGTu bYL 2T7
related: eRkT cTv H9v

Nötstyckning
type: Concept
in scheme: JobTech Taxonomy - Färdighet
definition: Nötstyckning avser processen för att stycka och bearbeta nöt- och nötkreaturens kött i olika delar för vidare försäljning eller användning. Kompetensen omfattar förstahandskunskaper om anatomiska delar, styckningstekniker och säkerhet vid hantering av rått kött.
broader: zmYu aAM TuF
related: QqHf XKZ eyy

Spårutbildning för SJ
type: Concept
in scheme: JobTech Taxonomy - Färdighet
definition: Spårutbildning för SJ
broader: Yrkesbevis/examen
related: iqZh 3yX i8n

Tillverkning av plastgjutformar
type: Concept
in scheme: JobTech Taxonomy - Färdighet
definition: Tillverkning av plastgjutformar
broader: zmYu aAM TuF
related: yPQ4 EaN Dtj

Elgitarr, undervisning musikskola
type: Concept
in scheme: JobTech Taxonomy - Färdighet
definition: Elgitarr, undervisning musikskola
broader: zmYu aAM TuF
related: mcRJ kq2 jFr

Fjärrstyrd lastning
type: Concept
in scheme: JobTech Taxonomy - Färdighet
definition: Fjärrstyrd lastning
broader: zmYu aAM TuF
related: sX9n CWa KVC
related: f71c gjL RDq

Danssport, instruktör/Danssport, tränare
type: Concept
in scheme: JobTech Taxonomy - Färdighet
definition: Danssport, instruktör/Danssport, tränare
alternative label: Danssport, instruktör
alternative label: Danssport, tränare
broader: Idrott/aktivitet
related: EA6o N1N QtT

Schlager
type: Concept
in scheme: JobTech Taxonomy - Färdighet
definition: Schlager
broader: p1WM wCw LTd
related: AWJF wqZ va9

Kompetensbevis, ställningsbyggnad över 9 meter
type: Concept
in scheme: JobTech Taxonomy - Färdighet
definition: Kompetensbevis, ställningsbyggnad över 9 meter
broader: s48H Sft DTn
related: bZ4J riZ zK6
related: Y4j1 P17 wVA
related: AD3U cFH rbe

Byggnadsvård, antikvarie
type: Concept
in scheme: JobTech Taxonomy - Färdighet
definition: Byggnadsvård, antikvarie
broader: zmYu aAM TuF
related: wVfo Njx 1rB
related: Qbvf 6nd Esn

Smyckessmide
type: Concept
in scheme: JobTech Taxonomy - Färdighet
definition: Smyckessmide avser processen för att forma och tillverka smycken av olika material, inklusive ädelmetaller och ädelstenar. Kompetensen omfattar tekniker för tillverkning, gravyr, samt infattning och montering av stenar och pärlor.
broader: zmYu aAM TuF
related: nwSm phw sPo

Sjukdomar hos mindre sällskapsdjur, specialistkompetens för veterinärer
type: Concept
in scheme: JobTech Taxonomy - Färdighet
definition: En fördjupad specialistkompetens för veterinär inom sjukdomar hos mindre sällskapsdjur.
broader: vSJu K1R wk3
related: WL4E r4b ek4

Total Productive Maintenance/TPM
type: Concept
in scheme: JobTech Taxonomy - Färdighet
definition: Total Productive Maintenance/TPM
alternative label: TPM
alternative label: Total Productive Maintenance
broader: Kvalitetsverktyg
related: Qo7p wjf gtv
related: vPP6 rsw dck
related: dMVD VYy kgg

Acryl, specialisering tandteknik
type: Concept
in scheme: JobTech Taxonomy - Färdighet
definition: Acryl, specialisering tandteknik
broader: zmYu aAM TuF
related: 39yB xPQ ozd

Kassaredovisning
type: Concept
in scheme: JobTech Taxonomy - Färdighet
definition: Kassaredovisning avser hantering och registrering av kontanta transaktioner inom en organisation. Kompetensen inkluderar bland annat kontroll och sammanställning av kassaflöden samt bokföring av in- och utbetalningar.
broader: zmYu aAM TuF
related: eQ4M CNm ozj
related: XFXX Jq9 Y2a
related: Fp7x Yqt bx9
related: JAFv ZaP tDG
related: UjoW meY Zwt
related: ij8k EwC zyB
related: 957L kZK rHZ

Skänkskötsel
type: Concept
in scheme: JobTech Taxonomy - Färdighet
definition: Skänkskötsel
broader: zmYu aAM TuF
related: E87t egE pjA
related: UcNa inr snV

IBM WebSphere, applikationsplattform
type: Concept
in scheme: JobTech Taxonomy - Färdighet
definition: IBM WebSphere, applikationsplattform
alternative label: IBM WebSphere
broader: Applikationsplattformar
related: BAeH eg8 T2d
related: cBBa ngH fCx
related: D9SL mtn vGM
related: DJh5 yyF hEM
related: UxT1 tPF Kbg
related: 4Jty HpK a3Q
related: UXKZ 3zZ ipB
related: MYAz x9m 2LJ

Egenkontroll, erfarenhet
type: Concept
in scheme: JobTech Taxonomy - Färdighet
definition: Egenkontroll, erfarenhet, avser den färdighet och kunskap som krävs för att självständigt övervaka och utvärdera egna arbetsprocesser eller produkter i syfte att säkerställa efterlevnad av krav och standarder. Denna kompetens omfattar både praktisk erfarenhet av att genomföra kontroller och teoretisk förståelse för gällande föreskrifter och rutiner.
broader: Yrkesövergripande kompetenser
related: BStc SJh DKG

Måleri
type: Concept
in scheme: JobTech Taxonomy - Färdighet
definition: Måleri
broader: zmYu aAM TuF
related: 34Tn BQQ tfo

Datafolieskärning
type: Concept
in scheme: JobTech Taxonomy - Färdighet
definition: Datafolieskärning
broader: zmYu aAM TuF
related: aKdV u7V R5j

MySQL, databashanterare
type: Concept
in scheme: JobTech Taxonomy - Färdighet
definition: MySQL, databashanterare
alternative label: MySQL
broader: Databaser
related: BAeH eg8 T2d
related: cBBa ngH fCx
related: Fv7d YhP YmS
related: D9SL mtn vGM
related: DJh5 yyF hEM
related: 4Jty HpK a3Q
related: MYAz x9m 2LJ

Bostadsförmedling
type: Concept
in scheme: JobTech Taxonomy - Färdighet
definition: Bostadsförmedling
broader: zmYu aAM TuF
related: eQ4M CNm ozj

Skatter och avgifter
type: Concept
in scheme: JobTech Taxonomy - Färdighet
definition: Skatter och avgifter
broader: zmYu aAM TuF
related: Y6yY SuR hVh
related: Uw4n UB2 RCW
related: q81z 3oD 1qu
related: mZsb A1K Gec
related: cRmd 536 pT1
related: FfMN Bw1 qYR
related: 9Mn4 PNA 7Yz

E-handel, undervisning/Elektronisk handel, undervisning
type: Concept
in scheme: JobTech Taxonomy - Färdighet
definition: E-handel, undervisning/Elektronisk handel, undervisning
alternative label: E-handel, undervisning
alternative label: Elektronisk handel, undervisning
broader: Dataundervisning
related: 1CX5 mZw Vcq
related: 4Jty HpK a3Q

Relationsrådgivning
type: Concept
in scheme: JobTech Taxonomy - Färdighet
definition: Relationsrådgivning
broader: zmYu aAM TuF
related: dJXy Rpq a2u

Examenshandläggning
type: Concept
in scheme: JobTech Taxonomy - Färdighet
definition: Examenshandläggning innebär att ta emot och registrera examensansökningar, kontrollera att alla kurskrav är uppfyllda enligt examensordningen, och bedöma innehållet i ansökan. Arbetsuppgifterna inkluderar kommunikation med studenter vid behov av kompletteringar, samordning med institutioner vid tillgodoräknanden samt utfärdande av examensbevis. Handläggningen sker i system som Ladok
broader: zmYu aAM TuF
related: oEmP NC1 sXE

Flygplansavisning
type: Concept
in scheme: JobTech Taxonomy - Färdighet
definition: Flygplansavisning avser hanteringen av flygplan på flygplatser, vilket innefattar lastning och lossning av bagage samt förberedelse av flygplan inför avgång och ankomst. Kompetensen omfattar även säkerhetskontroller.
broader: zmYu aAM TuF
related: 3ZtN hhA SM7
related: bwnk nv2 1cR

Glasering
type: Concept
in scheme: JobTech Taxonomy - Färdighet
definition: Glasering
broader: zmYu aAM TuF
related: aKdV u7V R5j

Redigering, rörlig bild
type: Concept
in scheme: JobTech Taxonomy - Färdighet
definition: Redigering, rörlig bild
broader: zmYu aAM TuF
related: 3J38 DNz YKK
related: 4Jty HpK a3Q

Certifikat, elektriker - elteknik
type: Concept
in scheme: JobTech Taxonomy - Färdighet
definition: Certifikat, elektriker - elteknik (även kallat ECY-certifikat), är bevis på godkänd teoretisk och praktisk utbildning till elektriker, erkänd av installationsbranschen. Certifikat erhålls efter fullgjord lärlingstid av ECY
alternative label: ECY-certifikat
broader: s48H Sft DTn
related: yyF7 jsW EeP

Speciallärarexamen inriktning språk-, skriv- och läsutveckling
type: Concept
in scheme: JobTech Taxonomy - Färdighet
definition: Speciallärarexamen inriktning språk-, skriv- och läsutveckling är en examen på högskolenivå kopplad till utbildning för speciallärare med inriktning språk-, skriv- och läsutveckling.
broader: Yrkesbevis/examen
related: 3FP7 4Eg x8P

Behörighetsbevis enligt FSD 5117, behörighetsklass G
type: Concept
in scheme: JobTech Taxonomy - Färdighet
definition: Behörighetsbevis enligt FSD 5117, behörighetsklass G
broader: s48H Sft DTn
related: SgAJ DW2 FN5
related: Kxm9 N3V shF
related: shkw ojo UL2

Cateringverksamhet
type: Concept
in scheme: JobTech Taxonomy - Färdighet
definition: Cateringverksamhet avser tillhandahållande av mat och dryck till olika evenemang och tillställningar utanför traditionella restauranger. Kompetensen omfattar planering, förberedelse, leverans och servering av maträtter, samt hantering av matsals- och kökspersonal.
broader: zmYu aAM TuF
related: BStc SJh DKG
related: UjoW meY Zwt
related: tPox ie4 X9X
related: XGyi i4B ME7

Specialistsjuksköterskeexamen
type: Concept
in scheme: JobTech Taxonomy - Färdighet
definition: Specialistsjuksköterskeexamen är en specialistutbildning på universitet/högskola med inriktning till specialistsjuksköterska.
broader: Yrkesbevis/examen
related: NFUg y9y 1TY
related: bEDv SL7 VrL
related: 6eAB cbY i9T
related: PHJN fva yxs
related: 7XXd 4St nit
related: nrVt xUL KdQ
related: cuaN Rj5 YCc
related: dyWo sDb MLQ
related: Bywn Doc 3VF
related: 6Fu3 qQA 9DK
related: 6zAR EHM Kwj
related: Z8ci bBE tmx
related: oj4c P4b cja

Arkivkunskap
type: Concept
in scheme: JobTech Taxonomy - Färdighet
definition: Arkivkunskap
broader: zmYu aAM TuF
related: 2kLc pto DpV
related: eQ4M CNm ozj
related: TQkt eeK eNp
related: zKvJ GnC Szx
related: 4Jty HpK a3Q

Gesällbrev, broderi/konstbroderi
type: Concept
in scheme: JobTech Taxonomy - Färdighet
definition: Gesällbrev, broderi/konstbroderi
alternative label: Gesällbrev, broderi
alternative label: Gesällbrev, konstbroderi
broader: Yrkesbevis/examen
related: UZBj yDX Ctp
related: aKdV u7V R5j

Ljud- och ljussättning
type: Concept
in scheme: JobTech Taxonomy - Färdighet
definition: Ljud- och ljussättning avser kompetens att skapa och hantera ljud- och ljusmiljöer för olika evenemang och produktioner. Detta innefattar kunskap om teknisk utrustning samt förmåga att anpassa ljud och ljus för att stödja konstnärliga visioner och förbättra upplevelsen för publiken.
broader: zmYu aAM TuF
related: SgNH hag n9D
related: 4BsK q2C sCL
related: bwnk nv2 1cR
related: 4Jty HpK a3Q

Ragtime
type: Concept
in scheme: JobTech Taxonomy - Färdighet
definition: Ragtime
broader: p1WM wCw LTd
related: AWJF wqZ va9

Idrifttagning, el
type: Concept
in scheme: JobTech Taxonomy - Färdighet
definition: Idrifttagning, el avser processen att sätta elektriska anläggningar i drift efter installation. Denna kompetens omfattar tester, justeringar och driftsättning av elektriska system för att säkerställa korrekt funktion och efterlevnad av säkerhetsstandarder.
broader: zmYu aAM TuF
related: nDaB vdy eAy
related: a75S eLg JWH

Mattläggning
type: Concept
in scheme: JobTech Taxonomy - Färdighet
definition: Mattläggning
broader: zmYu aAM TuF
related: V79C DD2 3Gj

Sandning, körvana/Plogning, körvana
type: Concept
in scheme: JobTech Taxonomy - Färdighet
definition: Sandning, körvana/Plogning, körvana
alternative label: Plogning, körvana
alternative label: Sandning, körvana
broader: zmYu aAM TuF
related: 3MBw pDA P2F

Teaterlektioner
type: Concept
in scheme: JobTech Taxonomy - Färdighet
definition: Teaterlektioner
broader: zmYu aAM TuF
related: mcRJ kq2 jFr

Psykisk funktionsnedsättning, arbetsrehabilitering
type: Concept
in scheme: JobTech Taxonomy - Färdighet
definition: Psykisk funktionsnedsättning, arbetsrehabilitering
broader: zmYu aAM TuF
related: fsnw ZCu v2U
related: pok1 ipJ yzD

Bamboo, byggverktyg
type: Concept
in scheme: JobTech Taxonomy - Färdighet
definition: Bamboo, byggverktyg
alternative label: Bamboo
broader: Programmerings- och systemutvecklingsverktyg
related: D9SL mtn vGM
related: UxT1 tPF Kbg
related: 4Jty HpK a3Q

Koreografi, jazzdans
type: Concept
in scheme: JobTech Taxonomy - Färdighet
definition: Koreografi, jazzdans
broader: zmYu aAM TuF
related: gmRr 7tt eHj

Trafiksäkerhetsregler
type: Concept
in scheme: JobTech Taxonomy - Färdighet
definition: Trafiksäkerhetsregler avser de föreskrifter och riktlinjer som gäller för säker trafik och förvaltning av transportmedel på vägarna. Kompetensen omfattar kunskap om lagar, förordningar och praktiska åtgärder som syftar till att förebygga olyckor och säkerställa tryggheten för både förare och övriga trafikanter.
broader: zmYu aAM TuF
related: ffz2 2n3 R7g
related: FiDm 2S8 gx7
related: nuXg Wjc JPd
related: 3MBw pDA P2F
related: P7Ay ooF pri
related: UGgc Vm9 Bog
related: 957L kZK rHZ

Komposition, sakral musik
type: Concept
in scheme: JobTech Taxonomy - Färdighet
definition: Komposition, sakral musik
broader: zmYu aAM TuF
related: AWJF wqZ va9
related: 4Jty HpK a3Q

Konstnärlig gestaltning i offentlig miljö
type: Concept
in scheme: JobTech Taxonomy - Färdighet
definition: Konstnärlig gestaltning i offentlig miljö
broader: zmYu aAM TuF
related: 34Tn BQQ tfo
related: CSUf ZVM a7Z
related: Qbvf 6nd Esn

Däcksbyggnad
type: Concept
in scheme: JobTech Taxonomy - Färdighet
definition: Däcksbyggnad
broader: zmYu aAM TuF
related: ENV6 BNa brP

Mellanstadielärarexamen
type: Concept
in scheme: JobTech Taxonomy - Färdighet
definition: Mellanstadielärarexamen
broader: Yrkesbevis/examen
related: oQUQ D11 HPx

Fordon, specialisering för officer
type: Concept
in scheme: JobTech Taxonomy - Färdighet
definition: Fordon, specialisering för officer
broader: zmYu aAM TuF
related: dhgR 9jk 95r
related: KiVA anS RJh

Skogsekonomisk rådgivning
type: Concept
in scheme: JobTech Taxonomy - Färdighet
definition: Skogsekonomisk rådgivning är kompetensen att ge skogsägare vägledning i ekonomiska aspekter av skogsbruket, som betalningsplaner, skatteplanering, investeringsanalyser och optimering av skogens lönsamhet. Det fokuserar på att strukturera ekonomiska mål, minimera risker och maximera avkastning genom analyser av virkesmarknad, avverkningstiming och fastighetsvärden. Rådgivningen kombinerar skogsekonomi med praktiska råd kring förvaltning, ofta erbjuden av skogsbolag eller konsulter för att stödja långsiktig ekonomisk hållbarhet.
broader: zmYu aAM TuF
related: yXbD NTH ijE
related: U8HK Jdi GuC
related: 3LdB WEJ 8Ms

Renrumsarbete
type: Concept
in scheme: JobTech Taxonomy - Färdighet
definition: Renrumsarbete avser arbete som utförs i en kontrollerad och störningsfri miljö för att upprätthålla högsta möjliga renhet och kvalitet på produkter eller processer. Kompetensen omfattar förståelse för och tillämpning av riktlinjer och procedurer för att hantera material, verktyg och utrustning i renrumsmiljöer.
broader: zmYu aAM TuF
related: rxmK wwM 1NA
related: e6nk AGp y28
related: QEBd qHu vGr

Mästarbrev, skorstensfejare
type: Concept
in scheme: JobTech Taxonomy - Färdighet
definition: Mästarbrev, skorstensfejare
broader: Yrkesbevis/examen
related: SUfj 4D9 FNx

Järnvägsteknik
type: Concept
in scheme: JobTech Taxonomy - Färdighet
definition: Järnvägsteknik
broader: zmYu aAM TuF
related: thZP oR7 WrY
related: w6ud quG dgh
related: K8yg U4C gkY
related: nuXg Wjc JPd
related: XeBP nMe pXx
related: PRQn 9yw NJA
related: 4Jty HpK a3Q

Scanner, installation och underhåll
type: Concept
in scheme: JobTech Taxonomy - Färdighet
definition: Scanner, installation och underhåll
broader: Hårdvara
related: fWrt sLg koW
related: 4Jty HpK a3Q
related: 13md uyV BNG

LAR/MSA
type: Concept
in scheme: JobTech Taxonomy - Färdighet
definition: LAR/MSA
alternative label: LAR
alternative label: MSA
broader: zmYu aAM TuF
related: ETAR ggZ Wuw

Hårdvarukonstruktion
type: Concept
in scheme: JobTech Taxonomy - Färdighet
definition: Hårdvarukonstruktion
broader: zmYu aAM TuF
related: nDaB vdy eAy
related: SPYW 7Z1 ShT
related: 4Jty HpK a3Q

Konstruera biomasseanläggning
type: Concept
in scheme: JobTech Taxonomy - Färdighet
definition: Konstruera biomasseanläggning
broader: zmYu aAM TuF
related: yXbD NTH ijE
related: PRQn 9yw NJA

Japanskt kök
type: Concept
in scheme: JobTech Taxonomy - Färdighet
definition: Japanskt kök
broader: zmYu aAM TuF
related: BStc SJh DKG

Allergianpassad miljö, dagbarnvårdare
type: Concept
in scheme: JobTech Taxonomy - Färdighet
definition: Allergianpassad miljö, dagbarnvårdare
broader: zmYu aAM TuF
related: Hi9c iTe gHH

Träarbete, husbyggnad
type: Concept
in scheme: JobTech Taxonomy - Färdighet
definition: Träarbete, husbyggnad avser arbete där trä används som huvudmaterial för att bygga och konstruera olika typer av byggnader och strukturkomponenter. Detta innefattar allt från uppförande av träkonstruktioner till monteringsarbete och fabrikation av delar som används i hus och anläggningar.
broader: zmYu aAM TuF
related: bZ4J riZ zK6
related: 9mJN VwW Xjg

Statistansvar
type: Concept
in scheme: JobTech Taxonomy - Färdighet
definition: Statistansvar
broader: zmYu aAM TuF
related: PH2M uV4 r72

Numerisk modellering
type: Concept
in scheme: JobTech Taxonomy - Färdighet
definition: Numerisk modellering
broader: zmYu aAM TuF
related: V7Yz 4WV g4z

Röjsågskörkort Nivå RA
type: Concept
in scheme: JobTech Taxonomy - Färdighet
definition: Röjsågskörkort Nivå RA Källa; skogsstyrelsen.se
broader: Yrkesbevis/examen
related: XBh3 Xrm C4R
related: qouP wtb 93q
related: 2xQ4 4kh kTZ

Gymnasielärarexamen
type: Concept
in scheme: JobTech Taxonomy - Färdighet
definition: Gymnasielärarexamen
broader: Yrkesbevis/examen
related: 2x2V UeL 6ke
related: 4KhP FxL uZ5

Webbdesign-Adobe Dreamweaver
type: Concept
in scheme: JobTech Taxonomy - Färdighet
definition: Webbdesign-Adobe Dreamweaver
broader: Programvara för digitalt skapande
related: 8Bmh vtM zts
related: Q5DF juj 8do
related: SgNH hag n9D
related: k1Nx auG sNh
related: 4Jty HpK a3Q
related: Mbt6 3ko DiD

Digital videokamerateknik
type: Concept
in scheme: JobTech Taxonomy - Färdighet
definition: Digital videokamerateknik
broader: zmYu aAM TuF
related: 4BsK q2C sCL
related: CkRH 4Qn iX3
related: 3J38 DNz YKK
related: 4Jty HpK a3Q

Examen i skydd mot olyckor
type: Concept
in scheme: JobTech Taxonomy - Färdighet
definition: Examen i skydd mot olyckor är en examen på eftergymnasial nivå kopplad till utbildning med inriktning mot arbete inom räddningstjänsten.
broader: Yrkesbevis/examen
related: ug5y o6z U3L

Konsthistoria, cirkelledning
type: Concept
in scheme: JobTech Taxonomy - Färdighet
definition: Konsthistoria, cirkelledning
broader: zmYu aAM TuF
related: 1CX5 mZw Vcq

Reportagefotografering
type: Concept
in scheme: JobTech Taxonomy - Färdighet
definition: Reportagefotografering
broader: zmYu aAM TuF
related: 3J38 DNz YKK

Farkostteknik
type: Concept
in scheme: JobTech Taxonomy - Färdighet
definition: Farkostteknik
broader: zmYu aAM TuF
related: K8yg U4C gkY
related: PRQn 9yw NJA

Franska, undervisning
type: Concept
in scheme: JobTech Taxonomy - Färdighet
definition: Franska, undervisning
broader: Inriktning på lärarkompetens
related: 4KhP FxL uZ5

Flight Planning
type: Concept
in scheme: JobTech Taxonomy - Färdighet
definition: Flight Planning innebär att planera och optimera flygningar utifrån luftvägar, väder, flygplansprestanda och regelverk. Kompetensen omfattar bland annat flow management, där flygtrafikens flöde anpassas till kapacitet och tillgängliga resurser, samt flight monitoring, som innebär övervakning av flygningar i realtid för att identifiera avvikelser och föreslå åtgärder. Flight Planning innefattar även operativt stöd till piloter genom tillhandahållande av färdplaner, väderinformation och ruttförslag, samt stöd till operativ ledning genom rapportering och beslutsunderlag vid störningar eller förändrade förutsättningar.
broader: zmYu aAM TuF
related: 957L kZK rHZ

Dokumentation inom hälso- och sjukvård
type: Concept
in scheme: JobTech Taxonomy - Färdighet
definition: Dokumentation inom hälso- och sjukvård avser systematiskt insamlande och förande av information om patienter, vårdåtgärder och behandlingsresultat.
broader: zmYu aAM TuF
related: HPxT fQJ zwT
related: NFUg y9y 1TY
related: nu7c QuB KVQ
related: bEDv SL7 VrL
related: 6eAB cbY i9T
related: ek9W qqp XpF
related: 5dxv nVQ N8o
related: SgNH hag n9D
related: PHJN fva yxs
related: seu9 VoQ VNo
related: jY19 knH MJp
related: nrVt xUL KdQ
related: LP4Z ABV gRm
related: 1tGC fXC mxX
related: cuaN Rj5 YCc
related: 4F9o Jzv Pwz
related: dyWo sDb MLQ
related: 4Jty HpK a3Q
related: gXqW s5Q ZjN
related: 6zAR EHM Kwj
related: Z8ci bBE tmx

Bakgavellyft
type: Concept
in scheme: JobTech Taxonomy - Färdighet
definition: Bakgavellyft avser en mekanisk anordning som används för att lyfta och sänka last på en lastbil eller annan typ av transportfordon. Denna kompetens innefattar kunskap om säker hantering och drift av bakgavellyften för att underlätta lastning och lossning av gods.
broader: zmYu aAM TuF
related: ffz2 2n3 R7g
related: FiDm 2S8 gx7
related: 3MBw pDA P2F
related: P7Ay ooF pri

Smärtbehandling
type: Concept
in scheme: JobTech Taxonomy - Färdighet
definition: Smärtbehandling
broader: zmYu aAM TuF
related: PHJN fva yxs
related: dyWo sDb MLQ
related: Z8ci bBE tmx

Praktisk filosofi
type: Concept
in scheme: JobTech Taxonomy - Färdighet
definition: Praktisk filosofi
broader: zmYu aAM TuF
related: sXgV QFg vpb

Osteopati
type: Concept
in scheme: JobTech Taxonomy - Färdighet
definition: Osteopati
broader: zmYu aAM TuF
related: aWki 4uA adn

Godkänd badvakt, SLS
type: Concept
in scheme: JobTech Taxonomy - Färdighet
definition: Godkänd badvakt, SLS
broader: Yrkesbevis/examen
related: ayQ4 G3W A2w

Svenska, undervisning grundskolenivå
type: Concept
in scheme: JobTech Taxonomy - Färdighet
definition: Svenska, undervisning grundskolenivå
broader: Inriktning på lärarkompetens
related: oQUQ D11 HPx

Ekologi
type: Concept
in scheme: JobTech Taxonomy - Färdighet
definition: Ekologi
broader: zmYu aAM TuF
related: XurM DVs ggn
related: rE1E m3d cx1
related: yXbD NTH ijE
related: e9FK VKh ahW

Pendeltåg, förarutbildning/Motorvagn, förarutbildning
type: Concept
in scheme: JobTech Taxonomy - Färdighet
definition: Pendeltåg, förarutbildning/Motorvagn, förarutbildning
alternative label: Motorvagn, förarutbildning
alternative label: Pendeltåg, förarutbildning
broader: Yrkesbevis/examen
related: UGgc Vm9 Bog

Sociologi
type: Concept
in scheme: JobTech Taxonomy - Färdighet
definition: Sociologi
broader: zmYu aAM TuF
related: sXgV QFg vpb

LINQ, frågespråk
type: Concept
in scheme: JobTech Taxonomy - Färdighet
definition: LINQ, frågespråk
broader: Datorspråk
related: D9SL mtn vGM
related: DJh5 yyF hEM
related: UxT1 tPF Kbg
related: 4Jty HpK a3Q
related: UXKZ 3zZ ipB

Brandsanering
type: Concept
in scheme: JobTech Taxonomy - Färdighet
definition: Brandsanering avser processen för att rengöra och återställa platser och lokaler efter brandincidenter. Denna kompetens innefattar åtgärder för att avlägsna brandrelaterade skador och säkerställa att miljön återställs till en säker och användbar status.
broader: zmYu aAM TuF
related: idjo 2Wr a3E
related: yXbD NTH ijE

Utbildningsbevis, industrirörmontör
type: Concept
in scheme: JobTech Taxonomy - Färdighet
definition: Utbildningsbevis, industrirörmontör
broader: Yrkesbevis/examen
related: fLKb bJ3 69p

Kockmatros, erfarenhet
type: Concept
in scheme: JobTech Taxonomy - Färdighet
definition: Kockmatros, erfarenhet
broader: Övriga specialiteter, sjöfart
related: CbQK 7th Tyf

Brandskyddsföreningens utbildning till Brandskyddskoordinator
type: Concept
in scheme: JobTech Taxonomy - Färdighet
definition: Utbildningen ges av Brandskyddsföreningen och ger grundläggande brandskyddskunskaper som krävs för att kunna organisera, planera och följa upp brandskyddsarbetet i en organisation.
broader: s48H Sft DTn
related: wCx8 rY3 XUT
related: nuXg Wjc JPd

Research
type: Concept
in scheme: JobTech Taxonomy - Färdighet
definition: Research
broader: zmYu aAM TuF
related: wVfo Njx 1rB
related: SgNH hag n9D
related: zfve s6G tpc
related: k1Nx auG sNh
related: 4Jty HpK a3Q

Fordonskunskap
type: Concept
in scheme: JobTech Taxonomy - Färdighet
definition: Fordonskunskap
broader: zmYu aAM TuF
related: Lzpv ofL 3H5

Glasetsning
type: Concept
in scheme: JobTech Taxonomy - Färdighet
definition: Glasetsning
broader: zmYu aAM TuF
related: aKdV u7V R5j

Miljöekonomi
type: Concept
in scheme: JobTech Taxonomy - Färdighet
definition: Miljöekonomi
broader: zmYu aAM TuF
related: XurM DVs ggn
related: rE1E m3d cx1
related: 9QMD sZ3 ZjX
related: 3LdB WEJ 8Ms
related: WZCM nfS eAk

Certifierad Heatsettryckare
type: Concept
in scheme: JobTech Taxonomy - Färdighet
definition: Certifierad Heatsettryckare
broader: s48H Sft DTn
related: XeJB bkn mRn

Borstbinderi
type: Concept
in scheme: JobTech Taxonomy - Färdighet
definition: Borstbinderi
broader: zmYu aAM TuF
related: aKdV u7V R5j

Uppsökande försäljning
type: Concept
in scheme: JobTech Taxonomy - Färdighet
definition: Uppsökande försäljning avser aktiviteter som utförs av en säljare för att aktivt söka upp potentiella kunder och erbjuda produkter eller tjänster. Denna kompetens omfattar kommunikation och relationsbyggande med målet att identifiera och tillgodose kunders behov, ofta genom direkt kontakt och presentation av erbjudanden.
broader: zmYu aAM TuF
related: oXSW fbY XrY
related: dUuh wwa FGj

Förordningar om medicintekniska produkter
type: Concept
in scheme: JobTech Taxonomy - Färdighet
definition: Förordningar om medicintekniska produkter
broader: zmYu aAM TuF
related: SgNH hag n9D

Kriminalvård
type: Concept
in scheme: JobTech Taxonomy - Färdighet
definition: Kriminalvård avser systematiska åtgärder och processer för att hantera och rehabilitera individer som dömts för brott. Detta innefattar övervakning och stöd för att underlätta återanpassning till samhället samt skydd av allmänheten genom att arbeta med beteendeförändring och social inkludering.
broader: zmYu aAM TuF
related: BWwk fYX S5B
related: bEDv SL7 VrL
related: hgAg gLr YGg
related: n6iX f2z XfE

Kassodling
type: Concept
in scheme: JobTech Taxonomy - Färdighet
definition: Kassodling
broader: zmYu aAM TuF
related: c8r8 e4L gwj

Vårdcentral
type: Concept
in scheme: JobTech Taxonomy - Färdighet
definition: Vårdcentral avser en vårdinrättning som erbjuder öppen hälso- och sjukvård till patienter inom ett visst geografiskt område. Denna kompetens omfattar verksamheter som distriktssköterskor och grundutbildade sjuksköterskor som bedömer och behandlar patienters hälsotillstånd och behov av vård.
broader: zmYu aAM TuF
related: Z8ci bBE tmx
related: oj4c P4b cja

Renoveringsarbeten, skrädderi
type: Concept
in scheme: JobTech Taxonomy - Färdighet
definition: Renoveringsarbeten, skrädderi
broader: zmYu aAM TuF
related: mwVN oEH g9k

ATI Vision, analysverktyg
type: Concept
in scheme: JobTech Taxonomy - Färdighet
definition: ATI Vision, analysverktyg
alternative label: ATI Vision
broader: zmYu aAM TuF
related: K8yg U4C gkY
related: nDaB vdy eAy
related: SPYW 7Z1 ShT
related: PRQn 9yw NJA
related: 4Jty HpK a3Q

MB-600: Microsoft Dynamics 365 Power Platform Solution Architect
type: Concept
in scheme: JobTech Taxonomy - Färdighet
definition: MB-600: Microsoft Dynamics 365 + Power Platform Solution Architect
broader: s48H Sft DTn
related: cBBa ngH fCx
related: DJh5 yyF hEM
related: 4Jty HpK a3Q
related: UXKZ 3zZ ipB
related: MYAz x9m 2LJ

Vakuumsanering
type: Concept
in scheme: JobTech Taxonomy - Färdighet
definition: Vakuumsanering
broader: zmYu aAM TuF
related: idjo 2Wr a3E
related: yXbD NTH ijE

Spelförsäljning, lottredovisningsterminal (GVT+)
type: Concept
in scheme: JobTech Taxonomy - Färdighet
definition: Spelförsäljning, lottredovisningsterminal (GVT+)
alternative label: GVT+
alternative label: Spelförsäljning, lottredovisningsterminal
broader: zmYu aAM TuF
related: JnTF wXr 6Eh
related: xyW2 toA Skh

Ishockey, professionell utövning
type: Concept
in scheme: JobTech Taxonomy - Färdighet
definition: Ishockey, professionell utövning
broader: Idrott/aktivitet
related: AwXA EM4 71n

Bake-off bakning
type: Concept
in scheme: JobTech Taxonomy - Färdighet
definition: Bake-off bakning
broader: zmYu aAM TuF
related: JnTF wXr 6Eh
related: s1Qk o98 2o1

Vandringsled, preparering och underhåll
type: Concept
in scheme: JobTech Taxonomy - Färdighet
definition: Vandringsled, preparering och underhåll
broader: zmYu aAM TuF
related: XBh3 Xrm C4R
related: EA6o N1N QtT
related: df9D e6y 61z
related: C3422
related: C9629
related: C6113
related: ieVp d5L rS9
related: C5153

Koreografi, modern dans
type: Concept
in scheme: JobTech Taxonomy - Färdighet
definition: Koreografi, modern dans
broader: zmYu aAM TuF
related: gmRr 7tt eHj

Mästarbrev, make-up artist
type: Concept
in scheme: JobTech Taxonomy - Färdighet
definition: Mästarbrev, make-up artist
broader: Yrkesbevis/examen
related: ezKk kss CiQ

Formpressning
type: Concept
in scheme: JobTech Taxonomy - Färdighet
definition: Formpressning
broader: zmYu aAM TuF
related: ENV6 BNa brP

3D-grafik-Autodesk Maya
type: Concept
in scheme: JobTech Taxonomy - Färdighet
definition: 3D-grafik-Autodesk Maya
broader: Programvara för digitalt skapande
related: 8Bmh vtM zts
related: 34Tn BQQ tfo
related: Q5DF juj 8do
related: 4Jty HpK a3Q
related: LeQV umf wUS
related: Mbt6 3ko DiD

Trädvård
type: Concept
in scheme: JobTech Taxonomy - Färdighet
definition: Trädvård avser åtgärder och metoder för att vårda och underhålla träd, inklusive beskärning, inspektion, vård av rötter och behandling mot sjukdomar samt skadedjur. Kompetensen omfattar kunskap om trädens livscykler, biologiska behov samt metoder för att säkerställa trädens hälsa och säkerhet i olika miljöer.
broader: zmYu aAM TuF
related: XBh3 Xrm C4R
related: yXbD NTH ijE
related: 2xQ4 4kh kTZ

Samba
type: Concept
in scheme: JobTech Taxonomy - Färdighet
definition: Samba
broader: p1WM wCw LTd
related: AWJF wqZ va9

Väggsättning
type: Concept
in scheme: JobTech Taxonomy - Färdighet
definition: Väggsättning
broader: zmYu aAM TuF
related: V79C DD2 3Gj

Fortran, programmeringsspråk
type: Concept
in scheme: JobTech Taxonomy - Färdighet
definition: Fortran, programmeringsspråk
alternative label: Fortran
broader: Datorspråk
related: BAeH eg8 T2d
related: Fv7d YhP YmS
related: D9SL mtn vGM
related: DJh5 yyF hEM
related: 4Jty HpK a3Q

Arbete med uppgifter av högt skyddsvärde
type: Concept
in scheme: JobTech Taxonomy - Färdighet
definition: Kompetensen innebär kunskaper om och korrekt hantering av information som vid röjande kan orsaka allvarlig skada för verksamheten. Sådana uppgifter kan till exempel innefatta säkerhetsskyddsklassificerade uppgifter, känsliga respektive skyddade personuppgifter, forskningsdata och affärshemligheter.
broader: zmYu aAM TuF
related: vPP6 rsw dck
related: rNcE Zno pD8

Redovisning
type: Concept
in scheme: JobTech Taxonomy - Färdighet
definition: Redovisning avser systematiska processer för att registrera, sammanställa och rapportera finansiell information om företag, organisationer och myndigheter. Kompetensen omfattar kunskaper i bokföring, ekonomisk analys och rapportering.
broader: zmYu aAM TuF
related: Y6yY SuR hVh
related: Uw4n UB2 RCW
related: q81z 3oD 1qu
related: mZsb A1K Gec
related: cRmd 536 pT1
related: ij8k EwC zyB

IWSD, Internationell svetskonstruktör, yrkesdiplom
type: Concept
in scheme: JobTech Taxonomy - Färdighet
definition: IWSD, Internationell svetskonstruktör, yrkesdiplom
alternative label: IWSD
alternative label: Internationell svetskonstruktör
broader: Svets-/lödarmetoder med verifierad kunskap
related: vaEp iBS c5h
related: wQ1E Bzk ZyA
related: PRQn 9yw NJA

Doktorsexamen, pedagogikämnen
type: Concept
in scheme: JobTech Taxonomy - Färdighet
definition: Doktorsexamen, pedagogikämnen
broader: Yrkesbevis/examen
related: Gm5j S2Y aTB
related: cYCo PxY zQd

Ukulele
type: Concept
in scheme: JobTech Taxonomy - Färdighet
definition: Ukulele
broader: wLYs CKS wK8
related: AWJF wqZ va9

Avloppsrening
type: Concept
in scheme: JobTech Taxonomy - Färdighet
definition: Avloppsrening
broader: zmYu aAM TuF
related: idjo 2Wr a3E

Leverantörsreskontra
type: Concept
in scheme: JobTech Taxonomy - Färdighet
definition: Leverantörsreskontra innebär att hantera leverantörsfakturor genom registrering, kontering och betalning, göra avstämningar av leverantörsskulder, följa upp utbetalningar och ha kontakt med leverantörer vid fakturafrågor och betalningsavstämning. Kompetensen omfattar även deltagande i bokslutsarbete kopplat till leverantörsreskontran.
broader: zmYu aAM TuF
related: q81z 3oD 1qu
related: ij8k EwC zyB

Fiberkemi
type: Concept
in scheme: JobTech Taxonomy - Färdighet
definition: Fiberkemi
broader: zmYu aAM TuF
related: v9nU 6Fw 4Qg
related: qn2U dB9 Cmh

Försöksplanering
type: Concept
in scheme: JobTech Taxonomy - Färdighet
definition: Försöksplanering
broader: zmYu aAM TuF
related: jv1x tpK 32p
related: 4Jty HpK a3Q

Fartygsnavigering
type: Concept
in scheme: JobTech Taxonomy - Färdighet
definition: Fartygsnavigering
broader: Övriga specialiteter, sjöfart
related: Rsoy sS6 6c4
related: kDnq Q98 sD3

Spanska, undervisning
type: Concept
in scheme: JobTech Taxonomy - Färdighet
definition: Spanska, undervisning
broader: Inriktning på lärarkompetens
related: 4KhP FxL uZ5

Verksamhetsledning, värmeverk
type: Concept
in scheme: JobTech Taxonomy - Färdighet
definition: Verksamhetsledning, värmeverk
broader: zmYu aAM TuF
related: pf1K PTz frm

Koncernredovisning
type: Concept
in scheme: JobTech Taxonomy - Färdighet
definition: Koncernredovisning
broader: zmYu aAM TuF
related: Y6yY SuR hVh
related: Uw4n UB2 RCW
related: q81z 3oD 1qu
related: mZsb A1K Gec
related: cRmd 536 pT1

Mekaniserad svetsning
type: Concept
in scheme: JobTech Taxonomy - Färdighet
definition: Mekaniserad svetsning
broader: on11 B1f LEw
related: vaEp iBS c5h

Genomförandeplaner inom socialt arbete
type: Concept
in scheme: JobTech Taxonomy - Färdighet
definition: Genomförandeplaner inom socialt arbete innebär att skapa konkreta, individuellt anpassade planer som beskriver vilka stödinsatser och aktiviteter som ska genomföras för en brukare. Planen tydliggör målen och vilka åtgärder som ska utföras, när och hur, för att främja brukarens självständighet och livskvalitet. Den fungerar som ett praktiskt verktyg i det dagliga arbetet och underlättar uppföljning och samordning mellan olika insatser och aktörer.
broader: zmYu aAM TuF
related: BWwk fYX S5B
related: jY19 knH MJp
related: pok1 ipJ yzD

Skidskytte, instruktör/Skidskytte, tränare
type: Concept
in scheme: JobTech Taxonomy - Färdighet
definition: Skidskytte, instruktör/Skidskytte, tränare
alternative label: Skidskytte, instruktör
alternative label: Skidskytte, tränare
broader: Idrott/aktivitet
related: EA6o N1N QtT

Driftövervakning
type: Concept
in scheme: JobTech Taxonomy - Färdighet
definition: Driftövervakning avser övervakning och styrning av system och processer för att säkerställa effektiv drift och funktionalitet. Denna kompetens omfattar övervakning av anläggningar och utrustning inom olika sektorer, inklusive värme, vatten, energi och industriella processer.
broader: zmYu aAM TuF
related: thZP oR7 WrY
related: Cppd 9P7 HeR
related: 7Zqy hSM Fig
related: fLKb bJ3 69p
related: 4Jty HpK a3Q

Svart certifikat, CNC
type: Concept
in scheme: JobTech Taxonomy - Färdighet
definition: Svart certifikat, CNC
broader: s48H Sft DTn
related: vaEp iBS c5h
related: K8yg U4C gkY
related: 4Jty HpK a3Q

Produktionsdesign
type: Concept
in scheme: JobTech Taxonomy - Färdighet
definition: Produktionsdesign
broader: zmYu aAM TuF
related: CSUf ZVM a7Z

Adobe Dreamweaver
type: Concept
in scheme: JobTech Taxonomy - Färdighet
definition: Adobe Dreamweaver
broader: Programmerings- och systemutvecklingsverktyg
related: 8Bmh vtM zts
related: SgNH hag n9D
related: D9SL mtn vGM
related: zfve s6G tpc
related: 4Jty HpK a3Q
related: Mbt6 3ko DiD
related: MYAz x9m 2LJ

Bokföringsvana
type: Concept
in scheme: JobTech Taxonomy - Färdighet
definition: Bokföringsvana avser kunskaper och färdigheter kopplade till registrering och hantering av finansiella transaktioner inom ett företag eller en organisation. Kompetensen innefattar förståelse för bokföringsprinciper, redovisningsmetoder och tillämpning av relevant lagstiftning.
broader: zmYu aAM TuF
related: eQ4M CNm ozj
related: 8A1f sxQ adT
related: 48KE fDE ryL
related: bYde Frc xcB
related: ZQTR hVC QhJ
related: L7eh ihX vM5
related: MGk3 LvL AU2
related: oEmP NC1 sXE
related: q81z 3oD 1qu
related: dUuh wwa FGj
related: FfMN Bw1 qYR
related: ij8k EwC zyB
related: 957L kZK rHZ

Fritidspedagogik
type: Concept
in scheme: JobTech Taxonomy - Färdighet
definition: Fritidspedagogik avser den pedagogiska kompetensen som omfattar planering, genomförande och utvärdering av fritidsverksamhet för barn och ungdomar, ofta i anslutning till skolans verksamhet. Kompetensen syftar till att främja sociala, emotionella och motoriska färdigheter hos deltagare genom lek, lärande och kreativitet.
broader: zmYu aAM TuF
related: EA6o N1N QtT
related: oQUQ D11 HPx

Delgivningsarbete
type: Concept
in scheme: JobTech Taxonomy - Färdighet
definition: Delgivningsarbete
broader: zmYu aAM TuF
related: JAFv ZaP tDG

Tandläkarutrustning, underhåll
type: Concept
in scheme: JobTech Taxonomy - Färdighet
definition: Tandläkarutrustning, underhåll
broader: zmYu aAM TuF
related: HPxT fQJ zwT
related: 5dxv nVQ N8o
related: 39yB xPQ ozd
related: GC7L Yw7 Mfo

Ljud-Ableton Live
type: Concept
in scheme: JobTech Taxonomy - Färdighet
definition: Ljud-Ableton Live
broader: Programvara för digitalt skapande
related: 4BsK q2C sCL
related: 4Jty HpK a3Q

Rökavvänjning, ledarerfarenhet
type: Concept
in scheme: JobTech Taxonomy - Färdighet
definition: Rökavvänjning, ledarerfarenhet
broader: zmYu aAM TuF
related: FpPP jqK xzT
related: aA2Z 9XX R1v

Balettlibretto
type: Concept
in scheme: JobTech Taxonomy - Färdighet
definition: Balettlibretto
broader: zmYu aAM TuF
related: gmRr 7tt eHj

Instrument Rating/IR
type: Concept
in scheme: JobTech Taxonomy - Färdighet
definition: Instrument Rating/IR
alternative label: IR
alternative label: Instrument Rating
broader: s48H Sft DTn
related: 7n3y FTE qSe

Fast rescue boats
type: Concept
in scheme: JobTech Taxonomy - Färdighet
definition: Fast rescue boats
broader: s48H Sft DTn
related: BStc SJh DKG
related: Rsoy sS6 6c4
related: kZwz D8K bKs
related: CbQK 7th Tyf
related: UjoW meY Zwt
related: KttZ Skc bMR
related: kDnq Q98 sD3
related: a75S eLg JWH

Djurskydd
type: Concept
in scheme: JobTech Taxonomy - Färdighet
definition: Djurskydd
broader: zmYu aAM TuF
related: puim 6PY DGj
related: yXbD NTH ijE
related: WL4E r4b ek4

Oracle Fusion Middleware, integrationsplattform
type: Concept
in scheme: JobTech Taxonomy - Färdighet
definition: Oracle Fusion Middleware, integrationsplattform
alternative label: Oracle Fusion Middleware
alternative label: Oracle-kunskaper
alternative label: Oraclekunskap
alternative label: Oracleutveckling
broader: Integrationsplattformar
related: BAeH eg8 T2d
related: cBBa ngH fCx
related: D9SL mtn vGM
related: DJh5 yyF hEM
related: 4Jty HpK a3Q
related: UXKZ 3zZ ipB
related: MYAz x9m 2LJ

CPLD, programmerbar krets
type: Concept
in scheme: JobTech Taxonomy - Färdighet
definition: CPLD, programmerbar krets
broader: zmYu aAM TuF
related: nDaB vdy eAy
related: SPYW 7Z1 ShT
related: 4Jty HpK a3Q

Fiskodling
type: Concept
in scheme: JobTech Taxonomy - Färdighet
definition: Fiskodling avser processen att odla och avla fisk och skaldjur i kontrollerade miljöer, vilket innefattar både inplantering och skötsel av vattenlevande organismer. Kompetensen omfattar kunskaper om vattenkvalitet, fodertillförsel, sjukdomshantering och hållbarhetsaspekter relaterade till aquakultur.
broader: zmYu aAM TuF
related: c8r8 e4L gwj
related: oEmP NC1 sXE

VVS, byggnadsinspektion
type: Concept
in scheme: JobTech Taxonomy - Färdighet
definition: VVS, byggnadsinspektion
broader: zmYu aAM TuF
related: wCx8 rY3 XUT

Konstbedömning
type: Concept
in scheme: JobTech Taxonomy - Färdighet
definition: Konstbedömning
broader: zmYu aAM TuF
related: Qbvf 6nd Esn

Familjepsykologi
type: Concept
in scheme: JobTech Taxonomy - Färdighet
definition: Familjepsykologi
broader: zmYu aAM TuF
related: VYeq GDF a2g

Verksamhetsledning, arkiv
type: Concept
in scheme: JobTech Taxonomy - Färdighet
definition: Verksamhetsledning, arkiv
broader: zmYu aAM TuF
related: sWzF 6pd Y6L

Filmning, reklamfilm
type: Concept
in scheme: JobTech Taxonomy - Färdighet
definition: Filmning, reklamfilm
broader: zmYu aAM TuF
related: CkRH 4Qn iX3
related: 3J38 DNz YKK
related: 4Jty HpK a3Q

Visma SPCS, redovisningssystem
type: Concept
in scheme: JobTech Taxonomy - Färdighet
definition: Visma SPCS, redovisningssystem
alternative label: Visma SPCS
broader: xSJR 1Kq pxB
related: eQ4M CNm ozj
related: q81z 3oD 1qu
related: ij8k EwC zyB
related: 4Jty HpK a3Q

Elsäkerhetsverkets föreskrifter
type: Concept
in scheme: JobTech Taxonomy - Färdighet
definition: Elsäkerhetsverkets föreskrifter
broader: zmYu aAM TuF
related: MW1P GNJ 4F9
related: nDaB vdy eAy
related: SPYW 7Z1 ShT
related: 7Zqy hSM Fig
related: fWrt sLg koW
related: a75S eLg JWH
related: yyF7 jsW EeP

Motorcyklar, reparationsvana
type: Concept
in scheme: JobTech Taxonomy - Färdighet
definition: Motorcyklar, reparationsvana avser kompetens att analysera fel och genomföra reparationer samt underhåll av motorcyklar. Denna kompetens inkluderar färdigheter i att diagnostisera och åtgärda tekniska problem, samt att utföra rutinunderhåll och service av motorcyklar, vilket bidrar till säkerhet och funktionalitet.
broader: zmYu aAM TuF
related: Lzpv ofL 3H5

Grundläggande juridiska kompetenser inom rättsväsende, brottsbekämpning och kriminalvård
type: Concept
in scheme: JobTech Taxonomy - Färdighet
definition: Grundläggande juridiska kompetenser avser kunskaper i rättskällor, straffrätt, processrätt och juridisk metodik för att fatta rättssäkra beslut. Detta inkluderar förmåga att tillämpa lagar i vardagliga situationer som utredningar, ingripanden och förhör, ofta verifierat genom utbildning eller erfarenhet.
broader: zmYu aAM TuF
related: hgAg gLr YGg
related: rNcE Zno pD8

Gynekologi och urologi, specialistkompetens för fysioterapeuter
type: Concept
in scheme: JobTech Taxonomy - Färdighet
definition: Gynekologi och urologi, specialistkompetens för fysioterapeuter
broader: Specialistinriktning inom fysioterapi
related: s7vU FhY L5Z

Yrkesutbildning, akupunktör
type: Concept
in scheme: JobTech Taxonomy - Färdighet
definition: Yrkesutbildning inom akupunktur genom en av branschen godkänd utbildningsanordnare.
broader: Yrkesutbildning
related: F19Z oB6 pg3

Tillv.industri-Top Solid
type: Concept
in scheme: JobTech Taxonomy - Färdighet
definition: Tillv.industri-Top Solid
broader: mTLu uo2 gq2
related: VKKg e4t t46
related: 4Jty HpK a3Q

Kognitiv psykologi
type: Concept
in scheme: JobTech Taxonomy - Färdighet
definition: Kognitiv psykologi
broader: zmYu aAM TuF
related: VYeq GDF a2g

Grafikprogram, undervisning
type: Concept
in scheme: JobTech Taxonomy - Färdighet
definition: Grafikprogram, undervisning
broader: Dataundervisning
related: 1CX5 mZw Vcq
related: 4Jty HpK a3Q

Aktivitet och folkhälsa, specialistområde för arbetsterapeut
type: Concept
in scheme: JobTech Taxonomy - Färdighet
definition: Ett specialistområde och en fördjupad specialistkompetens för arbetsterapeut inom aktivitet och folkhälsa.
broader: Specialistområde för arbetsterapeut
related: TPH4 2AM isT

Personalavveckling
type: Concept
in scheme: JobTech Taxonomy - Färdighet
definition: Personalavveckling
broader: zmYu aAM TuF
related: mNoS AN5 drn
related: Fp7x Yqt bx9
related: bjqk F3A 5Hk

Certifikat, dykledare
type: Concept
in scheme: JobTech Taxonomy - Färdighet
definition: Certifikat, dykledare
broader: s48H Sft DTn
related: DPPw 4wa AsH

Country blues
type: Concept
in scheme: JobTech Taxonomy - Färdighet
definition: Country blues
broader: p1WM wCw LTd
related: AWJF wqZ va9

Maskinskötsel, industribageri
type: Concept
in scheme: JobTech Taxonomy - Färdighet
definition: Maskinskötsel, industribageri avser hantering och övervakning av maskiner i industribagerier som bearbetar råvaror för att producera olika typer av bröd och bakverk. Kompetensen innefattar att styra maskingruppers arbete, säkerställa kvalitet i produktionen med hjälp av automatiserade system samt att genomföra löpande underhåll och åtgärder för att optimera produktionseffektiviteten.
broader: zmYu aAM TuF
related: kF59 fge kts
related: 5qT8 z9d 8rw

Slalom, professionell utövning
type: Concept
in scheme: JobTech Taxonomy - Färdighet
definition: Slalom, professionell utövning
broader: Idrott/aktivitet
related: AwXA EM4 71n

Viltforskning
type: Concept
in scheme: JobTech Taxonomy - Färdighet
definition: Viltforskning
broader: zmYu aAM TuF
related: yXbD NTH ijE
related: e9FK VKh ahW

Diplomerad shiatsuterapeut
type: Concept
in scheme: JobTech Taxonomy - Färdighet
definition: Kompetensen avser genomför utbildning för att utöva behandlingsformen shiatsu, enligt branschstandarder.
broader: s48H Sft DTn
related: F19Z oB6 pg3

Cybersäkerhet, IoT/sakernas Internet
type: Concept
in scheme: JobTech Taxonomy - Färdighet
definition: Cybersäkerhet, IoT/sakernas Internet
alternative label: Internet of Things (IoT) security
broader: zmYu aAM TuF
related: BAeH eg8 T2d
related: 4Jty HpK a3Q

Rökgasanalyser
type: Concept
in scheme: JobTech Taxonomy - Färdighet
definition: Rökgasanalyser
broader: zmYu aAM TuF
related: idjo 2Wr a3E
related: yXbD NTH ijE
related: SUfj 4D9 FNx

Livförsäkringar
type: Concept
in scheme: JobTech Taxonomy - Färdighet
definition: Livförsäkringar
broader: zmYu aAM TuF
related: Ru4W zn2 LEz
related: 9dLz BCK oDA

Unix-script, programmeringsspråk
type: Concept
in scheme: JobTech Taxonomy - Färdighet
definition: Unix-script, programmeringsspråk
alternative label: Unix-script
broader: Datorspråk
related: BAeH eg8 T2d
related: Fv7d YhP YmS
related: Q5DF juj 8do
related: D9SL mtn vGM
related: DJh5 yyF hEM
related: 4Jty HpK a3Q

Byggnaders energiprestanda
type: Concept
in scheme: JobTech Taxonomy - Färdighet
definition: Byggnaders energiprestanda avser en byggnads förmåga att använda energi effektivt och hållbart i förhållande till dess konstruktion och funktion. Denna kompetens omfattar aspekter som energiförbrukning, isolering, ventilation och användning av förnybara energikällor, och berör således såväl byggprocessen som de tekniska installationerna i byggnaderna.
broader: zmYu aAM TuF
related: wCx8 rY3 XUT
related: yXbD NTH ijE
related: 4Jty HpK a3Q

Fail Mode, Eff Analys or Critical Analys/FMEA
type: Concept
in scheme: JobTech Taxonomy - Färdighet
definition: Fail Mode, Eff Analys or Critical Analys/FMEA
alternative label: FMEA
alternative label: Fail Mode, Eff Analys or Critical Analys
broader: Kvalitetsverktyg
related: v9nU 6Fw 4Qg
related: Qo7p wjf gtv
related: vPP6 rsw dck
related: dMVD VYy kgg

Patinering
type: Concept
in scheme: JobTech Taxonomy - Färdighet
definition: Patinering avser tekniken att skapa en åldrad eller sliten yta på material, ofta för att efterlikna naturliga effekter som uppstår över tid. Detta omfattar användning av olika material och metoder för att applicera färger och texturer som ger objekt en visuellt tilltalande patina.
broader: zmYu aAM TuF
related: aKdV u7V R5j
related: PF4H kQD zpL
related: PH2M uV4 r72
related: CSUf ZVM a7Z

Textil, väv
type: Concept
in scheme: JobTech Taxonomy - Färdighet
definition: Textil, väv
broader: zmYu aAM TuF
related: 34Tn BQQ tfo

Gesällbrev, riggare
type: Concept
in scheme: JobTech Taxonomy - Färdighet
definition: Gesällbrev, riggare
broader: Yrkesbevis/examen
related: vaEp iBS c5h

Bygglov
type: Concept
in scheme: JobTech Taxonomy - Färdighet
definition: Bygglov avser den formella tillståndsprocess som krävs för att genomföra byggnadsarbeten och förändringar av byggnader och mark.
broader: zmYu aAM TuF
related: wCx8 rY3 XUT
related: Pd51 xnr KCY
related: 41KB bfk 5jR

Windows, operativsystem
type: Concept
in scheme: JobTech Taxonomy - Färdighet
definition: Windows, operativsystem avser en programvaruplattform som används för att hantera datorresurser och utföra applikationer på persondatorer och servrar. Kompetensen omfattar användning och konfiguration av Windows-operativsystemet, inklusive hantering av filer, installation av programvara och utförande av systemuppdateringar.
alternative label: Windows
broader: xAWr WYq JPP
related: BAeH eg8 T2d
related: cBBa ngH fCx
related: Fv7d YhP YmS
related: 1CX5 mZw Vcq
related: D9SL mtn vGM
related: VCpu 5EN bBt
related: DJh5 yyF hEM
related: 4Jty HpK a3Q
related: 13md uyV BNG
related: UXKZ 3zZ ipB
related: MYAz x9m 2LJ

Maskinkonstruktion
type: Concept
in scheme: JobTech Taxonomy - Färdighet
definition: Maskinkonstruktion
broader: zmYu aAM TuF
related: K8yg U4C gkY
related: PRQn 9yw NJA

CTI, datorstödd telefoni
type: Concept
in scheme: JobTech Taxonomy - Färdighet
definition: CTI, datorstödd telefoni
broader: zmYu aAM TuF
related: nDaB vdy eAy
related: DJh5 yyF hEM
related: SPYW 7Z1 ShT
related: 4Jty HpK a3Q

Maskinbefäl klass VII (behörighet)
type: Concept
in scheme: JobTech Taxonomy - Färdighet
definition: Maskinbefäl klass VII (behörighet)
broader: Behörigheter, sjöfart
related: Rsoy sS6 6c4

Neurokemi
type: Concept
in scheme: JobTech Taxonomy - Färdighet
definition: Neurokemi
broader: zmYu aAM TuF
related: eofS oZs RZi

Verksamhetsanalys
type: Concept
in scheme: JobTech Taxonomy - Färdighet
definition: Verksamhetsanalys avser processen att studera och utvärdera en verksamhets strukturer, processer och prestationer för att identifiera förbättringsområden och strategiska möjligheter. Denna kompetens omfattar insamling och analys av data, samt framtagande av rekommendationer som kan stödja beslutsfattande och strategisk utveckling.
broader: zmYu aAM TuF
related: BAeH eg8 T2d
related: cBBa ngH fCx
related: Qo7p wjf gtv
related: 8SPu K1k 5qR
related: coyZ Cyv Srw
related: z8di AqX GBr
related: g6eC Fwu B3J
related: DJh5 yyF hEM
related: eWiB mGP MjE
related: mZsb A1K Gec
related: 4GAs rKs 2Ne
related: wby2 mwq fWV
related: AuTi FEo j3R
related: uxst tkg zDh
related: X1Ac Y9P PJo
related: 3i4a Ufc qpp
related: nNxJ YWy vR2
related: UxT1 tPF Kbg
related: 4Jty HpK a3Q
related: UXKZ 3zZ ipB

Budgetrådgivning
type: Concept
in scheme: JobTech Taxonomy - Färdighet
definition: Budgetrådgivning
broader: zmYu aAM TuF
related: Y6yY SuR hVh
related: Bbkh nrm 2J8
related: pTr9 RBT 9ur
related: FfMN Bw1 qYR

Transportnätsystem
type: Concept
in scheme: JobTech Taxonomy - Färdighet
top concept of: JobTech Taxonomy - Färdighet
definition: Transportnätsystem
narrower: DXC, teletransmission
narrower: usst WrA N8M
narrower: ATM, teletransmission
narrower: xiRv nUu 3KS
narrower: DWDM, teletransmission

Länkad data
type: Concept
in scheme: JobTech Taxonomy - Färdighet
definition: Framtagande, beskrivning, lagring och tillgängliggörande av data i enlighet med principer om länkad data.
alternative label: Linked Data
broader: zmYu aAM TuF
related: cBBa ngH fCx
related: vPP6 rsw dck
related: DJh5 yyF hEM
related: UxT1 tPF Kbg
related: 4Jty HpK a3Q
related: UXKZ 3zZ ipB

Organisk kemi
type: Concept
in scheme: JobTech Taxonomy - Färdighet
definition: Organisk kemi
broader: zmYu aAM TuF
related: v9nU 6Fw 4Qg
related: qn2U dB9 Cmh
related: eofS oZs RZi
related: bExu 8gk azk

Utomhuspedagogik
type: Concept
in scheme: JobTech Taxonomy - Färdighet
definition: Utomhuspedagogik
broader: zmYu aAM TuF
related: Hi9c iTe gHH
related: 5ek3 Cgq WeZ

ETS, Europeisk termisk sprutoperatör, yrkesdiplom
type: Concept
in scheme: JobTech Taxonomy - Färdighet
definition: ETS, Europeisk termisk sprutoperatör, yrkesdiplom
alternative label: ETS
alternative label: Europeisk termisk sprutoperatör
broader: s48H Sft DTn
related: vaEp iBS c5h
related: wQ1E Bzk ZyA

Katalogiseringsvana, bibliotek
type: Concept
in scheme: JobTech Taxonomy - Färdighet
definition: Katalogiseringsvana, bibliotek, avser färdigheten att systematiskt organisera och registrera olika typer av publicerat material såsom böcker och tidskrifter. Kompetensen innebär kunskap om klassificeringssystem och metoder för att säkerställa att materialet är lättillgängligt för användare.
broader: zmYu aAM TuF
related: wVfo Njx 1rB
related: TQkt eeK eNp

Bas
type: Concept
in scheme: JobTech Taxonomy - Färdighet
definition: Bas
broader: Sång
related: AWJF wqZ va9

Hjulbyten
type: Concept
in scheme: JobTech Taxonomy - Färdighet
definition: Hjulbyten avser kompetens att byta hjul på fordon, vilket inkluderar avmontering och montering av däck samt säkerställande av korrekt åtdragning av hjulskruvar.
broader: zmYu aAM TuF
related: Kxm9 N3V shF
related: FjdF H2e tAG

Verksamhetsledning, skogsbruk
type: Concept
in scheme: JobTech Taxonomy - Färdighet
definition: Verksamhetsledning, skogsbruk
broader: zmYu aAM TuF
related: 9QMD sZ3 ZjX

Komposition, filmmusik
type: Concept
in scheme: JobTech Taxonomy - Färdighet
definition: Komposition, filmmusik
broader: zmYu aAM TuF
related: AWJF wqZ va9
related: 4Jty HpK a3Q

Mästarbrev, guldsmed
type: Concept
in scheme: JobTech Taxonomy - Färdighet
definition: Mästarbrev, guldsmed
broader: Yrkesbevis/examen
related: nwSm phw sPo

Frisörlicens
type: Concept
in scheme: JobTech Taxonomy - Färdighet
definition: Frisörlicens erhålls efter avlagt del- eller gesällprov. Delprovet är första delen av gesällprovet och intygar behörighet A på licensen. Gesällprovet som innebär att man är fullt behörig som frisör intygar AB som behörighet. Licensen intygar upp till sex behörigheter med bokstäverna ABCDEF. Frisörföretagarna utfärdar licensen efter ansökan.
broader: Yrkesbevis/examen
related: LyBp bY6 bZK

Transportledning, avfallshantering och återvinning
type: Concept
in scheme: JobTech Taxonomy - Färdighet
definition: Transportledning, avfallshantering och återvinning
broader: zmYu aAM TuF
related: yXbD NTH ijE
related: 957L kZK rHZ

Härdfysik/Reaktorteknik
type: Concept
in scheme: JobTech Taxonomy - Färdighet
definition: Härdfysik/Reaktorteknik
alternative label: Härdfysik
alternative label: Reaktorteknik
broader: zmYu aAM TuF
related: KM7d Z6Y LCJ

Utbildning av nya säljare
type: Concept
in scheme: JobTech Taxonomy - Färdighet
definition: Utbildning av nya säljare
broader: zmYu aAM TuF
related: oXSW fbY XrY
related: Fp7x Yqt bx9

Tjänstemarknadsföring
type: Concept
in scheme: JobTech Taxonomy - Färdighet
definition: Tjänstemarknadsföring
broader: zmYu aAM TuF
related: WX67 Pfb WMN

Film/redigering-Adobe Premiere
type: Concept
in scheme: JobTech Taxonomy - Färdighet
definition: Film/redigering-Adobe Premiere
alternative label: Film-Adobe Premiere
alternative label: redigering-Adobe Premiere
broader: Programvara för digitalt skapande
related: 8Bmh vtM zts
related: 4BsK q2C sCL
related: CkRH 4Qn iX3
related: 3J38 DNz YKK
related: PH2M uV4 r72
related: 4Jty HpK a3Q

Säljcoachning
type: Concept
in scheme: JobTech Taxonomy - Färdighet
definition: Säljcoachning
broader: zmYu aAM TuF
related: oXSW fbY XrY
related: Pz9M srJ Lc9

Datoriserade styr- och reglersystem
type: Concept
in scheme: JobTech Taxonomy - Färdighet
definition: Datoriserade styr- och reglersystem avser användning av datorer och mjukvara för att styra och övervaka tekniska processer inom olika industrier. Denna kompetens innebär kunskaper om systemens uppbyggnad och funktion samt förmåga att utföra installation, underhåll och felsökning av dessa system.
broader: zmYu aAM TuF
related: 4obu LL6 RqJ
related: LEvM 7Hs w8i
related: MW1P GNJ 4F9
related: df9D e6y 61z
related: UdrS qzV P7i
related: 1G6H AuG qyy
related: Cppd 9P7 HeR
related: o31g CX1 qhQ
related: 7Zqy hSM Fig
related: QEBd qHu vGr
related: fLKb bJ3 69p
related: fWrt sLg koW
related: 3UzE P8A 9sS
related: a75S eLg JWH
related: 4Jty HpK a3Q
related: L4hA SJP SFi
related: yyF7 jsW EeP

Körkunskap, travhästar
type: Concept
in scheme: JobTech Taxonomy - Färdighet
definition: Körkunskap, travhästar
broader: zmYu aAM TuF
related: KYmy iqC xiQ

Rördragning
type: Concept
in scheme: JobTech Taxonomy - Färdighet
definition: Rördragning
broader: zmYu aAM TuF
related: fLKb bJ3 69p

Yrkesbevis, växtkunskap steg 1–5
type: Concept
in scheme: JobTech Taxonomy - Färdighet
definition: Yrkesbevis, växtkunskap steg 1–5
broader: Yrkesbevis/examen
related: XBh3 Xrm C4R
related: df9D e6y 61z
related: yXbD NTH ijE
related: 2xQ4 4kh kTZ

EU-medel, förvaltning
type: Concept
in scheme: JobTech Taxonomy - Färdighet
definition: EU-medel, förvaltning
broader: zmYu aAM TuF
related: vPP6 rsw dck

Fartygsbefäl klass III (behörighet)
type: Concept
in scheme: JobTech Taxonomy - Färdighet
definition: Fartygsbefäl klass III (behörighet)
broader: Behörigheter, sjöfart
related: kZwz D8K bKs
related: kDnq Q98 sD3

Talstörningar, behandling
type: Concept
in scheme: JobTech Taxonomy - Färdighet
definition: Talstörningar, behandling
broader: zmYu aAM TuF
related: pzch NRY 9ZF

Dragpressning
type: Concept
in scheme: JobTech Taxonomy - Färdighet
definition: Dragpressning
broader: zmYu aAM TuF
related: vaEp iBS c5h

Tillskärning, däcksgummi
type: Concept
in scheme: JobTech Taxonomy - Färdighet
definition: Tillskärning, däcksgummi
broader: zmYu aAM TuF
related: ENV6 BNa brP

Elgitarr
type: Concept
in scheme: JobTech Taxonomy - Färdighet
definition: Elgitarr
broader: wLYs CKS wK8
related: AWJF wqZ va9

Kassettäckning
type: Concept
in scheme: JobTech Taxonomy - Färdighet
definition: Kassettäckning
broader: zmYu aAM TuF
related: 3g5x Tm7 8QH
related: bXfo 4hb SXx

ECDIS
type: Concept
in scheme: JobTech Taxonomy - Färdighet
definition: ECDIS
broader: s48H Sft DTn
related: kZwz D8K bKs
related: kDnq Q98 sD3

Godkänd livräddare, SLS
type: Concept
in scheme: JobTech Taxonomy - Färdighet
definition: Godkänd livräddare, SLS
broader: Yrkesbevis/examen
related: ayQ4 G3W A2w

Livsmedelskemi
type: Concept
in scheme: JobTech Taxonomy - Färdighet
definition: Livsmedelskemi
broader: zmYu aAM TuF
related: v9nU 6Fw 4Qg
related: XurM DVs ggn
related: qn2U dB9 Cmh
related: yXbD NTH ijE
related: eofS oZs RZi

Auktoriserad hudterapeut
type: Concept
in scheme: JobTech Taxonomy - Färdighet
definition: Auktoriserad hudterapeut avser en hudterapeut som har genomgått erkänd utbildning och är medlem i SHR (Sveriges Hudterapeuters Riksorganisation). Källa: SHR
broader: Yrkesbevis/examen
related: xr7w N6Q QMA

MIME-typer
type: Concept
in scheme: JobTech Taxonomy - Färdighet
definition: MIME-typer
broader: zmYu aAM TuF
related: Fv7d YhP YmS
related: DJh5 yyF hEM
related: 4Jty HpK a3Q
related: 13md uyV BNG

Metallpolering
type: Concept
in scheme: JobTech Taxonomy - Färdighet
definition: Metallpolering
broader: zmYu aAM TuF
related: e6nk AGp y28
related: 4bxV 58E P9N

Stenskulptur
type: Concept
in scheme: JobTech Taxonomy - Färdighet
definition: Stenskulptur
broader: zmYu aAM TuF
related: 34Tn BQQ tfo

Specialistinriktning inom fysioterapi
type: Concept
in scheme: JobTech Taxonomy - Färdighet
top concept of: JobTech Taxonomy - Färdighet
definition: Specialistinriktning inom fysioterapi
narrower: Gynekologi och urologi, specialistkompetens för fysioterapeuter
narrower: Reumatologi, specialistkompetens för fysioterapeuter
narrower: yG9A NkA Xnc
narrower: Ortopedisk manuell terapi (OMT), specialistkompetens för fysioterapeuter
narrower: wVzn xz2 jDC
narrower: Intensivvård, specialistkompetens för fysioterapeuter
narrower: Hjärt-kärlsjukdomar, specialistkompetens för fysioterapeuter
narrower: Fysisk aktivitet och Idrottsmedicin, specialistkompetens för fysioterapeuter
narrower: vyqL ygd geE
narrower: Obstetrik, specialistkompetens för fysioterapeuter
narrower: yrkE Wrh YEM
narrower: Äldres hälsa, specialistkompetens för fysioterapeuter
narrower: Primär hälso- och sjukvård, specialistkompetens för fysioterapeuter
narrower: Onkologi, specialistkompetens för fysioterapeuter
narrower: Pediatrik, specialistkompetens för fysioterapeuter
narrower: ua3Q M2A fqT
narrower: Ortopedi, specialistkompetens för fysioterapeuter
narrower: Veterinärmedicin, specialistkompetens för fysioterapeuter

Yrkesbevis, SRY
type: Concept
in scheme: JobTech Taxonomy - Färdighet
definition: Yrkesbevis som intygar kompetens inom städbranschen. Utfärdas av Servicebranschens Yrkesnämnd.
broader: Yrkesbevis/examen
related: o1gn FoS fB7
related: Z6TY xDf Yup
related: yXbD NTH ijE
related: FjdF H2e tAG
related: FtyZ Joo tB8

Krukväxtodling
type: Concept
in scheme: JobTech Taxonomy - Färdighet
definition: Krukväxtodling
broader: zmYu aAM TuF
related: XBh3 Xrm C4R
related: XurM DVs ggn
related: yXbD NTH ijE
related: 2xQ4 4kh kTZ
related: k3R3 UkC nK2

Talpedagogexamen
type: Concept
in scheme: JobTech Taxonomy - Färdighet
definition: Talpedagogexamen
broader: Yrkesbevis/examen
related: 3FP7 4Eg x8P

Grundskollärarexamen inr 4–9
type: Concept
in scheme: JobTech Taxonomy - Färdighet
definition: Grundskollärarexamen inr 4–9
broader: Yrkesbevis/examen
related: oQUQ D11 HPx

Guldsmedsvaror/Smycken
type: Concept
in scheme: JobTech Taxonomy - Färdighet
definition: Guldsmedsvaror/Smycken avser tillverkning och design av smycken och andra föremål i ädelmetall, vilket inkluderar att formge, tillverka, gravera och reparera guldsmedsprodukter. Kompetensen omfattar också kunskap inom slipning av ädelstenar och infattning av stenar och pärlor.
alternative label: Guldsmedsvaror
alternative label: Smycken
broader: zmYu aAM TuF
related: nwSm phw sPo
related: JAFv ZaP tDG
related: YKL2 FCB 1yr

Elmaskinisterfarenhet
type: Concept
in scheme: JobTech Taxonomy - Färdighet
definition: Elmaskinisterfarenhet
broader: Övriga specialiteter, sjöfart
related: Rsoy sS6 6c4

Cylinderslipning
type: Concept
in scheme: JobTech Taxonomy - Färdighet
definition: Cylinderslipning
broader: zmYu aAM TuF
related: 4bxV 58E P9N

Reparation av trummor
type: Concept
in scheme: JobTech Taxonomy - Färdighet
definition: Reparation av trummor avser processen att åteuppbygga och återställa funktion och estetik hos trummor genom arbete på deras olika komponenter, såsom trumskal, trumhuvuden och mekaniska delar. Kompetensen innefattar teknisk kunskap om material, konstruktion i trummor samt färdigheter i användning av verktyg och metoder för att utföra reparationer som säkerställer ljudkvalitet och hållbarhet.
broader: zmYu aAM TuF
related: aKdV u7V R5j

Idrottsmassage
type: Concept
in scheme: JobTech Taxonomy - Färdighet
definition: Idrottsmassage
broader: zmYu aAM TuF
related: uxHV KXc PKD

Storkök
type: Concept
in scheme: JobTech Taxonomy - Färdighet
definition: Storkök avser en typ av kök där storskalig matlagning och servering sker, ofta i samband med institutioner som skolor, sjukhus eller andra storhushåll. Kompetensen omfattar kunskaper och färdigheter som är nödvändiga för att effektivt planera, laga och servera mat.
broader: zmYu aAM TuF
related: BStc SJh DKG
related: tPox ie4 X9X
related: h324 DPT 7Tw

Statistiska prognoser
type: Concept
in scheme: JobTech Taxonomy - Färdighet
definition: Statistiska prognoser
broader: zmYu aAM TuF
related: jv1x tpK 32p
related: ZA1N Z2B nFQ
related: 4Jty HpK a3Q

RFID-teknik
type: Concept
in scheme: JobTech Taxonomy - Färdighet
definition: RFID-teknik
broader: Kommunikationsprotokoll
related: BAeH eg8 T2d
related: cBBa ngH fCx
related: nDaB vdy eAy
related: D9SL mtn vGM
related: DJh5 yyF hEM
related: SPYW 7Z1 ShT
related: 4Jty HpK a3Q
related: 13md uyV BNG
related: UXKZ 3zZ ipB
related: MYAz x9m 2LJ

Friluftsförskola, erfarenhet
type: Concept
in scheme: JobTech Taxonomy - Färdighet
definition: Friluftsförskola, erfarenhet
broader: zmYu aAM TuF
related: Hi9c iTe gHH

Uppblåsning
type: Concept
in scheme: JobTech Taxonomy - Färdighet
definition: Uppblåsning
broader: zmYu aAM TuF
related: aKdV u7V R5j

Spridningsnät
type: Concept
in scheme: JobTech Taxonomy - Färdighet
definition: Spridningsnät
broader: zmYu aAM TuF
related: fWrt sLg koW
related: a75S eLg JWH
related: yyF7 jsW EeP

Fartygseltekniker, ETO (behörighet)
type: Concept
in scheme: JobTech Taxonomy - Färdighet
definition: Fartygseltekniker, ETO (behörighet)
broader: Behörigheter, sjöfart
related: Rsoy sS6 6c4

Fartygslogistik
type: Concept
in scheme: JobTech Taxonomy - Färdighet
definition: Fartygslogistik omfattar planering och samordning av fartygens rörelser, inklusive ruttval, lastning, lossning och tidsfönster i hamn. Kompetensen kan innefatta arbete med optimering av logistikflöden, minimering av liggetider samt hänsyn till fartygstyper, hamnförhållanden och sjöfartens operativa regler. Fartygslogistik sker ofta i samverkan med terminaler, rederier och andra aktörer inom transportkedjan.
broader: zmYu aAM TuF
related: AuTi FEo j3R
related: 957L kZK rHZ

Dokumentation
type: Concept
in scheme: JobTech Taxonomy - Färdighet
definition: Dokumentation
broader: Yrkesövergripande kompetenser

AdminStudio, programmeringsverktyg
type: Concept
in scheme: JobTech Taxonomy - Färdighet
definition: AdminStudio, programmeringsverktyg
alternative label: AdminStudio
broader: Programmerings- och systemutvecklingsverktyg
related: D9SL mtn vGM
related: DJh5 yyF hEM
related: 4Jty HpK a3Q
related: MYAz x9m 2LJ

Bygginriktning-anläggningsfordon, undervisning
type: Concept
in scheme: JobTech Taxonomy - Färdighet
definition: Bygginriktning-anläggningsfordon, undervisning
broader: Inriktning på lärarkompetens
related: 2x2V UeL 6ke

Oljelasthantering, behörighet
type: Concept
in scheme: JobTech Taxonomy - Färdighet
definition: Oljelasthantering, behörighet
broader: Behörigheter, sjöfart
related: Rsoy sS6 6c4
related: kDnq Q98 sD3

XSLT, programmeringsspråk
type: Concept
in scheme: JobTech Taxonomy - Färdighet
definition: XSLT, programmeringsspråk
alternative label: XSLT
broader: Datorspråk
related: BAeH eg8 T2d
related: Fv7d YhP YmS
related: D9SL mtn vGM
related: DJh5 yyF hEM
related: 4Jty HpK a3Q

Sjuksköterskeexamen
type: Concept
in scheme: JobTech Taxonomy - Färdighet
definition: Sjuksköterskeexamen är en yrkesexamen på högskolenivå kopplad till utbildning med inriktning mot sjuksköterska.
broader: Yrkesbevis/examen
related: 2kLc pto DpV
related: NFUg y9y 1TY
related: bEDv SL7 VrL
related: 6eAB cbY i9T
related: NxXz fBh w7j
related: PHJN fva yxs
related: 7XXd 4St nit
related: nrVt xUL KdQ
related: cuaN Rj5 YCc
related: dyWo sDb MLQ
related: Bywn Doc 3VF
related: 6Fu3 qQA 9DK
related: 6zAR EHM Kwj
related: Z8ci bBE tmx
related: oj4c P4b cja

Strömningsteknik
type: Concept
in scheme: JobTech Taxonomy - Färdighet
definition: Strömningsteknik
broader: zmYu aAM TuF
related: K8yg U4C gkY
related: PRQn 9yw NJA
related: 4Jty HpK a3Q

CLP-Principal
type: Concept
in scheme: JobTech Taxonomy - Färdighet
definition: CLP-Principal
broader: s48H Sft DTn
related: BAeH eg8 T2d
related: hmaC cfi UKg
related: 1CX5 mZw Vcq
related: VCpu 5EN bBt
related: 13md uyV BNG

Yrkesutbildning, ambulanssjukvårdare
type: Concept
in scheme: JobTech Taxonomy - Färdighet
definition: Yrkesutbildning, ambulanssjukvårdare är en yrkeshögskoleutbildning med inriktning mot arbete inom ambulanssjukvården.
broader: Yrkesutbildning
related: 3H17 ZZr BEc

Regummering
type: Concept
in scheme: JobTech Taxonomy - Färdighet
definition: Regummering
broader: zmYu aAM TuF
related: Kxm9 N3V shF

1-färgstryck
type: Concept
in scheme: JobTech Taxonomy - Färdighet
definition: 1-färgstryck
broader: zmYu aAM TuF
related: XeJB bkn mRn

Synundersökning
type: Concept
in scheme: JobTech Taxonomy - Färdighet
definition: Synundersökning
broader: zmYu aAM TuF
related: PUhV DVQ MM6

Röjsågskörkort Nivå RB
type: Concept
in scheme: JobTech Taxonomy - Färdighet
definition: Röjsågskörkort Nivå RB Källa: skogsstyrelsen.se
broader: Yrkesbevis/examen
related: XBh3 Xrm C4R
related: qouP wtb 93q
related: 2xQ4 4kh kTZ

Gesällbrev, stickningsyrket
type: Concept
in scheme: JobTech Taxonomy - Färdighet
definition: Gesällbrev, stickningsyrket
broader: Yrkesbevis/examen
related: aKdV u7V R5j
related: skLS kpa Ui1

Manuell terapi
type: Concept
in scheme: JobTech Taxonomy - Färdighet
definition: Manuell terapi
broader: zmYu aAM TuF
related: F19Z oB6 pg3

Hållbar inredningsdesign
type: Concept
in scheme: JobTech Taxonomy - Färdighet
definition: Utveckla en miljövänlig inredningsdesign och främja användningen av kostnadseffektiva och förnybara material. Källa: ESCO
broader: zmYu aAM TuF
related: yXbD NTH ijE
related: 41KB bfk 5jR

Verksamhetsledning, livsmedelsproduktion
type: Concept
in scheme: JobTech Taxonomy - Färdighet
definition: Verksamhetsledning, livsmedelsproduktion
alternative label: Verksamhetsledning, livsmedelstillverkning
broader: zmYu aAM TuF
related: yJk6 azD ywF
related: kF59 fge kts
related: 5qT8 z9d 8rw
related: icae Y69 H8E
related: gJtZ EBc n2z

Verksamhetsledning, stadsträdgård
type: Concept
in scheme: JobTech Taxonomy - Färdighet
definition: Verksamhetsledning, stadsträdgård
broader: zmYu aAM TuF
related: 9QMD sZ3 ZjX

Kyrkomusik
type: Concept
in scheme: JobTech Taxonomy - Färdighet
definition: Kyrkomusik
broader: p1WM wCw LTd
related: AWJF wqZ va9

Kalkylprogram, undervisning
type: Concept
in scheme: JobTech Taxonomy - Färdighet
definition: Kalkylprogram, undervisning
broader: Dataundervisning
related: 1CX5 mZw Vcq
related: 4Jty HpK a3Q

Medicinsk fotvård
type: Concept
in scheme: JobTech Taxonomy - Färdighet
definition: Medicinsk fotvård avser specialistkompetensen att diagnostisera och behandla olika tillstånd och besvär relaterade till fötter och vrister. Detta innefattar åtgärder för att hantera problem såsom förhårdnader, nageltrång och andra fotrelaterade sjukdomstillstånd, samt att ge råd om egenvård och hjälpmedel.
broader: zmYu aAM TuF
related: HATH AfN RRz
related: vTgW pnr QMp

Mästarbrev, glashantverksyrken
type: Concept
in scheme: JobTech Taxonomy - Färdighet
definition: Mästarbrev, glashantverksyrken
broader: Yrkesbevis/examen
related: aKdV u7V R5j

Finbröd
type: Concept
in scheme: JobTech Taxonomy - Färdighet
definition: Finbröd
broader: zmYu aAM TuF
related: 5qT8 z9d 8rw

Tågklarering
type: Concept
in scheme: JobTech Taxonomy - Färdighet
definition: Tågklarering avser kompetensen att samordna och övervaka tågtrafik, inklusive säkerställande av att tåg kör enligt gällande tidtabeller och säkerhetsbestämmelser. Den omfattar även ansvar för att styra tågtrafik inom specifika geografiska områden och hantera växlar och signaler.
broader: zmYu aAM TuF
related: 957L kZK rHZ

Elektrooptik
type: Concept
in scheme: JobTech Taxonomy - Färdighet
definition: Elektrooptik
broader: zmYu aAM TuF
related: nDaB vdy eAy
related: SPYW 7Z1 ShT

Lehr (styrning av avkylningsprocess)
type: Concept
in scheme: JobTech Taxonomy - Färdighet
definition: Lehr (styrning av avkylningsprocess)
broader: zmYu aAM TuF
related: hxm6 xkr dHm

Kustbevakningens grundutbildning
type: Concept
in scheme: JobTech Taxonomy - Färdighet
definition: Kustbevakningens grundutbildning är en eftergymnasial yrkesinriktad utbildning mot arbete inom kustbevakningen.
broader: Yrkesbevis/examen
related: FKCE Anf zGH

EASA-certifikat, kategori A2 (flygplan kolvmotor)
type: Concept
in scheme: JobTech Taxonomy - Färdighet
definition: EASA-certifikat, kategori A2 (flygplan kolvmotor)
broader: s48H Sft DTn
related: iGTu bYL 2T7

Pulverbågsvetsning
type: Concept
in scheme: JobTech Taxonomy - Färdighet
definition: Pulverbågsvetsning är en högproduktiv, mekaniserad svetsmetod, som kan utföras med en till tre kontinuerliga elektroder. Källa: Svetskommissionen
broader: on11 B1f LEw
related: wQ1E Bzk ZyA
related: TrwQ RXT W8a
related: L4hA SJP SFi
related: bXfo 4hb SXx

Yrkesbevis, naturstensarbete steg 1–3
type: Concept
in scheme: JobTech Taxonomy - Färdighet
definition: Yrkesbevis, naturstensarbete steg 1–3
broader: Yrkesbevis/examen
related: XBh3 Xrm C4R
related: df9D e6y 61z

Maskinbokbindning
type: Concept
in scheme: JobTech Taxonomy - Färdighet
definition: Maskinbokbindning avser processen att binda böcker, broschyrer och tidskrifter med hjälp av maskiner. Kompetensen innefattar kunskaper om och hantering av olika bokbinderimaskiner, samt förståelse för materialvals och kvalitetskontroll i bindningsprocessen.
broader: zmYu aAM TuF
related: mPzg 93F QEv
related: 4Jty HpK a3Q

Heminredningsprodukter
type: Concept
in scheme: JobTech Taxonomy - Färdighet
definition: Heminredningsprodukter
broader: zmYu aAM TuF
related: oXSW fbY XrY
related: YKL2 FCB 1yr
related: 85cq 6uK 4cK

Samtalsmetodik
type: Concept
in scheme: JobTech Taxonomy - Färdighet
definition: Samtalsmetodik
broader: zmYu aAM TuF
related: jJF3 qaQ Zsh
related: bjqk F3A 5Hk

Ritningsläsning, armering
type: Concept
in scheme: JobTech Taxonomy - Färdighet
definition: Ritningsläsning, armering
broader: zmYu aAM TuF
related: bZ4J riZ zK6
related: q2Ge zrQ zJb

Verksamhetsledning, hamn
type: Concept
in scheme: JobTech Taxonomy - Färdighet
definition: Verksamhetsledning, hamn
broader: zmYu aAM TuF
related: 3i4a Ufc qpp

Naturgasteknik
type: Concept
in scheme: JobTech Taxonomy - Färdighet
definition: Naturgasteknik innefattar bland annat utvinning, bearbetning och användningsområden för naturgas. Detta innefattar även utrustning för lagring distribution och hantering av flytande naturgas (LNG). Källa: ESCO och aktuella annonser
broader: zmYu aAM TuF
related: PRQn 9yw NJA

WordPress, CMS
type: Concept
in scheme: JobTech Taxonomy - Färdighet
definition: WordPress, CMS, avser ett innehållshanteringssystem som möjliggör skapande, redigering och publicering av digitalt innehåll på webbplatser. Kompetensen omfattar förståelse för systemets funktioner och verktyg samt förmåga att anpassa och underhålla webbplatser baserat på användarens behov.
alternative label: WordPress, innehållshanteringssystem
broader: jTAz uCP RNc
related: BAeH eg8 T2d
related: cBBa ngH fCx
related: Fv7d YhP YmS
related: vPP6 rsw dck
related: oEmP NC1 sXE
related: 4Jty HpK a3Q
related: MYAz x9m 2LJ

LabView, programmeringsspråk
type: Concept
in scheme: JobTech Taxonomy - Färdighet
definition: LabView, programmeringsspråk
alternative label: LabView
broader: Datorspråk
related: BAeH eg8 T2d
related: Fv7d YhP YmS
related: nDaB vdy eAy
related: D9SL mtn vGM
related: DJh5 yyF hEM
related: SPYW 7Z1 ShT
related: 4Jty HpK a3Q

Diabetesvård, specialistområde för sjuksköterska
type: Concept
in scheme: JobTech Taxonomy - Färdighet
definition: En fördjupad specialistkompetens för sjuksköterska inom diabetsvård.
broader: Specialistområde för sjuksköterska
related: 6zAR EHM Kwj
related: oj4c P4b cja

Baryton
type: Concept
in scheme: JobTech Taxonomy - Färdighet
definition: Baryton
broader: Sång
related: AWJF wqZ va9

Gruppsykologi
type: Concept
in scheme: JobTech Taxonomy - Färdighet
definition: Gruppsykologi
broader: zmYu aAM TuF
related: VYeq GDF a2g

Jordkabelsarbeten
type: Concept
in scheme: JobTech Taxonomy - Färdighet
definition: Jordkabelsarbeten
broader: zmYu aAM TuF
related: MW1P GNJ 4F9

Filterteknik
type: Concept
in scheme: JobTech Taxonomy - Färdighet
definition: Filterteknik
broader: zmYu aAM TuF
related: v9nU 6Fw 4Qg

Showdans
type: Concept
in scheme: JobTech Taxonomy - Färdighet
definition: Showdans
broader: Dans
related: gmRr 7tt eHj

Reparationsrådgivning, bilverkstad
type: Concept
in scheme: JobTech Taxonomy - Färdighet
definition: Reparationsrådgivning, bilverkstad avser kompetensen att ge vägledning och råd kring reparationer och underhåll av motorfordon. Detta innefattar att analysera problem och behov, samt att förmedla information om kostnader och alternativ till kunder som besöker en bilverkstad.
broader: zmYu aAM TuF
related: Lzpv ofL 3H5
related: dUuh wwa FGj

Filminspelning
type: Concept
in scheme: JobTech Taxonomy - Färdighet
definition: Filminspelning
broader: zmYu aAM TuF
related: 4BsK q2C sCL
related: PH2M uV4 r72

Dekorationsmålning
type: Concept
in scheme: JobTech Taxonomy - Färdighet
definition: Dekorationsmålning
broader: zmYu aAM TuF
related: 34Tn BQQ tfo
related: QKvX v7r PNL

Verksamhetsledning, rederi
type: Concept
in scheme: JobTech Taxonomy - Färdighet
definition: Verksamhetsledning, rederi
broader: zmYu aAM TuF
related: 3i4a Ufc qpp

Betongarbete
type: Concept
in scheme: JobTech Taxonomy - Färdighet
definition: Betongarbete
broader: zmYu aAM TuF
related: DPPw 4wa AsH
related: q2Ge zrQ zJb
related: o31g CX1 qhQ

Administrativt stöd, erfarenhet
type: Concept
in scheme: JobTech Taxonomy - Färdighet
definition: Administrativt stöd, erfarenhet avser kompetens att utföra och bistå i olika administrativa uppgifter som underlättar verksamhetens funktioner.
broader: zmYu aAM TuF
related: vPP6 rsw dck
related: zKvJ GnC Szx
related: vCAb uuo ek5

Skrädderiarbeten
type: Concept
in scheme: JobTech Taxonomy - Färdighet
definition: Skrädderiarbeten avser processen att designa, konstruera och anpassa klädesplagg och textilprodukter för individuella kunder eller specifika behov. Kompetensen innefattar kunskap om olika tyger, mönsterkonstruktion och sömnadstekniker, samt förmåga att utföra reparationer och omarbetningar av befintliga kläder.
broader: zmYu aAM TuF
related: mwVN oEH g9k
related: vJQk YvC XB7
related: PF4H kQD zpL

Pedagogisk dokumentation
type: Concept
in scheme: JobTech Taxonomy - Färdighet
definition: Pedagogisk dokumentation
broader: zmYu aAM TuF
related: Hi9c iTe gHH
related: 5ek3 Cgq WeZ

Speciallärarexamen inriktning matematikutveckling
type: Concept
in scheme: JobTech Taxonomy - Färdighet
definition: Speciallärarexamen inriktning matematikutveckling är en examen på högskolenivå kopplad till utbildning för speciallärare med inriktning matematikutveckling.
broader: Yrkesbevis/examen
related: 3FP7 4Eg x8P

Onkologi, specialistkompetens för fysioterapeuter
type: Concept
in scheme: JobTech Taxonomy - Färdighet
definition: Onkologi, specialistkompetens för fysioterapeuter
broader: Specialistinriktning inom fysioterapi
related: s7vU FhY L5Z

Yrkesbevis, tak- och tätskiktsmontör
type: Concept
in scheme: JobTech Taxonomy - Färdighet
definition: Yrkesbevis, tak- och tätskiktsmontör
broader: Yrkesbevis/examen
related: 3g5x Tm7 8QH

Klassisk massage
type: Concept
in scheme: JobTech Taxonomy - Färdighet
definition: Klassisk massage avser en form av terapeutisk behandling som syftar till att motverka spänningar och främja avslappning i kroppens mjukdelsvävnader. Denna kompetens innebär kunskaper om olika massagetekniker och kroppsanatomi för att kunna utföra behandlingar anpassade efter individens behov.
broader: zmYu aAM TuF
related: ezKk kss CiQ
related: xr7w N6Q QMA
related: uxHV KXc PKD

Vidareutbildning inom ortodonti för tandsköterskor
type: Concept
in scheme: JobTech Taxonomy - Färdighet
definition: Vidareutbildning inom ortodonti för tandsköterskor är en vidareutbildning med inriktning mot ortodonti/tandreglering.
broader: Yrkesbevis/examen
related: 5dxv nVQ N8o

Budgetansvar
type: Concept
in scheme: JobTech Taxonomy - Färdighet
definition: Budgetansvar avser hantering och övervakning av budgetar inom en verksamhet, vilket inkluderar planering, fördelning av resurser och uppföljning av ekonomiska mål. Kompetensen innefattar också att säkerställa att verksamheten håller sig inom de fastställda budgetramarna.
broader: zmYu aAM TuF
related: x9mo 1VH Rps
related: eQ4M CNm ozj
related: Y6yY SuR hVh
related: oXSW fbY XrY
related: cBBa ngH fCx
related: womV SEj CAH
related: NQTS fou E6u
related: Qo7p wjf gtv
related: Fu4x 7KG YgC
related: mNoS AN5 drn
related: 8SPu K1k 5qR
related: Uw4n UB2 RCW
related: WhBn FAp ZNW
related: pf1K PTz frm
related: 48KE fDE ryL
related: vPP6 rsw dck
related: ajwx FvL YuY
related: bYde Frc xcB
related: coyZ Cyv Srw
related: thZP oR7 WrY
related: QG4f MCh vND
related: NxXz fBh w7j
related: SgNH hag n9D
related: 7mn2 kA9 ftp
related: Pz9M srJ Lc9
related: Fp7x Yqt bx9
related: 33Nt DSs YYA
related: z8di AqX GBr
related: g6eC Fwu B3J
related: ddGt fEH 432
related: DJh5 yyF hEM
related: eWiB mGP MjE
related: mZsb A1K Gec
related: U8HK Jdi GuC
related: eX3C MtJ nPA
related: 4GAs rKs 2Ne
related: wby2 mwq fWV
related: AuTi FEo j3R
related: cRmd 536 pT1
related: uxst tkg zDh
related: X1Ac Y9P PJo
related: FfMN Bw1 qYR
related: hZLv S5f jo2
related: mpuA s56 Hsy
related: 3i4a Ufc qpp
related: sWzF 6pd Y6L
related: rYSG 3WJ LmC
related: 9QMD sZ3 ZjX
related: nNxJ YWy vR2
related: 1uau t1u rDL
related: XGyi i4B ME7
related: h324 DPT 7Tw
related: 9Mn4 PNA 7Yz
related: 85cq 6uK 4cK
related: pok1 ipJ yzD
related: UXKZ 3zZ ipB

Rättspsykiatrisk vård
type: Concept
in scheme: JobTech Taxonomy - Färdighet
definition: Rättspsykiatrisk vård
broader: zmYu aAM TuF
related: bEDv SL7 VrL
related: 7fNG sve JWU

Doktorsexamen, biologiämnen
type: Concept
in scheme: JobTech Taxonomy - Färdighet
definition: Doktorsexamen, biologiämnen
broader: Yrkesbevis/examen
related: Gm5j S2Y aTB
related: cYCo PxY zQd

Linbaneskötsel
type: Concept
in scheme: JobTech Taxonomy - Färdighet
definition: Linbaneskötsel
broader: zmYu aAM TuF
related: XYzP 5Tn 7Ep

Högskoleexamen
type: Concept
in scheme: JobTech Taxonomy - Färdighet
definition: Högskoleexamen är en generell examen på högskolenivå som består av fullgjorda kurser om 120 högskolepoäng varav minst 60 högskolepoäng ska vara inom en viss inriktning (huvudområde). Källa: UHR (Universitets- och högskolerådet)
broader: Yrkesövergripande kompetenser
related: Qo7p wjf gtv
related: vPP6 rsw dck

Ventilationsrengöring
type: Concept
in scheme: JobTech Taxonomy - Färdighet
definition: Ventilationsrengöring avser åtgärder och metoder för att rengöra ventilationssystem och aggregat. Kompetensen inkluderar tekniker för att avlägsna damm, smuts och andra föroreningar, vilket bidrar till att förbättra luftkvaliteten inomhus och förebygga hälsoproblem.
broader: zmYu aAM TuF
related: idjo 2Wr a3E
related: Z6TY xDf Yup
related: yXbD NTH ijE
related: SUfj 4D9 FNx

Verksamhetsledning, trädgårdsföretag
type: Concept
in scheme: JobTech Taxonomy - Färdighet
definition: Verksamhetsledning, trädgårdsföretag avser ansvaret för strategisk och operativ ledning av företag som verkar inom trädgårdssektorn. Kompetensen omfattar formulering av mål, strategier och riktlinjer, budgetansvar samt resursfördelning och personalansvar för att säkerställa verksamhetens framgång och effektivitet.
broader: zmYu aAM TuF
related: 2xQ4 4kh kTZ
related: 9QMD sZ3 ZjX

Pedagogiska utredningar
type: Concept
in scheme: JobTech Taxonomy - Färdighet
definition: Pedagogiska utredningar
broader: zmYu aAM TuF
related: 3FP7 4Eg x8P

Bowling, instruktör/Bowling, tränare
type: Concept
in scheme: JobTech Taxonomy - Färdighet
definition: Bowling, instruktör/Bowling, tränare
alternative label: Bowling, instruktör
alternative label: Bowling, tränare
broader: Idrott/aktivitet
related: EA6o N1N QtT

Sjukhusfotografering
type: Concept
in scheme: JobTech Taxonomy - Färdighet
definition: Sjukhusfotografering
broader: zmYu aAM TuF
related: 3J38 DNz YKK

Allergologi, specialistkompetens för läkare
type: Concept
in scheme: JobTech Taxonomy - Färdighet
definition: Allergologi, specialistkompetens för läkare
broader: Specialistbevis för läkare
related: nu7c QuB KVQ

Fullbetald elektriker
type: Concept
in scheme: JobTech Taxonomy - Färdighet
definition: Fullbetald elektriker
broader: Yrkesbevis/examen
related: yyF7 jsW EeP

Reningsteknik inom gasindustri
type: Concept
in scheme: JobTech Taxonomy - Färdighet
definition: Rening av gaser från industri. Föroreningar i gaser kan vara gasformiga eller partikelformiga. Vänliga ämnen som renas från naturgas är kvicksilver, kväve och helium. Källa: egen undersökning och ESCO
broader: zmYu aAM TuF
related: yXbD NTH ijE
related: Cppd 9P7 HeR
related: PRQn 9yw NJA

Gesällbrev, installatör - inbrottslarm
type: Concept
in scheme: JobTech Taxonomy - Färdighet
definition: Gesällbrev, installatör - inbrottslarm
broader: Yrkesbevis/examen
related: fWrt sLg koW
related: 4Jty HpK a3Q

Skogsbruksplanläggning
type: Concept
in scheme: JobTech Taxonomy - Färdighet
definition: Skogsbruksplanläggning
broader: zmYu aAM TuF
related: yXbD NTH ijE
related: 3LdB WEJ 8Ms

Fordonsreservdelar, produktkunskap
type: Concept
in scheme: JobTech Taxonomy - Färdighet
definition: Fordonsreservdelar, produktkunskap avser kunskaper om och förståelse för olika reservdelar som används i motorfordon, inklusive deras funktioner, specifikationer och kompatibilitet med olika fordonsmodeller. Denna kompetens omfattar även insikter i hur reservdelar påverkar fordonets prestanda och underhåll, samt kunskap om korrekt installation och utbyte av dessa delar.
broader: zmYu aAM TuF
related: Lzpv ofL 3H5
related: WhBn FAp ZNW
related: JnTF wXr 6Eh
related: dUuh wwa FGj
related: YKL2 FCB 1yr

Tältmontering
type: Concept
in scheme: JobTech Taxonomy - Färdighet
definition: Tältmontering
broader: zmYu aAM TuF
related: ieVp d5L rS9

Motivlackering
type: Concept
in scheme: JobTech Taxonomy - Färdighet
definition: Motivlackering avser en teknik inom måleriet där detaljerade och konstnärliga motiv appliceras på ytor genom lackering. Kompetensen inkluderar förmåga att kombinera färger och mönster för att skapa estetiska och dekorativa effekter på olika material.
broader: zmYu aAM TuF
related: dKUb KBP mw3

Virkesmätarutbildning
type: Concept
in scheme: JobTech Taxonomy - Färdighet
definition: Virkesmätarutbildning är en yrkesutbildning med inriktning mot mätning och bedömning av virke.
broader: Yrkesbevis/examen
related: qouP wtb 93q

UI-art
type: Concept
in scheme: JobTech Taxonomy - Färdighet
definition: UI-art
broader: zmYu aAM TuF
related: 4Jty HpK a3Q
related: Mbt6 3ko DiD

Compiere, affärssystem
type: Concept
in scheme: JobTech Taxonomy - Färdighet
definition: Compiere, affärssystem
alternative label: Compiere
broader: xSJR 1Kq pxB
related: eQ4M CNm ozj
related: Y6yY SuR hVh
related: Uw4n UB2 RCW
related: iWcY mko rq2
related: q81z 3oD 1qu
related: cRmd 536 pT1
related: ij8k EwC zyB
related: 4Jty HpK a3Q

Gemmologi
type: Concept
in scheme: JobTech Taxonomy - Färdighet
definition: Gemmologi avser studien av ädelstenar och deras egenskaper, inklusive identifiering, klassificering och värdering. Kompetensen omfattar kunskaper om olika typer av ädelstenar, deras ursprung och behandlingsmetoder samt tekniker för att bedöma deras kvalitet och värde.
broader: zmYu aAM TuF
related: nwSm phw sPo

Fartygsbefäl klass VI (behörighet)
type: Concept
in scheme: JobTech Taxonomy - Färdighet
definition: Fartygsbefäl klass VI (behörighet)
broader: Behörigheter, sjöfart
related: kZwz D8K bKs
related: kDnq Q98 sD3

Brotschning
type: Concept
in scheme: JobTech Taxonomy - Färdighet
definition: Brotschning
broader: zmYu aAM TuF
related: 4bxV 58E P9N

Svenska som andraspråk, undervisning grundskola
type: Concept
in scheme: JobTech Taxonomy - Färdighet
definition: Svenska som andraspråk, undervisning grundskola
broader: Inriktning på lärarkompetens
related: oQUQ D11 HPx

Webbdesign-Adobe Animate/Flash
type: Concept
in scheme: JobTech Taxonomy - Färdighet
definition: Webbdesign-Adobe Animate/Flash
alternative label: Webbdesign-Adobe Animate
alternative label: Webbdesign-Adobe Flash
broader: Programvara för digitalt skapande
related: 8Bmh vtM zts
related: Q5DF juj 8do
related: SgNH hag n9D
related: k1Nx auG sNh
related: 4Jty HpK a3Q
related: Mbt6 3ko DiD

Doktorsexamen, samhällsvetenskapliga ämnen
type: Concept
in scheme: JobTech Taxonomy - Färdighet
definition: Doktorsexamen, samhällsvetenskapliga ämnen
broader: Yrkesbevis/examen
related: Gm5j S2Y aTB
related: cYCo PxY zQd

Konferensservice
type: Concept
in scheme: JobTech Taxonomy - Färdighet
definition: Konferensservice avser åtgärder och aktiviteter som syftar till att planera och genomföra konferenser och möten, vilket innefattar hantering av lokaler, utrustning och förtäring. Kompetensen innefattar även att säkerställa att teknisk utrustning fungerar som den ska och att deltagarnas behov tillgodoses under evenemanget.
broader: zmYu aAM TuF
related: bYde Frc xcB
related: 9DdK AZY ZNK

Biotester
type: Concept
in scheme: JobTech Taxonomy - Färdighet
definition: Biotester
broader: zmYu aAM TuF
related: yXbD NTH ijE
related: bExu 8gk azk

Ridterapi
type: Concept
in scheme: JobTech Taxonomy - Färdighet
definition: Ridterapi
broader: zmYu aAM TuF
related: BWwk fYX S5B
related: 3FP7 4Eg x8P
related: s7vU FhY L5Z
related: F19Z oB6 pg3

Psykiatrisk arbetsterapi
type: Concept
in scheme: JobTech Taxonomy - Färdighet
definition: Psykiatrisk arbetsterapi
broader: zmYu aAM TuF
related: TPH4 2AM isT

Värdepappershandel
type: Concept
in scheme: JobTech Taxonomy - Färdighet
definition: Värdepappershandel avser kompetens att köpa och sälja värdepapper som aktier, obligationer och derivat på finansmarknader, ofta på uppdrag av kunder eller arbetsgivare. Den inkluderar analys av marknadstrender, riskbedömning, transaktionshantering och kundrådgivning för att optimera investeringar.
broader: zmYu aAM TuF
related: aQpg E2T cWq

Observationstekniker, UX
type: Concept
in scheme: JobTech Taxonomy - Färdighet
definition: Observationstekniker, UX
broader: zmYu aAM TuF
related: UxT1 tPF Kbg
related: 4Jty HpK a3Q

Gruvavfall
type: Concept
in scheme: JobTech Taxonomy - Färdighet
definition: Gruvavfall är ett mineralavfall som uppkommer vid utvinning av mineral. Gruvavfallet består främst av gråberg och anrikningssand, som är det bergmaterial som blir över efter brytning och anrikning av metallhaltig malm. Dessutom uppkommer relativt små mängder kasserad sand och lera. Källa: SCB
broader: zmYu aAM TuF
related: 3jEy yuT aVo
related: rwpH 6RA XTT
related: w6ud quG dgh
related: 7mn2 kA9 ftp
related: yXbD NTH ijE
related: V7Yz 4WV g4z
related: f71c gjL RDq

Blått certifikat, CNC
type: Concept
in scheme: JobTech Taxonomy - Färdighet
definition: Blått certifikat, CNC
broader: s48H Sft DTn
related: vaEp iBS c5h
related: 4Jty HpK a3Q

Fysikalisk kemi
type: Concept
in scheme: JobTech Taxonomy - Färdighet
definition: Fysikalisk kemi
broader: zmYu aAM TuF
related: v9nU 6Fw 4Qg
related: qn2U dB9 Cmh
related: eofS oZs RZi
related: bExu 8gk azk

Centrifugering, kemisk produktion
type: Concept
in scheme: JobTech Taxonomy - Färdighet
definition: Centrifugering, kemisk produktion
broader: zmYu aAM TuF
related: rxmK wwM 1NA
related: QEBd qHu vGr

Klassificering av handlingar
type: Concept
in scheme: JobTech Taxonomy - Färdighet
definition: Klassificering av handlingar
broader: zmYu aAM TuF
related: 2kLc pto DpV
related: eQ4M CNm ozj
related: wVfo Njx 1rB
related: TQkt eeK eNp
related: zKvJ GnC Szx
related: 4Jty HpK a3Q

Databasdesign
type: Concept
in scheme: JobTech Taxonomy - Färdighet
definition: Databasdesign
broader: zmYu aAM TuF
related: DJh5 yyF hEM
related: 4Jty HpK a3Q
related: UXKZ 3zZ ipB

Chassiteknik
type: Concept
in scheme: JobTech Taxonomy - Färdighet
definition: Chassiteknik
broader: zmYu aAM TuF
related: L4hA SJP SFi

Friluftsledare, erfarenhet
type: Concept
in scheme: JobTech Taxonomy - Färdighet
definition: Friluftsledare, erfarenhet
broader: zmYu aAM TuF
related: A6X3 efC VNy

Bilglasning
type: Concept
in scheme: JobTech Taxonomy - Färdighet
definition: Bilglasning
broader: zmYu aAM TuF
related: J17g Q2a 2u1

Attributörsuppgifter
type: Concept
in scheme: JobTech Taxonomy - Färdighet
definition: Attributörsuppgifter
broader: zmYu aAM TuF
related: PH2M uV4 r72

Gjutning, klass 1
type: Concept
in scheme: JobTech Taxonomy - Färdighet
definition: Gjutning, klass 1
broader: zmYu aAM TuF
related: thZP oR7 WrY

Hyresavtal fastighet
type: Concept
in scheme: JobTech Taxonomy - Färdighet
definition: Kompetensen hyresavtal handlar om att hantera, förhandla och administrera hyreskontrakt inom fastighetsförvaltning. Det omfattar upprättande och omförhandling av avtal, hyresjusteringar, inkasso, vakanshantering och efterlevnad av hyreslagstiftning samt kundkontakter kring kontraktsskrivning och andrahandsuthyrning.
broader: zmYu aAM TuF
related: U8HK Jdi GuC

Mjukvarukonstruktion
type: Concept
in scheme: JobTech Taxonomy - Färdighet
definition: Mjukvarukonstruktion avser processer för design och utveckling av programvara och IT-system. Kompetensen inkluderar bland annat analys, programmering och dokumentation, med fokus på att skapa effektiva och användarvänliga lösningar för olika applikationer och system.
broader: zmYu aAM TuF
related: nDaB vdy eAy
related: DJh5 yyF hEM
related: SPYW 7Z1 ShT

Windows Azure, molnplattform
type: Concept
in scheme: JobTech Taxonomy - Färdighet
definition: Windows Azure, molnplattform, avser en plattform för molntjänster som möjliggör utveckling, testning, distribution och hantering av applikationer och tjänster genom Microsofts globala datacenter. Kompetensen omfattar kunskap om att använda och integrera olika tjänster inom plattformen för att stödja IT-lösningar och affärsbehov.
alternative label: Windows Azure
broader: Applikationsplattformar
related: VCpu 5EN bBt
related: DJh5 yyF hEM
related: 4Jty HpK a3Q
related: UXKZ 3zZ ipB

Skolhälsovård, specialistkompetens för läkare
type: Concept
in scheme: JobTech Taxonomy - Färdighet
definition: Skolhälsovård, specialistkompetens för läkare
broader: Specialistbevis för läkare
related: nu7c QuB KVQ

Möbeltillverkning
type: Concept
in scheme: JobTech Taxonomy - Färdighet
definition: Möbeltillverkning avser processen för att skapa och färdigställa möbler, vilket innefattar design, tillverkning och sammansättning av olika material som trä, metal och textilier. Kompetensen innebär kunskap om både traditionella och moderna tillverkningsmetoder, samt förståelse för ergonomi och hållbarhet i möbeldesign.
broader: zmYu aAM TuF
related: VKKg e4t t46

Barnmorskemottagning
type: Concept
in scheme: JobTech Taxonomy - Färdighet
definition: Barnmorskemottagning
broader: zmYu aAM TuF
related: 7XXd 4St nit

Tvärflöjt, undervisning musikskola
type: Concept
in scheme: JobTech Taxonomy - Färdighet
definition: Tvärflöjt, undervisning musikskola
broader: zmYu aAM TuF
related: mcRJ kq2 jFr

Räddningsledning
type: Concept
in scheme: JobTech Taxonomy - Färdighet
definition: Räddningsledning
broader: zmYu aAM TuF
related: ug5y o6z U3L

Filterkonstruktion (elektroniska filter)
type: Concept
in scheme: JobTech Taxonomy - Färdighet
definition: Filterkonstruktion (elektroniska filter)
broader: zmYu aAM TuF
related: nDaB vdy eAy
related: SPYW 7Z1 ShT
related: 4Jty HpK a3Q

Värmebehandlingsugn
type: Concept
in scheme: JobTech Taxonomy - Färdighet
definition: Värmebehandlingsugn avser en apparat som används för att värmebehandla material, särskilt metall, för att förbättra deras egenskaper genom olika processer som härdning, glödgning eller mjukning. Kompetensen innefattar kunskap om reglagesystem och temperaturkontroll för att säkerställa korrekta värmebehandlingscykler för att uppnå önskade materialegenskaper.
broader: zmYu aAM TuF
related: E87t egE pjA

Arbete på väg steg 3, anpassad säkerhetskompetens
type: Concept
in scheme: JobTech Taxonomy - Färdighet
definition: Arbete på väg steg 3, anpassad säkerhetskompetens Se www.trafikverket.se
broader: s48H Sft DTn
related: mis4 feV uex
related: 3ZtN hhA SM7
related: bZ4J riZ zK6
related: thZP oR7 WrY
related: 7zKm 4NW eey
related: w6ud quG dgh
related: ayQ4 G3W A2w
related: 3MBw pDA P2F
related: ketV G9W GeR

Byggkonstruktion-POINT Konstruktion
type: Concept
in scheme: JobTech Taxonomy - Färdighet
definition: Byggkonstruktion-POINT Konstruktion
broader: mTLu uo2 gq2
related: thZP oR7 WrY
related: w6ud quG dgh
related: Pd51 xnr KCY
related: XeBP nMe pXx
related: ETAR ggZ Wuw
related: 41KB bfk 5jR
related: 4Jty HpK a3Q

TCP/IP, kommunikationsprotokoll
type: Concept
in scheme: JobTech Taxonomy - Färdighet
definition: TCP/IP, kommunikationsprotokoll
alternative label: TCP/IP
broader: Kommunikationsprotokoll
related: BAeH eg8 T2d
related: cBBa ngH fCx
related: Fv7d YhP YmS
related: Q5DF juj 8do
related: D9SL mtn vGM
related: VCpu 5EN bBt
related: DJh5 yyF hEM
related: fWrt sLg koW
related: 4Jty HpK a3Q
related: 13md uyV BNG
related: UXKZ 3zZ ipB
related: MYAz x9m 2LJ

Bibbo, hotellbokningssystem
type: Concept
in scheme: JobTech Taxonomy - Färdighet
definition: Bibbo, hotellbokningssystem
alternative label: Bibbo
broader: kRoQ fPR 8oK
related: bYde Frc xcB
related: 4Jty HpK a3Q

Byggsanering
type: Concept
in scheme: JobTech Taxonomy - Färdighet
definition: Byggsanering
broader: zmYu aAM TuF
related: idjo 2Wr a3E
related: yXbD NTH ijE

Lastbilslackering
type: Concept
in scheme: JobTech Taxonomy - Färdighet
definition: Lastbilslackering avser processen att applicera lack och färg på lastbilar för att skydda ytan och ge ett estetiskt tilltalande utseende. Kompetensen innefattar kunskaper om olika lackeringsmetoder, ytförberedelse och hantering av specialiserade verktyg och material som används för att uppnå önskade kvalitetsstandarder.
broader: zmYu aAM TuF
related: dKUb KBP mw3

Appium, systemutvecklingsverktyg
type: Concept
in scheme: JobTech Taxonomy - Färdighet
definition: Appium, systemutvecklingsverktyg
alternative label: Appium
broader: Programmerings- och systemutvecklingsverktyg
related: D9SL mtn vGM
related: 4Jty HpK a3Q

Geologi
type: Concept
in scheme: JobTech Taxonomy - Färdighet
definition: Geologi
broader: zmYu aAM TuF
related: 7zKm 4NW eey
related: yXbD NTH ijE
related: XeBP nMe pXx

Trafikundervisning, motorcykel
type: Concept
in scheme: JobTech Taxonomy - Färdighet
definition: Trafikundervisning, motorcykel
broader: zmYu aAM TuF
related: nuXg Wjc JPd
related: yVZH zHh 6fG

Ringnotsfiske
type: Concept
in scheme: JobTech Taxonomy - Färdighet
definition: Ringnotsfiske
broader: zmYu aAM TuF
related: Lm3Z gek GYc

Estetiska programmet, undervisning
type: Concept
in scheme: JobTech Taxonomy - Färdighet
definition: Estetiska programmet, undervisning
broader: zmYu aAM TuF
related: mcRJ kq2 jFr

Behörighetsbevis enligt FSD 5115 behörighetsklass YR
type: Concept
in scheme: JobTech Taxonomy - Färdighet
definition: Behörighetsbevis enligt FSD 5115 behörighetsklass YR
broader: s48H Sft DTn
related: SgAJ DW2 FN5
related: Kxm9 N3V shF
related: shkw ojo UL2

VVS, el, tele-Magicad
type: Concept
in scheme: JobTech Taxonomy - Färdighet
definition: VVS, el, tele-Magicad
broader: mTLu uo2 gq2
related: K8yg U4C gkY
related: nDaB vdy eAy
related: SPYW 7Z1 ShT
related: PRQn 9yw NJA
related: 4Jty HpK a3Q

Integrationsplattformar
type: Concept
in scheme: JobTech Taxonomy - Färdighet
top concept of: JobTech Taxonomy - Färdighet
definition: Integrationsplattformar
narrower: Microsoft Biztalk, integrationsplattform
narrower: IBM MQ
narrower: Software AG Integration Suite, integrationsplattform
narrower: Citrix, integrationsplattform
narrower: Software AG WebMethods, integrationsplattform
narrower: Sun SeeBeyond eGate Integrator, integrationsplattform
narrower: TIBCO, integrationsplattform
narrower: Oracle Service Bus, integrationsplattform
narrower: IBM Integration Bus
narrower: wUMC s8f Tmb
narrower: Oracle Data Integrator, integrationsplattform
narrower: Oracle Fusion Middleware, integrationsplattform

Ritteknik/Ritningsproduktion
type: Concept
in scheme: JobTech Taxonomy - Färdighet
definition: Ritteknik/Ritningsproduktion
alternative label: Ritningsproduktion
alternative label: Ritteknik
broader: zmYu aAM TuF
related: mis4 feV uex
related: 3jEy yuT aVo
related: thZP oR7 WrY
related: K8yg U4C gkY
related: nDaB vdy eAy
related: 33Nt DSs YYA
related: 4BsK q2C sCL
related: ketV G9W GeR
related: SPYW 7Z1 ShT
related: XeBP nMe pXx
related: PRQn 9yw NJA
related: PH2M uV4 r72
related: 4Jty HpK a3Q
related: CSUf ZVM a7Z

3D-grafik-McNeel Rhino 3D
type: Concept
in scheme: JobTech Taxonomy - Färdighet
definition: 3D-grafik-McNeel Rhino 3D
broader: Programvara för digitalt skapande
related: 8Bmh vtM zts
related: 34Tn BQQ tfo
related: Q5DF juj 8do
related: 4Jty HpK a3Q
related: LeQV umf wUS
related: Mbt6 3ko DiD

Verktygsteknik
type: Concept
in scheme: JobTech Taxonomy - Färdighet
definition: Verktygsteknik
broader: zmYu aAM TuF
related: K8yg U4C gkY
related: PRQn 9yw NJA

Reparation av dragspel
type: Concept
in scheme: JobTech Taxonomy - Färdighet
definition: Reparation av dragspel
broader: zmYu aAM TuF
related: aKdV u7V R5j

E-handel, sårbarhetsanalys/Elektronisk handel, sårbarhetsanalys
type: Concept
in scheme: JobTech Taxonomy - Färdighet
definition: E-handel, sårbarhetsanalys/Elektronisk handel, sårbarhetsanalys
alternative label: E-handel, sårbarhetsanalys
alternative label: Elektronisk handel, sårbarhetsanalys
broader: zmYu aAM TuF
related: BAeH eg8 T2d
related: 4Jty HpK a3Q

Foderväxtodling
type: Concept
in scheme: JobTech Taxonomy - Färdighet
definition: Foderväxtodling
broader: zmYu aAM TuF
related: yXbD NTH ijE
related: 9QMD sZ3 ZjX
related: k3R3 UkC nK2
related: RYCQ ogb uUY

A-kassefrågor
type: Concept
in scheme: JobTech Taxonomy - Färdighet
definition: A-kassefrågor avser frågor och ärenden kopplade till arbetslöshetsförsäkringen och dess hantering. Kompetensen inkluderar kunnande om regler, rättigheter och skyldigheter som rör A-kassa, samt möjlighet att ge information och vägledning till individer angående deras situationer inom detta område.
broader: zmYu aAM TuF
related: ZQiZ 6Kd D3a

ITIL Expert
type: Concept
in scheme: JobTech Taxonomy - Färdighet
definition: ITIL Expert
broader: zmYu aAM TuF
related: BAeH eg8 T2d
related: 4Jty HpK a3Q

Utbildning för missionsverksamhet
type: Concept
in scheme: JobTech Taxonomy - Färdighet
definition: Utbildning för missionsverksamhet
broader: Yrkesbevis/examen
related: x5rn vga gRK

Certifikat, massamaskinförare
type: Concept
in scheme: JobTech Taxonomy - Färdighet
definition: Certifikat, massamaskinförare
broader: s48H Sft DTn
related: 4obu LL6 RqJ

Säljsupport, administrativt säljstöd
type: Concept
in scheme: JobTech Taxonomy - Färdighet
definition: Säljsupport, administrativt säljstöd avser rutinmässiga och administrativa uppgifter som stödjer försäljningsprocessen och bidrar till en effektiv hantering av säljärenden. Kompetensen omfattar administration, koordinering av försäljningsaktiviteter samt stöd till säljteamet genom dokumentation och kommunikation med kunder och leverantörer.
broader: zmYu aAM TuF
related: eQ4M CNm ozj
related: 8A1f sxQ adT
related: dUuh wwa FGj
related: p16X 44f rwZ

Konverteringsoptimering
type: Concept
in scheme: JobTech Taxonomy - Färdighet
definition: Konverteringsoptimering
broader: zmYu aAM TuF
related: Fv7d YhP YmS
related: WX67 Pfb WMN
related: k1Nx auG sNh
related: 4Jty HpK a3Q

Mobiltelefoner, monteringsvana
type: Concept
in scheme: JobTech Taxonomy - Färdighet
definition: Mobiltelefoner, monteringsvana
broader: zmYu aAM TuF
related: SgAJ DW2 FN5
related: fWrt sLg koW
related: 4Jty HpK a3Q

Rörkapning
type: Concept
in scheme: JobTech Taxonomy - Färdighet
definition: Rörkapning
broader: zmYu aAM TuF
related: UcNa inr snV

Verksamhetsledning, vård
type: Concept
in scheme: JobTech Taxonomy - Färdighet
definition: Verksamhetsledning, vård
broader: zmYu aAM TuF
related: womV SEj CAH

B-truckar
type: Concept
in scheme: JobTech Taxonomy - Färdighet
definition: B-truckar avser användning av en kategorigrupp av truckar som är avsedda för transport och hantering av gods inom lager och terminaler. Kompetensen innefattar färdigheter för att köra och manövrera dessa truckar effektivt och säkert.
broader: zmYu aAM TuF
related: WhBn FAp ZNW
related: kLyY rwr aJr
related: 3MBw pDA P2F
related: MrcX RDn N53

Husmanskost
type: Concept
in scheme: JobTech Taxonomy - Färdighet
definition: Husmanskost
broader: zmYu aAM TuF
related: BStc SJh DKG

Kampsport, professionell utövning
type: Concept
in scheme: JobTech Taxonomy - Färdighet
definition: Kampsport, professionell utövning
broader: Idrott/aktivitet
related: AwXA EM4 71n

Grunt, systemutvecklingsverktyg
type: Concept
in scheme: JobTech Taxonomy - Färdighet
definition: Grunt, systemutvecklingsverktyg
alternative label: Grunt
broader: Programmerings- och systemutvecklingsverktyg
related: D9SL mtn vGM
related: DJh5 yyF hEM
related: UxT1 tPF Kbg
related: 4Jty HpK a3Q
related: UXKZ 3zZ ipB

Teckning
type: Concept
in scheme: JobTech Taxonomy - Färdighet
definition: Teckning
broader: zmYu aAM TuF
related: 34Tn BQQ tfo

Neonatal vård/Spädbarnsvård
type: Concept
in scheme: JobTech Taxonomy - Färdighet
definition: Neonatal vård/Spädbarnsvård avser den specialiserade vård som ges till nyfödda barn, särskilt de som är prematura eller har hälsoproblem. Kompetensen omfattar övervakning, behandling och stöd i samband med barnets fysiska, emotionella och utvecklingsmässiga behov under den första perioden av livet.
alternative label: Neonatal vård
alternative label: Spädbarnsvård
broader: zmYu aAM TuF
related: NFUg y9y 1TY
related: 7XXd 4St nit
related: LP4Z ABV gRm
related: kHgb AHf vrY

Kognitiv beteendeterapi
type: Concept
in scheme: JobTech Taxonomy - Färdighet
definition: Kognitiv beteendeterapi
broader: zmYu aAM TuF
related: BWwk fYX S5B
related: dJXy Rpq a2u
related: VYeq GDF a2g

Motorsport, instruktör/Motorsport, tränare
type: Concept
in scheme: JobTech Taxonomy - Färdighet
definition: Motorsport, instruktör/Motorsport, tränare
alternative label: Motorsport, instruktör
alternative label: Motorsport, tränare
broader: Idrott/aktivitet
related: EA6o N1N QtT

Synskadade, arbetslivsinriktad rehabilitering
type: Concept
in scheme: JobTech Taxonomy - Färdighet
definition: Synskadade, arbetslivsinriktad rehabilitering
broader: zmYu aAM TuF
related: TPH4 2AM isT
related: fsnw ZCu v2U

Regi, musikdramatik
type: Concept
in scheme: JobTech Taxonomy - Färdighet
definition: Regi, musikdramatik
broader: zmYu aAM TuF
related: rYSG 3WJ LmC

Dekormålning, film
type: Concept
in scheme: JobTech Taxonomy - Färdighet
definition: Dekormålning, film
broader: zmYu aAM TuF
related: CSUf ZVM a7Z

Medicinska njursjukdomar, specialistkompetens för läkare
type: Concept
in scheme: JobTech Taxonomy - Färdighet
definition: Medicinska njursjukdomar, specialistkompetens för läkare
broader: Specialistbevis för läkare
related: nu7c QuB KVQ

Klippotek
type: Concept
in scheme: JobTech Taxonomy - Färdighet
definition: Klippotek
broader: zmYu aAM TuF
related: mwVN oEH g9k
related: LyBp bY6 bZK

Gruvgeologi
type: Concept
in scheme: JobTech Taxonomy - Färdighet
definition: Gruvgeologi
broader: zmYu aAM TuF
related: 7zKm 4NW eey
related: yXbD NTH ijE
related: V7Yz 4WV g4z

Morse
type: Concept
in scheme: JobTech Taxonomy - Färdighet
definition: Morse
broader: zmYu aAM TuF
related: kZwz D8K bKs
related: 4Jty HpK a3Q

Grundskollärarexamen inr 1–7
type: Concept
in scheme: JobTech Taxonomy - Färdighet
definition: Grundskollärarexamen inr 1–7
broader: Yrkesbevis/examen
related: oQUQ D11 HPx

Yrkesbevis/examen
type: Concept
in scheme: JobTech Taxonomy - Färdighet
top concept of: JobTech Taxonomy - Färdighet
definition: Yrkesbevis/examen
alternative label: Yrkesbevis
alternative label: examen
narrower: viQT 1Vf hvu
narrower: Gesällbrev, silversmed
narrower: xW23 QFV g9F
narrower: jNzh 6NW bWz
narrower: yyJQ gFx TKr
narrower: Utbildning inom okulär farmakologi
narrower: Dietistexamen
narrower: Motorsågskörkort Nivå A
narrower: p4mQ KPR u1g
narrower: vCvL Fux WLR
narrower: uk72 nCq m5Z
narrower: Yrkesbevis, byggnadsplåtslagare
narrower: siJz YEX fvq
narrower: Doktorsexamen, biologiämnen
narrower: Yrkesdiplom, försäkringsförmedlare
narrower: Mästarbrev, bilsadelmakare
narrower: Diplommålning, utbildning inom järnmålning
narrower: Utbildad dramapedagog
narrower: Hundförareutbildning
narrower: Mellanstadielärarexamen
narrower: ppox 6V9 ZTo
narrower: Legitimation som läkare
narrower: pESU 6WD qhR
narrower: Speciallärarexamen inriktning grav språkstörning
narrower: Specialpedagogexamen
narrower: Auktoriserad fartygsagent
narrower: Gesällbrev, väskmakare
narrower: Yrkesbevis, teleskopslastare
narrower: qwR4 VM5 2Cd
narrower: Mästarbrev, byggnadsplåtslagare
narrower: Jägarexamen
narrower: Gesällbrev, slöjdaryrket - trä
narrower: Lärarexamen-förskola och grundskolans tidigare år
narrower: tFaJ a6p PFP
narrower: qo65 Rvp 32c
narrower: sicB 2Xi eQh
narrower: Djursjukvårdarexamen
narrower: Mästarbrev, inredningssadelmakare
narrower: Spårutbildning för SL
narrower: Röjsågskörkort Nivå RA
narrower: Omsorgsutbildning/Omvårdnadsutbildning
narrower: Yrkesbevis, tak- och tätskiktsmontör
narrower: Mästarbrev, duodji
narrower: oKbA wEE pxf
narrower: Yrkesbevis, SRY
narrower: jcJj Ek8 D6Q
narrower: Mästarbrev, väskmakare
narrower: ucwX rMS 9dx
narrower: Mediepedagogik, utbildad inom
narrower: Badbevakareutbildning
narrower: Yrkesbevis, motorschaktvagn
narrower: Vidareutbildning inom ortodonti för tandsköterskor
narrower: Gesällbrev, broderi/konstbroderi
narrower: Gymnasieexamen naturbruk, inriktning hästhållning
narrower: o7QW 9FB PQ3
narrower: 3-års montör
narrower: Gesällbrev, duodji
narrower: Specialpedagogexamen inriktning komplicerad inlärning
narrower: oiLH gv4 Q3b
narrower: Mästarbrev, trädgårdsanläggare
narrower: Ridande polis-utbildning
narrower: Spårutbildning för SJ
narrower: Natur- och kulturhänsyn - Röjning/Förröjning
narrower: Godkänd livräddare, SLS
narrower: Gymnasieutbildning
narrower: Mästarbrev, handvävare
narrower: Speciallärarexamen inriktning språk-, skriv- och läsutveckling
narrower: Gesällbrev, konstinramare
narrower: oYDh d6r cSu
narrower: Kriminalvårdens grundutbildning
narrower: Påbyggnadsutbildning i räddningstjänst för brandingenjörer
narrower: Skattehandläggarutbildning
narrower: Doktorsexamen, geovetenskapliga ämnen

Musikinstrument, justering och underhåll
type: Concept
in scheme: JobTech Taxonomy - Färdighet
definition: Musikinstrument, justering och underhåll avser kunskaper och färdigheter relaterade till anpassning, reparation och underhåll av musikinstrument för att säkerställa deras funktionalitet och ljudkvalitet. Kompetensen innefattar även förmåga att stämma och justera instrument, vilket är centralt för att optimera deras prestation och livslängd.
broader: zmYu aAM TuF
related: aKdV u7V R5j

Yrkesbevis, Vår uppgift som kyrkogårdsarbetare
type: Concept
in scheme: JobTech Taxonomy - Färdighet
definition: Yrkesbevis, Vår uppgift som kyrkogårdsarbetare, visar att yrkesarbetaren har, för branschen och yrket i fråga, en godkänd yrkesteoretisk utbildning och en godkänd praktisk utbildning. Yrkesbeviset utfärdas av TCYK
broader: Yrkesbevis/examen
related: XBh3 Xrm C4R

Gesällbrev, make-up artist
type: Concept
in scheme: JobTech Taxonomy - Färdighet
definition: Gesällbrev, make-up artist
broader: Yrkesbevis/examen
related: ezKk kss CiQ

Skadevärdering
type: Concept
in scheme: JobTech Taxonomy - Färdighet
definition: Skadevärdering
broader: zmYu aAM TuF
related: dKUb KBP mw3

Mötesadministration
type: Concept
in scheme: JobTech Taxonomy - Färdighet
definition: Mötesadministration innebär att planera, organisera och genomföra möten på ett strukturerat och effektivt sätt. Det omfattar bland annat att boka möteslokaler, hantera deltagarlistor, förbereda och distribuera mötesunderlag, protokollföra samt följa upp beslut och åtgärder.
broader: Yrkesövergripande kompetenser

Yrkesmatematik, bygg
type: Concept
in scheme: JobTech Taxonomy - Färdighet
definition: Yrkesmatematik, bygg
broader: zmYu aAM TuF
related: DPPw 4wa AsH
related: 3ZtN hhA SM7
related: bZ4J riZ zK6
related: V79C DD2 3Gj
related: 3g5x Tm7 8QH
related: QKvX v7r PNL
related: 7zKm 4NW eey
related: Y4j1 P17 wVA
related: q2Ge zrQ zJb
related: 9mJN VwW Xjg
related: XYzP 5Tn 7Ep
related: AD3U cFH rbe
related: f71c gjL RDq
related: fLKb bJ3 69p
related: 3UzE P8A 9sS
related: NnB3 eWH auo
related: iHrC aRv fVm
related: 4Jty HpK a3Q
related: cGxX R9c kW1
related: bXfo 4hb SXx

IFU-diplom, försäkringssäljare
type: Concept
in scheme: JobTech Taxonomy - Färdighet
definition: IFU-diplom, försäkringssäljare
broader: Yrkesbevis/examen
related: 9dLz BCK oDA

ADR, styckegods (grundkurs)
type: Concept
in scheme: JobTech Taxonomy - Färdighet
definition: ADR, styckegods (grundkurs) avser utbildning som är obligatorisk för förare som transporterar farligt gods över vissa mängder.
alternative label: ADR
broader: s48H Sft DTn
related: SZ7Q 2zF nFy
related: 3ZtN hhA SM7
related: yXbD NTH ijE
related: 3MBw pDA P2F
related: bwnk nv2 1cR
related: k3R3 UkC nK2

Aeroponik
type: Concept
in scheme: JobTech Taxonomy - Färdighet
definition: Odling av växter utan användning av ett medium, t.ex. jord. Växternas rötter är direkt exponerade för den omgivande luften eller dimman och bevattnas med näringslösningar. Källa ESCO
broader: zmYu aAM TuF
related: XBh3 Xrm C4R
related: yXbD NTH ijE
related: 2xQ4 4kh kTZ
related: RYCQ ogb uUY

Yrkeshögskoleutbildning, Paralegal
type: Concept
in scheme: JobTech Taxonomy - Färdighet
definition: Yrkeshögskoleutbildning, Paralegal är en yrkeshögskoleutbildning med inriktning till paralegal.
broader: Yrkesutbildning
related: zKvJ GnC Szx

Dansterapi
type: Concept
in scheme: JobTech Taxonomy - Färdighet
definition: Dansterapi
broader: zmYu aAM TuF
related: vTgW pnr QMp

Elementarpartikelfysik
type: Concept
in scheme: JobTech Taxonomy - Färdighet
definition: Elementarpartikelfysik
broader: zmYu aAM TuF
related: KM7d Z6Y LCJ

Grupp- och konferensresor, reseproduktion
type: Concept
in scheme: JobTech Taxonomy - Färdighet
definition: Grupp- och konferensresor, reseproduktion
broader: zmYu aAM TuF
related: 48KE fDE ryL

Privatbokbindning
type: Concept
in scheme: JobTech Taxonomy - Färdighet
definition: Privatbokbindning avser färdighet att binda böcker för privat bruk, vilket inkluderar både hantverksmässiga och maskinella metoder för att producera böcker, broschyrer och tidskrifter. Kompetensen omfattar kunskap om materialhantering, sammansättning av böcker samt användning av olika verktyg och utrustning relaterade till bokbindning.
broader: zmYu aAM TuF
related: mPzg 93F QEv

Kallkök
type: Concept
in scheme: JobTech Taxonomy - Färdighet
definition: Kallkök avser den del inom restaurang- och storköksverksamhet där förberedelse och tillagning av kalla rätter sker. Kompetensen inkluderar kunskaper om råvaruhantering, presentation och garnityr för olika typer av kall mat, samt regler för livsmedelssäkerhet och hygien.
broader: zmYu aAM TuF
related: BStc SJh DKG

Slutbleck, låsteknik
type: Concept
in scheme: JobTech Taxonomy - Färdighet
definition: Slutbleck, låsteknik
broader: zmYu aAM TuF
related: e6nk AGp y28

Textil, konst
type: Concept
in scheme: JobTech Taxonomy - Färdighet
definition: Textil, konst
broader: zmYu aAM TuF
related: 34Tn BQQ tfo

Tankoperativ kurs, olja
type: Concept
in scheme: JobTech Taxonomy - Färdighet
definition: Tankoperativ kurs, olja
broader: s48H Sft DTn
related: Rsoy sS6 6c4
related: kZwz D8K bKs
related: kDnq Q98 sD3

Sprängarbetsledare
type: Concept
in scheme: JobTech Taxonomy - Färdighet
definition: Sprängarbetsledare
broader: xKbn JBn EPE
related: sX9n CWa KVC
related: f71c gjL RDq

Löneförhandlingar
type: Concept
in scheme: JobTech Taxonomy - Färdighet
definition: Löneförhandlingar
broader: zmYu aAM TuF
related: mNoS AN5 drn
related: bjqk F3A 5Hk

Data- och medianät
type: Concept
in scheme: JobTech Taxonomy - Färdighet
definition: Data- och medianät
broader: zmYu aAM TuF
related: MW1P GNJ 4F9
related: a75S eLg JWH
related: 4Jty HpK a3Q
related: yyF7 jsW EeP

Bordtennis, instruktör/Bordtennis, tränare
type: Concept
in scheme: JobTech Taxonomy - Färdighet
definition: Bordtennis, instruktör/Bordtennis, tränare
alternative label: Bordtennis, instruktör
alternative label: Bordtennis, tränare
broader: Idrott/aktivitet
related: EA6o N1N QtT

Folietryck
type: Concept
in scheme: JobTech Taxonomy - Färdighet
definition: Folietryck
broader: zmYu aAM TuF
related: XeJB bkn mRn

Matros, inre fart (behörighet)
type: Concept
in scheme: JobTech Taxonomy - Färdighet
definition: Matros, inre fart (behörighet)
broader: Behörigheter, sjöfart
related: CbQK 7th Tyf

Konstgjutning
type: Concept
in scheme: JobTech Taxonomy - Färdighet
definition: Konstgjutning innebär en teknik för att skapa skulpturer och konstverk genom att gjuta material i formar. Denna kompetens kan innefatta olika gjutmetoder och materialval för att realisera konstnärliga visioner.
broader: zmYu aAM TuF
related: 34Tn BQQ tfo
related: J9Vz JxJ Bji

ADR, radioaktivt
type: Concept
in scheme: JobTech Taxonomy - Färdighet
definition: ADR, radioaktivt
broader: s48H Sft DTn
related: SZ7Q 2zF nFy
related: yXbD NTH ijE
related: 3MBw pDA P2F
related: bwnk nv2 1cR

Fastighetsskötsel
type: Concept
in scheme: JobTech Taxonomy - Färdighet
definition: Fastighetsskötsel avser ansvar för övervakning, skötsel och underhåll av fastigheters inre och yttre miljö. Kompetensen inkluderar kontroll av ventilations- och värmeanläggningar, utförande av mindre reparationer samt service till hyresgäster och besökare.
broader: zmYu aAM TuF
related: df9D e6y 61z

Virkesmätning
type: Concept
in scheme: JobTech Taxonomy - Färdighet
definition: Virkesmätning avser mätning och bedömning av träds volym, kvalitet och vikt inom skogsbruk. Kompetensen omfattar metoder och verktyg för att utföra noggranna och tillförlitliga mätningar av virke för användning i olika tillämpningar inom skogsindustrin.
broader: zmYu aAM TuF
related: qouP wtb 93q
related: 9QMD sZ3 ZjX
related: 3LdB WEJ 8Ms

Beklädnad, träfasad
type: Concept
in scheme: JobTech Taxonomy - Färdighet
definition: Beklädnad, träfasad
broader: zmYu aAM TuF
related: 9mJN VwW Xjg

Syntolkning
type: Concept
in scheme: JobTech Taxonomy - Färdighet
definition: Syntolkning
broader: zmYu aAM TuF
related: PQDm Z63 zst

Butiksledning, fackhandel
type: Concept
in scheme: JobTech Taxonomy - Färdighet
definition: Butiksledning, fackhandel avser kompetens inom planering och styrning av verksamhet inom detaljhandeln, med fokus på att uppnå affärsmål och förbättra kundupplevelser. Denna kompetens omfattar strategiskt tänkande, budgetansvar och personalledning samt förmåga att utforma riktlinjer och följa upp verksamhetens resultat.
broader: zmYu aAM TuF
related: Fu4x 7KG YgC
related: Fp7x Yqt bx9

Beredning, verkstadsmaskiner
type: Concept
in scheme: JobTech Taxonomy - Färdighet
definition: Beredning, verkstadsmaskiner
broader: zmYu aAM TuF
related: vaEp iBS c5h

Trädgårdsodling
type: Concept
in scheme: JobTech Taxonomy - Färdighet
definition: Trädgårdsodling innefattar bland annat sådd, plantering, omplantering, bevattning, ogräsrensning och växtskyddskontroll. Under skördesäsong innebär arbetet ofta plockning, packning och leverans. Vanliga arbetsplatser är plantskolor och handelsträdgårdar. Arbetet kan både ske i frilandsodlingar och i växthus.
broader: zmYu aAM TuF
related: 2xQ4 4kh kTZ

Möbler
type: Concept
in scheme: JobTech Taxonomy - Färdighet
definition: Möbler
broader: zmYu aAM TuF
related: oXSW fbY XrY
related: YKL2 FCB 1yr
related: 85cq 6uK 4cK

Blockmurning
type: Concept
in scheme: JobTech Taxonomy - Färdighet
definition: Blockmurning
broader: zmYu aAM TuF
related: NnB3 eWH auo

Konsumentköplagen
type: Concept
in scheme: JobTech Taxonomy - Färdighet
definition: Konsumentköplagen
broader: zmYu aAM TuF
related: br6a VVS V3y
related: DZVN v5g Fco

Sjuktransporter
type: Concept
in scheme: JobTech Taxonomy - Färdighet
definition: Sjuktransporter avser kompetens att transportera patienter som inte kräver akut medicinsk vård men som av olika skäl behöver sittande eller liggande transport. Kompetensen innefattar även samarbeta med ambulanssjukvården, grundläggande medicinska kunskaper och första hjälpen.
broader: zmYu aAM TuF
related: 3H17 ZZr BEc

Sjukgymnastexamen
type: Concept
in scheme: JobTech Taxonomy - Färdighet
definition: Sjukgymnastexamen
broader: Yrkesbevis/examen
related: s7vU FhY L5Z

Nordens arkeologi
type: Concept
in scheme: JobTech Taxonomy - Färdighet
definition: Nordens arkeologi
broader: zmYu aAM TuF
related: sXgV QFg vpb

TSS-tolkning (Tecken som Stöd)
type: Concept
in scheme: JobTech Taxonomy - Färdighet
definition: TSS-tolkning (Tecken som Stöd)
broader: zmYu aAM TuF
related: PQDm Z63 zst

Programmerings- och systemutvecklingsverktyg
type: Concept
in scheme: JobTech Taxonomy - Färdighet
top concept of: JobTech Taxonomy - Färdighet
definition: Programmerings- och systemutvecklingsverktyg
narrower: wbj8 LR2 aZ8
narrower: FrontPage, HTML-editor
narrower: Microsoft Expression Web, programmeringsverktyg
narrower: Microsoft Autopilot, systemutvecklingsverktyg
narrower: Pagespinner, HTML-editor
narrower: Selenium, systemutvecklingsverktyg
narrower: SCCM, systemutvecklingsverktyg
narrower: Bower, pakethanterare
narrower: uR9q DNx eWm
narrower: Rational ClearCase, versionshanteringssystem
narrower: Vagrant, miljökonfigurering
narrower: Rational Performance Tester, systemutvecklingsverktyg
narrower: zqiz PQv xLD
narrower: Homesite, HTML-editor
narrower: JBuilder, programmeringsverktyg
narrower: Emacs, texteditor
narrower: AdminStudio, programmeringsverktyg
narrower: Rational Rose, systemutvecklingsverktyg
narrower: z3v2 Z4t CA2
narrower: ypyR 7oD 4Xu
narrower: Appium, systemutvecklingsverktyg
narrower: Oracle Forms, programmeringsverktyg
narrower: Rational Application Developer, systemutvecklingsverktyg
narrower: ocZE Fi7 kTv
narrower: trJM HZA Hjp
narrower: CICS, programmeringsverktyg
narrower: Visual Page, HTML-editor
narrower: Grunt, systemutvecklingsverktyg
narrower: Rational Functional Tester, systemutvecklingsverktyg
narrower: Bean Machine, HTML-editor
narrower: xGEc fZi Zf3
narrower: Rational SoDA, systemutvecklingsverktyg
narrower: tmyt n6R 1Gc
narrower: Scrum, systemutvecklingsmetod
narrower: Motif, programmeringsverktyg
narrower: mRpj JZE DxB
narrower: Microsoft Intune, systemutvecklingsverktyg
narrower: Visual InterDev, programmeringsverktyg
narrower: Adobe Dreamweaver
narrower: Agila arbetsmetoder
narrower: zZmK VPd WD8
narrower: Mono, programmeringsverktyg
narrower: m8mi pid qin
narrower: Visual Studio Code, integrerad utvecklingsmiljö
narrower: RAD, systemutvecklingsmetod
narrower: BBedit, HTML-editor
narrower: Visual Studio, integrerad utvecklingsmiljö
narrower: NetBeans, integrerad utvecklingsmiljö
narrower: Wise Installation Express, programmeringsverktyg
narrower: Node, exekveringsmiljö
narrower: MS Team Foundation Server, systemutvecklingsverktyg
narrower: SQLite, programmeringsverktyg
narrower: Rational Software Architect, systemutvecklingsverktyg
narrower: Bamboo, byggverktyg
narrower: Xcode, integrerad utvecklingsmiljö
narrower: Pagemill, HTML-editor
narrower: mpuQ isQ pTU
narrower: IntelliJ, integrerad utvecklingsmiljö
narrower: kWds MTo 9Qb
narrower: jfka n8S NG5
narrower: Aptana Studio, HTML-editor
narrower: o8wC djg C6k
narrower: xGPG PpL zWN
narrower: Hudson, byggverktyg
narrower: ww9j V8i y6X
narrower: Rational Manual Tester, systemutvecklingsverktyg
narrower: Teamcity, systemutvecklingsverktyg
narrower: Netobjects Fusion, HTML-editor
narrower: Sed, texteditor
narrower: nCFz FWm VTP
narrower: JIRA, systemutvecklingsverktyg
narrower: Delphi, programmeringsverktyg
narrower: Software Virtualization Solution/SVS
narrower: Testrail, systemutvecklingsverktyg
narrower: Eclipse, integrerad utvecklingsmiljö

CNC-programmering
type: Concept
in scheme: JobTech Taxonomy - Färdighet
definition: CNC-programmering avser processen att skapa och justera program för datorstyrda maskiner som används för att bearbeta olika material. Kompetensen inkluderar kunskap om programmeringsspråk, maskininställningar och utförande av komplexa detaljer genom automationssystem, vilket är relevant inom bland annat trä- och metallindustrin.
broader: zmYu aAM TuF
related: VKKg e4t t46
related: e6nk AGp y28
related: vaEp iBS c5h
related: 4Jty HpK a3Q

Metallförgyllning
type: Concept
in scheme: JobTech Taxonomy - Färdighet
definition: Metallförgyllning avser processen att applicera ett lager av guld eller guldliknande material på metallföremål för att förbättra deras utseende och hållbarhet. Denna teknik används inom olika hantverksområden, inklusive konst, inredning och musikinstrumenttillverkning för att uppnå både dekorativa och funktionella syften.
broader: zmYu aAM TuF
related: YiQw N87 zLU
related: aKdV u7V R5j

Manus, Radio
type: Concept
in scheme: JobTech Taxonomy - Färdighet
definition: Skriva manus/skript för radioproduktioner.
broader: zmYu aAM TuF
related: zfve s6G tpc

Läkarintyg för sjöfolk
type: Concept
in scheme: JobTech Taxonomy - Färdighet
definition: Läkarintyg för sjöfolk
broader: s48H Sft DTn
related: BStc SJh DKG
related: Rsoy sS6 6c4
related: kZwz D8K bKs
related: CbQK 7th Tyf
related: Z6TY xDf Yup
related: UjoW meY Zwt
related: tPox ie4 X9X
related: KttZ Skc bMR
related: kDnq Q98 sD3
related: a75S eLg JWH
related: XGyi i4B ME7
related: h324 DPT 7Tw

Bandschaktare
type: Concept
in scheme: JobTech Taxonomy - Färdighet
definition: Bandschaktare
broader: zmYu aAM TuF
related: X7HR rZK 4wj

Oförstörande provning: Visuell kontroll (VT)
type: Concept
in scheme: JobTech Taxonomy - Färdighet
definition: Oförstörande provning: Visuell kontroll (VT)
broader: zmYu aAM TuF
related: Lzpv ofL 3H5
related: K8yg U4C gkY
related: iGTu bYL 2T7
related: eRkT cTv H9v

Verksamhetsledning, folkhögskola
type: Concept
in scheme: JobTech Taxonomy - Färdighet
definition: Verksamhetsledning, folkhögskola
broader: zmYu aAM TuF
related: z8di AqX GBr

Tvätteri
type: Concept
in scheme: JobTech Taxonomy - Färdighet
definition: Tvätteri avser processen för att rena och underhålla textilier, inklusive blekning, färgning och tvättning av olika material. Kompetensen inkluderar kunskap om och hantering av maskiner och tekniker bakom dessa behandlingsprocesser, samt förståelse för kemikalier och metoder involverade i kemtvätt av textiler och skinn.
broader: zmYu aAM TuF
related: 4DET dLf iB9

Modern jazz
type: Concept
in scheme: JobTech Taxonomy - Färdighet
definition: Modern jazz
broader: p1WM wCw LTd
related: AWJF wqZ va9

Utbildningsbevis, PCB-sanering
type: Concept
in scheme: JobTech Taxonomy - Färdighet
definition: Utbildningsbevis, PCB-sanering
broader: s48H Sft DTn
related: NnB3 eWH auo

Båttillbehör
type: Concept
in scheme: JobTech Taxonomy - Färdighet
definition: Båttillbehör avser produkter och utrustning som används för att förbättra, underhålla eller anpassa båtar. Dessa kan omfatta allt från säkerhetsutrustning och navigationssystem till komfortartiklar och dekorationer.
broader: zmYu aAM TuF
related: oXSW fbY XrY
related: YKL2 FCB 1yr

Kraniosakral terapi
type: Concept
in scheme: JobTech Taxonomy - Färdighet
definition: Kraniosakral terapi
broader: zmYu aAM TuF
related: F19Z oB6 pg3

RTL-kompetens, video
type: Concept
in scheme: JobTech Taxonomy - Färdighet
definition: RTL-kompetens, video
broader: Yrkesbevis/examen
related: fWrt sLg koW

Källsortering
type: Concept
in scheme: JobTech Taxonomy - Färdighet
definition: Källsortering
broader: zmYu aAM TuF
related: df9D e6y 61z
related: yXbD NTH ijE
related: 9DdK AZY ZNK

Titan och andra speciella materia, materialkunskap svets
type: Concept
in scheme: JobTech Taxonomy - Färdighet
definition: Titan och andra speciella materia, materialkunskap svets
broader: Materialkunskap
related: wQ1E Bzk ZyA

Joomla, CMS
type: Concept
in scheme: JobTech Taxonomy - Färdighet
definition: Joomla, CMS/innehållshanteringssystem
alternative label: Joomla, innehållshanteringssystem
broader: jTAz uCP RNc
related: BAeH eg8 T2d
related: cBBa ngH fCx
related: vPP6 rsw dck
related: oEmP NC1 sXE
related: 4Jty HpK a3Q
related: MYAz x9m 2LJ

Elnätsplanering
type: Concept
in scheme: JobTech Taxonomy - Färdighet
definition: Elnätsplanering
broader: zmYu aAM TuF
related: nDaB vdy eAy
related: SPYW 7Z1 ShT

Grönt certifikat, CNC
type: Concept
in scheme: JobTech Taxonomy - Färdighet
definition: Grönt certifikat, CNC
broader: s48H Sft DTn
related: vaEp iBS c5h
related: 4Jty HpK a3Q

Analys/Beräkning-MathLab
type: Concept
in scheme: JobTech Taxonomy - Färdighet
definition: Analys/Beräkning-MathLab
alternative label: Analys-MathLab
alternative label: Beräkning-MathLab
broader: mTLu uo2 gq2
related: thZP oR7 WrY
related: K8yg U4C gkY
related: Pd51 xnr KCY
related: XeBP nMe pXx
related: PRQn 9yw NJA
related: ETAR ggZ Wuw
related: 41KB bfk 5jR
related: 4Jty HpK a3Q

Spårutbildning för SL
type: Concept
in scheme: JobTech Taxonomy - Färdighet
definition: Spårutbildning för SL
broader: Yrkesbevis/examen
related: iqZh 3yX i8n

Allmänkonstruktion-AutoCAD LT
type: Concept
in scheme: JobTech Taxonomy - Färdighet
definition: Allmänkonstruktion-AutoCAD LT
broader: mTLu uo2 gq2
related: 3jEy yuT aVo
related: rwpH 6RA XTT
related: thZP oR7 WrY
related: MSnK 3Z8 4qA
related: K8yg U4C gkY
related: nDaB vdy eAy
related: Pd51 xnr KCY
related: ketV G9W GeR
related: SPYW 7Z1 ShT
related: XeBP nMe pXx
related: PRQn 9yw NJA
related: ETAR ggZ Wuw
related: 41KB bfk 5jR
related: 4Jty HpK a3Q

CNC-programmering, Mazatrol
type: Concept
in scheme: JobTech Taxonomy - Färdighet
definition: CNC-programmering, Mazatrol
broader: Programmering, CNC-styrsystem
related: vaEp iBS c5h
related: 4Jty HpK a3Q

Musikvetenskap
type: Concept
in scheme: JobTech Taxonomy - Färdighet
definition: Musikvetenskap
broader: zmYu aAM TuF
related: sXgV QFg vpb

Plåtriktning
type: Concept
in scheme: JobTech Taxonomy - Färdighet
definition: Plåtriktning avser processen att korrigera och justera plåtmaterial för att säkerställa att det uppfyller specifika krav på form och dimension. Kompetensen innebär kunskap om olika metoder och verktyg för riktning av plåt samt förståelse för de mekaniska egenskaper som påverkar plåtens struktur.
broader: zmYu aAM TuF
related: UcNa inr snV
related: L4hA SJP SFi

Diatermi/Epilering/Hårborttagning
type: Concept
in scheme: JobTech Taxonomy - Färdighet
definition: Diatermi/Epilering/Hårborttagning
alternative label: Diatermi
alternative label: Epilering
alternative label: Hårborttagning
broader: zmYu aAM TuF
related: xr7w N6Q QMA

Arkivfotografering
type: Concept
in scheme: JobTech Taxonomy - Färdighet
definition: Arkivfotografering
broader: zmYu aAM TuF
related: 3J38 DNz YKK

MMA, metallbågssvetsning
type: Concept
in scheme: JobTech Taxonomy - Färdighet
definition: MMA - manuell metallbågssvetsning (Manuell Metal Arc) kallas även bågsvetsning eller handsvetsning. Källa: Svetskommissionen
broader: on11 B1f LEw
related: Lzpv ofL 3H5
related: wQ1E Bzk ZyA
related: TrwQ RXT W8a
related: L4hA SJP SFi
related: bXfo 4hb SXx

Korsordsredigering
type: Concept
in scheme: JobTech Taxonomy - Färdighet
definition: Korsordsredigering
broader: zmYu aAM TuF
related: SgNH hag n9D
related: zfve s6G tpc

Specialistbevis psykolog
type: Concept
in scheme: JobTech Taxonomy - Färdighet
definition: Ett bevis som intygar att en psykolog har fördjupad specialistkompetens inom ett specifikt område efter avslutad relevant utbildning och tjänstgöring.
broader: Yrkesbevis/examen
related: VYeq GDF a2g

Barn- och ungdomsmedicin, specialistkompetens för läkare
type: Concept
in scheme: JobTech Taxonomy - Färdighet
definition: Barn- och ungdomsmedicin, specialistkompetens för läkare
broader: Specialistbevis för läkare
related: nu7c QuB KVQ

Stand-up comedy, dockspel
type: Concept
in scheme: JobTech Taxonomy - Färdighet
definition: Stand-up comedy, dockspel
broader: zmYu aAM TuF
related: iBUL s38 izZ

Möbelkonservering
type: Concept
in scheme: JobTech Taxonomy - Färdighet
definition: Möbelkonservering
broader: zmYu aAM TuF
related: 34Tn BQQ tfo

Stand-up comedy, scen
type: Concept
in scheme: JobTech Taxonomy - Färdighet
definition: Stand-up comedy, scen
broader: zmYu aAM TuF
related: iBUL s38 izZ

Första hjälpen offshore
type: Concept
in scheme: JobTech Taxonomy - Färdighet
definition: Första hjälpen offshore
broader: s48H Sft DTn
related: BStc SJh DKG
related: Rsoy sS6 6c4
related: kZwz D8K bKs
related: CbQK 7th Tyf
related: UjoW meY Zwt
related: tPox ie4 X9X
related: KttZ Skc bMR
related: kDnq Q98 sD3
related: a75S eLg JWH

Specialkost
type: Concept
in scheme: JobTech Taxonomy - Färdighet
definition: Specialkost avser kostförhållanden som är anpassade för att möta specifika behov hos individer, vilket kan inkludera allergier, intoleranser, hälsotillstånd eller personliga preferenser.
broader: zmYu aAM TuF
related: BStc SJh DKG
related: Z2MZ eYc Lfv
related: Pq5C SPC bRA
related: tPox ie4 X9X

Doktorsexamen, matematikämnen
type: Concept
in scheme: JobTech Taxonomy - Färdighet
definition: Doktorsexamen, matematikämnen
broader: Yrkesbevis/examen
related: Gm5j S2Y aTB
related: cYCo PxY zQd

Pedagogisk verksamhet, hemslöjd
type: Concept
in scheme: JobTech Taxonomy - Färdighet
definition: Pedagogisk verksamhet, hemslöjd
broader: zmYu aAM TuF
related: mcRJ kq2 jFr
related: 1CX5 mZw Vcq

Xylofon, undervisning musikskola
type: Concept
in scheme: JobTech Taxonomy - Färdighet
definition: Xylofon, undervisning musikskola
broader: zmYu aAM TuF
related: mcRJ kq2 jFr

Readymades
type: Concept
in scheme: JobTech Taxonomy - Färdighet
definition: Readymades
broader: zmYu aAM TuF
related: 34Tn BQQ tfo

Modern dans
type: Concept
in scheme: JobTech Taxonomy - Färdighet
definition: Modern dans
broader: Dans
related: gmRr 7tt eHj

Europarätt
type: Concept
in scheme: JobTech Taxonomy - Färdighet
definition: Europarätt
broader: zmYu aAM TuF
related: q8wL kdi WaW
related: br6a VVS V3y
related: 6aak 8eh iwT
related: DZVN v5g Fco
related: JfYV ZGg 6rm

Maskinskötsel, tobaksindustri
type: Concept
in scheme: JobTech Taxonomy - Färdighet
definition: Maskinskötsel, tobaksindustri
broader: zmYu aAM TuF
related: icae Y69 H8E

Lösvirke
type: Concept
in scheme: JobTech Taxonomy - Färdighet
definition: Lösvirke
broader: zmYu aAM TuF
related: bZ4J riZ zK6
related: 9mJN VwW Xjg

Nationalekonomi
type: Concept
in scheme: JobTech Taxonomy - Färdighet
definition: Nationalekonomi
broader: zmYu aAM TuF
related: sXgV QFg vpb
related: WZCM nfS eAk

API-design
type: Concept
in scheme: JobTech Taxonomy - Färdighet
definition: API-design
broader: zmYu aAM TuF
related: DJh5 yyF hEM
related: 4Jty HpK a3Q
related: UXKZ 3zZ ipB

Shell, programmeringsspråk
type: Concept
in scheme: JobTech Taxonomy - Färdighet
definition: Shell, programmeringsspråk
alternative label: Shell
alternative label: Shellprogrammering
broader: Datorspråk
related: BAeH eg8 T2d
related: Fv7d YhP YmS
related: D9SL mtn vGM
related: DJh5 yyF hEM
related: 4Jty HpK a3Q

Medlemsfrågor, utveckling och samordning
type: Concept
in scheme: JobTech Taxonomy - Färdighet
definition: Medlemsfrågor, utveckling och samordning
broader: zmYu aAM TuF
related: vPP6 rsw dck
related: 4Jty HpK a3Q

Processteknik
type: Concept
in scheme: JobTech Taxonomy - Färdighet
definition: Processteknik
broader: zmYu aAM TuF
related: PRQn 9yw NJA

Flistransporter, körvana
type: Concept
in scheme: JobTech Taxonomy - Färdighet
definition: Flistransporter, körvana
broader: zmYu aAM TuF
related: 3MBw pDA P2F

Isbanor
type: Concept
in scheme: JobTech Taxonomy - Färdighet
definition: Isbanor
broader: zmYu aAM TuF
related: df9D e6y 61z

Tillverkning av blåsinstrument
type: Concept
in scheme: JobTech Taxonomy - Färdighet
definition: Tillverkning av blåsinstrument refererar till processen för att skapa musikinstrument som använder luft för att producera ljud, såsom trumpet, klarinett och flöjt. Denna kompetens omfattar kunskap om materialval, akustik och hantverkstekniker som krävs för att forma och justera instrumenten för att säkerställa korrekt ljudkvalitet och spelbarhet.
broader: zmYu aAM TuF
related: aKdV u7V R5j

Taltidningsinläsning
type: Concept
in scheme: JobTech Taxonomy - Färdighet
definition: Taltidningsinläsning
broader: zmYu aAM TuF
related: xuSE mtB Mir

Fullgjord värnplikt
type: Concept
in scheme: JobTech Taxonomy - Färdighet
definition: Fullgjord värnplikt
broader: zmYu aAM TuF
related: dhgR 9jk 95r
related: KiVA anS RJh

Hammarklaver
type: Concept
in scheme: JobTech Taxonomy - Färdighet
definition: Hammarklaver
broader: wLYs CKS wK8
related: AWJF wqZ va9

Courtage
type: Concept
in scheme: JobTech Taxonomy - Färdighet
definition: Courtage
broader: zmYu aAM TuF
related: aQpg E2T cWq

E-handel, juridisk tillämpning/Elektronisk handel, juridisk tillämpning
type: Concept
in scheme: JobTech Taxonomy - Färdighet
definition: E-handel, juridisk tillämpning/Elektronisk handel, juridisk tillämpning
alternative label: E-handel, juridisk tillämpning
alternative label: Elektronisk handel, juridisk tillämpning
broader: zmYu aAM TuF
related: br6a VVS V3y
related: DZVN v5g Fco
related: JfYV ZGg 6rm
related: 4Jty HpK a3Q

Underhåll, industrimaskiner
type: Concept
in scheme: JobTech Taxonomy - Färdighet
definition: Underhåll, industrimaskiner
broader: zmYu aAM TuF
related: KttZ Skc bMR

Vinberedning
type: Concept
in scheme: JobTech Taxonomy - Färdighet
definition: Vinberedning
broader: zmYu aAM TuF
related: icae Y69 H8E

Våtrumsbehörighet, målare
type: Concept
in scheme: JobTech Taxonomy - Färdighet
definition: Våtrumsbehörighet, målare
broader: Yrkesbevis/examen
related: QKvX v7r PNL

Legitimation som audionom
type: Concept
in scheme: JobTech Taxonomy - Färdighet
definition: Legitimation som krävs för att kunna arbeta som audionom i Sverige. Utfärdas av Socialstyrelsen.
broader: Yrkesbevis/examen
related: pzch NRY 9ZF
related: 4P8B LtK JgE
related: r1Gk 3EN bpw

Kornett
type: Concept
in scheme: JobTech Taxonomy - Färdighet
definition: Kornett
broader: wLYs CKS wK8
related: AWJF wqZ va9

Verktygsbyte, CNC
type: Concept
in scheme: JobTech Taxonomy - Färdighet
definition: Verktygsbyte, CNC
broader: zmYu aAM TuF
related: vaEp iBS c5h

Skärgårdsfartyg
type: Concept
in scheme: JobTech Taxonomy - Färdighet
definition: Skärgårdsfartyg
broader: Övriga specialiteter, sjöfart
related: CbQK 7th Tyf
related: KttZ Skc bMR
related: kDnq Q98 sD3

Reparation av flyglar
type: Concept
in scheme: JobTech Taxonomy - Färdighet
definition: Reparation av flyglar
broader: zmYu aAM TuF
related: aKdV u7V R5j

Charterresor, reseproduktion
type: Concept
in scheme: JobTech Taxonomy - Färdighet
definition: Charterresor, reseproduktion
broader: zmYu aAM TuF
related: 48KE fDE ryL

Instudering, dans
type: Concept
in scheme: JobTech Taxonomy - Färdighet
definition: Instudering, dans
broader: zmYu aAM TuF
related: gmRr 7tt eHj

Biokemi
type: Concept
in scheme: JobTech Taxonomy - Färdighet
definition: Biokemi
broader: zmYu aAM TuF
related: XurM DVs ggn
related: qn2U dB9 Cmh
related: eofS oZs RZi
related: bExu 8gk azk
related: 3LdB WEJ 8Ms

Programmering, CNC-styrsystem
type: Concept
in scheme: JobTech Taxonomy - Färdighet
top concept of: JobTech Taxonomy - Färdighet
definition: Programmering, CNC-styrsystem
narrower: CNC-programmering, Num
narrower: CNC-programmering, Fanuc
narrower: CNC-programmering, Maho
narrower: CNC-programmering, Heidenhain
narrower: CNC-programmering, Mazatrol
narrower: CNC-programmering, Yasnac
narrower: CNC-programmering, Siemens
narrower: CNC-programmering, Bosch
narrower: CNC-programmering, Philips
narrower: yYvR uTu o6c

Fartygstillstånd
type: Concept
in scheme: JobTech Taxonomy - Färdighet
definition: Fartygstillstånd
broader: zmYu aAM TuF
related: Lm3Z gek GYc

Verksamhetsledning, gymnasieskolan
type: Concept
in scheme: JobTech Taxonomy - Färdighet
definition: Verksamhetsledning, gymnasieskolan
broader: zmYu aAM TuF
related: z8di AqX GBr

Dragverktyg, tillverkning
type: Concept
in scheme: JobTech Taxonomy - Färdighet
definition: Dragverktyg, tillverkning
broader: zmYu aAM TuF
related: MSnK 3Z8 4qA

Undertextning
type: Concept
in scheme: JobTech Taxonomy - Färdighet
definition: Undertextning
broader: zmYu aAM TuF
related: PQDm Z63 zst
related: 4Jty HpK a3Q

Processrätt
type: Concept
in scheme: JobTech Taxonomy - Färdighet
definition: Processrätt avser den del av juridiken som reglerar förfarandet i domstolar och hur rättsliga tvister handläggs. Kompetensen omfattar kunskap om rättegångsordningar, processuella regler och principer, samt förmåga att tillämpa dessa i praktiska situationer för att säkerställa en rättssäker prövning av mål.
broader: zmYu aAM TuF
related: br6a VVS V3y
related: zKvJ GnC Szx
related: DZVN v5g Fco
related: JfYV ZGg 6rm
related: qsJJ EYo fzA

Glaspolering
type: Concept
in scheme: JobTech Taxonomy - Färdighet
definition: Glaspolering avser processen att främja klarhet och blanka ytor på glasprodukter genom att använda olika tekniker och verktyg för att avlägsna repor, smuts och oxidation. Kompetensen omfattar kunskap om materialens egenskaper och lämpliga metoder för att uppnå önskat resultat utan att skada glaset.
broader: zmYu aAM TuF
related: aKdV u7V R5j

Antikviteter, värdering
type: Concept
in scheme: JobTech Taxonomy - Färdighet
definition: Antikviteter, värdering avser bedömning och uppskattning av värdet på föremål med historiskt och kulturellt intresse, inklusive möbler, konstverk och samlarobjekt. Kompetensen innefattar kunskaper om marknadspriser, stilhistorik och äkthet av antikviteter för att säkerställa korrekt värdering i samband med försäljning eller försäkring.
broader: zmYu aAM TuF
related: Ru4W zn2 LEz
related: dUuh wwa FGj

Verksamhetsledning, simhall
type: Concept
in scheme: JobTech Taxonomy - Färdighet
definition: Verksamhetsledning, simhall
broader: zmYu aAM TuF
related: wby2 mwq fWV

Gesällbrev, silversmed
type: Concept
in scheme: JobTech Taxonomy - Färdighet
definition: Gesällbrev, silversmed är ett bevis på att en hantverkare har genomgått utbildning och avlagt de delprov som krävs inom det specifika hantverksyrket, och därigenom uppnått ett erkännande av färdigheter och kompetens inom yrket. Utfärdas av Sveriges hantverksråd i samråd med aktuell branschorganisation
broader: Yrkesbevis/examen
related: nwSm phw sPo

Kvalitetsrevisor, utbildad
type: Concept
in scheme: JobTech Taxonomy - Färdighet
definition: Kvalitetsrevisor, utbildad
broader: Yrkesbevis/examen
related: Qo7p wjf gtv

Hjälpmedelsservice, kommunikationshjälpmedel
type: Concept
in scheme: JobTech Taxonomy - Färdighet
definition: Hjälpmedelsservice, kommunikationshjälpmedel
broader: zmYu aAM TuF
related: pzch NRY 9ZF
related: 4Jty HpK a3Q

Testledning, elektronik
type: Concept
in scheme: JobTech Taxonomy - Färdighet
definition: Testledning, elektronik
broader: zmYu aAM TuF
related: nDaB vdy eAy
related: SPYW 7Z1 ShT

Spanska, cirkelledning
type: Concept
in scheme: JobTech Taxonomy - Färdighet
definition: Spanska, cirkelledning
broader: zmYu aAM TuF
related: 1CX5 mZw Vcq

Elitidrott, erfarenhet
type: Concept
in scheme: JobTech Taxonomy - Färdighet
definition: Elitidrott, erfarenhet
broader: Idrott/aktivitet
related: AwXA EM4 71n

Oracle Certified Database Administrator
type: Concept
in scheme: JobTech Taxonomy - Färdighet
definition: Oracle Certified Database Administrator
broader: s48H Sft DTn
related: BAeH eg8 T2d
related: DJh5 yyF hEM
related: 4Jty HpK a3Q
related: UXKZ 3zZ ipB

Skogshushållning
type: Concept
in scheme: JobTech Taxonomy - Färdighet
definition: Skogshushållning
broader: zmYu aAM TuF
related: 3LdB WEJ 8Ms

Service på dykutrustning
type: Concept
in scheme: JobTech Taxonomy - Färdighet
definition: Service på dykutrustning
broader: zmYu aAM TuF
related: DPPw 4wa AsH

Markberedning, skogsbruk
type: Concept
in scheme: JobTech Taxonomy - Färdighet
definition: Markberedning, skogsbruk
broader: zmYu aAM TuF
related: KwVo sQu G2e

Allmänkonstruktion-AutoCAD
type: Concept
in scheme: JobTech Taxonomy - Färdighet
definition: Allmänkonstruktion-AutoCAD
broader: mTLu uo2 gq2
related: 3jEy yuT aVo
related: rwpH 6RA XTT
related: thZP oR7 WrY
related: MSnK 3Z8 4qA
related: K8yg U4C gkY
related: nDaB vdy eAy
related: Pd51 xnr KCY
related: ketV G9W GeR
related: SPYW 7Z1 ShT
related: XeBP nMe pXx
related: PRQn 9yw NJA
related: ETAR ggZ Wuw
related: 41KB bfk 5jR
related: 4Jty HpK a3Q
related: CSUf ZVM a7Z

Utvecklingssamtal, metodutveckling
type: Concept
in scheme: JobTech Taxonomy - Färdighet
definition: Utvecklingssamtal, metodutveckling
broader: zmYu aAM TuF
related: mNoS AN5 drn
related: bjqk F3A 5Hk

Kartläggning av nutritionsstatus
type: Concept
in scheme: JobTech Taxonomy - Färdighet
definition: Kartläggning av nutritionsstatus
broader: zmYu aAM TuF
related: Pq5C SPC bRA

Vägteknik
type: Concept
in scheme: JobTech Taxonomy - Färdighet
definition: Vägteknik
broader: zmYu aAM TuF
related: thZP oR7 WrY
related: w6ud quG dgh

Möbelsnickeri
type: Concept
in scheme: JobTech Taxonomy - Färdighet
definition: Möbelsnickeri avser hantverksmässig tillverkning och reparation av möbler och andra träprodukter. Kompetensen omfattar kunskaper om materialval, snickeritekniker och design för att skapa funktionella och estetiskt tilltalande möbler.
broader: zmYu aAM TuF
related: 1Nwn GYH wkH

Inspelningsledning
type: Concept
in scheme: JobTech Taxonomy - Färdighet
definition: Inspelningsledning
broader: zmYu aAM TuF
related: 4BsK q2C sCL
related: CkRH 4Qn iX3
related: PH2M uV4 r72

HTML, programmeringsspråk
type: Concept
in scheme: JobTech Taxonomy - Färdighet
definition: HTML, programmeringsspråk, avser ett markup-språk som används för att strukturera och presentera innehåll på webbsidor. Kompetensen innebär kunskaper om syntax och grundläggande funktioner för att skapa och utveckla webbinnehåll samt integration med andra teknologier som CSS och JavaScript.
alternative label: HTML
broader: Datorspråk
related: BAeH eg8 T2d
related: Fv7d YhP YmS
related: 8Bmh vtM zts
related: D9SL mtn vGM
related: DJh5 yyF hEM
related: 4Jty HpK a3Q
related: Mbt6 3ko DiD

Allergibehandling
type: Concept
in scheme: JobTech Taxonomy - Färdighet
definition: Allergibehandling
broader: zmYu aAM TuF
related: Z8ci bBE tmx

SOAP, kommunikationsprotokoll
type: Concept
in scheme: JobTech Taxonomy - Färdighet
definition: SOAP, kommunikationsprotokoll
alternative label: SOAP
broader: Kommunikationsprotokoll
related: BAeH eg8 T2d
related: cBBa ngH fCx
related: D9SL mtn vGM
related: DJh5 yyF hEM
related: 4Jty HpK a3Q
related: 13md uyV BNG
related: UXKZ 3zZ ipB
related: MYAz x9m 2LJ

Varmsmidning
type: Concept
in scheme: JobTech Taxonomy - Färdighet
definition: Varmsmidning avser en metallbearbetningsteknik där metaller formas medan de är uppvärmda till en temperatur som gör dem plastiska. Denna kompetens kräver kunskap om de fysiska egenskaperna hos metaller samt förmåga att hantera och styra de processer som är involverade i smidning för att uppnå önskade former och kvaliteter.
broader: zmYu aAM TuF
related: vaEp iBS c5h

Kundsupport
type: Concept
in scheme: JobTech Taxonomy - Färdighet
definition: Kundsupport avser att ge råd och information samt besvara frågor om produkter, tjänster eller policyer från ett företag eller en organisation. Denna kompetens inkluderar förmågan att kommunicera effektivt med kunder för att lösa problem och tillhandahålla relevant information.
broader: zmYu aAM TuF
related: pwRH MT1 8nR

Värmetak
type: Concept
in scheme: JobTech Taxonomy - Färdighet
definition: Värmetak
broader: zmYu aAM TuF
related: 3g5x Tm7 8QH

Kartografi
type: Concept
in scheme: JobTech Taxonomy - Färdighet
definition: Kartografi
broader: zmYu aAM TuF
related: thZP oR7 WrY
related: ketV G9W GeR
related: sXgV QFg vpb
related: 4Jty HpK a3Q

Projektering värme och kyla
type: Concept
in scheme: JobTech Taxonomy - Färdighet
definition: Projektering värme och kyla
broader: zmYu aAM TuF
related: thZP oR7 WrY
related: yXbD NTH ijE
related: XeBP nMe pXx

Lingo, programmeringsspråk
type: Concept
in scheme: JobTech Taxonomy - Färdighet
definition: Lingo, programmeringsspråk
alternative label: Lingo
broader: Datorspråk
related: BAeH eg8 T2d
related: Fv7d YhP YmS
related: D9SL mtn vGM
related: DJh5 yyF hEM
related: 4Jty HpK a3Q

Byggelement, tillverkning
type: Concept
in scheme: JobTech Taxonomy - Färdighet
definition: Byggelement, tillverkning avser processen för produktion av olika typer av byggelement som används inom bygg- och anläggningssektorn. Kompetensen innefattar arbete med material och maskiner för att tillverka komponenter som trä-, betong- och cementprodukter som ingår i byggnader och infrastrukturer.
broader: zmYu aAM TuF
related: VKKg e4t t46
related: o31g CX1 qhQ

Biodrivmedel, tillverkning
type: Concept
in scheme: JobTech Taxonomy - Färdighet
definition: Biodrivmedel, tillverkning
broader: zmYu aAM TuF
related: yXbD NTH ijE
related: QEBd qHu vGr

Yrkessvenska, industriell tillverkning
type: Concept
in scheme: JobTech Taxonomy - Färdighet
definition: Yrkessvenska, industriell tillverkning
broader: zmYu aAM TuF
related: yJk6 azD ywF
related: YiQw N87 zLU
related: sX9n CWa KVC
related: dKUb KBP mw3
related: m8TS hdk pSf
related: HXzD qvt HV6
related: ENV6 BNa brP
related: 4obu LL6 RqJ
related: hxm6 xkr dHm
related: LEvM 7Hs w8i
related: rxmK wwM 1NA
related: Vfum e6B 7Bw
related: VKKg e4t t46
related: MSnK 3Z8 4qA
related: UdrS qzV P7i
related: XeJB bkn mRn
related: 1G6H AuG qyy
related: vaEp iBS c5h
related: 8ddv P8e iYz
related: yPQ4 EaN Dtj
related: kF59 fge kts
related: SgAJ DW2 FN5
related: iZLB KpD LLo
related: Kxm9 N3V shF
related: mPzg 93F QEv
related: shkw ojo UL2
related: o31g CX1 qhQ
related: 4DET dLf iB9
related: skLS kpa Ui1
related: J9Vz JxJ Bji
related: aU9p ekE Fqf
related: TrwQ RXT W8a
related: UcNa inr snV
related: icae Y69 H8E
related: LeQV umf wUS
related: gJtZ EBc n2z
related: AUs8 M5f dLt
related: L4hA SJP SFi
related: 4bxV 58E P9N

Samhällsbyggnad
type: Concept
in scheme: JobTech Taxonomy - Färdighet
definition: Samhällsbyggnad
broader: zmYu aAM TuF
related: GMDo DVo Yzh

Distriktssköterskeutbildning
type: Concept
in scheme: JobTech Taxonomy - Färdighet
definition: Distriktssköterskeutbildning är en specialistutbildning på universitet/högskola med inriktning till distriktssköterska.
broader: Specialistområde för sjuksköterska
related: oj4c P4b cja

Låssmide
type: Concept
in scheme: JobTech Taxonomy - Färdighet
definition: Låssmide avser den hantverksmässiga kompetensen att tillverka, installera och reparera lås samt relaterade säkerhetssystem. Kompetensen omfattar även kunskaper om materialhantering, mekaniska system och precisionsarbete, vilket är avgörande för att säkerställa funktion och säkerhet i olika typer av låsanordningar.
broader: zmYu aAM TuF
related: e6nk AGp y28

A cappella
type: Concept
in scheme: JobTech Taxonomy - Färdighet
definition: A cappella
broader: Sång
related: AWJF wqZ va9

Psykosocialt arbete
type: Concept
in scheme: JobTech Taxonomy - Färdighet
definition: Psykosocialt arbete
broader: zmYu aAM TuF
related: BWwk fYX S5B
related: dJXy Rpq a2u

Tutti
type: Concept
in scheme: JobTech Taxonomy - Färdighet
definition: Tutti
broader: zmYu aAM TuF
related: AWJF wqZ va9

Skrivtolkning
type: Concept
in scheme: JobTech Taxonomy - Färdighet
definition: Skrivtolkning
broader: zmYu aAM TuF
related: PQDm Z63 zst

Verktyg
type: Concept
in scheme: JobTech Taxonomy - Färdighet
definition: Verktyg
broader: zmYu aAM TuF
related: oXSW fbY XrY
related: YKL2 FCB 1yr
related: 85cq 6uK 4cK

Realtidsprogrammering
type: Concept
in scheme: JobTech Taxonomy - Färdighet
definition: Realtidsprogrammering
broader: zmYu aAM TuF
related: Q5DF juj 8do
related: nDaB vdy eAy
related: DJh5 yyF hEM
related: SPYW 7Z1 ShT
related: 4Jty HpK a3Q

Takmontering
type: Concept
in scheme: JobTech Taxonomy - Färdighet
definition: Takmontering
broader: zmYu aAM TuF
related: 3g5x Tm7 8QH

Bingo, erfarenhet
type: Concept
in scheme: JobTech Taxonomy - Färdighet
definition: Bingo, erfarenhet
broader: zmYu aAM TuF
related: YHwG fk2 MDL

Butiksinredning, planeringsvana
type: Concept
in scheme: JobTech Taxonomy - Färdighet
definition: Butiksinredning, planeringsvana
broader: zmYu aAM TuF
related: dUuh wwa FGj
related: CSUf ZVM a7Z

Konsthistorisk guidning
type: Concept
in scheme: JobTech Taxonomy - Färdighet
definition: Konsthistorisk guidning
broader: zmYu aAM TuF
related: A6X3 efC VNy

Experimentell teater
type: Concept
in scheme: JobTech Taxonomy - Färdighet
definition: Experimentell teater
broader: zmYu aAM TuF
related: iBUL s38 izZ

Kallvalsning
type: Concept
in scheme: JobTech Taxonomy - Färdighet
definition: Kallvalsning
broader: zmYu aAM TuF
related: m8TS hdk pSf

Nätverksprogrammering
type: Concept
in scheme: JobTech Taxonomy - Färdighet
definition: Nätverksprogrammering
broader: zmYu aAM TuF
related: Q5DF juj 8do
related: VCpu 5EN bBt
related: DJh5 yyF hEM
related: 4Jty HpK a3Q

Översättningsminnen
type: Concept
in scheme: JobTech Taxonomy - Färdighet
definition: Översättningsminnen
broader: zmYu aAM TuF
related: PQDm Z63 zst
related: 4Jty HpK a3Q

Linsslipning
type: Concept
in scheme: JobTech Taxonomy - Färdighet
definition: Linsslipning
broader: zmYu aAM TuF
related: hxm6 xkr dHm
related: YKL2 FCB 1yr

Energimassage
type: Concept
in scheme: JobTech Taxonomy - Färdighet
definition: Energimassage
broader: zmYu aAM TuF
related: uxHV KXc PKD

Viltmästarutbildning
type: Concept
in scheme: JobTech Taxonomy - Färdighet
definition: Viltmästarutbildning
broader: Yrkesbevis/examen
related: yXbD NTH ijE
related: 3LdB WEJ 8Ms

Mästarbrev, stickningsyrket
type: Concept
in scheme: JobTech Taxonomy - Färdighet
definition: Mästarbrev, stickningsyrket
broader: Yrkesbevis/examen
related: aKdV u7V R5j
related: skLS kpa Ui1

Webb
type: Concept
in scheme: JobTech Taxonomy - Färdighet
definition: Webb
broader: zmYu aAM TuF
related: zfve s6G tpc
related: 4Jty HpK a3Q

Primär hälso- och sjukvård, specialistkompetens för fysioterapeuter
type: Concept
in scheme: JobTech Taxonomy - Färdighet
definition: Primär hälso- och sjukvård, specialistkompetens för fysioterapeuter
broader: Specialistinriktning inom fysioterapi
related: s7vU FhY L5Z

Driftsätta och övervaka maskinutrustning
type: Concept
in scheme: JobTech Taxonomy - Färdighet
definition: Driftsätta och övervaka maskinutrustning avser processen att installera, starta och övervaka maskiner för att säkerställa att de fungerar korrekt och effektivt. Denna kompetens inkluderar även att hantera maskinens prestanda och utföra nödvändiga justeringar för att optimera drift och säkerhet.
broader: zmYu aAM TuF
related: vaEp iBS c5h

Mode, herrkonfektion/Design, herrkonfektion
type: Concept
in scheme: JobTech Taxonomy - Färdighet
definition: Mode, herrkonfektion/Design, herrkonfektion
alternative label: Design, herrkonfektion
alternative label: Mode, herrkonfektion
broader: zmYu aAM TuF
related: PF4H kQD zpL

D, programmeringsspråk
type: Concept
in scheme: JobTech Taxonomy - Färdighet
definition: D, programmeringsspråk
alternative label: D
broader: Datorspråk
related: BAeH eg8 T2d
related: Fv7d YhP YmS
related: D9SL mtn vGM
related: DJh5 yyF hEM
related: 4Jty HpK a3Q

Briljant, redovisningssystem
type: Concept
in scheme: JobTech Taxonomy - Färdighet
definition: Briljant, redovisningssystem
alternative label: Briljant
alternative label: Redovisningssystemet briljant
broader: xSJR 1Kq pxB
related: eQ4M CNm ozj
related: q81z 3oD 1qu
related: ij8k EwC zyB
related: 4Jty HpK a3Q

Bygginriktning-plåtslageri, undervisning
type: Concept
in scheme: JobTech Taxonomy - Färdighet
definition: Bygginriktning-plåtslageri, undervisning
broader: Inriktning på lärarkompetens
related: 2x2V UeL 6ke

Hemelektronik, leverans och installation
type: Concept
in scheme: JobTech Taxonomy - Färdighet
definition: Hemelektronik, leverans och installation avser kompetens inom transport och installation av olika typer av hemelektronikprodukter, som apparater, system och tillbehör, i privata och kommersiella miljöer. Denna kompetens omfattar kunskap om korrekt hantering, anslutning och optimering av utrustning för att säkerställa funktionalitet och användartillfredsställelse.
broader: zmYu aAM TuF
related: bwnk nv2 1cR

Masterdata
type: Concept
in scheme: JobTech Taxonomy - Färdighet
definition: Masterdata
broader: zmYu aAM TuF
related: DJh5 yyF hEM
related: UxT1 tPF Kbg
related: 4Jty HpK a3Q
related: UXKZ 3zZ ipB

Råstockning
type: Concept
in scheme: JobTech Taxonomy - Färdighet
definition: Råstockning
broader: zmYu aAM TuF
related: e6nk AGp y28

Malning av malm
type: Concept
in scheme: JobTech Taxonomy - Färdighet
definition: Malning av malm avser processen att krossa, mala och anrika malm för att separera värdefulla mineraler från den omgivande bergarten. Detta innefattar kunskaper inom olika kross- och malningstekniker samt förståelse för de processer som används för att effektivt extrahera och bearbeta råmaterialet.
broader: zmYu aAM TuF
related: LEvM 7Hs w8i

Amazon Web Services (AWS), molnplattform
type: Concept
in scheme: JobTech Taxonomy - Färdighet
definition: Amazon Web Services (AWS), molnplattform, avser ett omfattande set av molntjänster som tillhandahålls av Amazon för att stödja företag och organisationer i deras IT-behov. Kompetensen omfattar förståelse för att implementera, hantera och optimera dessa tjänster för att skapa effektiva och skalbara lösningar.
alternative label: AWS
alternative label: Amazon Web Services
alternative label: Amazon Web Services (AWS)
broader: Applikationsplattformar
related: VCpu 5EN bBt
related: DJh5 yyF hEM
related: 4Jty HpK a3Q
related: UXKZ 3zZ ipB

Avfallsinsamling
type: Concept
in scheme: JobTech Taxonomy - Färdighet
definition: Avfallsinsamling avser processen för insamling och transport av avfall från olika källor till anläggningar för behandling och återvinning. Kompetensen omfattar kunskap om hantering av olika typer av avfall, transportmetoder och miljöregler kring avfallshantering.
broader: zmYu aAM TuF
related: X7HR rZK 4wj
related: yXbD NTH ijE
related: 3MBw pDA P2F

Routingprotokoll
type: Concept
in scheme: JobTech Taxonomy - Färdighet
top concept of: JobTech Taxonomy - Färdighet
definition: Routingprotokoll
narrower: EIGRP, routingprotokoll
narrower: RIP, routingprotokoll
narrower: BGP, routingprotokoll
narrower: OSPF, routingprotokoll

Pressverktyg, tillverkning
type: Concept
in scheme: JobTech Taxonomy - Färdighet
definition: Pressverktyg, tillverkning
broader: zmYu aAM TuF
related: MSnK 3Z8 4qA

Öppen vård
type: Concept
in scheme: JobTech Taxonomy - Färdighet
definition: Öppen vård
broader: zmYu aAM TuF
related: bEDv SL7 VrL

Tidningsdesign
type: Concept
in scheme: JobTech Taxonomy - Färdighet
definition: Tidningsdesign
broader: zmYu aAM TuF
related: 8Bmh vtM zts
related: 4Jty HpK a3Q

Koreografi, filmproduktion
type: Concept
in scheme: JobTech Taxonomy - Färdighet
definition: Koreografi, filmproduktion
broader: zmYu aAM TuF
related: gmRr 7tt eHj

Certifierad nagelterapeut
type: Concept
in scheme: JobTech Taxonomy - Färdighet
definition: Certifierad nagelterapeut är en certifiering som intygar att en nagelterapeut har genomgått utbildning och uppnått kompetens inom området.
broader: s48H Sft DTn
related: ezKk kss CiQ

Regi, cirkus
type: Concept
in scheme: JobTech Taxonomy - Färdighet
definition: Regi, cirkus
broader: zmYu aAM TuF
related: rYSG 3WJ LmC

Metall, konstkonservering
type: Concept
in scheme: JobTech Taxonomy - Färdighet
definition: Metall, konstkonservering
broader: zmYu aAM TuF
related: 34Tn BQQ tfo

Maskinelement
type: Concept
in scheme: JobTech Taxonomy - Färdighet
definition: Maskinelement
broader: zmYu aAM TuF
related: K8yg U4C gkY

Kärntillverkning
type: Concept
in scheme: JobTech Taxonomy - Färdighet
definition: Kärntillverkning
broader: zmYu aAM TuF
related: UcNa inr snV

Planglas, monteringsvana
type: Concept
in scheme: JobTech Taxonomy - Färdighet
definition: Planglas, monteringsvana
broader: zmYu aAM TuF
related: J17g Q2a 2u1

Tentamensadministration
type: Concept
in scheme: JobTech Taxonomy - Färdighet
definition: Tentamensadministration avser hantering av hela tentamensprocessen. Detta inkluderar planering, schemaläggning och bokning av tentamenstillfällen och lokaler i system som TimeEdit och Ladok. Även administration kring registrering av tentamensresultat i system som Ladok ingår. av Det kan även ingå att samordna och handleda tentamensvakter.
broader: zmYu aAM TuF
related: oEmP NC1 sXE

FPR/MSA
type: Concept
in scheme: JobTech Taxonomy - Färdighet
definition: FPR/MSA
alternative label: FPR
alternative label: MSA
broader: zmYu aAM TuF
related: Pd51 xnr KCY

Auktoriserat patentombud
type: Concept
in scheme: JobTech Taxonomy - Färdighet
definition: Auktoriserat patentombud
broader: Yrkesbevis/examen
related: mp2Y vyC RFV

Arbetsledning inom trädgård
type: Concept
in scheme: JobTech Taxonomy - Färdighet
definition: Arbetsledning inom trädgård innebär att organisera, planera och leda det dagliga arbetet på trädgårdsföretag. Kompetensen omfattar att samordna personal och resurser, fördela arbetsuppgifter samt följa upp arbetsresultat och kvalitet.
broader: zmYu aAM TuF
related: XBh3 Xrm C4R
related: 2xQ4 4kh kTZ

Driftansvar, data
type: Concept
in scheme: JobTech Taxonomy - Färdighet
definition: Driftansvar, data
broader: zmYu aAM TuF
related: eWiB mGP MjE
related: 4Jty HpK a3Q

Miljörätt
type: Concept
in scheme: JobTech Taxonomy - Färdighet
definition: Miljörätt
broader: zmYu aAM TuF
related: q8wL kdi WaW
related: br6a VVS V3y
related: rE1E m3d cx1
related: yXbD NTH ijE
related: 6aak 8eh iwT
related: DZVN v5g Fco
related: JfYV ZGg 6rm
related: V7Yz 4WV g4z

Yrkesövergripande kompetenser
type: Concept
in scheme: JobTech Taxonomy - Färdighet
top concept of: JobTech Taxonomy - Färdighet
definition: Yrkesövergripande kompetenser
narrower: Utlandstjänstgöring, erfarenhet
narrower: Forskning, erfarenhet
narrower: Informationssökning
narrower: mwCM MmB 6Ks
narrower: Kundbemötande och service
narrower: t65P wc7 98A
narrower: Dokumentation
narrower: Hållbarhetskompetens
narrower: Administrativt arbete, erfarenhet
narrower: Arbetsgrupp, erfarenhet
narrower: Underhållsplanering, erfarenhet
narrower: Digitala arbetssätt, erfarenhet
narrower: Omvärldsbevakning
narrower: Jämställdhetsarbete
narrower: Försäljning, erfarenhet
narrower: Krisberedskap
narrower: Arbetsledarerfarenhet
narrower: Undervisning, erfarenhet
narrower: xFfo VEf 9yE
narrower: Egenföretagare, erfarenhet
narrower: uHUu GNT 25X
narrower: Egenkontroll, erfarenhet
narrower: Lagerhållning
narrower: Handledarerfarenhet
narrower: Projektledning, erfarenhet
narrower: Mötesadministration
narrower: Högskoleexamen

Scenografi, scen
type: Concept
in scheme: JobTech Taxonomy - Färdighet
definition: Scenografi, scen
broader: zmYu aAM TuF
related: 4BsK q2C sCL
related: rYSG 3WJ LmC
related: CSUf ZVM a7Z

Discjockey, erfarenhet
type: Concept
in scheme: JobTech Taxonomy - Färdighet
definition: Discjockey, erfarenhet
broader: zmYu aAM TuF
related: xuSE mtB Mir

Datorarkitektur, undervisning
type: Concept
in scheme: JobTech Taxonomy - Färdighet
definition: Datorarkitektur, undervisning
broader: Dataundervisning
related: 1CX5 mZw Vcq
related: 4Jty HpK a3Q

Magenta, redovisningssystem
type: Concept
in scheme: JobTech Taxonomy - Färdighet
definition: Magenta, redovisningssystem
alternative label: Magenta
broader: xSJR 1Kq pxB
related: eQ4M CNm ozj
related: q81z 3oD 1qu
related: ij8k EwC zyB
related: 4Jty HpK a3Q

Acceptance and Commitment Therapy/ACT
type: Concept
in scheme: JobTech Taxonomy - Färdighet
definition: Acceptance and Commitment Therapy/ACT
alternative label: ACT
alternative label: Acceptance and Commitment Therapy
broader: zmYu aAM TuF
related: UUQi UJ5 MSb
related: VYeq GDF a2g

Facilities Management
type: Concept
in scheme: JobTech Taxonomy - Färdighet
definition: Facilities Management
broader: zmYu aAM TuF
related: vPP6 rsw dck
related: thZP oR7 WrY
related: U8HK Jdi GuC

Utbildningsbevis, mobila arbetsplattformar
type: Concept
in scheme: JobTech Taxonomy - Färdighet
definition: Utbildningsbevis, mobila arbetsplattformar
broader: s48H Sft DTn
related: DPPw 4wa AsH
related: 3ZtN hhA SM7
related: bZ4J riZ zK6
related: V79C DD2 3Gj
related: J17g Q2a 2u1
related: 3g5x Tm7 8QH
related: QKvX v7r PNL
related: idjo 2Wr a3E
related: Y4j1 P17 wVA
related: q2Ge zrQ zJb
related: 9mJN VwW Xjg
related: XYzP 5Tn 7Ep
related: ketV G9W GeR
related: 7Zqy hSM Fig
related: AD3U cFH rbe
related: f71c gjL RDq
related: fLKb bJ3 69p
related: 3UzE P8A 9sS
related: a75S eLg JWH
related: vpHn q1R gV4
related: NnB3 eWH auo
related: iHrC aRv fVm
related: cGxX R9c kW1
related: yyF7 jsW EeP
related: bXfo 4hb SXx

El, strömavtagare, nedbindare
type: Concept
in scheme: JobTech Taxonomy - Färdighet
definition: El, strömavtagare, nedbindare
broader: Yrkesbevis/examen
related: MW1P GNJ 4F9

Monterbygge
type: Concept
in scheme: JobTech Taxonomy - Färdighet
definition: Monterbygge
broader: zmYu aAM TuF
related: 9mJN VwW Xjg
related: 1Nwn GYH wkH

Analog videokamerateknik
type: Concept
in scheme: JobTech Taxonomy - Färdighet
definition: Analog videokamerateknik
broader: zmYu aAM TuF
related: 4BsK q2C sCL
related: CkRH 4Qn iX3
related: 3J38 DNz YKK

2-färgstryck
type: Concept
in scheme: JobTech Taxonomy - Färdighet
definition: 2-färgstryck
broader: zmYu aAM TuF
related: XeJB bkn mRn

MasterCAM, tillverkningsprogram
type: Concept
in scheme: JobTech Taxonomy - Färdighet
definition: MasterCAM, tillverkningsprogram
broader: zmYu aAM TuF
related: K8yg U4C gkY
related: 4Jty HpK a3Q

Mästarbrev, hattmakare
type: Concept
in scheme: JobTech Taxonomy - Färdighet
definition: Mästarbrev, hattmakare
broader: Yrkesbevis/examen
related: mwVN oEH g9k

Badmästarutbildning
type: Concept
in scheme: JobTech Taxonomy - Färdighet
definition: Badmästarutbildning avser den utbildning som ger kompetens att övervaka och säkerställa säkerheten vid badsanläggningar, såsom simbassänger och stränder. Utbildningen omfattar kunskaper om livräddning, säkerhetsrutiner och första hjälpen, vilket är nödvändigt för att utföra bevaknings- och säkerhetsarbete inom detta område.
broader: Yrkesbevis/examen
related: ayQ4 G3W A2w

Mönsterkortskonstruktion
type: Concept
in scheme: JobTech Taxonomy - Färdighet
definition: Mönsterkortskonstruktion
broader: zmYu aAM TuF
related: nDaB vdy eAy
related: SPYW 7Z1 ShT
related: 4Jty HpK a3Q

EN 13133, Hårdlödning/ISO 13585
type: Concept
in scheme: JobTech Taxonomy - Färdighet
definition: EN 13133, Hårdlödning/ISO 13585
broader: Svets-/lödarmetoder med verifierad kunskap
related: vaEp iBS c5h
related: wQ1E Bzk ZyA
related: fLKb bJ3 69p
related: 3UzE P8A 9sS

Manusprogram-Final Draft
type: Concept
in scheme: JobTech Taxonomy - Färdighet
definition: Manusprogram-Final Draft
broader: Programvara för digitalt skapande
related: zfve s6G tpc
related: 4Jty HpK a3Q

Hopsättning, trä
type: Concept
in scheme: JobTech Taxonomy - Färdighet
definition: Hopsättning, trä
broader: zmYu aAM TuF
related: VKKg e4t t46
related: 8ddv P8e iYz

3D-grafik-Autodesk MotionBuilder
type: Concept
in scheme: JobTech Taxonomy - Färdighet
definition: 3D-grafik-Autodesk MotionBuilder
broader: Programvara för digitalt skapande
related: 8Bmh vtM zts
related: 34Tn BQQ tfo
related: Q5DF juj 8do
related: 4Jty HpK a3Q
related: LeQV umf wUS
related: Mbt6 3ko DiD

Inspektionsdykning
type: Concept
in scheme: JobTech Taxonomy - Färdighet
definition: Inspektionsdykning
broader: zmYu aAM TuF
related: DPPw 4wa AsH

Fotografering, storformatskamera
type: Concept
in scheme: JobTech Taxonomy - Färdighet
definition: Fotografering, storformatskamera
broader: zmYu aAM TuF
related: 4BsK q2C sCL
related: CkRH 4Qn iX3
related: 3J38 DNz YKK

Hjärt-kärlsjukdomar, specialistkompetens för fysioterapeuter
type: Concept
in scheme: JobTech Taxonomy - Färdighet
definition: Hjärt-kärlsjukdomar, specialistkompetens för fysioterapeuter
broader: Specialistinriktning inom fysioterapi
related: s7vU FhY L5Z

Psykologi, undervisning
type: Concept
in scheme: JobTech Taxonomy - Färdighet
definition: Psykologi, undervisning
broader: Inriktning på lärarkompetens
related: 4KhP FxL uZ5

Spiralborrning
type: Concept
in scheme: JobTech Taxonomy - Färdighet
definition: Spiralborrning
broader: zmYu aAM TuF
related: vaEp iBS c5h

Systematiskt brandskyddsarbete (SBA)
type: Concept
in scheme: JobTech Taxonomy - Färdighet
definition: Kompetens inom systematiskt brandskyddsarbete (SBA) innebär att planera, dokumentera, följa upp och förbättra brandskyddet i en verksamhet för att förebygga och begränsa skador vid brand. Det inkluderar att ha kunskap om tekniska och organisatoriska brandskyddsåtgärder, upprätta rutiner för regelbundna kontroller och underhåll, samt utbilda personal för att säkerställa rätt insatser vid brand. Kompetensen omfattar också ansvarsfördelning i brandskyddsorganisationen, riskinventeringar, utarbetande av handlingsplaner och att anpassa brandskyddet efter verksamhetens komplexitet. SBA-dokumentation är viktig för verksamheten och kan integreras i andra ledningssystem. Rollen kräver förmåga att kommunicera med alla berörda parter och säkerställa att brandskyddet följer lag (LSO) och föreskrifter (SRVFS 2004:3).
broader: zmYu aAM TuF
related: wCx8 rY3 XUT
related: nuXg Wjc JPd

Lokalisering
type: Concept
in scheme: JobTech Taxonomy - Färdighet
definition: Lokalisering
broader: zmYu aAM TuF
related: PQDm Z63 zst

Dramaturgi
type: Concept
in scheme: JobTech Taxonomy - Färdighet
definition: Dramaturgi
broader: zmYu aAM TuF
related: iBUL s38 izZ
related: ezKk kss CiQ
related: 4BsK q2C sCL
related: zfve s6G tpc
related: CkRH 4Qn iX3
related: PF4H kQD zpL
related: rYSG 3WJ LmC
related: 3J38 DNz YKK
related: PH2M uV4 r72
related: CSUf ZVM a7Z

Lärarexamen-förskola, förskoleklass tidigare år
type: Concept
in scheme: JobTech Taxonomy - Färdighet
definition: Lärarexamen-förskola, förskoleklass tidigare år
broader: Yrkesbevis/examen
related: oQUQ D11 HPx

Miljövetenskap
type: Concept
in scheme: JobTech Taxonomy - Färdighet
definition: Miljövetenskap
broader: zmYu aAM TuF
related: rE1E m3d cx1
related: yXbD NTH ijE

Mineralteknik
type: Concept
in scheme: JobTech Taxonomy - Färdighet
definition: Mineralteknik
broader: zmYu aAM TuF
related: 3jEy yuT aVo
related: rwpH 6RA XTT

Äger godkänd tjänstehund
type: Concept
in scheme: JobTech Taxonomy - Färdighet
definition: Äger godkänd tjänstehund
broader: zmYu aAM TuF
related: iqZh 3yX i8n

Brottning, professionell utövning
type: Concept
in scheme: JobTech Taxonomy - Färdighet
definition: Brottning, professionell utövning
broader: Idrott/aktivitet
related: AwXA EM4 71n

Airline Transport Pilot License/ATPL
type: Concept
in scheme: JobTech Taxonomy - Färdighet
definition: Airline Transport Pilot License/ATPL
alternative label: ATPL
alternative label: Airline Transport Pilot License
broader: s48H Sft DTn
related: 7n3y FTE qSe

Gesällbrev, sadelmakare
type: Concept
in scheme: JobTech Taxonomy - Färdighet
definition: Gesällbrev, sadelmakare
broader: Yrkesbevis/examen
related: vJQk YvC XB7

Computer Aided Translation/CAT-verktyg
type: Concept
in scheme: JobTech Taxonomy - Färdighet
definition: Computer Aided Translation/CAT-verktyg
alternative label: CAT-verktyg
alternative label: Computer Aided Translation
broader: Allmänna datakunskaper
related: eQ4M CNm ozj
related: fdLf oPp wVw
related: vPP6 rsw dck
related: iWcY mko rq2
related: 1CX5 mZw Vcq
related: L7eh ihX vM5
related: MGk3 LvL AU2
related: H2Zj eL9 x28
related: PQDm Z63 zst
related: pwRH MT1 8nR
related: zKvJ GnC Szx
related: ij8k EwC zyB
related: 4Jty HpK a3Q
related: p16X 44f rwZ

Bytomter, arkeologisk kunskap
type: Concept
in scheme: JobTech Taxonomy - Färdighet
definition: Bytomter, arkeologisk kunskap
broader: zmYu aAM TuF
related: sXgV QFg vpb

Begravningsmusik/Sorgemusik
type: Concept
in scheme: JobTech Taxonomy - Färdighet
definition: Begravningsmusik/Sorgemusik
alternative label: Begravningsmusik
alternative label: Sorgemusik
broader: p1WM wCw LTd
related: AWJF wqZ va9

ADR-intyg
type: Concept
in scheme: JobTech Taxonomy - Färdighet
definition: ADR-intyg är en certifiering som krävs för yrkesverksamma som transporterar farligt gods enligt europeiska regler. MSB utfärdar ADR-intyg.
broader: s48H Sft DTn
related: WhBn FAp ZNW
related: kLyY rwr aJr
related: 7zKm 4NW eey
related: 3MBw pDA P2F
related: MrcX RDn N53
related: P7Ay ooF pri

Kylisolering
type: Concept
in scheme: JobTech Taxonomy - Färdighet
definition: Kylisolering
broader: zmYu aAM TuF
related: yXbD NTH ijE
related: cGxX R9c kW1

Talsyntes
type: Concept
in scheme: JobTech Taxonomy - Färdighet
definition: Talsyntes
broader: zmYu aAM TuF
related: PQDm Z63 zst
related: 4Jty HpK a3Q

Elinstallation, ombyggnad
type: Concept
in scheme: JobTech Taxonomy - Färdighet
definition: Elinstallation, ombyggnad avser kompetensen att installera och ombygga elektriska system och anläggningar i byggnader, vilket innefattar arbete med både nyinstallationer och omstrukturering av befintliga installationer. Denna kompetens kräver kunskap om säkerhetsföreskrifter, material och tekniska riktlinjer för att säkerställa funktionalitet och säkerhet enligt gällande regler.
broader: zmYu aAM TuF
related: SgAJ DW2 FN5
related: a75S eLg JWH
related: yyF7 jsW EeP

Strängsprutning
type: Concept
in scheme: JobTech Taxonomy - Färdighet
definition: Strängsprutning
broader: zmYu aAM TuF
related: ENV6 BNa brP
related: yPQ4 EaN Dtj

Konstruktionsprogram, undervisning
type: Concept
in scheme: JobTech Taxonomy - Färdighet
definition: Konstruktionsprogram, undervisning
broader: Dataundervisning
related: 1CX5 mZw Vcq
related: 4Jty HpK a3Q

Kraftförsörjning, omformarstationer
type: Concept
in scheme: JobTech Taxonomy - Färdighet
definition: Kraftförsörjning, omformarstationer
broader: Yrkesbevis/examen
related: MW1P GNJ 4F9

Digitalt färdskrivarkort
type: Concept
in scheme: JobTech Taxonomy - Färdighet
definition: Tunga lastbilar och bussar är utrustade med digital färdskrivare. Föraren måste ha ett personligt digitalt förarkort som förs in i färdskrivaren och registrerar kör- och vilotider. Polisen kan i efterhand kontrollera att föraren följt gällande arbetstidsregler. Äldre lastbilar och bussar kan vara utrustade med annan typ av färdskrivare.
broader: zmYu aAM TuF
related: FiDm 2S8 gx7
related: 3MBw pDA P2F

Sockerbetsodling
type: Concept
in scheme: JobTech Taxonomy - Färdighet
definition: Sockerbetsodling
broader: zmYu aAM TuF
related: 9QMD sZ3 ZjX
related: k3R3 UkC nK2
related: RYCQ ogb uUY

Imitation
type: Concept
in scheme: JobTech Taxonomy - Färdighet
definition: Imitation
broader: zmYu aAM TuF
related: iBUL s38 izZ
related: xuSE mtB Mir

Grönytemaskiner, körvana
type: Concept
in scheme: JobTech Taxonomy - Färdighet
definition: Grönytemaskiner, körvana avser färdigheten att köra och hantera olika typer av maskiner avsedda för arbete i grönytor, såsom gräsklippare, häcksaxar och snöskotrar. Denna kompetens innefattar kunskap om maskinernas funktion och säkerhetsåtgärder för att utföra arbete effektivt och säkert inom trädgårdsanläggning och fastighetsskötsel.
broader: zmYu aAM TuF
related: XBh3 Xrm C4R
related: df9D e6y 61z

Informationsverksamhet, förening
type: Concept
in scheme: JobTech Taxonomy - Färdighet
definition: Informationsverksamhet, förening
broader: zmYu aAM TuF
related: aA2Z 9XX R1v

Verksamhetsledning, ideell organisation
type: Concept
in scheme: JobTech Taxonomy - Färdighet
definition: Verksamhetsledning, ideell organisation
broader: zmYu aAM TuF
related: ajwx FvL YuY

Köksinredning
type: Concept
in scheme: JobTech Taxonomy - Färdighet
definition: Köksinredning
broader: zmYu aAM TuF
related: oXSW fbY XrY
related: YKL2 FCB 1yr
related: 85cq 6uK 4cK

Befraktning
type: Concept
in scheme: JobTech Taxonomy - Färdighet
definition: Befraktning innebär att organisera transport av gods via fartyg genom att förmedla frakter mellan lastägare (befraktare) och redare. Kompetensområdet omfattar förståelse för fraktmarknaden, sjötransporträtt, affärsförhandling och kontraktsvillkor.
broader: zmYu aAM TuF
related: Ru4W zn2 LEz
related: AuTi FEo j3R
related: 957L kZK rHZ

Alcatel, telefonväxel
type: Concept
in scheme: JobTech Taxonomy - Färdighet
definition: Alcatel, telefonväxel
broader: Telefonväxlar
related: 4aPu 2nd 8X6
related: ByrL ANp UwV
related: 4Jty HpK a3Q

Museifotografering
type: Concept
in scheme: JobTech Taxonomy - Färdighet
definition: Museifotografering
broader: zmYu aAM TuF
related: 3J38 DNz YKK

Film/redigering-Autodesk Smoke
type: Concept
in scheme: JobTech Taxonomy - Färdighet
definition: Film/redigering-Autodesk Smoke
alternative label: Film-Autodesk Smoke
alternative label: redigering-Autodesk Smoke
broader: Programvara för digitalt skapande
related: 8Bmh vtM zts
related: 4BsK q2C sCL
related: CkRH 4Qn iX3
related: 3J38 DNz YKK
related: PH2M uV4 r72
related: 4Jty HpK a3Q

DB2, databashanterare
type: Concept
in scheme: JobTech Taxonomy - Färdighet
definition: DB2, databashanterare
alternative label: DB2
broader: Databaser
related: BAeH eg8 T2d
related: cBBa ngH fCx
related: Fv7d YhP YmS
related: D9SL mtn vGM
related: DJh5 yyF hEM
related: 4Jty HpK a3Q
related: MYAz x9m 2LJ

Läder- och skinnsömnad
type: Concept
in scheme: JobTech Taxonomy - Färdighet
definition: Läder- och skinnsömnad avser processen att sy och bearbeta läder och skinn för att tillverka olika produkter, inklusive kläder, accessoarer och möbler. Kompetensen innefattar tekniker för sömnad, mönsterkonstruktion och materialhantering som är specifika för läder- och skinnindustrin.
broader: zmYu aAM TuF
related: UZBj yDX Ctp
related: skLS kpa Ui1
related: vJQk YvC XB7

Yrkesbevis, schakt, fyllning och dränering
type: Concept
in scheme: JobTech Taxonomy - Färdighet
definition: Yrkesbevis, schakt, fyllning och dränering
broader: Yrkesbevis/examen
related: XBh3 Xrm C4R
related: df9D e6y 61z

Yrkeshögskoleutbildning, drifttekniker vid vatten- och avloppsanläggning
type: Concept
in scheme: JobTech Taxonomy - Färdighet
definition: Yrkeshögskoleutbildning, drifttekniker vid vatten- och avloppsanläggning är en yrkeshögskoleutbildning med inriktning till drifttekniker inom vatten- och avlopp.
broader: Yrkesutbildning
related: Cppd 9P7 HeR

Gjutmetaller
type: Concept
in scheme: JobTech Taxonomy - Färdighet
definition: Gjutmetaller
broader: zmYu aAM TuF
related: J9Vz JxJ Bji
related: UcNa inr snV

Mästarbrev, bilsadelmakare
type: Concept
in scheme: JobTech Taxonomy - Färdighet
definition: Mästarbrev, bilsadelmakare är ett bevis på högsta kompetensnivå inom ett hantverksyrke där innehavaren har uppnått mästarnivå, oftast genom ett mästarprov och uppfyllande av samtliga krav enligt branschens regler. Utfärdas av Sveriges hantverksråd i samråd med aktuell branschorganisation.
broader: Yrkesbevis/examen
related: vJQk YvC XB7
related: vhUJ LyD XWc

Elinriktning-dator- och kommunikationsteknik, undervisning
type: Concept
in scheme: JobTech Taxonomy - Färdighet
definition: Elinriktning-dator- och kommunikationsteknik, undervisning
broader: Inriktning på lärarkompetens
related: 2x2V UeL 6ke

Risk- och säkerhetsanalyser, arbetsmiljö
type: Concept
in scheme: JobTech Taxonomy - Färdighet
definition: Risk- och säkerhetsanalyser, arbetsmiljö
broader: zmYu aAM TuF
related: mp2Y vyC RFV
related: Uw64 cuc U3H
related: puim 6PY DGj
related: yXbD NTH ijE
related: 4Jty HpK a3Q

Eventmarketing
type: Concept
in scheme: JobTech Taxonomy - Färdighet
definition: Eventmarketing
broader: zmYu aAM TuF
related: WX67 Pfb WMN

Fransböjning
type: Concept
in scheme: JobTech Taxonomy - Färdighet
definition: Fransböjning
broader: zmYu aAM TuF
related: ezKk kss CiQ

Butiksvana, fartygserfarenhet
type: Concept
in scheme: JobTech Taxonomy - Färdighet
definition: Butiksvana, fartygserfarenhet
broader: Övriga specialiteter, sjöfart
related: UjoW meY Zwt

Yrkesbevis, byggnadsplåtslagare
type: Concept
in scheme: JobTech Taxonomy - Färdighet
definition: Yrkesbevis, byggnadsplåtslagare
broader: Yrkesbevis/examen
related: L4hA SJP SFi
related: bXfo 4hb SXx

Peoplesoft, affärssystem
type: Concept
in scheme: JobTech Taxonomy - Färdighet
definition: Peoplesoft, affärssystem
alternative label: Peoplesoft
broader: xSJR 1Kq pxB
related: eQ4M CNm ozj
related: Y6yY SuR hVh
related: Uw4n UB2 RCW
related: iWcY mko rq2
related: q81z 3oD 1qu
related: cRmd 536 pT1
related: ij8k EwC zyB
related: 4Jty HpK a3Q

Stavparkettläggning
type: Concept
in scheme: JobTech Taxonomy - Färdighet
definition: Stavparkettläggning
broader: zmYu aAM TuF
related: V79C DD2 3Gj

Spelprogrammering
type: Concept
in scheme: JobTech Taxonomy - Färdighet
definition: Spelprogrammering
broader: zmYu aAM TuF
related: Q5DF juj 8do
related: 4Jty HpK a3Q

Beklädnad, innervägg
type: Concept
in scheme: JobTech Taxonomy - Färdighet
definition: Beklädnad, innervägg
broader: zmYu aAM TuF
related: 9mJN VwW Xjg

Demonstrationsvana, skönhetsmedel
type: Concept
in scheme: JobTech Taxonomy - Färdighet
definition: Demonstrationsvana, skönhetsmedel
broader: zmYu aAM TuF
related: YKL2 FCB 1yr
related: NCeZ rSk B4D

Domarebehörighet
type: Concept
in scheme: JobTech Taxonomy - Färdighet
definition: Domarebehörighet
broader: Yrkesbevis/examen
related: qsJJ EYo fzA

Keramik, cirkelledning
type: Concept
in scheme: JobTech Taxonomy - Färdighet
definition: Keramik, cirkelledning
broader: zmYu aAM TuF
related: 1CX5 mZw Vcq

ITIL Foundation
type: Concept
in scheme: JobTech Taxonomy - Färdighet
definition: ITIL Foundation
broader: zmYu aAM TuF
related: BAeH eg8 T2d
related: 4Jty HpK a3Q

Fartygssäkerhet
type: Concept
in scheme: JobTech Taxonomy - Färdighet
definition: Fartygssäkerhet
broader: Övriga specialiteter, sjöfart
related: BStc SJh DKG
related: Rsoy sS6 6c4
related: CbQK 7th Tyf
related: UjoW meY Zwt
related: tPox ie4 X9X
related: KttZ Skc bMR
related: kDnq Q98 sD3
related: a75S eLg JWH

Charkuterier, produktkunskap
type: Concept
in scheme: JobTech Taxonomy - Färdighet
definition: Charkuterier, produktkunskap avser förståelse av olika typer av charkuterivaror samt deras tillverkningsprocesser. Kompetensen innebär kännedom om ingredienser, lagringsmetoder och användningsområden för charkprodukter.
broader: zmYu aAM TuF
related: QqHf XKZ eyy
related: YKL2 FCB 1yr

Medeltidens arkeologi
type: Concept
in scheme: JobTech Taxonomy - Färdighet
definition: Medeltidens arkeologi
broader: zmYu aAM TuF
related: sXgV QFg vpb

Joddling
type: Concept
in scheme: JobTech Taxonomy - Färdighet
definition: Joddling
broader: p1WM wCw LTd
related: AWJF wqZ va9

Modellsnickeri
type: Concept
in scheme: JobTech Taxonomy - Färdighet
definition: Modellsnickeri avser tillverkning av modeller och prototyper i trä med avseende på detaljer och precision. Kompetensen omfattar tekniker för håltagning, sammansättning och ytbehandling av olika träprodukter, vilket görs genom hantverksmässiga metoder och verktyg.
broader: zmYu aAM TuF
related: 1Nwn GYH wkH

Stombyggnad
type: Concept
in scheme: JobTech Taxonomy - Färdighet
definition: Stombyggnad
broader: zmYu aAM TuF
related: 9mJN VwW Xjg

Församlingsarbete
type: Concept
in scheme: JobTech Taxonomy - Färdighet
definition: Församlingsarbete avser aktiviteter och insatser som syftar till att stödja och främja gemenskapen inom en församling. Kompetensen innefattar planering, ledning och genomförande av olika former av verksamheter som riktar sig till medlemmar i församlingen, inklusive socialt arbete och stödjande insatser.
broader: zmYu aAM TuF
related: df9D e6y 61z
related: x5rn vga gRK
related: aA2Z 9XX R1v
related: wzeq No2 LF1

Ritsning
type: Concept
in scheme: JobTech Taxonomy - Färdighet
definition: Ritsning
broader: zmYu aAM TuF
related: MSnK 3Z8 4qA

Kollektivtrafik, körning
type: Concept
in scheme: JobTech Taxonomy - Färdighet
definition: Kollektivtrafik, körning avser färdighet att köra fordon inom den offentliga transportsektorn, där resenärer transporteras med bussar, trådbussar eller spårvagnar. Kompetensen omfattar ansvar för passagerares säkerhet, övervakning av biljetter och meddelande av hållplatser under resan.
broader: zmYu aAM TuF
related: FiDm 2S8 gx7

Aktivitet och hälsa för äldre personer, specialistområde för arbetsterapeut
type: Concept
in scheme: JobTech Taxonomy - Färdighet
definition: Ett specialistområde och en fördjupad specialistkompetens för arbetsterapeut inom aktivitet och hälsa för äldre personer.
broader: Specialistområde för arbetsterapeut
related: TPH4 2AM isT

Estetik
type: Concept
in scheme: JobTech Taxonomy - Färdighet
definition: Estetik
broader: zmYu aAM TuF
related: sXgV QFg vpb

Förändringsledning
type: Concept
in scheme: JobTech Taxonomy - Färdighet
definition: Förändringsledning avser processen att planera, genomföra och följa upp förändringar inom organisationer för att förbättra deras verksamhet och anpassa sig till nya förutsättningar. Kompetensen innefattar strategier och metoder för att hantera övergångar och säkerställa att förändringar implementeras på ett effektivt och hållbart sätt.
alternative label: Change management
alternative label: Förändringsstyrning
broader: zmYu aAM TuF
related: Qo7p wjf gtv
related: vPP6 rsw dck
related: UXKZ 3zZ ipB

Vibrafon
type: Concept
in scheme: JobTech Taxonomy - Färdighet
definition: Vibrafon
broader: wLYs CKS wK8
related: AWJF wqZ va9

Medicinteknisk inriktning, tandtekniker
type: Concept
in scheme: JobTech Taxonomy - Färdighet
definition: Medicinteknisk inriktning, tandtekniker
broader: zmYu aAM TuF
related: 39yB xPQ ozd

Matematik, undervisning grundskolenivå
type: Concept
in scheme: JobTech Taxonomy - Färdighet
definition: Matematik, undervisning grundskolenivå
broader: Inriktning på lärarkompetens
related: oQUQ D11 HPx

Handledning för yrkesverksamma inom hälso- och sjukvård
type: Concept
in scheme: JobTech Taxonomy - Färdighet
definition: Handledning för yrkesverksamma inom hälso- och sjukvård
broader: zmYu aAM TuF
related: NFUg y9y 1TY
related: nu7c QuB KVQ
related: bEDv SL7 VrL
related: 6eAB cbY i9T
related: PHJN fva yxs
related: nrVt xUL KdQ
related: 1tGC fXC mxX
related: cuaN Rj5 YCc
related: dyWo sDb MLQ
related: gXqW s5Q ZjN
related: 6zAR EHM Kwj

Personutredningar i brottmål
type: Concept
in scheme: JobTech Taxonomy - Färdighet
definition: Personutredningar i brottmål
broader: zmYu aAM TuF
related: n6iX f2z XfE

Reparationsvana, bilplåt
type: Concept
in scheme: JobTech Taxonomy - Färdighet
definition: Reparationsvana, bilplåt avser färdigheten att utföra reparationer och återställande av skador på bilplåtar och karosser. Kompetensen inkluderar kunskap om materialhantering, verktyg och tekniker som används för att reparera plåtskador, vilket bidrar till bilens estetiska och funktionella egenskaper.
broader: zmYu aAM TuF
related: dKUb KBP mw3
related: L4hA SJP SFi

Byggtransporter, körvana/Anläggningstransporter, körvana
type: Concept
in scheme: JobTech Taxonomy - Färdighet
definition: Byggtransporter, körvana/Anläggningstransporter, körvana
alternative label: Anläggningstransporter, körvana
alternative label: Byggtransporter, körvana
broader: zmYu aAM TuF
related: 3MBw pDA P2F

Mängdantagning
type: Concept
in scheme: JobTech Taxonomy - Färdighet
definition: Mängdantagning
broader: zmYu aAM TuF
related: 8A1f sxQ adT
related: dUuh wwa FGj

Småföretagarekonomi
type: Concept
in scheme: JobTech Taxonomy - Färdighet
definition: Småföretagarekonomi
broader: zmYu aAM TuF
related: Y6yY SuR hVh
related: pTr9 RBT 9ur
related: FfMN Bw1 qYR

Matematik, undervisning gymnasienivå
type: Concept
in scheme: JobTech Taxonomy - Färdighet
definition: Matematik, undervisning gymnasienivå
broader: Inriktning på lärarkompetens
related: 4KhP FxL uZ5

WML, programmeringsspråk
type: Concept
in scheme: JobTech Taxonomy - Färdighet
definition: WML, programmeringsspråk
alternative label: WML
broader: Datorspråk
related: BAeH eg8 T2d
related: Fv7d YhP YmS
related: D9SL mtn vGM
related: DJh5 yyF hEM
related: 4Jty HpK a3Q

Trådgnistning
type: Concept
in scheme: JobTech Taxonomy - Färdighet
definition: Trådgnistning
broader: zmYu aAM TuF
related: vaEp iBS c5h

Potatisodling
type: Concept
in scheme: JobTech Taxonomy - Färdighet
definition: Potatisodling
broader: zmYu aAM TuF
related: yXbD NTH ijE
related: 9QMD sZ3 ZjX
related: k3R3 UkC nK2
related: RYCQ ogb uUY

Användbarhetstest/Användartest/User test
type: Concept
in scheme: JobTech Taxonomy - Färdighet
definition: Användbarhetstest/Användartest/User test
alternative label: Användartest
alternative label: Användbarhetstest
alternative label: User test
broader: zmYu aAM TuF
related: UxT1 tPF Kbg
related: 4Jty HpK a3Q

Ateljésnickeri
type: Concept
in scheme: JobTech Taxonomy - Färdighet
definition: Ateljésnickeri
broader: zmYu aAM TuF
related: 1Nwn GYH wkH

Webbdesign-Adobe Fireworks
type: Concept
in scheme: JobTech Taxonomy - Färdighet
definition: Webbdesign-Adobe Fireworks
broader: Programvara för digitalt skapande
related: 8Bmh vtM zts
related: Q5DF juj 8do
related: SgNH hag n9D
related: k1Nx auG sNh
related: 4Jty HpK a3Q
related: Mbt6 3ko DiD

Efterbearbetning
type: Concept
in scheme: JobTech Taxonomy - Färdighet
definition: Efterbearbetning
broader: zmYu aAM TuF
related: SgNH hag n9D
related: rYSG 3WJ LmC

Transferverktyg, tillverkning
type: Concept
in scheme: JobTech Taxonomy - Färdighet
definition: Transferverktyg, tillverkning
broader: zmYu aAM TuF
related: MSnK 3Z8 4qA

Funktionsnedsättning, arbetsterapi
type: Concept
in scheme: JobTech Taxonomy - Färdighet
definition: Funktionsnedsättning, arbetsterapi
broader: zmYu aAM TuF
related: TPH4 2AM isT

Bergförstärkning
type: Concept
in scheme: JobTech Taxonomy - Färdighet
definition: Bergförstärkning
broader: zmYu aAM TuF
related: f71c gjL RDq

Tillverkningsindustri-Creo
type: Concept
in scheme: JobTech Taxonomy - Färdighet
definition: Tillverkningsindustri-Creo
broader: mTLu uo2 gq2
related: mis4 feV uex
related: xm5G vGn iyk
related: mp2Y vyC RFV
related: 3jEy yuT aVo
related: rwpH 6RA XTT
related: MSnK 3Z8 4qA
related: K8yg U4C gkY
related: PRQn 9yw NJA
related: 4Jty HpK a3Q

VVS-isolering
type: Concept
in scheme: JobTech Taxonomy - Färdighet
definition: VVS-isolering
broader: zmYu aAM TuF
related: yXbD NTH ijE
related: cGxX R9c kW1

Vision 80/20, telefonväxel
type: Concept
in scheme: JobTech Taxonomy - Färdighet
definition: Vision 80/20, telefonväxel
broader: Telefonväxlar
related: 4aPu 2nd 8X6
related: ByrL ANp UwV
related: 4Jty HpK a3Q

Porslinsmålning, cirkelledning
type: Concept
in scheme: JobTech Taxonomy - Färdighet
definition: Porslinsmålning, cirkelledning
broader: zmYu aAM TuF
related: 1CX5 mZw Vcq

Windows Server, applikationsplattform
type: Concept
in scheme: JobTech Taxonomy - Färdighet
definition: Windows Server, applikationsplattform, avser en serveroperativsystemmiljö som används för att stödja olika applikationer och tjänster inom en IT-infrastruktur. Kompetensen omfattar kunskap om installation, konfiguration och hantering av Windows Server-funktioner för att optimera driftskompatibilitet och prestanda.
alternative label: Windows Server
broader: Applikationsplattformar
related: BAeH eg8 T2d
related: cBBa ngH fCx
related: D9SL mtn vGM
related: DJh5 yyF hEM
related: UxT1 tPF Kbg
related: 4Jty HpK a3Q
related: 13md uyV BNG
related: UXKZ 3zZ ipB
related: MYAz x9m 2LJ

Tärning, croupierutbildad
type: Concept
in scheme: JobTech Taxonomy - Färdighet
definition: Tärning, croupierutbildad
broader: Yrkesbevis/examen
related: YHwG fk2 MDL

Elevvård/Skolpsykologi
type: Concept
in scheme: JobTech Taxonomy - Färdighet
definition: Elevvård/Skolpsykologi
alternative label: Elevvård
alternative label: Skolpsykologi
broader: zmYu aAM TuF
related: VYeq GDF a2g

Rättstolkning
type: Concept
in scheme: JobTech Taxonomy - Färdighet
definition: Rättstolkning
broader: zmYu aAM TuF
related: PQDm Z63 zst

Kabaré/Revy
type: Concept
in scheme: JobTech Taxonomy - Färdighet
definition: Kabaré/Revy
alternative label: Kabaré
alternative label: Revy
broader: zmYu aAM TuF
related: AWJF wqZ va9
related: gmRr 7tt eHj

Ciselering
type: Concept
in scheme: JobTech Taxonomy - Färdighet
definition: Ciselering
broader: zmYu aAM TuF
related: nwSm phw sPo
related: aKdV u7V R5j

Fysisk aktivitet och Idrottsmedicin, specialistkompetens för fysioterapeuter
type: Concept
in scheme: JobTech Taxonomy - Färdighet
definition: Fysisk aktivitet och Idrottsmedicin, specialistkompetens för fysioterapeuter
broader: Specialistinriktning inom fysioterapi
related: s7vU FhY L5Z

Polopoly, CMS
type: Concept
in scheme: JobTech Taxonomy - Färdighet
definition: Polopoly, CMS/innehållshanteringssystem
alternative label: Polopoly, innehållshanteringssystem
broader: jTAz uCP RNc
related: BAeH eg8 T2d
related: cBBa ngH fCx
related: Fv7d YhP YmS
related: vPP6 rsw dck
related: oEmP NC1 sXE
related: 4Jty HpK a3Q
related: MYAz x9m 2LJ

Klinisk fysiologi, specialistkompetens för läkare
type: Concept
in scheme: JobTech Taxonomy - Färdighet
definition: Klinisk fysiologi, specialistkompetens för läkare
broader: Specialistbevis för läkare
related: nu7c QuB KVQ

Vindkraftteknik
type: Concept
in scheme: JobTech Taxonomy - Färdighet
definition: Vindkraftteknik avser kunskapen och färdigheterna som krävs för att utveckla, installera, underhålla och optimera vindkraftssystem. Kompetensen innefattar både tekniska aspekter av vindkraftverk samt förståelse för miljömässiga och ekonomiska faktorer relaterade till produktion av förnybar energi.
broader: zmYu aAM TuF
related: rE1E m3d cx1
related: yXbD NTH ijE
related: PRQn 9yw NJA
related: KttZ Skc bMR

Solaris, operativsystem
type: Concept
in scheme: JobTech Taxonomy - Färdighet
definition: Solaris, operativsystem
alternative label: Solaris
broader: xAWr WYq JPP
related: BAeH eg8 T2d
related: cBBa ngH fCx
related: Fv7d YhP YmS
related: D9SL mtn vGM
related: VCpu 5EN bBt
related: DJh5 yyF hEM
related: 4Jty HpK a3Q
related: 13md uyV BNG
related: UXKZ 3zZ ipB
related: MYAz x9m 2LJ

Idrott/aktivitet
type: Concept
in scheme: JobTech Taxonomy - Färdighet
top concept of: JobTech Taxonomy - Färdighet
definition: Idrott/aktivitet
alternative label: Idrott
alternative label: aktivitet
narrower: zE9j gh9 5gr
narrower: sUeE CXb hzj
narrower: Gång och vandring, instruktör
narrower: Fäktning, instruktör/Fäktning, tränare
narrower: zFop CGz JuL
narrower: Tyngdlyftning, instruktör/Tyngdlyftning, tränare
narrower: Fotboll, professionell utövning
narrower: Brottning, professionell utövning
narrower: xqBY b9F wuB
narrower: Trav, instruktör/Trav, tränare
narrower: Basket, professionell utövning
narrower: Trav, professionell utövning
narrower: Landhockey, instruktör/Landhockey, tränare
narrower: tUhg LNZ Lv4
narrower: Tennis, professionell utövning
narrower: Amerikansk fotboll, instruktör/Amerikansk fotboll, tränare
narrower: xhjf d2X a4a
narrower: Kampsport, professionell utövning
narrower: r6hH BYe nSx
narrower: x5rt 5HF xVn
narrower: Friidrott, instruktör/Friidrott, tränare
narrower: Motorsport, professionell utövning
narrower: Baseboll, instruktör/Baseboll, tränare
narrower: py2D khv urN
narrower: Budo, instruktör/Budo, tränare
narrower: Cykling, instruktör/Cykling, tränare
narrower: Boxning, instruktör/Boxning, tränare
narrower: Softboll, instruktör/Softboll, tränare
narrower: ugPq DqQ QmB
narrower: Ishockey, professionell utövning
narrower: ujrb y6V Jso
narrower: Triathlon, instruktör/Triathlon, tränare
narrower: tDcq CyG KbH
narrower: Hästdressyr, instruktör/Hästdressyr, tränare
narrower: Bowling, instruktör/Bowling, tränare
narrower: sVqA fEm aCY
narrower: Fälttävlan, instruktör/Fälttävlan, tränare
narrower: Brottning, instruktör/Brottning, tränare
narrower: Slalom, professionell utövning
narrower: Orientering, instruktör/Orientering, tränare
narrower: t9vF pPR zfz
narrower: rXJg kya ktB
narrower: Danssport, instruktör/Danssport, tränare
narrower: Pilates, instruktör/Pilates, tränare
narrower: kvk4 aeL Jvv
narrower: knc6 cxi bvx
narrower: Längdskidåkning, instruktör/Längdskidåkning, tränare
narrower: Yoga, instruktör/Yoga, tränare
narrower: Tennis, instruktör/Tennis, tränare
narrower: o3Ar rvj EZH
narrower: Gymnastik, instruktör/Gymnastik, tränare
narrower: Sportfiske, instruktör
narrower: Golf, professionell utövning
narrower: Judo, instruktör/Judo, tränare
narrower: Volleyboll, instruktör/Volleyboll, tränare
narrower: tzQv YHB TrS
narrower: Basket, instruktör/Basket, tränare
narrower: Ishockey, instruktör/Ishockey, tränare
narrower: Taekwondo, instruktör/Taekwondo, tränare
narrower: Gymnastik, professionell utövning
narrower: tJ3X tPB 9C4
narrower: Bordtennis, instruktör/Bordtennis, tränare
narrower: Sportskytte, instruktör/Sportskytte, tränare
narrower: Galopp, professionell utövning
narrower: Rugby, instruktör/Rugby, tränare
narrower: Elitidrott, erfarenhet
narrower: Fallskärmshoppning, instruktör
narrower: Handboll, instruktör/Handboll, tränare
narrower: xEPd bLn R5i
narrower: wSJn d6E 5Aj
narrower: Forsränning, instruktör
narrower: Bangolf, instruktör/Bangolf, tränare
narrower: Motorsport, instruktör/Motorsport, tränare

Business Intelligence/BI
type: Concept
in scheme: JobTech Taxonomy - Färdighet
definition: Business Intelligence/BI
alternative label: BI
alternative label: Business Intelligence
broader: zmYu aAM TuF
related: Y6yY SuR hVh
related: Qo7p wjf gtv
related: Bbkh nrm 2J8
related: Uw4n UB2 RCW
related: pf1K PTz frm
related: vPP6 rsw dck
related: QG4f MCh vND
related: jv1x tpK 32p
related: Pz9M srJ Lc9
related: pTr9 RBT 9ur
related: 4Jty HpK a3Q
related: WZCM nfS eAk

CNC-programmering, Philips
type: Concept
in scheme: JobTech Taxonomy - Färdighet
definition: CNC-programmering, Philips
broader: Programmering, CNC-styrsystem
related: vaEp iBS c5h
related: 4Jty HpK a3Q

Trådspolning, metall
type: Concept
in scheme: JobTech Taxonomy - Färdighet
definition: Trådspolning, metall
broader: zmYu aAM TuF
related: UcNa inr snV

Montessoripedagogik, erfarenhet
type: Concept
in scheme: JobTech Taxonomy - Färdighet
definition: Montessoripedagogik, erfarenhet
broader: zmYu aAM TuF
related: Hi9c iTe gHH

Fritidsartiklar/Sportartiklar
type: Concept
in scheme: JobTech Taxonomy - Färdighet
definition: Fritidsartiklar/Sportartiklar
alternative label: Fritidsartiklar
alternative label: Sportartiklar
broader: zmYu aAM TuF
related: oXSW fbY XrY
related: YKL2 FCB 1yr
related: 85cq 6uK 4cK

Dövblinda, funktionshindersfrågor
type: Concept
in scheme: JobTech Taxonomy - Färdighet
definition: Dövblinda, funktionshindersfrågor
broader: zmYu aAM TuF
related: vPP6 rsw dck

Tillverkningsindustri-Solid Works
type: Concept
in scheme: JobTech Taxonomy - Färdighet
definition: Tillverkningsindustri-Solid Works
broader: mTLu uo2 gq2
related: mis4 feV uex
related: xm5G vGn iyk
related: mp2Y vyC RFV
related: 3jEy yuT aVo
related: rwpH 6RA XTT
related: MSnK 3Z8 4qA
related: K8yg U4C gkY
related: PRQn 9yw NJA
related: 4Jty HpK a3Q

Traverskörning
type: Concept
in scheme: JobTech Taxonomy - Färdighet
definition: Traverskörning avser kompetens att manövrera traverkranar och lyftanordningar för att effektivt och säkert utföra lyft- och transportuppgifter inom olika arbetssituationer. Denna kompetens kräver kunskap om säkerhetsföreskrifter, maskinhantering och miljöanpassat arbete.
broader: zmYu aAM TuF
related: yJk6 azD ywF
related: ENV6 BNa brP
related: 4obu LL6 RqJ
related: hxm6 xkr dHm
related: 1G6H AuG qyy
related: vaEp iBS c5h
related: kF59 fge kts
related: XYzP 5Tn 7Ep
related: o31g CX1 qhQ
related: E87t egE pjA
related: UcNa inr snV
related: icae Y69 H8E
related: gJtZ EBc n2z
related: 4bxV 58E P9N

Tyngdlyftning, instruktör/Tyngdlyftning, tränare
type: Concept
in scheme: JobTech Taxonomy - Färdighet
definition: Tyngdlyftning, instruktör/Tyngdlyftning, tränare
alternative label: Tyngdlyftning, instruktör
alternative label: Tyngdlyftning, tränare
broader: Idrott/aktivitet
related: EA6o N1N QtT

Flygande inspektion
type: Concept
in scheme: JobTech Taxonomy - Färdighet
definition: Kompetensen flygande inspektion innebär att behöriga poliser eller bilinspektörer utför spontana kontroller av fordon ute i trafiken för att säkerställa att dessa är trafiksäkra och uppfyller lagstadgade krav. V
broader: zmYu aAM TuF
related: nuXg Wjc JPd

Bygghissar, monteringsvana
type: Concept
in scheme: JobTech Taxonomy - Färdighet
definition: Bygghissar, monteringsvana avser kompetens att installera och montera bygghissar, vilket innebär hantering av lyftutrustning för att effektivt transportera material och personer på byggarbetsplatser. Kompetensen innefattar kunskaper om säkerhetsföreskrifter och tekniska specifikationer som är relaterade till bygghissar och deras installation.
broader: zmYu aAM TuF
related: 9mJN VwW Xjg
related: AD3U cFH rbe
related: KttZ Skc bMR

Hotellstädning
type: Concept
in scheme: JobTech Taxonomy - Färdighet
definition: Hotellstädning avser processen att städa och rengöra hotellrum och gemensamma utrymmen för att säkerställa en hög standard av renlighet och trivsel för gäster. Denna kompetens innefattar olika uppgifter såsom dammsugning, dammtorkning, byte av sänglinne och hantering av städutrustning enligt standardiserade rutiner.
broader: zmYu aAM TuF
related: bYde Frc xcB
related: Z6TY xDf Yup
related: FtyZ Joo tB8

Business-to-business/B2B
type: Concept
in scheme: JobTech Taxonomy - Färdighet
definition: Business-to-business/B2B avser affärstransaktioner som sker mellan företag snarare än mellan företag och individer. Denna kompetens omfattar förståelse för företagsmarknader, särskilda behov hos företag och strategier för att bygga relationer mellan affärspartner.
alternative label: Business-to-business, B2B
broader: zmYu aAM TuF
related: oXSW fbY XrY
related: dUuh wwa FGj

Linjeproduktion/Line production
type: Concept
in scheme: JobTech Taxonomy - Färdighet
definition: Linjeproduktion/Line production
alternative label: Line production
alternative label: Linjeproduktion
broader: zmYu aAM TuF
related: rYSG 3WJ LmC

Hattsömnad, cirkelledning
type: Concept
in scheme: JobTech Taxonomy - Färdighet
definition: Hattsömnad, cirkelledning
broader: zmYu aAM TuF
related: 1CX5 mZw Vcq

European Computer Driving Licence/ECDL
type: Concept
in scheme: JobTech Taxonomy - Färdighet
definition: European Computer Driving Licence/ECDL
alternative label: ECDL
alternative label: European Computer Driving Licence
broader: Allmänna datakunskaper
related: eQ4M CNm ozj
related: Y6yY SuR hVh
related: Uw4n UB2 RCW
related: fdLf oPp wVw
related: vPP6 rsw dck
related: iWcY mko rq2
related: ZQTR hVC QhJ
related: br6a VVS V3y
related: 1CX5 mZw Vcq
related: L7eh ihX vM5
related: MGk3 LvL AU2
related: jJF3 qaQ Zsh
related: oEmP NC1 sXE
related: bjqk F3A 5Hk
related: H2Zj eL9 x28
related: dJXy Rpq a2u
related: pwRH MT1 8nR
related: cRmd 536 pT1
related: zKvJ GnC Szx
related: n6iX f2z XfE
related: DZVN v5g Fco
related: ij8k EwC zyB
related: JfYV ZGg 6rm
related: vCAb uuo ek5
related: 4Jty HpK a3Q
related: p16X 44f rwZ
related: pok1 ipJ yzD

Reskontrabokföring
type: Concept
in scheme: JobTech Taxonomy - Färdighet
definition: Reskontrabokföring avser registrering och hantering av kund- och leverantörsreskontra, vilket innebär att hålla ordning på utestående fordringar och skulder inom företagets bokföring. Kompetensen inkluderar också att kontrollera och bearbeta fakturor, samt sköta in- och utbetalningar, vilket är väsentligt för den ekonomiska redovisningen av verksamheten.
broader: zmYu aAM TuF
related: eQ4M CNm ozj
related: fdLf oPp wVw
related: q81z 3oD 1qu
related: ij8k EwC zyB

Områdesansvar, tandvårdsverksamhet
type: Concept
in scheme: JobTech Taxonomy - Färdighet
definition: Områdesansvar, tandvårdsverksamhet
broader: zmYu aAM TuF
related: womV SEj CAH

Motorteknik
type: Concept
in scheme: JobTech Taxonomy - Färdighet
definition: Motorteknik
broader: zmYu aAM TuF
related: K8yg U4C gkY
related: PRQn 9yw NJA
related: L4hA SJP SFi

Country
type: Concept
in scheme: JobTech Taxonomy - Färdighet
definition: Country
broader: p1WM wCw LTd
related: AWJF wqZ va9

Ombordansvar
type: Concept
in scheme: JobTech Taxonomy - Färdighet
definition: Ombordansvar
broader: zmYu aAM TuF
related: s78G Zp2 dkq
related: UGgc Vm9 Bog

Indie
type: Concept
in scheme: JobTech Taxonomy - Färdighet
definition: Indie
broader: p1WM wCw LTd
related: AWJF wqZ va9

Konstnärsmaterial/Tavelramar
type: Concept
in scheme: JobTech Taxonomy - Färdighet
definition: Konstnärsmaterial/Tavelramar
alternative label: Konstnärsmaterial
alternative label: Tavelramar
broader: zmYu aAM TuF
related: oXSW fbY XrY
related: YKL2 FCB 1yr
related: 85cq 6uK 4cK

Forskningsbiblioteksinriktning
type: Concept
in scheme: JobTech Taxonomy - Färdighet
definition: Forskningsbiblioteksinriktning
broader: zmYu aAM TuF
related: wVfo Njx 1rB

Bokslut
type: Concept
in scheme: JobTech Taxonomy - Färdighet
definition: Bokslut avser sammanställningen av ett företags eller en organisations ekonomiska resultat i slutet av en räkenskapsperiod. Detta inkluderar upprättande av balans- och resultaträkningar samt nedskrivning av tillgångar och redovisning av skulder.
broader: zmYu aAM TuF
related: eQ4M CNm ozj
related: Y6yY SuR hVh
related: Uw4n UB2 RCW
related: oEmP NC1 sXE
related: q81z 3oD 1qu
related: mZsb A1K Gec
related: cRmd 536 pT1
related: ij8k EwC zyB

Områdesansvar, kriminalvård
type: Concept
in scheme: JobTech Taxonomy - Färdighet
definition: Områdesansvar, kriminalvård
broader: zmYu aAM TuF
related: sWzF 6pd Y6L

Informationssäkerhet
type: Concept
in scheme: JobTech Taxonomy - Färdighet
definition: Informationssäkerhet avser åtgärder och strategier som syftar till att skydda information och informationssystem från obehörig åtkomst, förstörelse, förändring eller spridning. Kompetensen innefattar en kombination av tekniska och organisatoriska lösningar för att säkerställa konfidentialitet, integritet och tillgänglighet av information.
broader: zmYu aAM TuF
related: BAeH eg8 T2d
related: vPP6 rsw dck
related: eWiB mGP MjE
related: 4Jty HpK a3Q

Tornkran
type: Concept
in scheme: JobTech Taxonomy - Färdighet
definition: Tornkran avser en typ av lyftanordning som är installerad på en permanent bas och används för att lyfta och förflytta tunga laster på byggarbetsplatser. Kompetensen innefattar kunskap om manövrering, säkerhet och drift av tornkranar, samt förståelse för vikten av rätt användning av utrustningen enligt gällande säkerhetsföreskrifter.
broader: zmYu aAM TuF
related: XYzP 5Tn 7Ep

BGP, routingprotokoll
type: Concept
in scheme: JobTech Taxonomy - Färdighet
definition: BGP, routingprotokoll
broader: Routingprotokoll
related: nDaB vdy eAy
related: VCpu 5EN bBt
related: fWrt sLg koW
related: 4Jty HpK a3Q

NEWS-bedömningar (National Early Warning Score)
type: Concept
in scheme: JobTech Taxonomy - Färdighet
definition: NEWS-bedömningar (National Early Warning Score)
broader: zmYu aAM TuF
related: NFUg y9y 1TY
related: nu7c QuB KVQ
related: bEDv SL7 VrL
related: 6eAB cbY i9T
related: ek9W qqp XpF
related: PHJN fva yxs
related: seu9 VoQ VNo
related: jY19 knH MJp
related: nrVt xUL KdQ
related: LP4Z ABV gRm
related: 1tGC fXC mxX
related: cuaN Rj5 YCc
related: dyWo sDb MLQ
related: gXqW s5Q ZjN
related: 6zAR EHM Kwj
related: Z8ci bBE tmx

Rangering
type: Concept
in scheme: JobTech Taxonomy - Färdighet
definition: Rangering avser processen att sortera och organisera vagnar och tåg på bangårdar för att optimera flödet av godstransporter. Denna kompetens omfattar aktiviteter som att växla, iordningställa och säkerhetskontrollera tåg samt hantera vagnupptagning och expediering av varor.
broader: zmYu aAM TuF
related: WhBn FAp ZNW
related: nk6Z 5oD QoM
related: kLyY rwr aJr

VRML, programmeringsspråk
type: Concept
in scheme: JobTech Taxonomy - Färdighet
definition: VRML, programmeringsspråk
alternative label: VRML
broader: Datorspråk
related: BAeH eg8 T2d
related: Fv7d YhP YmS
related: D9SL mtn vGM
related: DJh5 yyF hEM
related: 4Jty HpK a3Q

IPX, kommunikationsprotokoll
type: Concept
in scheme: JobTech Taxonomy - Färdighet
definition: IPX, kommunikationsprotokoll
alternative label: IPX
broader: Kommunikationsprotokoll
related: BAeH eg8 T2d
related: cBBa ngH fCx
related: Fv7d YhP YmS
related: Q5DF juj 8do
related: D9SL mtn vGM
related: VCpu 5EN bBt
related: DJh5 yyF hEM
related: fWrt sLg koW
related: 4Jty HpK a3Q
related: 13md uyV BNG
related: MYAz x9m 2LJ

Utvecklingsarbete
type: Concept
in scheme: JobTech Taxonomy - Färdighet
definition: Utvecklingsarbete
broader: zmYu aAM TuF
related: bjqk F3A 5Hk

Klimatologi
type: Concept
in scheme: JobTech Taxonomy - Färdighet
definition: Klimatologi
broader: zmYu aAM TuF
related: LP8B auW wMp
related: yXbD NTH ijE
related: sXgV QFg vpb

Hårdrock
type: Concept
in scheme: JobTech Taxonomy - Färdighet
definition: Hårdrock
broader: p1WM wCw LTd
related: AWJF wqZ va9

Idrott, undervisning högskolenivå
type: Concept
in scheme: JobTech Taxonomy - Färdighet
definition: Idrott, undervisning högskolenivå
broader: Inriktning på högskolelärarkompetens
related: Gm5j S2Y aTB
related: NNK9 F1o pK5
related: cYCo PxY zQd
related: RPBE x5M cXX
related: P7eS nP8 3dy

MacVonk, redovisningssystem
type: Concept
in scheme: JobTech Taxonomy - Färdighet
definition: MacVonk, redovisningssystem
alternative label: MacVonk
broader: xSJR 1Kq pxB
related: eQ4M CNm ozj
related: q81z 3oD 1qu
related: ij8k EwC zyB
related: 4Jty HpK a3Q

Gesällbrev, handskmakare
type: Concept
in scheme: JobTech Taxonomy - Färdighet
definition: Gesällbrev, handskmakare
broader: Yrkesbevis/examen
related: skLS kpa Ui1

Ackompanjemang
type: Concept
in scheme: JobTech Taxonomy - Färdighet
definition: Ackompanjemang
broader: zmYu aAM TuF
related: AWJF wqZ va9

Manusprogram-Screenwriter
type: Concept
in scheme: JobTech Taxonomy - Färdighet
definition: Manusprogram-Screenwriter
broader: Programvara för digitalt skapande
related: zfve s6G tpc
related: 4Jty HpK a3Q

Unit tester, metod/systemutvecklingsverktyg
type: Concept
in scheme: JobTech Taxonomy - Färdighet
definition: Unit tester, metod/systemutvecklingsverktyg
alternative label: Unit tester
alternative label: Unit tester, metod
alternative label: Unit tester, systemutvecklingsverktyg
broader: Programmerings- och systemutvecklingsverktyg
related: D9SL mtn vGM
related: UxT1 tPF Kbg
related: 4Jty HpK a3Q

Natur- och kulturhänsyn - Plantering för plantbasar
type: Concept
in scheme: JobTech Taxonomy - Färdighet
definition: Natur- och kulturhänsyn - Plantering för plantbasar
broader: Yrkesbevis/examen
related: qouP wtb 93q

HVB-verksamhet, behandlingserfarenhet
type: Concept
in scheme: JobTech Taxonomy - Färdighet
definition: HVB-verksamhet, behandlingserfarenhet avser kompetens inom boendeform och behandlingsmetoder för individer med behov av stöd och behandling, exempelvis inom psykiatri och missbruk. Kompetensen omfattar förståelse för och tillämpning av interventioner som syftar till att främja hälsa och välbefinnande hos klienter i HVB-hem.
broader: zmYu aAM TuF
related: BWwk fYX S5B
related: 7fNG sve JWU

Aktivitet och hälsa i arbetsliv och utbildning, specialistområde för arbetsterapeut
type: Concept
in scheme: JobTech Taxonomy - Färdighet
definition: Ett specialistområde och en fördjupad specialistkompetens för arbetsterapeut inom aktivitet och hälsa i arbetsliv och utbildning.
broader: Specialistområde för arbetsterapeut
related: TPH4 2AM isT

Psykiatrisk diagnostik
type: Concept
in scheme: JobTech Taxonomy - Färdighet
definition: Psykiatrisk diagnostik
broader: zmYu aAM TuF
related: nu7c QuB KVQ
related: bEDv SL7 VrL
related: ek9W qqp XpF
related: seu9 VoQ VNo
related: gXqW s5Q ZjN
related: 6zAR EHM Kwj

Adressering
type: Concept
in scheme: JobTech Taxonomy - Färdighet
definition: Adressering
broader: zmYu aAM TuF
related: mPzg 93F QEv

Microsoft Certified: Azure Administrator Associate
type: Concept
in scheme: JobTech Taxonomy - Färdighet
definition: Microsoft Certified: Azure Administrator Associate
broader: s48H Sft DTn
related: VCpu 5EN bBt
related: DJh5 yyF hEM
related: 4Jty HpK a3Q
related: UXKZ 3zZ ipB
related: MYAz x9m 2LJ

Handelsträdgård
type: Concept
in scheme: JobTech Taxonomy - Färdighet
definition: Handelsträdgård
broader: zmYu aAM TuF
related: XBh3 Xrm C4R
related: yXbD NTH ijE
related: 2xQ4 4kh kTZ

Modejournalistik
type: Concept
in scheme: JobTech Taxonomy - Färdighet
definition: Modejournalistik
broader: zmYu aAM TuF
related: SgNH hag n9D

Digital marknadsföring/Onlinemarknadsföring
type: Concept
in scheme: JobTech Taxonomy - Färdighet
definition: Digital marknadsföring/Onlinemarknadsföring avser strategier och aktiviteter som syftar till att marknadsföra produkter och tjänster genom digitala kanaler, såsom sociala medier, sökmotorer och e-post. Kompetensen innefattar färdigheter i analys, skapande av innehåll samt användning av verktyg för att nå och engagera målgrupper på nätet.
alternative label: Digital marknadsföring
alternative label: Onlinemarknadsföring
broader: zmYu aAM TuF
related: oXSW fbY XrY
related: Fv7d YhP YmS
related: Pz9M srJ Lc9
related: WX67 Pfb WMN
related: k1Nx auG sNh
related: 4Jty HpK a3Q
related: p16X 44f rwZ

Skridskoslipning
type: Concept
in scheme: JobTech Taxonomy - Färdighet
definition: Skridskoslipning
broader: zmYu aAM TuF
related: Lzpv ofL 3H5
related: df9D e6y 61z

Triathlon, instruktör/Triathlon, tränare
type: Concept
in scheme: JobTech Taxonomy - Färdighet
definition: Triathlon, instruktör/Triathlon, tränare
alternative label: Triathlon, instruktör
alternative label: Triathlon, tränare
broader: Idrott/aktivitet
related: EA6o N1N QtT

Kvalitetsbedömning, livsmedel
type: Concept
in scheme: JobTech Taxonomy - Färdighet
definition: Kvalitetsbedömning, livsmedel avser den systematiska process där egenskaper och standarder för livsmedelsprodukter bedöms och utvärderas. Kompetensen innefattar analyser av råvaror, färdiga produkter samt bedömningar av smak, utseende och textur för att säkerställa att livsmedel uppfyller fastställda kvalitetskrav.
broader: zmYu aAM TuF
related: dAu7 VyL hsy
related: bExu 8gk azk

Free-to-play
type: Concept
in scheme: JobTech Taxonomy - Färdighet
definition: Free-to-play
broader: zmYu aAM TuF
related: Q5DF juj 8do
related: 4Jty HpK a3Q
related: Mbt6 3ko DiD

Symaskiner
type: Concept
in scheme: JobTech Taxonomy - Färdighet
definition: Symaskiner
broader: zmYu aAM TuF
related: oXSW fbY XrY
related: YKL2 FCB 1yr
related: 85cq 6uK 4cK

Låsmontering i dörr
type: Concept
in scheme: JobTech Taxonomy - Färdighet
definition: Låsmontering i dörr
broader: zmYu aAM TuF
related: e6nk AGp y28

Arkitekt-Compusoft Winner CAD
type: Concept
in scheme: JobTech Taxonomy - Färdighet
definition: Arkitekt-Compusoft Winner CAD
broader: mTLu uo2 gq2
related: thZP oR7 WrY
related: w6ud quG dgh
related: Pd51 xnr KCY
related: XeBP nMe pXx
related: ETAR ggZ Wuw
related: 41KB bfk 5jR
related: 4Jty HpK a3Q

Testvana, rekrytering
type: Concept
in scheme: JobTech Taxonomy - Färdighet
definition: Testvana, rekrytering
broader: zmYu aAM TuF
related: mNoS AN5 drn
related: bjqk F3A 5Hk

Feldenkraispedagogik
type: Concept
in scheme: JobTech Taxonomy - Färdighet
definition: Feldenkraispedagogik
broader: zmYu aAM TuF
related: s7vU FhY L5Z

Passagerarfartyg
type: Concept
in scheme: JobTech Taxonomy - Färdighet
definition: Passagerarfartyg
broader: Övriga specialiteter, sjöfart
related: BStc SJh DKG
related: Rsoy sS6 6c4
related: CbQK 7th Tyf
related: Z6TY xDf Yup
related: UjoW meY Zwt
related: tPox ie4 X9X
related: KttZ Skc bMR
related: kDnq Q98 sD3
related: a75S eLg JWH
related: XGyi i4B ME7
related: h324 DPT 7Tw

Kärlkirurgi, specialistkompetens för läkare
type: Concept
in scheme: JobTech Taxonomy - Färdighet
definition: Kärlkirurgi, specialistkompetens för läkare
broader: Specialistbevis för läkare
related: nu7c QuB KVQ

Klartext, redovisningssystem
type: Concept
in scheme: JobTech Taxonomy - Färdighet
definition: Klartext, redovisningssystem
broader: xSJR 1Kq pxB
related: eQ4M CNm ozj
related: q81z 3oD 1qu
related: cRmd 536 pT1
related: zKvJ GnC Szx

Blockgjutning
type: Concept
in scheme: JobTech Taxonomy - Färdighet
definition: Blockgjutning
broader: zmYu aAM TuF
related: aKdV u7V R5j

Gesällbrev, duodji
type: Concept
in scheme: JobTech Taxonomy - Färdighet
definition: Gesällbrev, duodji
broader: Yrkesbevis/examen
related: 1CX5 mZw Vcq
related: aKdV u7V R5j

RoHS-direktivet
type: Concept
in scheme: JobTech Taxonomy - Färdighet
definition: RoHS-direktivet (Restriction of the use of certain Hazardous Substances in electrical and electronic equipment) syftar till att minska riskerna för människors hälsa och för miljön genom att ersätta och begränsa farliga kemiska ämnen i elektrisk och elektronisk utrustning. Direktivet ska även förbättra möjligheten till lönsam och hållbar materialåtervinning från avfall från elektrisk och elektronisk utrustning. Källa: Kemikalieinspektionen
broader: zmYu aAM TuF
related: nDaB vdy eAy
related: SgAJ DW2 FN5
related: yXbD NTH ijE
related: SPYW 7Z1 ShT
related: fWrt sLg koW

Psykos-psykoterapi
type: Concept
in scheme: JobTech Taxonomy - Färdighet
definition: Psykos-psykoterapi
broader: zmYu aAM TuF
related: UUQi UJ5 MSb
related: VYeq GDF a2g

Materialplanering, bygg
type: Concept
in scheme: JobTech Taxonomy - Färdighet
definition: Materialplanering, bygg
broader: zmYu aAM TuF
related: DPPw 4wa AsH
related: 3ZtN hhA SM7
related: bZ4J riZ zK6
related: V79C DD2 3Gj
related: 3g5x Tm7 8QH
related: QKvX v7r PNL
related: thZP oR7 WrY
related: 7zKm 4NW eey
related: w6ud quG dgh
related: Y4j1 P17 wVA
related: q2Ge zrQ zJb
related: 9mJN VwW Xjg
related: XYzP 5Tn 7Ep
related: XeBP nMe pXx
related: AD3U cFH rbe
related: f71c gjL RDq
related: fLKb bJ3 69p
related: 3UzE P8A 9sS
related: NnB3 eWH auo
related: iHrC aRv fVm
related: cGxX R9c kW1
related: bXfo 4hb SXx

Avstämningar
type: Concept
in scheme: JobTech Taxonomy - Färdighet
definition: Avstämningar
broader: zmYu aAM TuF
related: ij8k EwC zyB

HappyBooking, hotellbokningssystem
type: Concept
in scheme: JobTech Taxonomy - Färdighet
definition: HappyBooking, hotellbokningssystem
alternative label: HappyBooking
broader: kRoQ fPR 8oK
related: bYde Frc xcB
related: 4Jty HpK a3Q

VVS, el, tele-Bentley Building MechanicalSystems
type: Concept
in scheme: JobTech Taxonomy - Färdighet
definition: VVS, el, tele-Bentley Building MechanicalSystems
broader: mTLu uo2 gq2
related: K8yg U4C gkY
related: nDaB vdy eAy
related: SPYW 7Z1 ShT
related: PRQn 9yw NJA
related: 4Jty HpK a3Q

Gjutningsverktyg, tillverkning
type: Concept
in scheme: JobTech Taxonomy - Färdighet
definition: Gjutningsverktyg, tillverkning
broader: zmYu aAM TuF
related: MSnK 3Z8 4qA

R3-teknik
type: Concept
in scheme: JobTech Taxonomy - Färdighet
definition: R3-teknik
broader: zmYu aAM TuF
related: rxmK wwM 1NA
related: Z6TY xDf Yup
related: QEBd qHu vGr
related: FtyZ Joo tB8

Detaljsömnad
type: Concept
in scheme: JobTech Taxonomy - Färdighet
definition: Detaljsömnad avser en specialiserad färdighet inom sömnad där fokus ligger på att skapa och bearbeta detaljerade delar av kläder och konfektionsprodukter. Kompetensen omfattar kunskaper om tekniker för att sy, ändra och laga plagg samt en förståelse för materialens egenskaper och hur dessa påverkar slutresultatet.
broader: zmYu aAM TuF
related: mwVN oEH g9k

Pendeltåg
type: Concept
in scheme: JobTech Taxonomy - Färdighet
definition: Pendeltåg
broader: zmYu aAM TuF
related: UGgc Vm9 Bog

Grafitti
type: Concept
in scheme: JobTech Taxonomy - Färdighet
definition: Grafitti
broader: zmYu aAM TuF
related: 34Tn BQQ tfo

Barnhabilitering, arbetsterapi
type: Concept
in scheme: JobTech Taxonomy - Färdighet
definition: Barnhabilitering, arbetsterapi
broader: zmYu aAM TuF
related: TPH4 2AM isT

Smart Solar Shading Expert, utbildning
type: Concept
in scheme: JobTech Taxonomy - Färdighet
definition: Smart Solar Shading Expert, utbildning
broader: s48H Sft DTn
related: Kxm9 N3V shF

Förlossningsavdelning/BB-avdelning
type: Concept
in scheme: JobTech Taxonomy - Färdighet
definition: Förlossningsavdelning/BB-avdelning
broader: zmYu aAM TuF
related: 7XXd 4St nit

OSI-modellen
type: Concept
in scheme: JobTech Taxonomy - Färdighet
definition: OSI-modellen
broader: zmYu aAM TuF
related: K8yg U4C gkY
related: nDaB vdy eAy
related: SPYW 7Z1 ShT
related: PRQn 9yw NJA
related: 4Jty HpK a3Q

Filosofi, undervisning
type: Concept
in scheme: JobTech Taxonomy - Färdighet
definition: Filosofi, undervisning
broader: Inriktning på lärarkompetens
related: 4KhP FxL uZ5

Inredningsjournalistik
type: Concept
in scheme: JobTech Taxonomy - Färdighet
definition: Inredningsjournalistik
broader: zmYu aAM TuF
related: SgNH hag n9D

BlackBerry, operativsystem
type: Concept
in scheme: JobTech Taxonomy - Färdighet
definition: BlackBerry, operativsystem
broader: xAWr WYq JPP
related: Q5DF juj 8do
related: DJh5 yyF hEM
related: 4Jty HpK a3Q
related: UXKZ 3zZ ipB

ComActivity, affärssystem
type: Concept
in scheme: JobTech Taxonomy - Färdighet
definition: ComActivity, affärssystem
alternative label: ComActivity
broader: xSJR 1Kq pxB
related: eQ4M CNm ozj
related: iWcY mko rq2
related: q81z 3oD 1qu
related: ij8k EwC zyB
related: 4Jty HpK a3Q

RC-loksreparationer
type: Concept
in scheme: JobTech Taxonomy - Färdighet
definition: RC-loksreparationer
broader: zmYu aAM TuF
related: KttZ Skc bMR

Balkongrenovering
type: Concept
in scheme: JobTech Taxonomy - Färdighet
definition: Balkongrenovering
broader: zmYu aAM TuF
related: q2Ge zrQ zJb

Förbränningsanläggning, drift och underhåll
type: Concept
in scheme: JobTech Taxonomy - Färdighet
definition: Förbränningsanläggning, drift och underhåll
broader: zmYu aAM TuF
related: Cppd 9P7 HeR

Ben- och fotanfångning
type: Concept
in scheme: JobTech Taxonomy - Färdighet
definition: Ben- och fotanfångning
broader: zmYu aAM TuF
related: aKdV u7V R5j

Körning av pappersmaskin
type: Concept
in scheme: JobTech Taxonomy - Färdighet
definition: Körning av pappersmaskin innebär kompetens att styra och övervaka pappersmaskiner under produktionsprocessen av papper och kartong. Detta inkluderar hantering av maskiner för efterbehandling samt säkerställande av produktkvalitet och effektiv drift.
broader: zmYu aAM TuF
related: 1G6H AuG qyy

Anläggningsdykning
type: Concept
in scheme: JobTech Taxonomy - Färdighet
definition: Anläggningsdykning
broader: zmYu aAM TuF
related: DPPw 4wa AsH

Handformning
type: Concept
in scheme: JobTech Taxonomy - Färdighet
definition: Handformning avser en hantverksmässig teknik för att forma och bearbeta olika material med händerna, vilket kan innefatta skapande av föremål genom metoder som gjutning eller skulpturering. Denna kompetens omfattar kunskaper i materialens egenskaper samt precision och estetik i utförandet av hantverk.
broader: zmYu aAM TuF
related: aKdV u7V R5j
related: J9Vz JxJ Bji

Metallförsilvring
type: Concept
in scheme: JobTech Taxonomy - Färdighet
definition: Metallförsilvring
broader: zmYu aAM TuF
related: YiQw N87 zLU

Legitimation som hälso- och sjukvårdskurator
type: Concept
in scheme: JobTech Taxonomy - Färdighet
definition: Legitimation som krävs för att kunna arbeta som hälso- och sjukvårdskurator i Sverige. Utfärdas av Socialstyrelsen.
broader: Yrkesbevis/examen
related: dJXy Rpq a2u
related: 4P8B LtK JgE
related: r1Gk 3EN bpw

Metall-keramik, specialisering tandteknik
type: Concept
in scheme: JobTech Taxonomy - Färdighet
definition: Metall-keramik, specialisering tandteknik
broader: zmYu aAM TuF
related: 39yB xPQ ozd

Körning av kartongmaskin
type: Concept
in scheme: JobTech Taxonomy - Färdighet
definition: Körning av kartongmaskin
broader: zmYu aAM TuF
related: 1G6H AuG qyy

Miljöanalys
type: Concept
in scheme: JobTech Taxonomy - Färdighet
definition: Miljöanalys
broader: zmYu aAM TuF
related: puim 6PY DGj
related: rE1E m3d cx1
related: yXbD NTH ijE
related: V7Yz 4WV g4z

Träsnitt
type: Concept
in scheme: JobTech Taxonomy - Färdighet
definition: Träsnitt
broader: zmYu aAM TuF
related: 34Tn BQQ tfo

Kompetensbevis, Behörig installatör fastighetsnät
type: Concept
in scheme: JobTech Taxonomy - Färdighet
definition: Kompetensbevis, Behörig installatör fastighetsnät
broader: s48H Sft DTn
related: fWrt sLg koW
related: yyF7 jsW EeP

Träningsprogram
type: Concept
in scheme: JobTech Taxonomy - Färdighet
definition: Träningsprogram avser en strukturerad plan för fysisk träning som syftar till att förbättra en individs prestationer och hälsa genom specifika övningar och rutiner. Kompetensen innefattar kunskap om övningar, progression och anpassning av träning för olika målgrupper, inklusive professionella idrottsutövare, amatörer och motionärer.
broader: zmYu aAM TuF
related: EA6o N1N QtT

Maskinskötsel, stålverk/Maskinskötsel, metallverk
type: Concept
in scheme: JobTech Taxonomy - Färdighet
definition: Maskinskötsel, stålverk/Maskinskötsel, metallverk avser kompetensen att styra och övervaka maskiner och processer inom stål- och metallbearbetning. Denna kompetens omfattar flera olika arbetsuppgifter, inklusive arbete med valsverk, pressning, formning och gjutning av metallprodukter.
alternative label: Maskinskötsel, metallverk
alternative label: Maskinskötsel, stålverk
broader: zmYu aAM TuF
related: m8TS hdk pSf
related: E87t egE pjA
related: UcNa inr snV

Total Quality Control/TQC
type: Concept
in scheme: JobTech Taxonomy - Färdighet
definition: Total Quality Control/TQC
alternative label: TQC
alternative label: Total Quality Control
broader: Kvalitetsverktyg
related: Qo7p wjf gtv
related: vPP6 rsw dck
related: dMVD VYy kgg

Natur- och kulturhänsyn - Markberedning
type: Concept
in scheme: JobTech Taxonomy - Färdighet
definition: Natur- och kulturhänsyn - Markberedning
broader: Yrkesbevis/examen
related: KwVo sQu G2e

Turnéledning
type: Concept
in scheme: JobTech Taxonomy - Färdighet
definition: Turnéledning
broader: zmYu aAM TuF
related: dUuh wwa FGj

Olegerat stål, materialkunskap svets
type: Concept
in scheme: JobTech Taxonomy - Färdighet
definition: Olegerat stål, materialkunskap svets
broader: Materialkunskap
related: wQ1E Bzk ZyA

Omvårdnad
type: Concept
in scheme: JobTech Taxonomy - Färdighet
definition: Omvårdnad avser ett antal åtgärder och insatser som syftar till att ge fysisk, emotionell och social stöd och vård till individer med olika behov. Denna kompetens omfattar bland annat att förstå och tillämpa hälso- och sjukvårdsprinciper samt att ge omsorg och hjälp i dagliga aktiviteter.
broader: zmYu aAM TuF
related: NFUg y9y 1TY
related: PHJN fva yxs
related: 7XXd 4St nit
related: jY19 knH MJp
related: LP4Z ABV gRm
related: dyWo sDb MLQ
related: tAJS JNb hDH
related: 6zAR EHM Kwj
related: Z8ci bBE tmx
related: oj4c P4b cja

Gesällbrev, mur och puts
type: Concept
in scheme: JobTech Taxonomy - Färdighet
definition: Gesällbrev, mur och puts
broader: Yrkesbevis/examen
related: NnB3 eWH auo

Gjutgodsarbete
type: Concept
in scheme: JobTech Taxonomy - Färdighet
definition: Gjutgodsarbete
broader: zmYu aAM TuF
related: DxiF hTo b3X

Adjunktionstjänstgöring
type: Concept
in scheme: JobTech Taxonomy - Färdighet
definition: Adjunktionstjänstgöring
broader: zmYu aAM TuF
related: qsJJ EYo fzA

Automationsteknik
type: Concept
in scheme: JobTech Taxonomy - Färdighet
definition: Automationsteknik avser kunskap och färdigheter relaterade till automatisering av industriella processer och system. Detta omfattar design, implementation och underhåll av automatiserade lösningar för att effektivisera produktion och förbättra processkontroll.
broader: zmYu aAM TuF
related: yJk6 azD ywF
related: mis4 feV uex
related: YiQw N87 zLU
related: xm5G vGn iyk
related: v9nU 6Fw 4Qg
related: ENV6 BNa brP
related: 4obu LL6 RqJ
related: hxm6 xkr dHm
related: LEvM 7Hs w8i
related: mp2Y vyC RFV
related: rxmK wwM 1NA
related: Vfum e6B 7Bw
related: VKKg e4t t46
related: 1G6H AuG qyy
related: vaEp iBS c5h
related: K8yg U4C gkY
related: nDaB vdy eAy
related: yPQ4 EaN Dtj
related: kF59 fge kts
related: iZLB KpD LLo
related: o31g CX1 qhQ
related: SPYW 7Z1 ShT
related: 4DET dLf iB9
related: skLS kpa Ui1
related: PRQn 9yw NJA
related: 7Zqy hSM Fig
related: aU9p ekE Fqf
related: QEBd qHu vGr
related: E87t egE pjA
related: fWrt sLg koW
related: a75S eLg JWH
related: UcNa inr snV
related: 4Jty HpK a3Q
related: icae Y69 H8E
related: gJtZ EBc n2z
related: AUs8 M5f dLt
related: yyF7 jsW EeP
related: UXKZ 3zZ ipB

Föreningslivsfrågor
type: Concept
in scheme: JobTech Taxonomy - Färdighet
definition: Föreningslivsfrågor är kompetensen att förstå, stödja och utveckla det lokala föreningslivet. Det innebär kunskap om föreningars verksamhet, behov och utmaningar, samt förmåga att samarbeta, ge rådgivning och skapa goda förutsättningar för föreningarnas arbete. Kompetensen omfattar också att främja delaktighet, samverkan och nätverksbyggande inom och mellan föreningar för att stärka engagemang och hållbar utveckling i samhället.
broader: zmYu aAM TuF
related: vPP6 rsw dck
related: EA6o N1N QtT
related: aA2Z 9XX R1v

LAN
type: Concept
in scheme: JobTech Taxonomy - Färdighet
definition: LAN
broader: nHDU dpj R9H
related: 1CX5 mZw Vcq
related: nDaB vdy eAy
related: VCpu 5EN bBt
related: DJh5 yyF hEM
related: fWrt sLg koW
related: 4Jty HpK a3Q
related: 13md uyV BNG

Hästmassage
type: Concept
in scheme: JobTech Taxonomy - Färdighet
definition: Hästmassage
broader: zmYu aAM TuF
related: KYmy iqC xiQ

Produktionsledning, husbyggnadsteknik
type: Concept
in scheme: JobTech Taxonomy - Färdighet
definition: Produktionsledning, husbyggnadsteknik
broader: zmYu aAM TuF
related: 7mn2 kA9 ftp
related: XeBP nMe pXx

Jämställdhetsarbete
type: Concept
in scheme: JobTech Taxonomy - Färdighet
definition: Jämställdhetsarbete
broader: Yrkesövergripande kompetenser

Receptförskrivningsrätt
type: Concept
in scheme: JobTech Taxonomy - Färdighet
definition: Receptförskrivningsrätt
broader: zmYu aAM TuF
related: HPxT fQJ zwT
related: nu7c QuB KVQ
related: s7vU FhY L5Z
related: seu9 VoQ VNo
related: 7XXd 4St nit
related: 4F9o Jzv Pwz
related: Bywn Doc 3VF
related: gXqW s5Q ZjN
related: 6Fu3 qQA 9DK
related: 6zAR EHM Kwj
related: oj4c P4b cja

Fordonsinriktning-lastbil och mobila maskiner, undervisning
type: Concept
in scheme: JobTech Taxonomy - Färdighet
definition: Fordonsinriktning-lastbil och mobila maskiner, undervisning
broader: Inriktning på lärarkompetens
related: 2x2V UeL 6ke

Bulkgodshantering
type: Concept
in scheme: JobTech Taxonomy - Färdighet
definition: Bulkgodshantering
broader: zmYu aAM TuF
related: XYzP 5Tn 7Ep

Gesällbrev, florist
type: Concept
in scheme: JobTech Taxonomy - Färdighet
definition: Gesällbrev, florist är ett bevis på att en hantverkare har genomgått utbildning och avlagt de delprov som krävs inom det specifika hantverksyrket, och därigenom uppnått ett erkännande av färdigheter och kompetens inom yrket. Utfärdas av Sveriges hantverksråd i samråd med aktuell branschorganisation.
broader: Yrkesbevis/examen
related: yXbD NTH ijE
related: YKL2 FCB 1yr

Vindkraftsystem
type: Concept
in scheme: JobTech Taxonomy - Färdighet
definition: Vindkraftsystem avser kompetens inom design, installation och underhåll av system som används för att omvandla vindens energi till elektrisk energi. Denna kompetens omfattar en förståelse för både tekniska och miljömässiga aspekter av vindkraft, inklusive mekaniska, elektriska och strukturella system.
broader: zmYu aAM TuF
related: rE1E m3d cx1
related: yXbD NTH ijE
related: PRQn 9yw NJA
related: KttZ Skc bMR

Leveransuppföljning
type: Concept
in scheme: JobTech Taxonomy - Färdighet
definition: Leveransuppföljning
broader: zmYu aAM TuF
related: vPP6 rsw dck
related: br6a VVS V3y

Leveransbevakning
type: Concept
in scheme: JobTech Taxonomy - Färdighet
definition: Leveransbevakning
broader: zmYu aAM TuF
related: eQ4M CNm ozj
related: 8A1f sxQ adT
related: dUuh wwa FGj

Fordonsglasning
type: Concept
in scheme: JobTech Taxonomy - Färdighet
definition: Fordonsglasning
broader: zmYu aAM TuF
related: J17g Q2a 2u1

Mästarbrev, inredningssadelmakare
type: Concept
in scheme: JobTech Taxonomy - Färdighet
definition: Mästarbrev, inredningssadelmakare
broader: Yrkesbevis/examen
related: vhUJ LyD XWc

Teaterteknik
type: Concept
in scheme: JobTech Taxonomy - Färdighet
definition: Teaterteknik
broader: zmYu aAM TuF
related: 4BsK q2C sCL
related: CkRH 4Qn iX3

Visitationsarbete
type: Concept
in scheme: JobTech Taxonomy - Färdighet
definition: Visitationsarbete avser uppgifter som innebär att utföra visiteringar av personer och deras tillhörigheter för att säkerställa ordning och säkerhet i olika sammanhang.
broader: zmYu aAM TuF
related: hgAg gLr YGg

Fäktning
type: Concept
in scheme: JobTech Taxonomy - Färdighet
definition: Fäktning
broader: zmYu aAM TuF
related: iBUL s38 izZ

Besiktning, specialbyggda fordon
type: Concept
in scheme: JobTech Taxonomy - Färdighet
definition: Besiktning, specialbyggda fordon avser processen att inspektera och utvärdera fordon som är skräddarsydda för specifika ändamål, för att säkerställa att de uppfyller fastställda kvalitets- och säkerhetsstandarder. Denna kompetens innefattar kunskap om aktuella regler och föreskrifter samt metodik för att identifiera eventuella brister i konstruktion och funktionalitet av dessa fordon.
broader: zmYu aAM TuF
related: nuXg Wjc JPd

Styr- och utvecklingsmodeller
type: Concept
in scheme: JobTech Taxonomy - Färdighet
top concept of: JobTech Taxonomy - Färdighet
definition: Styr- och utvecklingsmodeller
narrower: SVEA, styr- och utvecklingsmodell
narrower: Ethics, styr- och utvecklingsmodell
narrower: OpenUP, utvecklingsmodell
narrower: OOAD, objektorienterad analys och design
narrower: Logic, styr- och utvecklingsmodell
narrower: RUP, utvecklingsprocessbeskrivning
narrower: OOS, styr- och utvecklingsmodell
narrower: kU8H M22 NtX
narrower: ISAC, styr- och utvecklingsmodell
narrower: sQgp BKY n43

Gesällbrev, krukmakare
type: Concept
in scheme: JobTech Taxonomy - Färdighet
definition: Gesällbrev, krukmakare är ett bevis på att en hantverkare har genomgått utbildning och avlagt de delprov som krävs inom det specifika hantverksyrket, och därigenom uppnått ett erkännande av färdigheter och kompetens inom yrket. Utfärdas av Sveriges hantverksråd i samråd med aktuell branschorganisation.
broader: Yrkesbevis/examen
related: aKdV u7V R5j

Försäljningsvana, hemförsäljning (homeparties)
type: Concept
in scheme: JobTech Taxonomy - Färdighet
definition: Försäljningsvana, hemförsäljning (homeparties) avser färdigheten att effektivt sälja produkter och tjänster i en informell hemmiljö, ofta genom sociala evenemang med närstående och bekanta. Denna kompetens inkluderar förmåga att demonstrera produkter, engagera deltagare samt skapa en positiv och säljande atmosfär under hemförsäljningstillfällen.
broader: zmYu aAM TuF
related: NCeZ rSk B4D

Ädelstensslipning
type: Concept
in scheme: JobTech Taxonomy - Färdighet
definition: Ädelstensslipning avser processen att forma och slipa ädelstenar. Kompetensen omfattar tekniker och verktyg som används för att bearbeta stenar och kräver kunskap om olika stenslag och deras egenskaper.
broader: zmYu aAM TuF
related: nwSm phw sPo

Undervisning, erfarenhet
type: Concept
in scheme: JobTech Taxonomy - Färdighet
definition: Undervisning, erfarenhet avser den kompetens som innebär att ha praktisk och teoretisk kunskap om undervisningstekniker och lärandeprocesser. Denna kompetens omfattar insikter om pedagogik och metodik samt förmågan att anpassa undervisningsinnehåll för olika lärandemål och elevgrupper.
broader: Yrkesövergripande kompetenser

Förebyggande djurhälsovård
type: Concept
in scheme: JobTech Taxonomy - Färdighet
definition: Förebyggande djurhälsovård
broader: zmYu aAM TuF
related: KYmy iqC xiQ
related: yXbD NTH ijE
related: MSzH F2n Emb

Node, exekveringsmiljö
type: Concept
in scheme: JobTech Taxonomy - Färdighet
definition: Node, exekveringsmiljö
alternative label: Node
alternative label: Node js
alternative label: Node.js
alternative label: Nodejs
broader: Programmerings- och systemutvecklingsverktyg
related: D9SL mtn vGM
related: DJh5 yyF hEM
related: UxT1 tPF Kbg
related: 4Jty HpK a3Q
related: UXKZ 3zZ ipB

Galopp, professionell utövning
type: Concept
in scheme: JobTech Taxonomy - Färdighet
definition: Galopp, professionell utövning
broader: Idrott/aktivitet
related: AwXA EM4 71n

Naturhistoria
type: Concept
in scheme: JobTech Taxonomy - Färdighet
definition: Naturhistoria
broader: zmYu aAM TuF
related: wVfo Njx 1rB
related: yXbD NTH ijE
related: sXgV QFg vpb
related: Qbvf 6nd Esn

Dräktighetsundersökningar, husdjur
type: Concept
in scheme: JobTech Taxonomy - Färdighet
definition: Dräktighetsundersökningar, husdjur avser procedurer för att fastställa dräktighet hos sällskapsdjur genom veterinärmedicinska metoder och tekniker. Denna kompetens är relevant för yrkesverksamma inom områden som avel och skötsel av husdjur, där korrekt diagnostik är viktig för djurens välbefinnande och för planering av uppfödning.
broader: zmYu aAM TuF
related: KYmy iqC xiQ
related: MSzH F2n Emb

Maskinmontage
type: Concept
in scheme: JobTech Taxonomy - Färdighet
definition: Maskinmontage avser processen att installera och sammanfoga olika maskindelar för att skapa kompletta maskiner och utrustning. Denna kompetens innefattar kännedom om mekaniska system, verktyg och tekniker för effektiv och säker montering av maskiner inom industrin.
broader: zmYu aAM TuF
related: KttZ Skc bMR

Presentationsprogram, undervisning
type: Concept
in scheme: JobTech Taxonomy - Färdighet
definition: Presentationsprogram, undervisning
broader: Dataundervisning
related: 1CX5 mZw Vcq
related: 4Jty HpK a3Q

Fäktning, instruktör/Fäktning, tränare
type: Concept
in scheme: JobTech Taxonomy - Färdighet
definition: Fäktning, instruktör/Fäktning, tränare
alternative label: Fäktning, instruktör
alternative label: Fäktning, tränare
broader: Idrott/aktivitet
related: EA6o N1N QtT

HVD, hänvisningssystem
type: Concept
in scheme: JobTech Taxonomy - Färdighet
definition: HVD, hänvisningssystem
broader: Hänvisningsdatorer
related: 4aPu 2nd 8X6
related: ByrL ANp UwV
related: 4Jty HpK a3Q

Tillverkningsindustri-Autodesk Inventor
type: Concept
in scheme: JobTech Taxonomy - Färdighet
definition: Tillverkningsindustri-Autodesk Inventor
broader: mTLu uo2 gq2
related: mis4 feV uex
related: xm5G vGn iyk
related: mp2Y vyC RFV
related: 3jEy yuT aVo
related: rwpH 6RA XTT
related: K8yg U4C gkY
related: PRQn 9yw NJA
related: 4Jty HpK a3Q

Företagsförvärv
type: Concept
in scheme: JobTech Taxonomy - Färdighet
definition: Företagsförvärv
alternative label: Mergers and acquisitions
broader: zmYu aAM TuF
related: pTr9 RBT 9ur

Ljussättning, multimedia
type: Concept
in scheme: JobTech Taxonomy - Färdighet
definition: Ljussättning, multimedia
broader: zmYu aAM TuF
related: 4BsK q2C sCL
related: CkRH 4Qn iX3

Hopsömnad, trikåsöm
type: Concept
in scheme: JobTech Taxonomy - Färdighet
definition: Hopsömnad, trikåsöm
broader: zmYu aAM TuF
related: skLS kpa Ui1

Isbrytare
type: Concept
in scheme: JobTech Taxonomy - Färdighet
definition: Isbrytare
broader: Övriga specialiteter, sjöfart
related: CbQK 7th Tyf
related: KttZ Skc bMR
related: kDnq Q98 sD3

Tandreglering, specialisering tandteknik
type: Concept
in scheme: JobTech Taxonomy - Färdighet
definition: Tandreglering, specialisering tandteknik
broader: zmYu aAM TuF
related: 39yB xPQ ozd

Vinjournalistik
type: Concept
in scheme: JobTech Taxonomy - Färdighet
definition: Vinjournalistik
broader: zmYu aAM TuF
related: SgNH hag n9D

Lärarexamen-förskola, fritidshem, grundskolans tidigare år
type: Concept
in scheme: JobTech Taxonomy - Färdighet
definition: Lärarexamen-förskola, fritidshem, grundskolans tidigare år
broader: Yrkesbevis/examen
related: 5ek3 Cgq WeZ

Gesällbrev, gardinmakare
type: Concept
in scheme: JobTech Taxonomy - Färdighet
definition: Gesällbrev, gardinmakare
broader: Yrkesbevis/examen
related: vhUJ LyD XWc
related: CSUf ZVM a7Z

Möbelrengöring
type: Concept
in scheme: JobTech Taxonomy - Färdighet
definition: Möbelrengöring
broader: zmYu aAM TuF
related: idjo 2Wr a3E
related: Z6TY xDf Yup

Anrikning
type: Concept
in scheme: JobTech Taxonomy - Färdighet
definition: Anrikning
broader: zmYu aAM TuF
related: sX9n CWa KVC
related: f71c gjL RDq

Systemutredning
type: Concept
in scheme: JobTech Taxonomy - Färdighet
definition: Systemutredning
broader: zmYu aAM TuF
related: BAeH eg8 T2d
related: DJh5 yyF hEM
related: eWiB mGP MjE
related: 4Jty HpK a3Q
related: UXKZ 3zZ ipB

Steadicam
type: Concept
in scheme: JobTech Taxonomy - Färdighet
definition: Steadicam
broader: zmYu aAM TuF
related: 4BsK q2C sCL
related: CkRH 4Qn iX3
related: 3J38 DNz YKK

Socionomexamen
type: Concept
in scheme: JobTech Taxonomy - Färdighet
definition: Socionomexamen är en examen på högskolenivå kopplad till utbildning med inriktning mot socionom.
broader: Yrkesbevis/examen
related: BWwk fYX S5B
related: dJXy Rpq a2u
related: n6iX f2z XfE
related: UUQi UJ5 MSb
related: 5uP5 Ugw aVE
related: pok1 ipJ yzD

Hårdvaruutveckling
type: Concept
in scheme: JobTech Taxonomy - Färdighet
definition: Hårdvaruutveckling
broader: zmYu aAM TuF
related: nDaB vdy eAy
related: SPYW 7Z1 ShT
related: 4Jty HpK a3Q

Specialpedagogexamen inriktning utvecklingsstörning
type: Concept
in scheme: JobTech Taxonomy - Färdighet
definition: Specialpedagogexamen inriktning utvecklingsstörning är en examen på högskolenivå kopplad till utbildning för specialpedagog med inriktning utvecklingsstörning.
broader: Yrkesbevis/examen
related: 3FP7 4Eg x8P

Miniatyrmåleri
type: Concept
in scheme: JobTech Taxonomy - Färdighet
definition: Miniatyrmåleri
broader: zmYu aAM TuF
related: 34Tn BQQ tfo

Sjukvårdssvenska
type: Concept
in scheme: JobTech Taxonomy - Färdighet
definition: Sjukvårdssvenska
broader: zmYu aAM TuF
related: HPxT fQJ zwT
related: NFUg y9y 1TY
related: nu7c QuB KVQ
related: bEDv SL7 VrL
related: 6eAB cbY i9T
related: ek9W qqp XpF
related: PHJN fva yxs
related: s7vU FhY L5Z
related: seu9 VoQ VNo
related: 7XXd 4St nit
related: jY19 knH MJp
related: nrVt xUL KdQ
related: LP4Z ABV gRm
related: TMsM oNw j6z
related: 1tGC fXC mxX
related: cuaN Rj5 YCc
related: dyWo sDb MLQ
related: gXqW s5Q ZjN
related: 6zAR EHM Kwj
related: Z8ci bBE tmx
related: oj4c P4b cja

Geofysik
type: Concept
in scheme: JobTech Taxonomy - Färdighet
definition: Geofysik
broader: zmYu aAM TuF
related: V7Yz 4WV g4z

Gesällbrev, inredningssadelmakare
type: Concept
in scheme: JobTech Taxonomy - Färdighet
definition: Gesällbrev, inredningssadelmakare
broader: Yrkesbevis/examen
related: vhUJ LyD XWc

Borrutrustning, underhåll
type: Concept
in scheme: JobTech Taxonomy - Färdighet
definition: Borrutrustning, underhåll avser kompetens inom skötsel och underhåll av borrutrustning som används för borrning efter vatten, olja och mineraler. Kompetensen innebär insikt i olika typer av borrmaskiner, deras funktion och hur de underhålls för att säkerställa effektiv drift och minimera driftstopp.
broader: zmYu aAM TuF
related: 7zKm 4NW eey
related: KttZ Skc bMR

Industrilackering
type: Concept
in scheme: JobTech Taxonomy - Färdighet
definition: Industrilackering avser processen att applicera lack eller färg på produkter av olika slag och material för att skydda och förbättra ytor. Kompetensen omfattar teknisk kunskap om olika lackeringsmetoder och material som används för att uppnå önskad effekt och hållbarhet, samt insikt i miljömässiga och säkerhetsrelaterade aspekter av lackeringsprocessen.
broader: zmYu aAM TuF
related: dKUb KBP mw3

Talboksinläsning
type: Concept
in scheme: JobTech Taxonomy - Färdighet
definition: Talboksinläsning
broader: zmYu aAM TuF
related: iBUL s38 izZ
related: xuSE mtB Mir

Steninfattning
type: Concept
in scheme: JobTech Taxonomy - Färdighet
definition: Steninfattning avser processen att infatta ädelstenar och andra stenar i olika typer av smycken och konstverk. Kompetensen omfattar tekniker för säker och estetisk montering.
broader: zmYu aAM TuF
related: nwSm phw sPo

Byggnadsgeologi
type: Concept
in scheme: JobTech Taxonomy - Färdighet
definition: Byggnadsgeologi
broader: zmYu aAM TuF
related: 7zKm 4NW eey
related: yXbD NTH ijE
related: V7Yz 4WV g4z
related: 4Jty HpK a3Q

Politiskt styrd verksamhet, erfarenhet
type: Concept
in scheme: JobTech Taxonomy - Färdighet
definition: Politiskt styrd verksamhet, erfarenhet
broader: zmYu aAM TuF
related: vPP6 rsw dck
related: fsnw ZCu v2U
related: dUuh wwa FGj
related: 5uP5 Ugw aVE
related: pok1 ipJ yzD

Byggkonstruktion-Autodesk Revit Structure
type: Concept
in scheme: JobTech Taxonomy - Färdighet
definition: Byggkonstruktion-Autodesk Revit Structure
broader: mTLu uo2 gq2
related: thZP oR7 WrY
related: w6ud quG dgh
related: Pd51 xnr KCY
related: XeBP nMe pXx
related: ETAR ggZ Wuw
related: 41KB bfk 5jR
related: 4Jty HpK a3Q

Munhälsovård
type: Concept
in scheme: JobTech Taxonomy - Färdighet
definition: Munhälsovård
broader: zmYu aAM TuF
related: HPxT fQJ zwT
related: 5dxv nVQ N8o

Hjälpmedelsteknik
type: Concept
in scheme: JobTech Taxonomy - Färdighet
definition: Hjälpmedelsteknik avser kunskap och färdigheter i att konstruera, anpassa och underhålla tekniska hjälpmedel som underlättar för personer med funktionsnedsättning. Kompetensen innefattar även justering och reparation av hjälpmedel för att säkerställa deras funktion och användbarhet.
broader: zmYu aAM TuF
related: e6nk AGp y28
related: TPH4 2AM isT

Dyslexi, specialpedagogik
type: Concept
in scheme: JobTech Taxonomy - Färdighet
definition: Dyslexi, specialpedagogik
broader: zmYu aAM TuF
related: 3FP7 4Eg x8P

IT-forensik
type: Concept
in scheme: JobTech Taxonomy - Färdighet
definition: IT-forensik avser metoder för att i brottsutredningar planera, säkra, extrahera, analysera och värdera digitala spår från elektroniska enheter eller källor. Kompetensen omfattar färdigheter i att hantera och tolka digital information för att stödja rättsliga utredningar.
broader: zmYu aAM TuF
related: BAeH eg8 T2d
related: 4Jty HpK a3Q

Neurologi, specialistkompetens för läkare
type: Concept
in scheme: JobTech Taxonomy - Färdighet
definition: Neurologi, specialistkompetens för läkare
broader: Specialistbevis för läkare
related: nu7c QuB KVQ

System för övervakning av matsvinn
type: Concept
in scheme: JobTech Taxonomy - Färdighet
definition: System för övervakning av matsvinn
broader: zmYu aAM TuF
related: yJk6 azD ywF
related: v9nU 6Fw 4Qg
related: BStc SJh DKG
related: kF59 fge kts
related: yXbD NTH ijE
related: dMVD VYy kgg
related: 4Jty HpK a3Q
related: icae Y69 H8E
related: gJtZ EBc n2z
related: h324 DPT 7Tw

Styr/400, logistiksystem
type: Concept
in scheme: JobTech Taxonomy - Färdighet
definition: Styr/400, logistiksystem
broader: m7Aj ZBk 1m8
related: xm5G vGn iyk
related: AuTi FEo j3R
related: 4Jty HpK a3Q

Manus, Film
type: Concept
in scheme: JobTech Taxonomy - Färdighet
definition: Skriva manus för film.
broader: zmYu aAM TuF
related: zfve s6G tpc

Kostekonomexamen
type: Concept
in scheme: JobTech Taxonomy - Färdighet
definition: Kostekonomexamen
broader: Yrkesbevis/examen
related: h324 DPT 7Tw

Symboldrama
type: Concept
in scheme: JobTech Taxonomy - Färdighet
definition: Symboldrama
broader: zmYu aAM TuF
related: VYeq GDF a2g

Varpmaskiner
type: Concept
in scheme: JobTech Taxonomy - Färdighet
definition: Varpmaskiner
broader: zmYu aAM TuF
related: skLS kpa Ui1

Konststoppning
type: Concept
in scheme: JobTech Taxonomy - Färdighet
definition: Konststoppning
broader: zmYu aAM TuF
related: UZBj yDX Ctp

Jämställdhetsfrågor
type: Concept
in scheme: JobTech Taxonomy - Färdighet
definition: Jämställdhetsfrågor
broader: zmYu aAM TuF
related: qVHD Hj5 PXh
related: vPP6 rsw dck
related: ajwx FvL YuY
related: oEmP NC1 sXE
related: ddGt fEH 432
related: sXgV QFg vpb

Bårhusverksamhet
type: Concept
in scheme: JobTech Taxonomy - Färdighet
definition: Bårhusverksamhet innefattar att hantera, förvara och förbereda avlidna för visning, transport eller obduktion.
broader: zmYu aAM TuF
related: GiNX ESA AL1

Certifierad yogainstruktör
type: Concept
in scheme: JobTech Taxonomy - Färdighet
definition: Certifierad yogainstruktör är en certifiering som intygar att en yogainstruktör har genomgått erkänd utbildning och uppnått kompetens inom området.
broader: s48H Sft DTn
related: EA6o N1N QtT

Förvaltningslagen
type: Concept
in scheme: JobTech Taxonomy - Färdighet
definition: Förvaltningslagen
broader: zmYu aAM TuF
related: eQ4M CNm ozj
related: zKvJ GnC Szx

Verkstadsmaskiner
type: Concept
in scheme: JobTech Taxonomy - Färdighet
definition: Verkstadsmaskiner
broader: zmYu aAM TuF
related: oXSW fbY XrY
related: 85cq 6uK 4cK

Vinprovning, avsmakning
type: Concept
in scheme: JobTech Taxonomy - Färdighet
definition: Vinprovning, avsmakning
broader: zmYu aAM TuF
related: dAu7 VyL hsy

Atomfysik/Molekylfysik
type: Concept
in scheme: JobTech Taxonomy - Färdighet
definition: Atomfysik/Molekylfysik
alternative label: Atomfysik
alternative label: Molekylfysik
broader: zmYu aAM TuF
related: KM7d Z6Y LCJ

Nyckelharpa
type: Concept
in scheme: JobTech Taxonomy - Färdighet
definition: Nyckelharpa
broader: wLYs CKS wK8
related: AWJF wqZ va9

Gesällbrev, hudterapeut
type: Concept
in scheme: JobTech Taxonomy - Färdighet
definition: Gesällbrev, hudterapeut
broader: Yrkesbevis/examen
related: xr7w N6Q QMA

Olf (order-lager-fakturering)
type: Concept
in scheme: JobTech Taxonomy - Färdighet
definition: Olf (order-lager-fakturering)
alternative label: Olf
alternative label: Order-lager-fakturering
broader: zmYu aAM TuF
related: ij8k EwC zyB
related: 4Jty HpK a3Q

Elitidrott, ledarerfarenhet
type: Concept
in scheme: JobTech Taxonomy - Färdighet
definition: Elitidrott, ledarerfarenhet
broader: zmYu aAM TuF
related: EA6o N1N QtT

VA-teknik
type: Concept
in scheme: JobTech Taxonomy - Färdighet
definition: VA-teknik
broader: zmYu aAM TuF
related: thZP oR7 WrY
related: K8yg U4C gkY
related: 7mn2 kA9 ftp
related: XeBP nMe pXx
related: PRQn 9yw NJA
related: 4Jty HpK a3Q

Smide
type: Concept
in scheme: JobTech Taxonomy - Färdighet
definition: Smide
broader: zmYu aAM TuF
related: 34Tn BQQ tfo
related: q8Ho 3Xw sHq

Populärmusik, undervisningsvana
type: Concept
in scheme: JobTech Taxonomy - Färdighet
definition: Populärmusik, undervisningsvana
broader: zmYu aAM TuF
related: mcRJ kq2 jFr

Sandberedning
type: Concept
in scheme: JobTech Taxonomy - Färdighet
definition: Sandberedning
broader: zmYu aAM TuF
related: UcNa inr snV

Supportsvarvning
type: Concept
in scheme: JobTech Taxonomy - Färdighet
definition: Supportsvarvning avser en teknik inom metallbearbetning där arbetsstycken roterar mot ett verktyg för att forma och bearbeta materialet. Denna kompetens innefattar kunskap om maskinställning och drift, vilket gör det möjligt att utföra precisionsbearbetning av olika metallkomponenter.
broader: zmYu aAM TuF
related: e6nk AGp y28
related: vaEp iBS c5h

Ismaskin, erfarenhet
type: Concept
in scheme: JobTech Taxonomy - Färdighet
definition: Ismaskin, erfarenhet
broader: zmYu aAM TuF
related: df9D e6y 61z

Accessoarer/Bijouterier
type: Concept
in scheme: JobTech Taxonomy - Färdighet
definition: Accessoarer/Bijouterier
alternative label: Accessoarer
alternative label: Bijouterier
broader: zmYu aAM TuF
related: oXSW fbY XrY
related: YKL2 FCB 1yr
related: 85cq 6uK 4cK

Datorstyrd utfodring
type: Concept
in scheme: JobTech Taxonomy - Färdighet
definition: Datorstyrd utfodring
broader: zmYu aAM TuF
related: KYmy iqC xiQ
related: RYCQ ogb uUY
related: 4Jty HpK a3Q

Life Cycle Cost/LCC
type: Concept
in scheme: JobTech Taxonomy - Färdighet
definition: Life Cycle Cost/LCC
alternative label: LCC
alternative label: Life Cycle Cost
broader: Kvalitetsverktyg
related: wCx8 rY3 XUT
related: Qo7p wjf gtv
related: vPP6 rsw dck
related: thZP oR7 WrY
related: dMVD VYy kgg

Yrkesbevis, beläggningsarbete
type: Concept
in scheme: JobTech Taxonomy - Färdighet
definition: Yrkesbevis, beläggningsarbete
broader: Yrkesbevis/examen
related: bZ4J riZ zK6

Ultraljudsundersökningar
type: Concept
in scheme: JobTech Taxonomy - Färdighet
definition: Ultraljudsundersökningar
broader: zmYu aAM TuF
related: 7XXd 4St nit
related: 1tGC fXC mxX

Modula-2, programmeringsspråk
type: Concept
in scheme: JobTech Taxonomy - Färdighet
definition: Modula-2, programmeringsspråk
broader: Datorspråk
related: DJh5 yyF hEM
related: 4Jty HpK a3Q

Ubuntu, operativsystem
type: Concept
in scheme: JobTech Taxonomy - Färdighet
definition: Ubuntu, operativsystem
alternative label: Ubuntu
broader: xAWr WYq JPP
related: BAeH eg8 T2d
related: cBBa ngH fCx
related: Fv7d YhP YmS
related: 1CX5 mZw Vcq
related: D9SL mtn vGM
related: VCpu 5EN bBt
related: DJh5 yyF hEM
related: 4Jty HpK a3Q
related: 13md uyV BNG
related: UXKZ 3zZ ipB
related: MYAz x9m 2LJ

Reklamfilm
type: Concept
in scheme: JobTech Taxonomy - Färdighet
definition: Reklamfilm
broader: zmYu aAM TuF
related: SgNH hag n9D

Kantslipning
type: Concept
in scheme: JobTech Taxonomy - Färdighet
definition: Kantslipning
broader: zmYu aAM TuF
related: aKdV u7V R5j

Hygienstädning
type: Concept
in scheme: JobTech Taxonomy - Färdighet
definition: Hygienstädning
broader: zmYu aAM TuF
related: Z6TY xDf Yup

NetBIOS, kommunikationsprotokoll
type: Concept
in scheme: JobTech Taxonomy - Färdighet
definition: NetBIOS, kommunikationsprotokoll
alternative label: NetBIOS
broader: Kommunikationsprotokoll
related: BAeH eg8 T2d
related: cBBa ngH fCx
related: D9SL mtn vGM
related: VCpu 5EN bBt
related: fWrt sLg koW
related: 4Jty HpK a3Q
related: 13md uyV BNG
related: MYAz x9m 2LJ

Skrivare, installation och underhåll
type: Concept
in scheme: JobTech Taxonomy - Färdighet
definition: Skrivare, installation och underhåll
broader: Hårdvara
related: hmaC cfi UKg
related: 1CX5 mZw Vcq
related: VCpu 5EN bBt
related: fWrt sLg koW
related: 4Jty HpK a3Q
related: 13md uyV BNG

Psykiatrisk öppenvård
type: Concept
in scheme: JobTech Taxonomy - Färdighet
definition: Psykiatrisk öppenvård
broader: zmYu aAM TuF
related: 7fNG sve JWU
related: LP4Z ABV gRm

Verksamhetsledning, media
type: Concept
in scheme: JobTech Taxonomy - Färdighet
definition: Verksamhetsledning, media
broader: zmYu aAM TuF
related: mpuA s56 Hsy

Kvalitetssamordning
type: Concept
in scheme: JobTech Taxonomy - Färdighet
definition: Kvalitetssamordning
broader: zmYu aAM TuF
related: mis4 feV uex
related: xm5G vGn iyk
related: cBBa ngH fCx
related: v9nU 6Fw 4Qg
related: Qo7p wjf gtv
related: qn2U dB9 Cmh
related: mp2Y vyC RFV
related: K8yg U4C gkY
related: nDaB vdy eAy
related: 33Nt DSs YYA
related: SPYW 7Z1 ShT
related: dMVD VYy kgg
related: PRQn 9yw NJA
related: MYAz x9m 2LJ

Fartygsbefäl klass VII, inre fart (behörighet)
type: Concept
in scheme: JobTech Taxonomy - Färdighet
definition: Fartygsbefäl klass VII, inre fart (behörighet)
broader: Behörigheter, sjöfart
related: kZwz D8K bKs
related: kDnq Q98 sD3

Redaktionsledning, TV
type: Concept
in scheme: JobTech Taxonomy - Färdighet
definition: Redaktionsledning, TV
broader: zmYu aAM TuF
related: 3i4a Ufc qpp

2D-grafik-Canvas
type: Concept
in scheme: JobTech Taxonomy - Färdighet
definition: 2D-grafik-Canvas
broader: Programvara för digitalt skapande
related: 8Bmh vtM zts
related: 34Tn BQQ tfo
related: mwVN oEH g9k
related: 4Jty HpK a3Q
related: Mbt6 3ko DiD

Fjärrstyrd kran
type: Concept
in scheme: JobTech Taxonomy - Färdighet
definition: Fjärrstyrd kran
broader: zmYu aAM TuF
related: XYzP 5Tn 7Ep

Kennelerfarenhet
type: Concept
in scheme: JobTech Taxonomy - Färdighet
definition: Kennelerfarenhet
broader: zmYu aAM TuF
related: MSzH F2n Emb

Fileteringsvana, fisk/Fileteringsvana, kött
type: Concept
in scheme: JobTech Taxonomy - Färdighet
definition: Fileteringsvana, fisk/Fileteringsvana, kött
alternative label: Fileteringsvana, fisk
alternative label: Fileteringsvana, kött
broader: zmYu aAM TuF
related: s1Qk o98 2o1

Civilingenjörsexamen
type: Concept
in scheme: JobTech Taxonomy - Färdighet
definition: Civilingenjörsexamen
broader: Yrkesbevis/examen
related: qn2U dB9 Cmh
related: rwpH 6RA XTT
related: GMDo DVo Yzh
related: Q5DF juj 8do
related: D9SL mtn vGM
related: DJh5 yyF hEM
related: SPYW 7Z1 ShT
related: XeBP nMe pXx
related: PRQn 9yw NJA
related: UxT1 tPF Kbg

Sed, texteditor
type: Concept
in scheme: JobTech Taxonomy - Färdighet
definition: Sed, texteditor
alternative label: Sed
broader: Programmerings- och systemutvecklingsverktyg
related: 8Bmh vtM zts
related: D9SL mtn vGM
related: 4Jty HpK a3Q
related: Mbt6 3ko DiD
related: MYAz x9m 2LJ

Historia
type: Concept
in scheme: JobTech Taxonomy - Färdighet
definition: Historia
broader: zmYu aAM TuF
related: wVfo Njx 1rB
related: Qbvf 6nd Esn

Bokslut vid börsnoterat företag
type: Concept
in scheme: JobTech Taxonomy - Färdighet
definition: Bokslut vid börsnoterat företag
broader: zmYu aAM TuF
related: mZsb A1K Gec

Rörläggning
type: Concept
in scheme: JobTech Taxonomy - Färdighet
definition: Rörläggning
broader: zmYu aAM TuF
related: bZ4J riZ zK6

MVS, operativsystem
type: Concept
in scheme: JobTech Taxonomy - Färdighet
definition: MVS, operativsystem
alternative label: MVS
broader: xAWr WYq JPP
related: BAeH eg8 T2d
related: cBBa ngH fCx
related: D9SL mtn vGM
related: VCpu 5EN bBt
related: DJh5 yyF hEM
related: 4Jty HpK a3Q
related: 13md uyV BNG
related: UXKZ 3zZ ipB
related: MYAz x9m 2LJ

Förzinkning
type: Concept
in scheme: JobTech Taxonomy - Färdighet
definition: Förzinkning
broader: zmYu aAM TuF
related: YiQw N87 zLU

Golf, professionell utövning
type: Concept
in scheme: JobTech Taxonomy - Färdighet
definition: Golf, professionell utövning
broader: Idrott/aktivitet
related: AwXA EM4 71n

Cykelvana
type: Concept
in scheme: JobTech Taxonomy - Färdighet
definition: Cykelvana avser den grundläggande erfarenheten och färdigheten att cykla, vilket innefattar kunskap om cykelns funktion och säkerhet samt förmåga att navigera i olika trafikmiljöer.
alternative label: Kunna cykla
broader: zmYu aAM TuF
related: gaBh 1vR tNE
related: jY19 knH MJp
related: P7Ay ooF pri
related: tAJS JNb hDH

Grundarbeten
type: Concept
in scheme: JobTech Taxonomy - Färdighet
definition: Grundarbeten
broader: zmYu aAM TuF
related: bZ4J riZ zK6
related: q2Ge zrQ zJb
related: 9mJN VwW Xjg

Redigering, TV-produktion
type: Concept
in scheme: JobTech Taxonomy - Färdighet
definition: Redigering, TV-produktion
broader: zmYu aAM TuF
related: 4BsK q2C sCL
related: CkRH 4Qn iX3
related: 4Jty HpK a3Q

Verksamhetsledning, fordonsverkstad
type: Concept
in scheme: JobTech Taxonomy - Färdighet
definition: Verksamhetsledning på fordonsverkstad innebär att leda och utveckla hela verkstadens verksamhet med fokus på effektivitet, kvalitet och kundnöjdhet. Det omfattar planering och styrning av produktionen, budget- och resultatansvar samt personalledning.
broader: zmYu aAM TuF
related: NQTS fou E6u

EDC-system, reparationsvana
type: Concept
in scheme: JobTech Taxonomy - Färdighet
definition: EDC-system, reparationsvana
broader: zmYu aAM TuF
related: Lzpv ofL 3H5

Utvecklingssamtal, ledning av
type: Concept
in scheme: JobTech Taxonomy - Färdighet
definition: Utvecklingssamtal, ledning av
broader: zmYu aAM TuF
related: mNoS AN5 drn

Projektadministration
type: Concept
in scheme: JobTech Taxonomy - Färdighet
definition: Projektadministration avser processen att planera, organisera och följa upp administrativa uppgifter kopplade till projekt, vilket inkluderar dokumentation, resursallokering och kommunikation inom projektteamet. Kompetensen omfattar förmåga att hantera tidslinjer och budgetar, samt att säkerställa att alla administrativa rutiner följs för att stödja projektets mål.
broader: zmYu aAM TuF
related: eQ4M CNm ozj
related: L7eh ihX vM5
related: oEmP NC1 sXE
related: H2Zj eL9 x28
related: ij8k EwC zyB
related: vCAb uuo ek5
related: 4Jty HpK a3Q
related: p16X 44f rwZ

Industri- och företagsinredning, produktkunskap
type: Concept
in scheme: JobTech Taxonomy - Färdighet
definition: Industri- och företagsinredning, produktkunskap
broader: zmYu aAM TuF
related: oXSW fbY XrY

Modersmål, undervisning grundskolenivå
type: Concept
in scheme: JobTech Taxonomy - Färdighet
definition: Modersmål, undervisning grundskolenivå
broader: Inriktning på lärarkompetens
related: oQUQ D11 HPx
related: CFW8 eBa NaV
related: 5ek3 Cgq WeZ

Djursjukvårdarexamen
type: Concept
in scheme: JobTech Taxonomy - Färdighet
definition: Djursjukvårdarexamen är en yrkesexamen på högskolenivå kopplad till utbildning med inriktning mot djursjukskötare. Källa: UHR (Universitets- och högskolerådet)
broader: Yrkesbevis/examen
related: 8q1B 5AR CEM
related: yXbD NTH ijE

DSB-godkännande
type: Concept
in scheme: JobTech Taxonomy - Färdighet
definition: DSB-godkännande
broader: s48H Sft DTn
related: a75S eLg JWH
related: yyF7 jsW EeP

Teradata, databashanterare
type: Concept
in scheme: JobTech Taxonomy - Färdighet
definition: Teradata, databashanterare
broader: Databaser
related: BAeH eg8 T2d
related: cBBa ngH fCx
related: Fv7d YhP YmS
related: D9SL mtn vGM
related: DJh5 yyF hEM
related: 4Jty HpK a3Q
related: MYAz x9m 2LJ

AFIS, fortbildning
type: Concept
in scheme: JobTech Taxonomy - Färdighet
definition: AFIS, fortbildning
broader: Yrkesbevis/examen
related: 957L kZK rHZ

Doktorsexamen, biblioteksvetenskap
type: Concept
in scheme: JobTech Taxonomy - Färdighet
definition: Doktorsexamen, biblioteksvetenskap
broader: Yrkesbevis/examen
related: Gm5j S2Y aTB
related: cYCo PxY zQd

Maskinkörkort, träindustrin
type: Concept
in scheme: JobTech Taxonomy - Färdighet
definition: Maskinkörkort, träindustrin
broader: s48H Sft DTn
related: VKKg e4t t46

Offsettryckning
type: Concept
in scheme: JobTech Taxonomy - Färdighet
definition: Offsettryckning
broader: zmYu aAM TuF
related: XeJB bkn mRn

Besiktning, entreprenadmaskiner
type: Concept
in scheme: JobTech Taxonomy - Färdighet
definition: Besiktning av entreprenadmaskiner innebär kunskap och färdighet i att kontrollera att entreprenadmaskiner uppfyller gällande säkerhetskrav, tekniska standarder och lagstiftning. För en besiktningsingenjör omfattar arbetsuppgifterna att genomföra återkommande besiktningar, första besiktningar och revisionsbesiktningar av maskiner som grävmaskiner, kranar, hjullastare, teleskoptruckar och andra lyftanordningar. Arbetet inkluderar även kontroll av lyft- och bromssystem, konstruktionens hållfasthet, stabilitet och skyddsanordningarnas funktion.
broader: zmYu aAM TuF
related: nuXg Wjc JPd

FileMaker Pro
type: Concept
in scheme: JobTech Taxonomy - Färdighet
definition: FileMaker Pro
broader: Allmänna datakunskaper
related: eQ4M CNm ozj
related: Y6yY SuR hVh
related: Uw4n UB2 RCW
related: fdLf oPp wVw
related: vPP6 rsw dck
related: iWcY mko rq2
related: ZQTR hVC QhJ
related: br6a VVS V3y
related: 1CX5 mZw Vcq
related: L7eh ihX vM5
related: MGk3 LvL AU2
related: jJF3 qaQ Zsh
related: oEmP NC1 sXE
related: bjqk F3A 5Hk
related: H2Zj eL9 x28
related: dJXy Rpq a2u
related: pwRH MT1 8nR
related: cRmd 536 pT1
related: zKvJ GnC Szx
related: n6iX f2z XfE
related: DZVN v5g Fco
related: ij8k EwC zyB
related: JfYV ZGg 6rm
related: vCAb uuo ek5
related: 4Jty HpK a3Q
related: p16X 44f rwZ
related: pok1 ipJ yzD

Utforma isolering för byggnader
type: Concept
in scheme: JobTech Taxonomy - Färdighet
definition: Utforma isolering för byggnader
alternative label: Utforma teknisk isolering
broader: zmYu aAM TuF
related: thZP oR7 WrY
related: yXbD NTH ijE
related: XeBP nMe pXx

Komposition för orkester
type: Concept
in scheme: JobTech Taxonomy - Färdighet
definition: Komposition för orkester
broader: zmYu aAM TuF
related: AWJF wqZ va9

Verksamhetsledning, elverk
type: Concept
in scheme: JobTech Taxonomy - Färdighet
definition: Verksamhetsledning, elverk
broader: zmYu aAM TuF
related: pf1K PTz frm

Granskning av bokslut
type: Concept
in scheme: JobTech Taxonomy - Färdighet
definition: Granskning av bokslut innebär oberoende kontroll av årsredovisning och bokföring för att säkerställa rättvisande bild och laglig efterlevnad. Det omfattar analys av redovisning, stickprov, avstämningar och riskbedömningar, och resulterar i en revisionsberättelse. Arbetet utförs av revisorer och revisorsassistenter.
broader: zmYu aAM TuF
related: eQ4M CNm ozj
related: Y6yY SuR hVh
related: Uw4n UB2 RCW
related: q81z 3oD 1qu
related: cRmd 536 pT1

Officiell veterinär, särskilt förordande
type: Concept
in scheme: JobTech Taxonomy - Färdighet
definition: Officiell veterinär, särskilt förordande
broader: zmYu aAM TuF
related: WL4E r4b ek4

Tråddragning
type: Concept
in scheme: JobTech Taxonomy - Färdighet
definition: Tråddragning
broader: zmYu aAM TuF
related: UcNa inr snV

Driftledning, lantbruk
type: Concept
in scheme: JobTech Taxonomy - Färdighet
definition: Driftledning, lantbruk
broader: zmYu aAM TuF
related: XurM DVs ggn

Plåtklippning
type: Concept
in scheme: JobTech Taxonomy - Färdighet
definition: Plåtklippning avser processen att skära och forma plåtmaterial till önskade dimensioner och former för användning i olika konstruktioner och installationer.
broader: zmYu aAM TuF
related: L4hA SJP SFi
related: bXfo 4hb SXx

Bolagsrätt
type: Concept
in scheme: JobTech Taxonomy - Färdighet
definition: Bolagsrätt
broader: zmYu aAM TuF
related: br6a VVS V3y
related: zKvJ GnC Szx
related: DZVN v5g Fco
related: JfYV ZGg 6rm

Oförstörande provning: Materialidentifiering PMI
type: Concept
in scheme: JobTech Taxonomy - Färdighet
definition: Oförstörande provning: Materialidentifiering PMI
broader: zmYu aAM TuF
related: Lzpv ofL 3H5
related: K8yg U4C gkY
related: iGTu bYL 2T7
related: eRkT cTv H9v

Facklitterär text
type: Concept
in scheme: JobTech Taxonomy - Färdighet
definition: Facklitterär text
broader: zmYu aAM TuF
related: PQDm Z63 zst

Deskriptiv statistik
type: Concept
in scheme: JobTech Taxonomy - Färdighet
definition: Deskriptiv statistik
broader: zmYu aAM TuF
related: jv1x tpK 32p
related: ZA1N Z2B nFQ
related: 4Jty HpK a3Q

Medicinsk gastroenterologi och hepatologi, specialistkompetens för läkare
type: Concept
in scheme: JobTech Taxonomy - Färdighet
definition: Medicinsk gastroenterologi och hepatologi, specialistkompetens för läkare
broader: Specialistbevis för läkare
related: nu7c QuB KVQ

Corporate Finance
type: Concept
in scheme: JobTech Taxonomy - Färdighet
definition: Corporate Finance
broader: zmYu aAM TuF
related: Bbkh nrm 2J8
related: pTr9 RBT 9ur
related: FfMN Bw1 qYR
related: 9Mn4 PNA 7Yz

Geokemi
type: Concept
in scheme: JobTech Taxonomy - Färdighet
definition: Geokemi
broader: zmYu aAM TuF
related: yXbD NTH ijE
related: XeBP nMe pXx
related: V7Yz 4WV g4z
related: bExu 8gk azk

Värmeteknik
type: Concept
in scheme: JobTech Taxonomy - Färdighet
definition: Värmeteknik avser området som omfattar teori och tillämpningar för överföring och hantering av värmeenergi i olika system och applikationer. Kompetensen inkluderar kunskap om värmeöverföring, termodynamik och energiteknologier för att effektivt designa och optimera system för uppvärmning, kylning och ventilering.
broader: zmYu aAM TuF
related: wCx8 rY3 XUT
related: K8yg U4C gkY
related: yXbD NTH ijE
related: PRQn 9yw NJA

Hemsjukvård
type: Concept
in scheme: JobTech Taxonomy - Färdighet
definition: Hemsjukvård avser den vård och omsorg som ges till patienter i deras hem, vilket innefattar både medicinska och omvårdnadsuppgifter för att stödja individens hälsa och livskvalitet.
broader: zmYu aAM TuF
related: NFUg y9y 1TY
related: 6eAB cbY i9T
related: jY19 knH MJp
related: tAJS JNb hDH
related: Z8ci bBE tmx
related: oj4c P4b cja

Onkologisk kirurgi
type: Concept
in scheme: JobTech Taxonomy - Färdighet
definition: Onkologisk kirurgi
broader: zmYu aAM TuF
related: 6zAR EHM Kwj

Synergonomi
type: Concept
in scheme: JobTech Taxonomy - Färdighet
definition: Synergonomi
broader: zmYu aAM TuF
related: Uw64 cuc U3H

Köttklassificering
type: Concept
in scheme: JobTech Taxonomy - Färdighet
definition: Köttklassificering avser processen att bedöma och kategorisera köttprodukter utifrån kvalitet och särskilda egenskaper såsom fettinnehåll, marmorering och segerutveckling. Detta innefattar kunskap om standarder och klassificeringssystem som används i köttbranschen för att säkerställa att produkter uppfyller krav på kvalitet och säkerhet.
broader: zmYu aAM TuF
related: QqHf XKZ eyy
related: Fp7x Yqt bx9
related: gJtZ EBc n2z

Kem. lab.arb., medicintekniskt område ingenjör
type: Concept
in scheme: JobTech Taxonomy - Färdighet
definition: Kem. lab.arb., medicintekniskt område ingenjör
broader: zmYu aAM TuF
related: GC7L Yw7 Mfo

Yrkesutbildning, trafiklärare
type: Concept
in scheme: JobTech Taxonomy - Färdighet
definition: Yrkesutbildning, trafiklärare är en yrkeshögskoleutbildning med inriktning till trafiklärare.
broader: Yrkesutbildning
related: yVZH zHh 6fG

Administration inom offentlig förvaltning
type: Concept
in scheme: JobTech Taxonomy - Färdighet
definition: Kompetensen innebär grundläggande grundläggande juridisk kunskaper om och korrekt hantering inom offentlig förvaltning. Detta innefattar bland annat förvaltningslagen, diarieföring, offentlighets- och sekretesslagen samt hantering om begäran av allmän handling.
broader: zmYu aAM TuF
related: 2kLc pto DpV
related: eQ4M CNm ozj

Avtalsjuridik
type: Concept
in scheme: JobTech Taxonomy - Färdighet
definition: Avtalsjuridik
broader: zmYu aAM TuF
related: Fghp zje WA8
related: U8HK Jdi GuC

Listmontage, trä/Listmontering, trä
type: Concept
in scheme: JobTech Taxonomy - Färdighet
definition: Listmontage, trä/Listmontering, trä
alternative label: Listmontage, trä
alternative label: Listmontering, trä
broader: zmYu aAM TuF
related: 8ddv P8e iYz
related: 9mJN VwW Xjg
related: ieVp d5L rS9

Beräkningsbiologi
type: Concept
in scheme: JobTech Taxonomy - Färdighet
definition: Beräkningsbiologi
broader: zmYu aAM TuF
related: Z2MZ eYc Lfv
related: dsK3 hkt zGy
related: e9FK VKh ahW
related: 4Jty HpK a3Q

Röjningsmaskin
type: Concept
in scheme: JobTech Taxonomy - Färdighet
definition: Röjningsmaskin
broader: zmYu aAM TuF
related: KwVo sQu G2e

Virtual reality/VR
type: Concept
in scheme: JobTech Taxonomy - Färdighet
definition: Virtual reality/VR
alternative label: VR
alternative label: Virtual reality
broader: zmYu aAM TuF
related: UxT1 tPF Kbg
related: 4Jty HpK a3Q
related: Mbt6 3ko DiD

Diakonvigd
type: Concept
in scheme: JobTech Taxonomy - Färdighet
definition: Diakonvigd
broader: Yrkesbevis/examen
related: wzeq No2 LF1

Fanering
type: Concept
in scheme: JobTech Taxonomy - Färdighet
definition: Fanering
broader: zmYu aAM TuF
related: VKKg e4t t46
related: 1Nwn GYH wkH

Områdesansvar, sjöfart
type: Concept
in scheme: JobTech Taxonomy - Färdighet
definition: Områdesansvar, sjöfart
broader: zmYu aAM TuF
related: 3i4a Ufc qpp

Svenska kyrkans grundkurs
type: Concept
in scheme: JobTech Taxonomy - Färdighet
definition: Svenska kyrkans grundkurs
broader: zmYu aAM TuF
related: aA2Z 9XX R1v

Elkraftsystem
type: Concept
in scheme: JobTech Taxonomy - Färdighet
definition: Elkraftsystem avser den tekniska infrastrukturen som hanterar produktion, överföring och distribution av elektrisk energi, inklusive alla komponenter och system som stödjer dessa processer. Kompetensen omfattar kunskaper om elektriska anläggningar, inklusive generatorer, transformatorer och distribuerade energikällor, samt deras samverkan inom ett övergripande nätverk.
broader: zmYu aAM TuF
related: w6ud quG dgh
related: nDaB vdy eAy
related: SPYW 7Z1 ShT

Apple iWork MAC
type: Concept
in scheme: JobTech Taxonomy - Färdighet
definition: Apple iWork MAC
broader: Allmänna datakunskaper
related: eQ4M CNm ozj
related: Y6yY SuR hVh
related: Uw4n UB2 RCW
related: fdLf oPp wVw
related: vPP6 rsw dck
related: iWcY mko rq2
related: ZQTR hVC QhJ
related: br6a VVS V3y
related: 1CX5 mZw Vcq
related: L7eh ihX vM5
related: MGk3 LvL AU2
related: jJF3 qaQ Zsh
related: oEmP NC1 sXE
related: bjqk F3A 5Hk
related: H2Zj eL9 x28
related: dJXy Rpq a2u
related: pwRH MT1 8nR
related: cRmd 536 pT1
related: zKvJ GnC Szx
related: n6iX f2z XfE
related: DZVN v5g Fco
related: ij8k EwC zyB
related: JfYV ZGg 6rm
related: vCAb uuo ek5
related: 4Jty HpK a3Q
related: p16X 44f rwZ
related: pok1 ipJ yzD

Kablagemontering
type: Concept
in scheme: JobTech Taxonomy - Färdighet
definition: Kablagemontering
broader: zmYu aAM TuF
related: SgAJ DW2 FN5

Regional och lokal turism
type: Concept
in scheme: JobTech Taxonomy - Färdighet
definition: Regional och lokal turism avser förmåga att utveckla och främja turism på regional och lokal nivå, vilket omfattar strategier och aktiviteter för att öka besöksantalet och stödja den lokala ekonomin. Kompetensen innefattar kunskaper om de specifika resurser och attraktioner som finns i områdena samt förmåga att samarbeta med olika aktörer inom turismsektorn, såsom guider, resebyråer och lokala företag.
broader: zmYu aAM TuF
related: NQTS fou E6u
related: fdLf oPp wVw
related: A6X3 efC VNy
related: yXbD NTH ijE

Arbetsmiljöansvar
type: Concept
in scheme: JobTech Taxonomy - Färdighet
definition: Arbetsmiljöansvar
broader: zmYu aAM TuF
related: x9mo 1VH Rps
related: womV SEj CAH
related: NQTS fou E6u
related: Fu4x 7KG YgC
related: mNoS AN5 drn
related: 8SPu K1k 5qR
related: pf1K PTz frm
related: ajwx FvL YuY
related: coyZ Cyv Srw
related: QG4f MCh vND
related: NxXz fBh w7j
related: 7mn2 kA9 ftp
related: Pz9M srJ Lc9
related: Fp7x Yqt bx9
related: z8di AqX GBr
related: g6eC Fwu B3J
related: eWiB mGP MjE
related: mZsb A1K Gec
related: eX3C MtJ nPA
related: 4GAs rKs 2Ne
related: wby2 mwq fWV
related: uxst tkg zDh
related: X1Ac Y9P PJo
related: hZLv S5f jo2
related: mpuA s56 Hsy
related: sWzF 6pd Y6L
related: rYSG 3WJ LmC
related: nNxJ YWy vR2
related: 1uau t1u rDL
related: XGyi i4B ME7
related: 9Mn4 PNA 7Yz

Orkesterklass, undervisningsvana
type: Concept
in scheme: JobTech Taxonomy - Färdighet
definition: Orkesterklass, undervisningsvana
broader: zmYu aAM TuF
related: mcRJ kq2 jFr

Flyginformation
type: Concept
in scheme: JobTech Taxonomy - Färdighet
definition: Kompetensen Flyginformation (ofta förknippad med AFIS - Aerodrome Flight Information Service) innebär att tillhandahålla nödvändig flyginformation och flygväderrapporter till piloter för att säkerställa säkra och effektiva flygoperationer, särskilt vid mindre och medelstora flygplatser.
broader: zmYu aAM TuF
related: yct8 Pun DWd

VxWorks, operativsystem
type: Concept
in scheme: JobTech Taxonomy - Färdighet
definition: VxWorks, operativsystem
alternative label: VxWorks
broader: xAWr WYq JPP
related: BAeH eg8 T2d
related: cBBa ngH fCx
related: D9SL mtn vGM
related: VCpu 5EN bBt
related: DJh5 yyF hEM
related: 4Jty HpK a3Q
related: 13md uyV BNG
related: UXKZ 3zZ ipB
related: MYAz x9m 2LJ

Rullstolar, reparationer
type: Concept
in scheme: JobTech Taxonomy - Färdighet
definition: Rullstolar, reparationer
broader: zmYu aAM TuF
related: e6nk AGp y28

Gatubelysning, installation och underhåll
type: Concept
in scheme: JobTech Taxonomy - Färdighet
definition: Gatubelysning, installation och underhåll
broader: zmYu aAM TuF
related: MW1P GNJ 4F9
related: yXbD NTH ijE

Maskinkunskap, CNC
type: Concept
in scheme: JobTech Taxonomy - Färdighet
definition: Maskinkunskap, CNC avser förståelse och färdighet inom drift och programmering av datorstyrda maskiner för att bearbeta material såsom metall och trä. Kompetensen innefattar kunskap om maskinernas funktioner, inställningar och underhåll, samt förmågan att skapa och justera CNC-program för att uppnå önskade produktionsresultat.
broader: zmYu aAM TuF
related: VKKg e4t t46
related: e6nk AGp y28
related: vaEp iBS c5h
related: o31g CX1 qhQ
related: vCBT Pnd 8UB
related: 4Jty HpK a3Q

Monumentalmålning
type: Concept
in scheme: JobTech Taxonomy - Färdighet
definition: Monumentalmålning
broader: zmYu aAM TuF
related: 34Tn BQQ tfo

Object Component Model/COM
type: Concept
in scheme: JobTech Taxonomy - Färdighet
definition: Object Component Model/COM
alternative label: COM
alternative label: Object Component Model
broader: Kommunikationsprotokoll
related: BAeH eg8 T2d
related: cBBa ngH fCx
related: nDaB vdy eAy
related: D9SL mtn vGM
related: DJh5 yyF hEM
related: SPYW 7Z1 ShT
related: 4Jty HpK a3Q
related: 13md uyV BNG
related: UXKZ 3zZ ipB
related: MYAz x9m 2LJ

Fallprevention
type: Concept
in scheme: JobTech Taxonomy - Färdighet
definition: Fallprevention innebär åtgärder för att förebygga fall som leder till kroppsskada för människor. Källa: Vårdhandboken
broader: zmYu aAM TuF
related: 6eAB cbY i9T
related: ek9W qqp XpF
related: TPH4 2AM isT
related: seu9 VoQ VNo
related: jY19 knH MJp
related: LP4Z ABV gRm
related: gXqW s5Q ZjN
related: 6zAR EHM Kwj
related: Z8ci bBE tmx

Godkänd skidpatrullörutbildning, SLAO
type: Concept
in scheme: JobTech Taxonomy - Färdighet
definition: Godkänd skidpatrullörutbildning, SLAO är en yrkesutbildning med inriktning till skidpatrullör med fokus på säkerhetsarbete, skadeförebyggande åtgärder samt omhändertagande av alla typer av olycksfall i en skidanläggning.
broader: Yrkesbevis/examen
related: EA6o N1N QtT
related: ayQ4 G3W A2w

Medicinteknisk inriktning, ingenjör
type: Concept
in scheme: JobTech Taxonomy - Färdighet
definition: Medicinteknisk inriktning, ingenjör
broader: zmYu aAM TuF
related: GC7L Yw7 Mfo
related: 4Jty HpK a3Q

Museipedagogisk verksamhet
type: Concept
in scheme: JobTech Taxonomy - Färdighet
definition: Museipedagogisk verksamhet
broader: zmYu aAM TuF
related: mcRJ kq2 jFr

Herrfrisering
type: Concept
in scheme: JobTech Taxonomy - Färdighet
definition: Herrfrisering avser kompetens inom skönhetsvård som specifikt fokuserar på klippning, behandling och vård av mäns hår. Inom detta område ingår även utförande av kemiska behandlingar samt skapande av stilar som passar kundens önskemål och ansiktsdrag.
broader: zmYu aAM TuF
related: mwVN oEH g9k
related: LyBp bY6 bZK

Reparationsvana, undervattensarbeten
type: Concept
in scheme: JobTech Taxonomy - Färdighet
definition: Reparationsvana, undervattensarbeten
broader: zmYu aAM TuF
related: DPPw 4wa AsH

Yrkesutbildning, vårdbiträde
type: Concept
in scheme: JobTech Taxonomy - Färdighet
definition: Yrkesutbildning, vårdbiträde är en eftergymnasial yrkesinriktad utbildning med inriktning till vårdbiträde.
broader: Yrkesutbildning
related: tAJS JNb hDH

Obeståndsärenden
type: Concept
in scheme: JobTech Taxonomy - Färdighet
definition: Obeståndsärenden
broader: zmYu aAM TuF
related: JAFv ZaP tDG
related: FfMN Bw1 qYR

Idrott och hälsa, undervisning grundskolenivå
type: Concept
in scheme: JobTech Taxonomy - Färdighet
definition: Idrott och hälsa, undervisning grundskolenivå
broader: Inriktning på lärarkompetens
related: oQUQ D11 HPx

CANalyzer, analysverktyg
type: Concept
in scheme: JobTech Taxonomy - Färdighet
definition: CANalyzer, analysverktyg
alternative label: CANalyzer
broader: zmYu aAM TuF
related: mis4 feV uex
related: v9nU 6Fw 4Qg
related: K8yg U4C gkY
related: nDaB vdy eAy
related: SPYW 7Z1 ShT
related: PRQn 9yw NJA
related: 4Jty HpK a3Q

Äldres hälsa, specialistkompetens för fysioterapeuter
type: Concept
in scheme: JobTech Taxonomy - Färdighet
definition: Äldres hälsa, specialistkompetens för fysioterapeuter
broader: Specialistinriktning inom fysioterapi
related: s7vU FhY L5Z

Mynt, arkeologisk kunskap
type: Concept
in scheme: JobTech Taxonomy - Färdighet
definition: Mynt, arkeologisk kunskap
broader: zmYu aAM TuF
related: sXgV QFg vpb

Analysteknik
type: Concept
in scheme: JobTech Taxonomy - Färdighet
definition: Analysteknik
broader: zmYu aAM TuF
related: v9nU 6Fw 4Qg
related: qn2U dB9 Cmh

Immunologi
type: Concept
in scheme: JobTech Taxonomy - Färdighet
definition: Immunologi
broader: zmYu aAM TuF
related: Z2MZ eYc Lfv
related: dsK3 hkt zGy
related: e9FK VKh ahW

Reach-förordningen
type: Concept
in scheme: JobTech Taxonomy - Färdighet
definition: Reach-förordningen handlar om registrering, utvärdering, tillstånd och begränsningar av kemiska ämnen. Reach innehåller också krav på användare av kemikalier, vilket inte förekommer i tidigare lagstiftning. Källa: Kemikalieinspektionen
broader: zmYu aAM TuF
related: v9nU 6Fw 4Qg
related: qn2U dB9 Cmh
related: Uw64 cuc U3H
related: nuXg Wjc JPd

Trä- och metallslöjd, undervisning
type: Concept
in scheme: JobTech Taxonomy - Färdighet
definition: Trä- och metallslöjd, undervisning
broader: Inriktning på lärarkompetens
related: oQUQ D11 HPx

Sjöfartsbok
type: Concept
in scheme: JobTech Taxonomy - Färdighet
definition: Sjöfartsbok
broader: s48H Sft DTn
related: BStc SJh DKG
related: Rsoy sS6 6c4
related: CbQK 7th Tyf
related: Z6TY xDf Yup
related: UjoW meY Zwt
related: KttZ Skc bMR
related: kDnq Q98 sD3
related: a75S eLg JWH
related: XGyi i4B ME7
related: h324 DPT 7Tw

Destillering, kemisk produktion
type: Concept
in scheme: JobTech Taxonomy - Färdighet
definition: Destillering, kemisk produktion
broader: zmYu aAM TuF
related: QEBd qHu vGr

Projektering, utbyggnad av fiber och 5G-nät
type: Concept
in scheme: JobTech Taxonomy - Färdighet
definition: Projektering, utbyggnad av fiber och 5G-nät avser planering och implementering av infrastrukturen för fiberoptiska och 5G-telekommunikationsnät. Kompetensen omfattar tekniska och strategiska kunskaper för att säkerställa effektiv och säker installation och utbyggnad av moderna kommunikationssystem.
broader: zmYu aAM TuF
related: nDaB vdy eAy
related: fWrt sLg koW

Auktoriserad skatterådgivare
type: Concept
in scheme: JobTech Taxonomy - Färdighet
definition: Auktoriserad skatterådgivare
broader: Yrkesbevis/examen
related: Y6yY SuR hVh
related: Uw4n UB2 RCW
related: cRmd 536 pT1

Speciallärarexamen inriktning grav språkstörning
type: Concept
in scheme: JobTech Taxonomy - Färdighet
definition: Speciallärarexamen inriktning grav språkstörning är en examen på högskolenivå kopplad till utbildning för speciallärare med inriktning grav språkstörning.
broader: Yrkesbevis/examen
related: 3FP7 4Eg x8P

Fiskevård
type: Concept
in scheme: JobTech Taxonomy - Färdighet
definition: Fiskevård
broader: zmYu aAM TuF
related: c8r8 e4L gwj
related: XurM DVs ggn
related: yXbD NTH ijE
related: Lm3Z gek GYc
related: e9FK VKh ahW

Guldsmide
type: Concept
in scheme: JobTech Taxonomy - Färdighet
definition: Guldsmide avser konst och teknik att bearbeta guld till olika former och föremål, vilket inkluderar tillverkning, gravyr och reparation av smycken och andra produkter i ädelmetall. Kompetensen omfattar också kunskaper i infattning och montering av ädelstenar samt utförande av konsthantverk.
broader: zmYu aAM TuF
related: nwSm phw sPo

Internatskola
type: Concept
in scheme: JobTech Taxonomy - Färdighet
definition: Internatskola
broader: zmYu aAM TuF
related: h324 DPT 7Tw
related: FtyZ Joo tB8

Markissömnad
type: Concept
in scheme: JobTech Taxonomy - Färdighet
definition: Markissömnad
broader: zmYu aAM TuF
related: UZBj yDX Ctp

Centerlesslipning
type: Concept
in scheme: JobTech Taxonomy - Färdighet
definition: Centerlesslipning
broader: zmYu aAM TuF
related: 4bxV 58E P9N

Rust, programmeringsspråk
type: Concept
in scheme: JobTech Taxonomy - Färdighet
definition: Rust, programmeringsspråk
broader: Datorspråk
related: BAeH eg8 T2d
related: Q5DF juj 8do
related: D9SL mtn vGM
related: DJh5 yyF hEM
related: 4Jty HpK a3Q

Sandgjutning
type: Concept
in scheme: JobTech Taxonomy - Färdighet
definition: Sandgjutning avser en metod för att tillverka metallkomponenter genom att forma flytande metall i sandformar. Denna process innefattar skapande av gjutformar och gjutkärnor samt övervakning av gjutning och kylning för att säkerställa den önskade kvaliteten och precisionen i det färdiga metallprodukten.
broader: zmYu aAM TuF
related: UcNa inr snV

Trubadurprogram
type: Concept
in scheme: JobTech Taxonomy - Färdighet
definition: Trubadurprogram
broader: zmYu aAM TuF
related: AWJF wqZ va9
related: xuSE mtB Mir

Glasdesign
type: Concept
in scheme: JobTech Taxonomy - Färdighet
definition: Glasdesign
broader: zmYu aAM TuF
related: PF4H kQD zpL

Tapetsering, fordon
type: Concept
in scheme: JobTech Taxonomy - Färdighet
definition: Tapetsering, fordon, avser kompetensen att utföra tapetseringsarbeten på fordon, vilket inkluderar renovering och omklädning av säten, inredning och andra textil- eller läderytor. Denna kompetens omfattar kunskaper om materialhantering, färgmatchning och användning av specialverktyg för att säkerställa en professionell finish och kostnadseffektiv restaurering av fordonets inredning.
broader: zmYu aAM TuF
related: vhUJ LyD XWc

Räddningsfarkoster och beredskapsbåtar
type: Concept
in scheme: JobTech Taxonomy - Färdighet
definition: Räddningsfarkoster och beredskapsbåtar
broader: s48H Sft DTn
related: BStc SJh DKG
related: Rsoy sS6 6c4
related: kZwz D8K bKs
related: CbQK 7th Tyf
related: Z6TY xDf Yup
related: UjoW meY Zwt
related: tPox ie4 X9X
related: KttZ Skc bMR
related: kDnq Q98 sD3
related: a75S eLg JWH
related: XGyi i4B ME7
related: h324 DPT 7Tw

Återvinningsteknik
type: Concept
in scheme: JobTech Taxonomy - Färdighet
definition: Återvinningsteknik
broader: zmYu aAM TuF
related: qn2U dB9 Cmh
related: yXbD NTH ijE

CNC-styrsystem
type: Concept
in scheme: JobTech Taxonomy - Färdighet
definition: CNC-styrsystem
broader: zmYu aAM TuF
related: vaEp iBS c5h
related: K8yg U4C gkY
related: PRQn 9yw NJA
related: 4Jty HpK a3Q

WCDMA-system
type: Concept
in scheme: JobTech Taxonomy - Färdighet
definition: WCDMA-system
broader: Mobiltelefonsystem
related: nDaB vdy eAy
related: SPYW 7Z1 ShT
related: 4Jty HpK a3Q

Utbildning inom strålskydd
type: Concept
in scheme: JobTech Taxonomy - Färdighet
definition: Personer som arbetar med joniserande strålning måste ha utbildning i strålskydd – inklusive risker, rutiner, föreskrifter och användning av skyddsutrustning. Utbildning anpassas efter arbetsuppgift och exponeringsnivå (kategori A eller B). Den som har tillstånd att driva verksamhet med joniserande strålning är också den som har ansvaret för personalens strålskydd. Utbildning inom strålskydd ges, förutom av arbetsgivare, även bland annat vid Uppsala universitet, MSB och Strålsäkerhetsmyndigheten. Källa: Strålsäkerhetsmyndigheten
broader: Yrkesbevis/examen
related: nuXg Wjc JPd

Elbas
type: Concept
in scheme: JobTech Taxonomy - Färdighet
definition: Elbas
broader: wLYs CKS wK8
related: AWJF wqZ va9

Stadsarkeologi
type: Concept
in scheme: JobTech Taxonomy - Färdighet
definition: Stadsarkeologi
broader: zmYu aAM TuF
related: sXgV QFg vpb

Registreringsbesiktning
type: Concept
in scheme: JobTech Taxonomy - Färdighet
definition: Registreringsbesiktning avser den process där fordon inspekteras för att säkerställa att de uppfyller gällande kvalitets- och säkerhetskrav innan de får registreras för användning på väg. Enligt Transportstyrelsen omfattar detta kontroller av fordonets teknik, säkerhetsutrustning och miljöpåverkan, samt utfärdande av besiktningsprotokoll och eventuella föreskrifter.
broader: zmYu aAM TuF
related: nuXg Wjc JPd

Ticketing
type: Concept
in scheme: JobTech Taxonomy - Färdighet
definition: Ticketing
broader: zmYu aAM TuF
related: fdLf oPp wVw

Gesällbrev, bokbindare
type: Concept
in scheme: JobTech Taxonomy - Färdighet
definition: Gesällbrev, bokbindare är ett bevis på att en hantverkare har genomgått utbildning och avlagt de delprov som krävs inom det specifika hantverksyrket, och därigenom uppnått ett erkännande av färdigheter och kompetens inom yrket. Utfärdas av Sveriges hantverksråd i samråd med aktuell branschorganisation.
broader: Yrkesbevis/examen
related: mPzg 93F QEv

Utveckling av statistiska metoder
type: Concept
in scheme: JobTech Taxonomy - Färdighet
definition: Utveckling av statistiska metoder
broader: zmYu aAM TuF
related: jv1x tpK 32p
related: ZA1N Z2B nFQ
related: 4Jty HpK a3Q

Test av prestanda och säkerhet
type: Concept
in scheme: JobTech Taxonomy - Färdighet
definition: Test av prestanda och säkerhet
broader: zmYu aAM TuF
related: K8yg U4C gkY
related: nDaB vdy eAy
related: 33Nt DSs YYA
related: SPYW 7Z1 ShT
related: PRQn 9yw NJA

Mästarbrev, båtbyggare
type: Concept
in scheme: JobTech Taxonomy - Färdighet
definition: Mästarbrev, båtbyggare
broader: Yrkesbevis/examen
related: 1Nwn GYH wkH

TV-sändning
type: Concept
in scheme: JobTech Taxonomy - Färdighet
definition: TV-sändning
broader: zmYu aAM TuF
related: 4BsK q2C sCL
related: xuSE mtB Mir
related: CkRH 4Qn iX3
related: PH2M uV4 r72
related: 4Jty HpK a3Q

Stilanalys
type: Concept
in scheme: JobTech Taxonomy - Färdighet
definition: Stilanalys avser bedömning och utvärdering av stil, färger och former i relation till individers personliga uttryck och behov. Kompetensen innefattar kunskap om hur val av kläder, smink och övriga skönhetsprodukter kan anpassas för att förstärka en individs stil och självkänsla.
broader: zmYu aAM TuF
related: ezKk kss CiQ

Säkert arbetssätt
type: Concept
in scheme: JobTech Taxonomy - Färdighet
definition: Säkert arbetssätt
broader: zmYu aAM TuF
related: Lzpv ofL 3H5
related: dKUb KBP mw3
related: bZ4J riZ zK6
related: V79C DD2 3Gj
related: 3g5x Tm7 8QH
related: MW1P GNJ 4F9
related: QKvX v7r PNL
related: df9D e6y 61z
related: VKKg e4t t46
related: 7zKm 4NW eey
related: Y4j1 P17 wVA
related: q2Ge zrQ zJb
related: SgAJ DW2 FN5
related: 9mJN VwW Xjg
related: XYzP 5Tn 7Ep
related: 4BsK q2C sCL
related: 9DdK AZY ZNK
related: 7Zqy hSM Fig
related: fLKb bJ3 69p
related: fWrt sLg koW
related: 3UzE P8A 9sS
related: a75S eLg JWH
related: NnB3 eWH auo
related: L4hA SJP SFi
related: yyF7 jsW EeP
related: bXfo 4hb SXx

Redovisningssystem, erfarenhet
type: Concept
in scheme: JobTech Taxonomy - Färdighet
definition: Redovisningssystem, erfarenhet avser både kunskap om och praktisk tillämpning av olika redovisningssystem för att hantera och registrera ekonomiska transaktioner. Denna kompetens omfattar förmåga att arbeta med programvaror och metoder för att effektivt sammanställa och rapportera finansiell information.
broader: zmYu aAM TuF
related: q81z 3oD 1qu

Polymerteknik
type: Concept
in scheme: JobTech Taxonomy - Färdighet
definition: Polymerteknik
broader: zmYu aAM TuF
related: v9nU 6Fw 4Qg
related: mp2Y vyC RFV
related: K8yg U4C gkY
related: PRQn 9yw NJA
related: bExu 8gk azk

Tonsättning
type: Concept
in scheme: JobTech Taxonomy - Färdighet
definition: Tonsättning
broader: zmYu aAM TuF
related: AWJF wqZ va9

Företagsrekonstruktioner
type: Concept
in scheme: JobTech Taxonomy - Färdighet
definition: Företagsrekonstruktioner
broader: zmYu aAM TuF
related: Y6yY SuR hVh
related: Bbkh nrm 2J8
related: Uw4n UB2 RCW
related: q81z 3oD 1qu
related: pTr9 RBT 9ur
related: mZsb A1K Gec
related: cRmd 536 pT1

Godkänd Finansanalytiker GFA
type: Concept
in scheme: JobTech Taxonomy - Färdighet
definition: Godkänd Finansanalytiker GFA
broader: Yrkesbevis/examen
related: Bbkh nrm 2J8
related: pTr9 RBT 9ur

Tillverkningsindustri-UG NX
type: Concept
in scheme: JobTech Taxonomy - Färdighet
definition: Tillverkningsindustri-UG NX
broader: mTLu uo2 gq2
related: mis4 feV uex
related: xm5G vGn iyk
related: mp2Y vyC RFV
related: 3jEy yuT aVo
related: rwpH 6RA XTT
related: K8yg U4C gkY
related: PRQn 9yw NJA
related: 4Jty HpK a3Q

Latinamerikansk dans
type: Concept
in scheme: JobTech Taxonomy - Färdighet
definition: Latinamerikansk dans
broader: Dans
related: gmRr 7tt eHj

VVS systemuppbyggnad
type: Concept
in scheme: JobTech Taxonomy - Färdighet
definition: VVS systemuppbyggnad
broader: zmYu aAM TuF
related: fLKb bJ3 69p
related: 3UzE P8A 9sS

Livsmedelsanalys
type: Concept
in scheme: JobTech Taxonomy - Färdighet
definition: Livsmedelsanalys
broader: zmYu aAM TuF
related: yXbD NTH ijE
related: bExu 8gk azk

Barn- och ungdomspedagogisk examen inriktning förskollärare
type: Concept
in scheme: JobTech Taxonomy - Färdighet
definition: Barn- och ungdomspedagogisk examen inriktning förskollärare
broader: Yrkesbevis/examen
related: 5ek3 Cgq WeZ

Friidrott, instruktör/Friidrott, tränare
type: Concept
in scheme: JobTech Taxonomy - Färdighet
definition: Friidrott, instruktör/Friidrott, tränare
alternative label: Friidrott, instruktör
alternative label: Friidrott, tränare
broader: Idrott/aktivitet
related: EA6o N1N QtT

Utskärning, skinn och läder
type: Concept
in scheme: JobTech Taxonomy - Färdighet
definition: Utskärning, skinn och läder avser processen att skära och bearbeta skinn och lädermaterial för vidare användning inom olika tillverkningar. Denna kompetens inkluderar kunskaper om skärtekniker, hantering av maskiner och arbetsmetoder för att bereda och forma skinn och läderprodukter.
broader: zmYu aAM TuF
related: mwVN oEH g9k
related: skLS kpa Ui1
related: vJQk YvC XB7

LTSPICE, simuleringsverktyg
type: Concept
in scheme: JobTech Taxonomy - Färdighet
definition: LTSPICE, simuleringsverktyg
alternative label: LTSPICE
broader: zmYu aAM TuF
related: K8yg U4C gkY
related: nDaB vdy eAy
related: SPYW 7Z1 ShT
related: PRQn 9yw NJA

Mästarbrev, glasmästare
type: Concept
in scheme: JobTech Taxonomy - Färdighet
definition: Mästarbrev, glasmästare
broader: Yrkesbevis/examen
related: J17g Q2a 2u1

Konsekutivtolkning
type: Concept
in scheme: JobTech Taxonomy - Färdighet
definition: Konsekutivtolkning
broader: zmYu aAM TuF
related: PQDm Z63 zst

EIGRP, routingprotokoll
type: Concept
in scheme: JobTech Taxonomy - Färdighet
definition: EIGRP, routingprotokoll
broader: Routingprotokoll
related: nDaB vdy eAy
related: VCpu 5EN bBt
related: fWrt sLg koW
related: 4Jty HpK a3Q

Keyboard, undervisning musikskola
type: Concept
in scheme: JobTech Taxonomy - Färdighet
definition: Keyboard, undervisning musikskola
broader: zmYu aAM TuF
related: mcRJ kq2 jFr

Microsoft Expression Web, programmeringsverktyg
type: Concept
in scheme: JobTech Taxonomy - Färdighet
definition: Microsoft Expression Web, programmeringsverktyg
alternative label: Microsoft Expression Web
broader: Programmerings- och systemutvecklingsverktyg
related: D9SL mtn vGM
related: DJh5 yyF hEM
related: 4Jty HpK a3Q
related: MYAz x9m 2LJ

Flyttstädning
type: Concept
in scheme: JobTech Taxonomy - Färdighet
definition: Flyttstädning
broader: zmYu aAM TuF
related: Z6TY xDf Yup

Datajournalistik
type: Concept
in scheme: JobTech Taxonomy - Färdighet
definition: Datajournalistik
broader: zmYu aAM TuF
related: SgNH hag n9D
related: 4Jty HpK a3Q

Schablontillverkning
type: Concept
in scheme: JobTech Taxonomy - Färdighet
definition: Schablontillverkning
broader: zmYu aAM TuF
related: XeJB bkn mRn

Medical first aid
type: Concept
in scheme: JobTech Taxonomy - Färdighet
definition: Medical first aid
broader: s48H Sft DTn
related: BStc SJh DKG
related: Rsoy sS6 6c4
related: kZwz D8K bKs
related: CbQK 7th Tyf
related: Z6TY xDf Yup
related: UjoW meY Zwt
related: KttZ Skc bMR
related: kDnq Q98 sD3
related: a75S eLg JWH
related: XGyi i4B ME7
related: h324 DPT 7Tw

Trycksaksframställning
type: Concept
in scheme: JobTech Taxonomy - Färdighet
definition: Trycksaksframställning
broader: zmYu aAM TuF
related: SgNH hag n9D
related: k1Nx auG sNh

Byggledning
type: Concept
in scheme: JobTech Taxonomy - Färdighet
definition: Byggledning avser kompetensen att leda och samordna byggprojekt, där fokus ligger på att säkerställa att arbete utförs enligt gällande ritningar, anvisningar och säkerhetsföreskrifter. Kompetensen innebär även ansvar för planering, resursallokering och uppföljning av arbetets framdrift samt samarbete med olika aktörer i byggprocessen, inklusive underentreprenörer.
broader: zmYu aAM TuF
related: thZP oR7 WrY
related: w6ud quG dgh
related: XeBP nMe pXx

DP Advanced course
type: Concept
in scheme: JobTech Taxonomy - Färdighet
definition: DP Advanced course
broader: s48H Sft DTn
related: kZwz D8K bKs
related: kDnq Q98 sD3

Diplomerad medicinsk fotterapeut
type: Concept
in scheme: JobTech Taxonomy - Färdighet
definition: Diplomerad medicinsk fotterapeut
broader: s48H Sft DTn
related: HATH AfN RRz

XyWrite
type: Concept
in scheme: JobTech Taxonomy - Färdighet
definition: XyWrite
broader: Allmänna datakunskaper
related: eQ4M CNm ozj
related: Y6yY SuR hVh
related: Uw4n UB2 RCW
related: fdLf oPp wVw
related: vPP6 rsw dck
related: iWcY mko rq2
related: ZQTR hVC QhJ
related: br6a VVS V3y
related: 1CX5 mZw Vcq
related: L7eh ihX vM5
related: MGk3 LvL AU2
related: jJF3 qaQ Zsh
related: oEmP NC1 sXE
related: bjqk F3A 5Hk
related: H2Zj eL9 x28
related: dJXy Rpq a2u
related: pwRH MT1 8nR
related: cRmd 536 pT1
related: zKvJ GnC Szx
related: n6iX f2z XfE
related: DZVN v5g Fco
related: ij8k EwC zyB
related: JfYV ZGg 6rm
related: vCAb uuo ek5
related: 4Jty HpK a3Q
related: p16X 44f rwZ
related: pok1 ipJ yzD

Idrottspsykologi
type: Concept
in scheme: JobTech Taxonomy - Färdighet
definition: Idrottspsykologi
broader: zmYu aAM TuF
related: VYeq GDF a2g

Högspänningsteknik
type: Concept
in scheme: JobTech Taxonomy - Färdighet
definition: Högspänningsteknik
broader: zmYu aAM TuF
related: nDaB vdy eAy
related: SPYW 7Z1 ShT

Säkerhetsutbildning för yrkesfiskare
type: Concept
in scheme: JobTech Taxonomy - Färdighet
definition: Säkerhetsutbildning för yrkesfiskare
broader: s48H Sft DTn
related: Lm3Z gek GYc

RAD, systemutvecklingsmetod
type: Concept
in scheme: JobTech Taxonomy - Färdighet
definition: RAD, systemutvecklingsmetod
alternative label: RAD
broader: Programmerings- och systemutvecklingsverktyg
related: DJh5 yyF hEM
related: 4Jty HpK a3Q

Doktorsexamen, statsvetenskap
type: Concept
in scheme: JobTech Taxonomy - Färdighet
definition: Doktorsexamen, statsvetenskap
broader: Yrkesbevis/examen
related: Gm5j S2Y aTB
related: cYCo PxY zQd

Underhåll inom fjärrvärmenät och fjärrkylenät
type: Concept
in scheme: JobTech Taxonomy - Färdighet
definition: Kompetensen avser förebyggande underhåll, avhjälpande underhåll, läcksökning, teknisk kontroll, ventilhantering och sektionering. Förebyggande underhåll innefattar att rondera, inspektera och serva nätets komponenter som ventiler, pumpar, mätare. Avhjälpande underhåll avser att snabbt lokalisera och reparera läckor, trasiga komponenter eller fel i kundanläggningar (värmecentraler). Läcksökning och teknisk kontroll avser att använda mätutrustning och visuell inspektion i brunnar för att upptäcka tryckfall, temperaturavvikelser eller onormalt vattenflöde. Ventilhantering och sektionering avser kunskap om hur man manövrerar och underhåller både manuella och automatiserade avstängningsventiler.
broader: zmYu aAM TuF
related: yXbD NTH ijE
related: 3UzE P8A 9sS

Brottsplatsfotografering
type: Concept
in scheme: JobTech Taxonomy - Färdighet
definition: Brottsplatsfotografering
broader: zmYu aAM TuF
related: 3J38 DNz YKK

IT strategy
type: Concept
in scheme: JobTech Taxonomy - Färdighet
definition: IT strategy
broader: zmYu aAM TuF
related: BAeH eg8 T2d
related: 4Jty HpK a3Q

Onkologisk vård, specialistområde för sjuksköterska
type: Concept
in scheme: JobTech Taxonomy - Färdighet
definition: En fördjupad specialistkompetens för sjuksköterska inom onkologisk vård.
broader: Specialistområde för sjuksköterska
related: 6zAR EHM Kwj

Betonghåltagning
type: Concept
in scheme: JobTech Taxonomy - Färdighet
definition: Betonghåltagning
broader: zmYu aAM TuF
related: bZ4J riZ zK6
related: q2Ge zrQ zJb
related: AD3U cFH rbe

Sjukvård, specialisering för officer
type: Concept
in scheme: JobTech Taxonomy - Färdighet
definition: Sjukvård, specialisering för officer
broader: zmYu aAM TuF
related: dhgR 9jk 95r
related: KiVA anS RJh

Verksamhetsledning, branschorganisation
type: Concept
in scheme: JobTech Taxonomy - Färdighet
definition: Verksamhetsledning, branschorganisation
broader: zmYu aAM TuF
related: ajwx FvL YuY

Grundläggande Naturvärdesbedömning
type: Concept
in scheme: JobTech Taxonomy - Färdighet
definition: Grundläggande Naturvärdesbedömning
broader: Yrkesbevis/examen
related: qouP wtb 93q
related: KwVo sQu G2e
related: 1EBv UzM ozQ

Utlandstrafik, planering
type: Concept
in scheme: JobTech Taxonomy - Färdighet
definition: Utlandstrafik, planering
broader: zmYu aAM TuF
related: 957L kZK rHZ

Mission
type: Concept
in scheme: JobTech Taxonomy - Färdighet
definition: Mission
broader: zmYu aAM TuF
related: x9mo 1VH Rps
related: 2L2s EU8 PzR
related: x5rn vga gRK

Psykoterapi
type: Concept
in scheme: JobTech Taxonomy - Färdighet
definition: Psykoterapi
broader: zmYu aAM TuF
related: bEDv SL7 VrL
related: 6eAB cbY i9T
related: Z8ci bBE tmx

Svets Grön, certifikat
type: Concept
in scheme: JobTech Taxonomy - Färdighet
definition: Kälsvetsning av plåt och rör. Källa: Svetskommissionen
broader: Svets-/lödarmetoder med verifierad kunskap
related: vaEp iBS c5h
related: wQ1E Bzk ZyA

FDT, redovisningssystem
type: Concept
in scheme: JobTech Taxonomy - Färdighet
definition: FDT, redovisningssystem
alternative label: FDT
broader: xSJR 1Kq pxB
related: eQ4M CNm ozj
related: q81z 3oD 1qu
related: ij8k EwC zyB
related: 4Jty HpK a3Q

Frilansuppdrag
type: Concept
in scheme: JobTech Taxonomy - Färdighet
definition: Frilansuppdrag
broader: zmYu aAM TuF
related: iBUL s38 izZ
related: ezKk kss CiQ
related: 8Bmh vtM zts
related: AWJF wqZ va9
related: 34Tn BQQ tfo
related: PQDm Z63 zst
related: 4BsK q2C sCL
related: zfve s6G tpc
related: xuSE mtB Mir
related: ETAR ggZ Wuw
related: F19Z oB6 pg3
related: 41KB bfk 5jR
related: CkRH 4Qn iX3
related: 3J38 DNz YKK
related: PH2M uV4 r72
related: Mbt6 3ko DiD
related: gmRr 7tt eHj
related: uxHV KXc PKD
related: CSUf ZVM a7Z

Projektledning, IT
type: Concept
in scheme: JobTech Taxonomy - Färdighet
definition: Projektledning, IT avser processer och metoder för att planera, utföra och övervaka IT-relaterade projekt. Kompetensen innefattar kunskap om projektstyrning, resurshantering och riskanalys inom ramen för tekniska och organisatoriska krav.
broader: zmYu aAM TuF
related: cBBa ngH fCx
related: DJh5 yyF hEM
related: rYSG 3WJ LmC
related: UxT1 tPF Kbg
related: 4Jty HpK a3Q
related: UXKZ 3zZ ipB

Green Supply Chain Management
type: Concept
in scheme: JobTech Taxonomy - Färdighet
definition: Green Supply Chain Management
alternative label: GrSCM
alternative label: Sustainable Supply Chain Management
broader: zmYu aAM TuF
related: xm5G vGn iyk
related: 33Nt DSs YYA
related: yXbD NTH ijE
related: AuTi FEo j3R
related: nNxJ YWy vR2
related: 957L kZK rHZ

Regi, TV
type: Concept
in scheme: JobTech Taxonomy - Färdighet
definition: Regi av Tv-produktioner.
broader: zmYu aAM TuF
related: rYSG 3WJ LmC

Maskinkunskap, handmaskiner
type: Concept
in scheme: JobTech Taxonomy - Färdighet
definition: Maskinkunskap, handmaskiner avser förståelse och praktisk färdighet i att hantera och använda handdrivna maskiner och verktyg i olika arbetsmiljöer. Kompetensen inkluderar kunskap om maskinens konstruktion, funktion och underhåll, samt säkerhetsåtgärder vid användning.
broader: zmYu aAM TuF
related: VKKg e4t t46
related: 9mJN VwW Xjg
related: 1Nwn GYH wkH
related: ieVp d5L rS9
related: L4hA SJP SFi
related: 4bxV 58E P9N

Kvalitetssystem
type: Concept
in scheme: JobTech Taxonomy - Färdighet
top concept of: JobTech Taxonomy - Färdighet
definition: Kvalitetssystem
narrower: tg8L maz wMN
narrower: HACCP
narrower: cGXP
narrower: Ledningssystem (ISO 9000-serien)
narrower: GXP (t.ex. GMP, GCP, GLP)
narrower: Miljöledning (ISO 14000-serien)
narrower: EMAS (miljösystem)

Psykiatrisk slutenvård
type: Concept
in scheme: JobTech Taxonomy - Färdighet
definition: Psykiatrisk slutenvård
broader: zmYu aAM TuF
related: bEDv SL7 VrL

Koreografi, fridans
type: Concept
in scheme: JobTech Taxonomy - Färdighet
definition: Koreografi, fridans
broader: zmYu aAM TuF
related: gmRr 7tt eHj

Digital elektronik
type: Concept
in scheme: JobTech Taxonomy - Färdighet
definition: Digital elektronik
broader: Elektronikkompetenser
related: e6nk AGp y28
related: nDaB vdy eAy
related: SPYW 7Z1 ShT
related: fWrt sLg koW
related: 4Jty HpK a3Q

Gesällbrev, urmakare
type: Concept
in scheme: JobTech Taxonomy - Färdighet
definition: Gesällbrev, urmakare är ett bevis på att en hantverkare har genomgått utbildning och avlagt de delprov som krävs inom det specifika hantverksyrket, och därigenom uppnått ett erkännande av färdigheter och kompetens inom yrket. Utfärdas av Sveriges hantverksråd i samråd med aktuell branschorganisation.
broader: Yrkesbevis/examen
related: e6nk AGp y28

Klinisk prövning
type: Concept
in scheme: JobTech Taxonomy - Färdighet
definition: Klinisk prövning
broader: zmYu aAM TuF
related: Z2MZ eYc Lfv
related: nu7c QuB KVQ
related: ek9W qqp XpF
related: seu9 VoQ VNo
related: dsK3 hkt zGy
related: e9FK VKh ahW
related: 4Jty HpK a3Q
related: gXqW s5Q ZjN

Nutrition
type: Concept
in scheme: JobTech Taxonomy - Färdighet
definition: Nutrition
broader: zmYu aAM TuF
related: Z2MZ eYc Lfv
related: Pq5C SPC bRA

Trägolv
type: Concept
in scheme: JobTech Taxonomy - Färdighet
definition: Trägolv
broader: zmYu aAM TuF
related: V79C DD2 3Gj

Produktionsteknik
type: Concept
in scheme: JobTech Taxonomy - Färdighet
definition: Produktionsteknik
broader: zmYu aAM TuF
related: ENV6 BNa brP
related: hxm6 xkr dHm
related: 3jEy yuT aVo
related: rwpH 6RA XTT
related: rxmK wwM 1NA
related: Vfum e6B 7Bw
related: VKKg e4t t46
related: thZP oR7 WrY
related: vaEp iBS c5h
related: K8yg U4C gkY
related: nDaB vdy eAy
related: 33Nt DSs YYA
related: yPQ4 EaN Dtj
related: iZLB KpD LLo
related: SPYW 7Z1 ShT
related: XeBP nMe pXx
related: PRQn 9yw NJA

Servoteknik
type: Concept
in scheme: JobTech Taxonomy - Färdighet
definition: Servoteknik
broader: zmYu aAM TuF
related: K8yg U4C gkY
related: nDaB vdy eAy
related: SPYW 7Z1 ShT
related: PRQn 9yw NJA
related: 4Jty HpK a3Q

3D-grafik-Autodesk Alias
type: Concept
in scheme: JobTech Taxonomy - Färdighet
definition: 3D-grafik-Autodesk Alias
broader: Programvara för digitalt skapande
related: 8Bmh vtM zts
related: 34Tn BQQ tfo
related: Q5DF juj 8do
related: 4Jty HpK a3Q
related: LeQV umf wUS
related: Mbt6 3ko DiD

Vintestning, kemisk analys
type: Concept
in scheme: JobTech Taxonomy - Färdighet
definition: Vintestning, kemisk analys
broader: zmYu aAM TuF
related: dAu7 VyL hsy

Reningsutrustning, kontroll
type: Concept
in scheme: JobTech Taxonomy - Färdighet
definition: Reningsutrustning, kontroll
broader: zmYu aAM TuF
related: df9D e6y 61z
related: yXbD NTH ijE

Legitimation som veterinär
type: Concept
in scheme: JobTech Taxonomy - Färdighet
definition: Legitimation som krävs för att kunna arbeta som veterinär i Sverige. Utfärdas av Jorbruksverket.
broader: Yrkesbevis/examen
related: yXbD NTH ijE
related: 4P8B LtK JgE
related: r1Gk 3EN bpw
related: WL4E r4b ek4

Klarinett, undervisning musikskola
type: Concept
in scheme: JobTech Taxonomy - Färdighet
definition: Klarinett, undervisning musikskola
broader: zmYu aAM TuF
related: mcRJ kq2 jFr

Flygledarassistentutbildning
type: Concept
in scheme: JobTech Taxonomy - Färdighet
definition: Flygledarassistentutbildning
broader: zmYu aAM TuF
related: yct8 Pun DWd
related: 4Jty HpK a3Q

Läkemedelsformulering
type: Concept
in scheme: JobTech Taxonomy - Färdighet
definition: Läkemedelsformulering
broader: zmYu aAM TuF
related: dsK3 hkt zGy
related: TMsM oNw j6z

Hälsopsykologi
type: Concept
in scheme: JobTech Taxonomy - Färdighet
definition: Hälsopsykologi
broader: zmYu aAM TuF
related: VYeq GDF a2g

Teletransmission
type: Concept
in scheme: JobTech Taxonomy - Färdighet
definition: Teletransmission
broader: zmYu aAM TuF
related: nDaB vdy eAy
related: 4Jty HpK a3Q

Tågvärdsutbildning
type: Concept
in scheme: JobTech Taxonomy - Färdighet
definition: Tågvärdsutbildning är en yrkesutbildning med inriktning till tågvärd.
broader: Yrkesbevis/examen
related: s78G Zp2 dkq

MAG/MIG-svetsning
type: Concept
in scheme: JobTech Taxonomy - Färdighet
definition: MAG/MIG, rörelektrod och gasmetallbågsvetsning. Källa: Svetskommissionen
alternative label: MAG-svetsning
alternative label: MIG-svetsning
broader: on11 B1f LEw
related: DPPw 4wa AsH
related: wQ1E Bzk ZyA
related: TrwQ RXT W8a
related: q8Ho 3Xw sHq
related: L4hA SJP SFi
related: bXfo 4hb SXx

Garnfärgning
type: Concept
in scheme: JobTech Taxonomy - Färdighet
definition: Garnfärgning
broader: zmYu aAM TuF
related: 4DET dLf iB9

Motorman (behörighet)
type: Concept
in scheme: JobTech Taxonomy - Färdighet
definition: Motorman (behörighet)
broader: Behörigheter, sjöfart
related: KttZ Skc bMR

Hudson, byggverktyg
type: Concept
in scheme: JobTech Taxonomy - Färdighet
definition: Hudson, byggverktyg
alternative label: Hudson
broader: Programmerings- och systemutvecklingsverktyg
related: D9SL mtn vGM
related: DJh5 yyF hEM
related: 4Jty HpK a3Q
related: MYAz x9m 2LJ

Hörselrubbningar, specialistkompetens för läkare
type: Concept
in scheme: JobTech Taxonomy - Färdighet
definition: Hörselrubbningar, specialistkompetens för läkare
broader: Specialistbevis för läkare
related: nu7c QuB KVQ

Djurslagsspecialisering, häst
type: Concept
in scheme: JobTech Taxonomy - Färdighet
definition: Djurslagsspecialisering, häst
broader: zmYu aAM TuF
related: WL4E r4b ek4

Produktionsplanering, kultur
type: Concept
in scheme: JobTech Taxonomy - Färdighet
definition: Produktionsplanering, kultur
broader: zmYu aAM TuF
related: rYSG 3WJ LmC
related: PH2M uV4 r72
related: 4Jty HpK a3Q

Butiksvana, dagligvaror
type: Concept
in scheme: JobTech Taxonomy - Färdighet
definition: Butiksvana, dagligvaror, avser förmåga och erfarenhet inom detaljhandeln med livsmedel och andra dagligvaror. Kompetensen innebär kunskaper om varuhantering, kundservice och arbetsrutiner i butiksverksamhet för att effektivt bemöta kundernas behov och säkerställa en smidig försäljningsprocess.
broader: zmYu aAM TuF
related: JnTF wXr 6Eh
related: Fp7x Yqt bx9
related: dUuh wwa FGj
related: s1Qk o98 2o1

GXP (t.ex. GMP, GCP, GLP)
type: Concept
in scheme: JobTech Taxonomy - Färdighet
definition: GXP (Good Practice) omfattar olika standarder och riktlinjer, exempelvis GMP (Good Manufacturing Practice), GCP (Good Clinical Practice) och GLP (Good Laboratory Practice), som tillämpas inom läkemedels- och livsmedelsindustrin för att säkerställa att produkter produceras och kontrolleras enligt högsta kvalitetsstandarder. Dessa riktlinjer syftar till att minimera risker och säkerställa att produkter är säkra och effektiva för konsumenter och patienter.
broader: Kvalitetssystem
related: mis4 feV uex
related: v9nU 6Fw 4Qg
related: Qo7p wjf gtv
related: Z2MZ eYc Lfv
related: qn2U dB9 Cmh
related: rwpH 6RA XTT
related: rxmK wwM 1NA
related: Vfum e6B 7Bw
related: K8yg U4C gkY
related: nDaB vdy eAy
related: 33Nt DSs YYA
related: SPYW 7Z1 ShT
related: XeBP nMe pXx
related: dMVD VYy kgg
related: PRQn 9yw NJA
related: QEBd qHu vGr
related: bExu 8gk azk

Depåförarbevis inom SL
type: Concept
in scheme: JobTech Taxonomy - Färdighet
definition: Depåförarbevis inom SL
broader: Yrkesbevis/examen
related: nk6Z 5oD QoM

Armering
type: Concept
in scheme: JobTech Taxonomy - Färdighet
definition: Armering avser processen att förstärka betongkonstruktioner genom insättning av stålstänger eller nät, vilket syftar till att öka hållfastheten och deformationstoleransen hos betongen. Kompetensen omfattar arbete med olika material och tekniker för att säkerställa att betongstrukturer uppfyller specificerade bärighetskrav.
broader: zmYu aAM TuF
related: bZ4J riZ zK6
related: q2Ge zrQ zJb
related: 9mJN VwW Xjg
related: o31g CX1 qhQ
related: AD3U cFH rbe

Mudderverk
type: Concept
in scheme: JobTech Taxonomy - Färdighet
definition: Mudderverk
broader: zmYu aAM TuF
related: 3ZtN hhA SM7

Elsystem, flyg
type: Concept
in scheme: JobTech Taxonomy - Färdighet
definition: Elsystem, flyg
broader: zmYu aAM TuF
related: iGTu bYL 2T7
related: eRkT cTv H9v

Certifikat, heta arbeten
type: Concept
in scheme: JobTech Taxonomy - Färdighet
definition: Certifikat, heta arbeten ger behörighet att utföra brandfarliga heta arbeten på en tillfällig arbetsplats. Certifikatet utfärdas av Brandskyddsföreningen
broader: s48H Sft DTn
related: Lzpv ofL 3H5
related: DPPw 4wa AsH
related: sX9n CWa KVC
related: dKUb KBP mw3
related: m8TS hdk pSf
related: 3ZtN hhA SM7
related: bZ4J riZ zK6
related: LEvM 7Hs w8i
related: V79C DD2 3Gj
related: J17g Q2a 2u1
related: 3g5x Tm7 8QH
related: QKvX v7r PNL
related: 7zKm 4NW eey
related: e6nk AGp y28
related: idjo 2Wr a3E
related: kZwz D8K bKs
related: KwVo sQu G2e
related: CbQK 7th Tyf
related: Y4j1 P17 wVA
related: q2Ge zrQ zJb
related: SgAJ DW2 FN5
related: 9mJN VwW Xjg
related: ayQ4 G3W A2w
related: XYzP 5Tn 7Ep
related: SUfj 4D9 FNx
related: wQ1E Bzk ZyA
related: o31g CX1 qhQ
related: 1Nwn GYH wkH
related: E87t egE pjA
related: AD3U cFH rbe
related: f71c gjL RDq
related: fLKb bJ3 69p
related: TrwQ RXT W8a
related: fWrt sLg koW
related: KttZ Skc bMR
related: 3UzE P8A 9sS
related: vCBT Pnd 8UB
related: kDnq Q98 sD3
related: a75S eLg JWH
related: NnB3 eWH auo
related: iHrC aRv fVm
related: UcNa inr snV
related: cGxX R9c kW1
related: q8Ho 3Xw sHq
related: L4hA SJP SFi
related: yyF7 jsW EeP
related: bXfo 4hb SXx

Skadebesiktning
type: Concept
in scheme: JobTech Taxonomy - Färdighet
definition: Skadebesiktning avser att systematiskt utreda och dokumentera skador av försäkrad egendom. Besiktning innehåller bland annat inspektion, mätning och intervjuer för att fastställa omfattning och orsak till skada. Resultat dokumentaras i form av rapporter som används som beslutsunderlag inom försäkringsäranden.
broader: zmYu aAM TuF
related: Ru4W zn2 LEz

Yrkesbevis, murare
type: Concept
in scheme: JobTech Taxonomy - Färdighet
definition: Yrkesbevis, murare
broader: Yrkesbevis/examen
related: NnB3 eWH auo

Kratsning
type: Concept
in scheme: JobTech Taxonomy - Färdighet
definition: Kratsning
broader: zmYu aAM TuF
related: ENV6 BNa brP

Prospektering (malmletning)
type: Concept
in scheme: JobTech Taxonomy - Färdighet
definition: Prospektering (malmletning)
broader: zmYu aAM TuF
related: V7Yz 4WV g4z

Utredningsvana
type: Concept
in scheme: JobTech Taxonomy - Färdighet
definition: Utredningsvana avser kompetensen att systematiskt samla in, analysera och bearbeta information för att utreda specifika frågor eller situationer. Kompetensen innefattar användning av olika metoder och verktyg för att säkerställa korrekta och objektiva resultat i utredningar.
broader: zmYu aAM TuF
related: Y6yY SuR hVh
related: q8wL kdi WaW
related: 4W6S 1kA nrv
related: Uw4n UB2 RCW
related: vPP6 rsw dck
related: Ru4W zn2 LEz
related: br6a VVS V3y
related: puim 6PY DGj
related: JAFv ZaP tDG
related: dJXy Rpq a2u
related: cRmd 536 pT1
related: 6aak 8eh iwT
related: n6iX f2z XfE
related: DZVN v5g Fco
related: JfYV ZGg 6rm
related: ZQiZ 6Kd D3a
related: wzeq No2 LF1
related: vCAb uuo ek5
related: 9dLz BCK oDA
related: WZCM nfS eAk
related: pok1 ipJ yzD

Ikonmålning
type: Concept
in scheme: JobTech Taxonomy - Färdighet
definition: Ikonmålning
broader: zmYu aAM TuF
related: 34Tn BQQ tfo

Inköp inom bygg
type: Concept
in scheme: JobTech Taxonomy - Färdighet
definition: Inköp inom bygg
broader: zmYu aAM TuF
related: thZP oR7 WrY
related: w6ud quG dgh
related: XeBP nMe pXx

Videoredigering
type: Concept
in scheme: JobTech Taxonomy - Färdighet
definition: Videoredigering
broader: zmYu aAM TuF
related: 4BsK q2C sCL
related: rYSG 3WJ LmC
related: 4Jty HpK a3Q

Banjo, undervisning musikskola
type: Concept
in scheme: JobTech Taxonomy - Färdighet
definition: Banjo, undervisning musikskola
broader: zmYu aAM TuF
related: mcRJ kq2 jFr

Yrkesutbildning, hovslagare
type: Concept
in scheme: JobTech Taxonomy - Färdighet
definition: Yrkesutbildning, hovslagare är en yrkeshögskoleutbildning med inriktning till hovslagare.
broader: Yrkesutbildning
related: KYmy iqC xiQ

Klinisk immunologi, specialistkompetens för läkare
type: Concept
in scheme: JobTech Taxonomy - Färdighet
definition: Klinisk immunologi, specialistkompetens för läkare
broader: Specialistbevis för läkare
related: nu7c QuB KVQ

Rational RequisitePro, systemutvecklingsverktyg
type: Concept
in scheme: JobTech Taxonomy - Färdighet
definition: Rational RequisitePro, systemutvecklingsverktyg
alternative label: Rational RequisitePro
broader: Programmerings- och systemutvecklingsverktyg
related: D9SL mtn vGM
related: DJh5 yyF hEM
related: 4Jty HpK a3Q
related: MYAz x9m 2LJ

Aspirantutbildning, kustbevakningen
type: Concept
in scheme: JobTech Taxonomy - Färdighet
definition: Aspirantutbildning, kustbevakningen
broader: Yrkesbevis/examen
related: FKCE Anf zGH

Diversearbete, bygg
type: Concept
in scheme: JobTech Taxonomy - Färdighet
definition: Diversearbete, bygg
broader: zmYu aAM TuF
related: iHrC aRv fVm

Offentlighets- och sekretesslagen, erfarenhet
type: Concept
in scheme: JobTech Taxonomy - Färdighet
definition: Offentlighets- och sekretesslagen, erfarenhet
broader: zmYu aAM TuF
related: pok1 ipJ yzD

Konst, undervisning högskolenivå
type: Concept
in scheme: JobTech Taxonomy - Färdighet
definition: Konst, undervisning högskolenivå
broader: Inriktning på högskolelärarkompetens
related: Gm5j S2Y aTB
related: NNK9 F1o pK5
related: cYCo PxY zQd
related: RPBE x5M cXX
related: P7eS nP8 3dy

Databasanvändning, undervisning
type: Concept
in scheme: JobTech Taxonomy - Färdighet
definition: Databasanvändning, undervisning
broader: Dataundervisning
related: 1CX5 mZw Vcq
related: 4Jty HpK a3Q

Telecine
type: Concept
in scheme: JobTech Taxonomy - Färdighet
definition: Överföring av film till elektronisk form, exempelvis digital video.
broader: zmYu aAM TuF
related: CkRH 4Qn iX3
related: 4Jty HpK a3Q

Asylrätt/Utlänningsrätt
type: Concept
in scheme: JobTech Taxonomy - Färdighet
definition: Asylrätt/Utlänningsrätt
alternative label: Asylrätt
alternative label: Utlänningsrätt
broader: zmYu aAM TuF
related: q8wL kdi WaW
related: vPP6 rsw dck
related: br6a VVS V3y
related: 6aak 8eh iwT
related: JfYV ZGg 6rm

Taktil massage
type: Concept
in scheme: JobTech Taxonomy - Färdighet
definition: Taktil massage
broader: zmYu aAM TuF
related: uxHV KXc PKD

Blinda, funktionshindersfrågor
type: Concept
in scheme: JobTech Taxonomy - Färdighet
definition: Blinda, funktionshindersfrågor
broader: zmYu aAM TuF
related: vPP6 rsw dck

Intervjuvana, besöksintervjuer
type: Concept
in scheme: JobTech Taxonomy - Färdighet
definition: Intervjuvana, besöksintervjuer avser erfarenhet och skicklighet i att genomföra intervjuer i personliga möten med individer. Kompetensen omfattar förmåga att ställa relevanta frågor, lyssna aktivt samt hantera och dokumentera svar under dessa intervjuer.
broader: zmYu aAM TuF
related: eQ4M CNm ozj
related: PxXc 16t oZo
related: 83wV GJa vMd

Pressmeddelanden
type: Concept
in scheme: JobTech Taxonomy - Färdighet
definition: Pressmeddelanden
broader: zmYu aAM TuF
related: SgNH hag n9D

Riggning/Omriggning, CNC
type: Concept
in scheme: JobTech Taxonomy - Färdighet
definition: Riggning/Omriggning, CNC avser processen att ställa in och justera CNC-maskiner för att säkerställa korrekt och effektiv bearbetning av arbetsstycken i metall eller liknande material. Denna kompetens omfattar kunskap om maskinens konstruktion, programmering och de specifika verktyg och inställningar som krävs för att optimera produktionsflödet.
broader: zmYu aAM TuF
related: vaEp iBS c5h

Kreditbedömning
type: Concept
in scheme: JobTech Taxonomy - Färdighet
definition: Kreditbedömning är kompetensen att analysera företags eller privatpersoners ekonomiska situation för att bedöma kreditvärdighet och risk vid lån eller finansiering. Den inkluderar granskning av balansräkningar, nyckeltal, likviditet, lönsamhet och återbetalningsförmåga samt identifiering av varningssignaler som obestånd eller bedrägerier.
broader: zmYu aAM TuF
related: Y6yY SuR hVh
related: JAFv ZaP tDG
related: pTr9 RBT 9ur
related: mZsb A1K Gec
related: FfMN Bw1 qYR
related: 9Mn4 PNA 7Yz

Fordonsrenovering
type: Concept
in scheme: JobTech Taxonomy - Färdighet
definition: Fordonsrenovering
broader: zmYu aAM TuF
related: Lzpv ofL 3H5

Skinn/Textilier
type: Concept
in scheme: JobTech Taxonomy - Färdighet
definition: Skinn/Textilier
alternative label: Skinn
alternative label: Textilier
broader: zmYu aAM TuF
related: oXSW fbY XrY
related: 34Tn BQQ tfo
related: YKL2 FCB 1yr
related: 85cq 6uK 4cK

Sprängkort
type: Concept
in scheme: JobTech Taxonomy - Färdighet
definition: Sprängkort
broader: s48H Sft DTn
related: sX9n CWa KVC
related: MW1P GNJ 4F9
related: 9mJN VwW Xjg
related: f71c gjL RDq

E-post, sårbarhetsanalys
type: Concept
in scheme: JobTech Taxonomy - Färdighet
definition: E-post, sårbarhetsanalys
broader: zmYu aAM TuF
related: BAeH eg8 T2d
related: 4Jty HpK a3Q

Elektrolytiska processer
type: Concept
in scheme: JobTech Taxonomy - Färdighet
definition: Elektrolytiska processer
broader: zmYu aAM TuF
related: YiQw N87 zLU

Dietistexamen
type: Concept
in scheme: JobTech Taxonomy - Färdighet
definition: Dietistexamenär en yrkesexamen på högskolenivå kopplad till utbildning med inriktning mot dietist. Källa: UHR (Universitets- och högskolerådet)
broader: Yrkesbevis/examen
related: Pq5C SPC bRA

Microsoft Certified Professional + Internet/MCP + I
type: Concept
in scheme: JobTech Taxonomy - Färdighet
definition: Microsoft Certified Professional + Internet/MCP + I
broader: s48H Sft DTn
related: Fv7d YhP YmS
related: hmaC cfi UKg
related: 1CX5 mZw Vcq
related: VCpu 5EN bBt
related: 13md uyV BNG

Certifierad yt- och rostskyddsmålare
type: Concept
in scheme: JobTech Taxonomy - Färdighet
definition: Certifierad yt- och rostskyddsmålare avser kompetensen att korrekt utföra skyddsbehandling av olika ytor, främst metall. Certifikatet utfärdas av Auktorisation för rostskyddsmålning.
broader: s48H Sft DTn
related: dKUb KBP mw3

Övervakning
type: Concept
in scheme: JobTech Taxonomy - Färdighet
definition: Övervakning avser en kompetens som innefattar att iaktta och kontrollera aktiviteter, beteenden eller miljöer för att säkerställa ordning och säkerhet.
broader: zmYu aAM TuF
related: hgAg gLr YGg

SAS, programmeringsspråk
type: Concept
in scheme: JobTech Taxonomy - Färdighet
definition: SAS, programmeringsspråk
broader: Datorspråk
related: jv1x tpK 32p
related: DJh5 yyF hEM
related: 4Jty HpK a3Q
related: WZCM nfS eAk

Fotoartiklar/Kameror
type: Concept
in scheme: JobTech Taxonomy - Färdighet
definition: Fotoartiklar/Kameror
alternative label: Fotoartiklar
alternative label: Kameror
broader: zmYu aAM TuF
related: oXSW fbY XrY
related: YKL2 FCB 1yr
related: 85cq 6uK 4cK

Blodprovsanalys
type: Concept
in scheme: JobTech Taxonomy - Färdighet
definition: Blodprovsanalys
broader: zmYu aAM TuF
related: wNrt Ysj WuT
related: bExu 8gk azk

Resefilmning
type: Concept
in scheme: JobTech Taxonomy - Färdighet
definition: Resefilmning
broader: zmYu aAM TuF
related: C3431
related: 3J38 DNz YKK

Judo, instruktör/Judo, tränare
type: Concept
in scheme: JobTech Taxonomy - Färdighet
definition: Judo, instruktör/Judo, tränare
alternative label: Judo, instruktör
alternative label: Judo, tränare
broader: Idrott/aktivitet
related: EA6o N1N QtT

Neuroanatomi
type: Concept
in scheme: JobTech Taxonomy - Färdighet
definition: Kunskap om nervsystemets uppbyggnad.
broader: zmYu aAM TuF
related: nu7c QuB KVQ
related: ek9W qqp XpF
related: seu9 VoQ VNo
related: gXqW s5Q ZjN
related: aWki 4uA adn

Amanda, redovisningssystem
type: Concept
in scheme: JobTech Taxonomy - Färdighet
definition: Amanda, redovisningssystem
alternative label: Amanda
broader: xSJR 1Kq pxB
related: eQ4M CNm ozj
related: q81z 3oD 1qu
related: ij8k EwC zyB
related: 4Jty HpK a3Q

Liftteknikerutbildning
type: Concept
in scheme: JobTech Taxonomy - Färdighet
definition: Liftteknikerutbildning är en yrkeshögskoleutbildning eller en eftergymnasial yrkesutbildning med inriktning till lifttekniker.
broader: s48H Sft DTn
related: XYzP 5Tn 7Ep

Grön IT
type: Concept
in scheme: JobTech Taxonomy - Färdighet
definition: Användning av IKT-system på ett miljömässigt ansvarsfullt och hållbart sätt, t.ex. införande av energieffektiva servrar och centralprocessorer, minskning av resurser och korrekt bortskaffande av e-avfall. Källa: ESCO
broader: zmYu aAM TuF
related: vPP6 rsw dck
related: rE1E m3d cx1
related: yXbD NTH ijE
related: 4Jty HpK a3Q

Boxning, instruktör/Boxning, tränare
type: Concept
in scheme: JobTech Taxonomy - Färdighet
definition: Boxning, instruktör/Boxning, tränare
alternative label: Boxning, instruktör
alternative label: Boxning, tränare
broader: Idrott/aktivitet
related: EA6o N1N QtT

Radiofysik/Strålningsfysik
type: Concept
in scheme: JobTech Taxonomy - Färdighet
definition: Radiofysik/Strålningsfysik
alternative label: Radiofysik
alternative label: Strålningsfysik
broader: zmYu aAM TuF
related: KM7d Z6Y LCJ

Gesällbrev, byggnadsplåtslagare
type: Concept
in scheme: JobTech Taxonomy - Färdighet
definition: Gesällbrev, byggnadsplåtslagare
broader: Yrkesbevis/examen
related: L4hA SJP SFi
related: bXfo 4hb SXx

Mussettdragspel
type: Concept
in scheme: JobTech Taxonomy - Färdighet
definition: Mussettdragspel
broader: wLYs CKS wK8
related: AWJF wqZ va9

Strukturkemi
type: Concept
in scheme: JobTech Taxonomy - Färdighet
definition: Strukturkemi
broader: zmYu aAM TuF
related: eofS oZs RZi

Klippverktyg, tillverkning
type: Concept
in scheme: JobTech Taxonomy - Färdighet
definition: Klippverktyg, tillverkning
broader: zmYu aAM TuF
related: MSnK 3Z8 4qA

Kardiologi, specialistkompetens för läkare
type: Concept
in scheme: JobTech Taxonomy - Färdighet
definition: Kardiologi, specialistkompetens för läkare
broader: Specialistbevis för läkare
related: nu7c QuB KVQ

Buteljsköljning
type: Concept
in scheme: JobTech Taxonomy - Färdighet
definition: Buteljsköljning
broader: zmYu aAM TuF
related: aU9p ekE Fqf

Fordonsservice, personbilar
type: Concept
in scheme: JobTech Taxonomy - Färdighet
definition: Fordonsservice, personbilar, avser kompetensen att genomföra underhåll och reparation av personbilar för att säkerställa deras funktion och säkerhet. Detta inkluderar diagnostisering av fel, utförande av service och byte av komponenter enligt tillverkarens anvisningar.
broader: zmYu aAM TuF
related: Lzpv ofL 3H5
related: dUuh wwa FGj

Systematiskt arbetsmiljöarbete/SAM
type: Concept
in scheme: JobTech Taxonomy - Färdighet
definition: Systematiskt arbetsmiljöarbete
alternative label: SAM
broader: zmYu aAM TuF
related: Uw64 cuc U3H
related: yXbD NTH ijE

Doktorsexamen, sociala ämnen
type: Concept
in scheme: JobTech Taxonomy - Färdighet
definition: Doktorsexamen, sociala ämnen
broader: Yrkesbevis/examen
related: Gm5j S2Y aTB
related: cYCo PxY zQd

Keramik, arkeologisk kunskap
type: Concept
in scheme: JobTech Taxonomy - Färdighet
definition: Keramik, arkeologisk kunskap
broader: zmYu aAM TuF
related: sXgV QFg vpb

Prästvigd
type: Concept
in scheme: JobTech Taxonomy - Färdighet
definition: Prästvigd
broader: Yrkesbevis/examen
related: x9mo 1VH Rps
related: 2L2s EU8 PzR

Handläggning, erfarenhet
type: Concept
in scheme: JobTech Taxonomy - Färdighet
definition: Handläggning, erfarenhet avser kompetens att hantera och administrera ärenden inom olika sektorer, ofta kopplat till offentliga verksamheter eller företag. Kompetensen inkluderar bland annat förmåga att planera, utreda och fatta beslut baserat på relevant information och riktlinjer.
broader: zmYu aAM TuF
related: 4W6S 1kA nrv
related: YPQ2 hTw voA
related: vPP6 rsw dck
related: oEmP NC1 sXE
related: zKvJ GnC Szx
related: ZQiZ 6Kd D3a

Fallskärmshoppning, instruktör
type: Concept
in scheme: JobTech Taxonomy - Färdighet
definition: Fallskärmshoppning, instruktör
broader: Idrott/aktivitet
related: EA6o N1N QtT

Certifierad medicinteknisk ingenjör
type: Concept
in scheme: JobTech Taxonomy - Färdighet
definition: Certifierad medicinteknisk ingenjör
broader: s48H Sft DTn
related: GC7L Yw7 Mfo

APL, programmeringsspråk
type: Concept
in scheme: JobTech Taxonomy - Färdighet
definition: APL, programmeringsspråk
alternative label: APL
broader: Datorspråk
related: BAeH eg8 T2d
related: Fv7d YhP YmS
related: D9SL mtn vGM
related: DJh5 yyF hEM
related: 4Jty HpK a3Q

Ergonomi
type: Concept
in scheme: JobTech Taxonomy - Färdighet
definition: Ergonomi
broader: zmYu aAM TuF
related: FpPP jqK xzT
related: EA6o N1N QtT
related: aA2Z 9XX R1v
related: F19Z oB6 pg3
related: uxHV KXc PKD

Opera
type: Concept
in scheme: JobTech Taxonomy - Färdighet
definition: Opera
broader: p1WM wCw LTd
related: AWJF wqZ va9
related: rYSG 3WJ LmC

Släktforskning, cirkelledning
type: Concept
in scheme: JobTech Taxonomy - Färdighet
definition: Släktforskning, cirkelledning
broader: zmYu aAM TuF
related: 1CX5 mZw Vcq

Materialkunskap, hantverk
type: Concept
in scheme: JobTech Taxonomy - Färdighet
definition: Materialkunskap, hantverk, avser kunskap om olika material och deras egenskaper samt tekniker för att bearbeta dessa inom hantverk. Denna kompetens innefattar förståelse för hur olika material, såsom trä, glas, metall och textil, kan användas och formas i olika hantverksprocesser.
broader: zmYu aAM TuF
related: nwSm phw sPo
related: J17g Q2a 2u1
related: UZBj yDX Ctp
related: mwVN oEH g9k
related: aKdV u7V R5j
related: yXbD NTH ijE
related: v7W3 cLQ q2S
related: vJQk YvC XB7
related: 1Nwn GYH wkH
related: vhUJ LyD XWc
related: q8Ho 3Xw sHq

Tandläkarexamen
type: Concept
in scheme: JobTech Taxonomy - Färdighet
definition: Tandläkarexamen är en examen på högskolenivå kopplad till utbildning med inriktning mot tandläkare.
broader: Yrkesbevis/examen
related: HPxT fQJ zwT

Film, cirkelledning
type: Concept
in scheme: JobTech Taxonomy - Färdighet
definition: Film, cirkelledning
broader: zmYu aAM TuF
related: 1CX5 mZw Vcq

Gesällbrev, bagare och konditor
type: Concept
in scheme: JobTech Taxonomy - Färdighet
definition: Gesällbrev, bagare och konditor är ett bevis på att en hantverkare har genomgått utbildning och avlagt de delprov som krävs inom det specifika hantverksyrket, och därigenom uppnått ett erkännande av färdigheter och kompetens inom yrket. Utfärdas av Sveriges hantverksråd i samråd med aktuell branschorganisation.
broader: Yrkesbevis/examen
related: 5qT8 z9d 8rw

Reparationer av blåsinstrument
type: Concept
in scheme: JobTech Taxonomy - Färdighet
definition: Reparationer av blåsinstrument avser kompetens att utföra underhåll och reparationer på musikinstrument som tillhör blåsinstrumentfamiljen. Denna kompetens omfattar identifiering av skador, justering av mekaniska delar och återställande av instrumentets funktionalitet.
broader: zmYu aAM TuF
related: aKdV u7V R5j

Regi, opera
type: Concept
in scheme: JobTech Taxonomy - Färdighet
definition: Regi, opera
broader: zmYu aAM TuF
related: rYSG 3WJ LmC

Internationella organisationer
type: Concept
in scheme: JobTech Taxonomy - Färdighet
definition: Internationella organisationer
broader: zmYu aAM TuF
related: WZCM nfS eAk

Tappning, konventionell maskin
type: Concept
in scheme: JobTech Taxonomy - Färdighet
definition: Tappning, konventionell maskin
broader: zmYu aAM TuF
related: VKKg e4t t46

Kommunikationsprotokoll
type: Concept
in scheme: JobTech Taxonomy - Färdighet
top concept of: JobTech Taxonomy - Färdighet
definition: Kommunikationsprotokoll
narrower: jTYU TTp 4iW
narrower: SOAP, kommunikationsprotokoll
narrower: IPX, kommunikationsprotokoll
narrower: X.400, kommunikationsprotokoll
narrower: yh11 sgo Z29
narrower: Local Interconnect Network, LIN
narrower: ob2k Bcp XHY
narrower: TCP/IP, kommunikationsprotokoll
narrower: IR-teknik
narrower: HTTP/HTTPS, kommunikationsprotokoll
narrower: XML Web Services
narrower: pqTD 5Mi 3mx
narrower: NetBIOS, kommunikationsprotokoll
narrower: juuL xEW Ebd
narrower: wwBc 7Re 5ut
narrower: yHvf EiK QUF
narrower: Object Component Model/COM
narrower: nTdr FJz ioy
narrower: RFID-teknik
narrower: rbgS KMd oji
narrower: IP-telefoniteknik
narrower: Bluetooth-teknik
narrower: SNA, kommunikationsprotokoll
narrower: X.500, kommunikationsprotokoll

Mikrovågskonstruktion
type: Concept
in scheme: JobTech Taxonomy - Färdighet
definition: Mikrovågskonstruktion
broader: zmYu aAM TuF
related: nDaB vdy eAy
related: SPYW 7Z1 ShT

Digital Video Effekt/DVE
type: Concept
in scheme: JobTech Taxonomy - Färdighet
definition: Digital Video Effekt/DVE
alternative label: DVE
alternative label: Digital Video Effekt
broader: zmYu aAM TuF
related: 4BsK q2C sCL
related: CkRH 4Qn iX3
related: 4Jty HpK a3Q

Legitimation som röntgensjuksköterska
type: Concept
in scheme: JobTech Taxonomy - Färdighet
definition: Legitimation som krävs för att kunna arbeta som röntgensjuksköterska i Sverige. Utfärdas av Socialstyrelsen.
broader: Yrkesbevis/examen
related: 4P8B LtK JgE
related: r1Gk 3EN bpw
related: 1tGC fXC mxX

Flygsäkerhetsarbete, erfarenhet
type: Concept
in scheme: JobTech Taxonomy - Färdighet
definition: Flygsäkerhetsarbete, erfarenhet refererar till kunskap och praktisk erfarenhet inom säkerhetsaspekter relaterade till luftfart. Denna kompetens omfattar arbete med riskhantering, inspektion och säkerställande av att säkerhetsstandarder följs i flygverksamhet.
broader: zmYu aAM TuF
related: K8yg U4C gkY
related: yct8 Pun DWd
related: nuXg Wjc JPd
related: iGTu bYL 2T7
related: PRQn 9yw NJA
related: 7n3y FTE qSe
related: eRkT cTv H9v

Missbruksvård
type: Concept
in scheme: JobTech Taxonomy - Färdighet
definition: Missbruksvård avser insatser och behandlingar som syftar till att stödja personer med skadligt bruk av alkohol, droger eller andra beroendeframkallande substanser. Kompetensen innefattar olika metoder för rehabilitering och stöd, där professionella inom området arbetar för att hjälpa individer att återfå kontrollen över sina liv och integreras i samhället.
broader: zmYu aAM TuF
related: BWwk fYX S5B
related: bEDv SL7 VrL
related: VYeq GDF a2g
related: pok1 ipJ yzD

ASIC, integrerad krets
type: Concept
in scheme: JobTech Taxonomy - Färdighet
definition: ASIC, integrerad krets
broader: zmYu aAM TuF
related: nDaB vdy eAy
related: SPYW 7Z1 ShT
related: 4Jty HpK a3Q

Mikrodatorstyrning
type: Concept
in scheme: JobTech Taxonomy - Färdighet
definition: Mikrodatorstyrning
broader: zmYu aAM TuF
related: nDaB vdy eAy
related: SPYW 7Z1 ShT

Industriarkeologi
type: Concept
in scheme: JobTech Taxonomy - Färdighet
definition: Industriarkeologi
broader: zmYu aAM TuF
related: sXgV QFg vpb

Prima vista-översättning
type: Concept
in scheme: JobTech Taxonomy - Färdighet
definition: Prima vista-översättning
broader: zmYu aAM TuF
related: PQDm Z63 zst

Godis/Konfektyr
type: Concept
in scheme: JobTech Taxonomy - Färdighet
definition: Godis/Konfektyr
alternative label: Godis
alternative label: Konfektyr
broader: zmYu aAM TuF
related: s1Qk o98 2o1

Mexikanskt kök
type: Concept
in scheme: JobTech Taxonomy - Färdighet
definition: Mexikanskt kök
broader: zmYu aAM TuF
related: BStc SJh DKG

ISA-certifierad arborist
type: Concept
in scheme: JobTech Taxonomy - Färdighet
definition: ISA-certifierad arborist för både klättrande och icke klättrande arborister och hålls av International Society of Arboriculture (ISA). Den som varit 3 år i trädvårdsbranchen har möjlighet att certifiera sig och får då göra ett skriftligt prov. Provet testar personens kunskaper i trädbiologi, artkunskap, marklära, plantering, beskärning, sjukdomsbestämning, träd vid nybyggnation, riskbedömning, arbetsmiljö och urbana skogar.
broader: s48H Sft DTn
related: XBh3 Xrm C4R

Montessoripedagogik, utbildning
type: Concept
in scheme: JobTech Taxonomy - Färdighet
definition: Montessoripedagogik, utbildning
broader: zmYu aAM TuF
related: 2x2V UeL 6ke
related: 3FP7 4Eg x8P
related: 4KhP FxL uZ5
related: oQUQ D11 HPx
related: 5ek3 Cgq WeZ

Rymdfysik
type: Concept
in scheme: JobTech Taxonomy - Färdighet
definition: Rymdfysik
broader: zmYu aAM TuF
related: SPYW 7Z1 ShT

Mästarbrev, bokbindare
type: Concept
in scheme: JobTech Taxonomy - Färdighet
definition: Mästarbrev, bokbindare
broader: Yrkesbevis/examen
related: mPzg 93F QEv

ASP, programmeringsspråk
type: Concept
in scheme: JobTech Taxonomy - Färdighet
definition: ASP, programmeringsspråk
alternative label: ASP
broader: Datorspråk
related: BAeH eg8 T2d
related: Fv7d YhP YmS
related: 8Bmh vtM zts
related: D9SL mtn vGM
related: DJh5 yyF hEM
related: 4Jty HpK a3Q
related: Mbt6 3ko DiD

Klättring, instruktör
type: Concept
in scheme: JobTech Taxonomy - Färdighet
definition: Klättring, instruktör
broader: Idrott/aktivitet
related: EA6o N1N QtT
related: A6X3 efC VNy

Apache Tomcat, webbserverprogram
type: Concept
in scheme: JobTech Taxonomy - Färdighet
definition: Apache Tomcat, webbserverprogram
alternative label: Apache Tomcat
broader: Applikationsplattformar
related: BAeH eg8 T2d
related: cBBa ngH fCx
related: D9SL mtn vGM
related: DJh5 yyF hEM
related: UxT1 tPF Kbg
related: 4Jty HpK a3Q
related: UXKZ 3zZ ipB
related: MYAz x9m 2LJ

Motif, programmeringsverktyg
type: Concept
in scheme: JobTech Taxonomy - Färdighet
definition: Motif, programmeringsverktyg
alternative label: Motif
broader: Programmerings- och systemutvecklingsverktyg
related: D9SL mtn vGM
related: DJh5 yyF hEM
related: 4Jty HpK a3Q
related: MYAz x9m 2LJ

Lodgistix, hotellbokningssystem
type: Concept
in scheme: JobTech Taxonomy - Färdighet
definition: Lodgistix, hotellbokningssystem
alternative label: Lodgistix
broader: kRoQ fPR 8oK
related: bYde Frc xcB
related: 4Jty HpK a3Q

Grusbil, körvana
type: Concept
in scheme: JobTech Taxonomy - Färdighet
definition: Grusbil, körvana
broader: zmYu aAM TuF
related: 3MBw pDA P2F

Annonsmottagning
type: Concept
in scheme: JobTech Taxonomy - Färdighet
definition: Annonsmottagning
broader: zmYu aAM TuF
related: p16X 44f rwZ

Valutahandel
type: Concept
in scheme: JobTech Taxonomy - Färdighet
definition: Valutahandel avser processen att köpa och sälja valutor på den globala valutamarknaden. Kompetensen innefattar kunskap om valutakurser, analys av marknadstrender och strategier för att maximera avkastning vid handel med olika valutor.
broader: zmYu aAM TuF
related: Bbkh nrm 2J8
related: aQpg E2T cWq
related: pTr9 RBT 9ur
related: FfMN Bw1 qYR
related: WNVp RYe zLX

Rättsutredning
type: Concept
in scheme: JobTech Taxonomy - Färdighet
definition: Rättsutredning innebär att samla in, analysera och sammanställa relevant juridisk information för att belysa en rättslig fråga eller ett ärende. Det handlar om att kartlägga fakta och tillämpliga lagar, bedöma rättsliga konsekvenser och sammanställa underlag.
broader: zmYu aAM TuF
related: br6a VVS V3y
related: zKvJ GnC Szx
related: DZVN v5g Fco
related: JfYV ZGg 6rm

Travers/Lyftanordningar
type: Concept
in scheme: JobTech Taxonomy - Färdighet
definition: Travers/Lyftanordningar avser kompetens kopplad till hantering och användning av traverser och andra lyftanordningar för att lyfta och transportera tunga laster. Detta inkluderar förståelse för säkerhetsföreskrifter samt teknisk kunskap om utrustningens funktion och underhåll.
alternative label: Lyftanordningar
alternative label: Travers
broader: zmYu aAM TuF
related: Lzpv ofL 3H5
related: fLKb bJ3 69p
related: TrwQ RXT W8a

Frihandsteckning
type: Concept
in scheme: JobTech Taxonomy - Färdighet
definition: Frihandsteckning
broader: zmYu aAM TuF
related: CSUf ZVM a7Z

Läkemedelsansvarig, erfarenhet
type: Concept
in scheme: JobTech Taxonomy - Färdighet
definition: Läkemedelsansvarig, erfarenhet
broader: zmYu aAM TuF
related: HPxT fQJ zwT
related: nu7c QuB KVQ
related: TMsM oNw j6z
related: XjcN 5LT bWx
related: gXqW s5Q ZjN
related: Z8ci bBE tmx

Parkeringsbevakning
type: Concept
in scheme: JobTech Taxonomy - Färdighet
definition: Parkeringsbevakning avser övervakning och kontroll av parkeringsområden för att säkerställa att gällande parkeringsbestämmelser och regler följs. Denna kompetens innefattar även tillsyn av fordonens säkerhet och hantering av olovlig parkering, vilket kan omfatta utfärdande av böter och kontakt med andra myndigheter vid behov.
broader: zmYu aAM TuF
related: ayQ4 G3W A2w
related: iqZh 3yX i8n

Gravar, arkeologisk kunskap
type: Concept
in scheme: JobTech Taxonomy - Färdighet
definition: Gravar, arkeologisk kunskap
broader: zmYu aAM TuF
related: sXgV QFg vpb

Oxidering
type: Concept
in scheme: JobTech Taxonomy - Färdighet
definition: Oxidering
broader: zmYu aAM TuF
related: YiQw N87 zLU

Mekanisk rengöring av avloppsrör
type: Concept
in scheme: JobTech Taxonomy - Färdighet
definition: Mekanisk rengöring av avloppsrör avser att mekaniskt avlägsna smuts och annat som förhindrar flöden i avloppsrören. Exempel är fräsning av avloppsrör som rotskärning. Mekanisk rengöring görs genom att föra in roterande verktyg i avloppsrör och sedan spola bort avlägsnat material.
broader: zmYu aAM TuF
related: idjo 2Wr a3E

Karriärplanering
type: Concept
in scheme: JobTech Taxonomy - Färdighet
definition: Karriärplanering
broader: zmYu aAM TuF
related: mNoS AN5 drn
related: 1CX5 mZw Vcq
related: jJF3 qaQ Zsh
related: bjqk F3A 5Hk

Dykarbok
type: Concept
in scheme: JobTech Taxonomy - Färdighet
definition: Dykarbok
broader: Yrkesbevis/examen
related: DPPw 4wa AsH
related: sXgV QFg vpb

Skyddsrum, underhållsbesiktning
type: Concept
in scheme: JobTech Taxonomy - Färdighet
definition: Skyddsrum, underhållsbesiktning
broader: zmYu aAM TuF
related: wCx8 rY3 XUT

Produktintegrering
type: Concept
in scheme: JobTech Taxonomy - Färdighet
definition: Produktintegrering
broader: zmYu aAM TuF
related: nDaB vdy eAy
related: SPYW 7Z1 ShT

AML/CTF
type: Concept
in scheme: JobTech Taxonomy - Färdighet
definition: AML/CTF
broader: zmYu aAM TuF
related: Uw4n UB2 RCW

ART-metodik
type: Concept
in scheme: JobTech Taxonomy - Färdighet
definition: ART-metodik
broader: zmYu aAM TuF
related: 5uP5 Ugw aVE

Adobe Acrobat
type: Concept
in scheme: JobTech Taxonomy - Färdighet
definition: Adobe Acrobat
broader: Allmänna datakunskaper
related: eQ4M CNm ozj
related: Y6yY SuR hVh
related: Uw4n UB2 RCW
related: fdLf oPp wVw
related: vPP6 rsw dck
related: iWcY mko rq2
related: ZQTR hVC QhJ
related: br6a VVS V3y
related: 1CX5 mZw Vcq
related: L7eh ihX vM5
related: MGk3 LvL AU2
related: jJF3 qaQ Zsh
related: oEmP NC1 sXE
related: bjqk F3A 5Hk
related: H2Zj eL9 x28
related: dJXy Rpq a2u
related: 4BsK q2C sCL
related: pwRH MT1 8nR
related: cRmd 536 pT1
related: zKvJ GnC Szx
related: n6iX f2z XfE
related: DZVN v5g Fco
related: ij8k EwC zyB
related: JfYV ZGg 6rm
related: vCAb uuo ek5
related: PH2M uV4 r72
related: 4Jty HpK a3Q
related: LeQV umf wUS
related: p16X 44f rwZ
related: pok1 ipJ yzD

Concertina, undervisning musikskola
type: Concept
in scheme: JobTech Taxonomy - Färdighet
definition: Concertina, undervisning musikskola
broader: zmYu aAM TuF
related: mcRJ kq2 jFr

Digital grafik
type: Concept
in scheme: JobTech Taxonomy - Färdighet
definition: Digital grafik
broader: zmYu aAM TuF
related: 34Tn BQQ tfo
related: 4Jty HpK a3Q

3D-grafik-Newtek Lightwave 3D
type: Concept
in scheme: JobTech Taxonomy - Färdighet
definition: 3D-grafik-Newtek Lightwave 3D
broader: Programvara för digitalt skapande
related: 8Bmh vtM zts
related: 34Tn BQQ tfo
related: Q5DF juj 8do
related: 4Jty HpK a3Q
related: LeQV umf wUS
related: Mbt6 3ko DiD

Villkorad läkemedelsanvändning
type: Concept
in scheme: JobTech Taxonomy - Färdighet
definition: Villkorad läkemedelsanvändning, ViLA, innebär att en lantbrukare under vissa förutsättningar kan ha läkemedel hemma och inleda behandling själv om vissa särskilt bestämda symtom uppstår. För den som ska utföra behandlingen krävs genomgången kurs i villkorad läkemedelsanvändning.
alternative label: D9
alternative label: ViLA
broader: zmYu aAM TuF
related: Lrsj wRZ sFV
related: KYmy iqC xiQ

Radialborrning
type: Concept
in scheme: JobTech Taxonomy - Färdighet
definition: Radialborrning
broader: zmYu aAM TuF
related: vaEp iBS c5h

Naturvård
type: Concept
in scheme: JobTech Taxonomy - Färdighet
definition: Naturvård avser åtgärder och strategier för att skydda, bevara och återställa ekologiska system och biologisk mångfald. Kompetensen innefattar kunskaper om ekologi, naturresurser och miljölagstiftning samt förmåga att analysera och utvärdera miljöförhållanden.
broader: zmYu aAM TuF
related: XBh3 Xrm C4R
related: XurM DVs ggn
related: qouP wtb 93q
related: rE1E m3d cx1
related: yXbD NTH ijE
related: 3LdB WEJ 8Ms

Varmfogning
type: Concept
in scheme: JobTech Taxonomy - Färdighet
definition: Varmfogning
broader: zmYu aAM TuF
related: yPQ4 EaN Dtj

EASA-certifikat, kategori B2 (avionik)
type: Concept
in scheme: JobTech Taxonomy - Färdighet
definition: EASA kategori B2-certifikat för flyplansunderhåll tillåter innehavaren att utföra och godkänna underhåll på flygplanets avionik- och elektriska system, som kommunikation, navigation och instrument. Certifikatet utfärdas av Transportstyrelsen
broader: s48H Sft DTn
related: eRkT cTv H9v

Underjordsspräning, ort och tunnel
type: Concept
in scheme: JobTech Taxonomy - Färdighet
definition: Underjordsspräning, ort och tunnel
broader: xKbn JBn EPE
related: sX9n CWa KVC
related: f71c gjL RDq

Sång, undervisning musikskola
type: Concept
in scheme: JobTech Taxonomy - Färdighet
definition: Sång, undervisning musikskola
broader: zmYu aAM TuF
related: mcRJ kq2 jFr

Fysikaliska tillämpningar
type: Concept
in scheme: JobTech Taxonomy - Färdighet
definition: Fysikaliska tillämpningar
broader: zmYu aAM TuF
related: KM7d Z6Y LCJ

Försäljningsvana, torg- och marknadsförsäljning
type: Concept
in scheme: JobTech Taxonomy - Färdighet
definition: Försäljningsvana, torg- och marknadsförsäljning avser färdigheter och erfarenhet för att sälja varor såsom frukt, grönsaker och andra produkter på torg och marknader. Kompetensen omfattar förmåga att interagera med kunder, hantera försäljningstransaktioner och presentera produkter på ett tilltalande sätt för att öka försäljningen.
broader: zmYu aAM TuF
related: xyW2 toA Skh
related: WNVp RYe zLX

Fysisk teater
type: Concept
in scheme: JobTech Taxonomy - Färdighet
definition: Fysisk teater
broader: zmYu aAM TuF
related: iBUL s38 izZ
related: xuSE mtB Mir

Områdesansvar, socialförsäkringsfrågor
type: Concept
in scheme: JobTech Taxonomy - Färdighet
definition: Områdesansvar, socialförsäkringsfrågor
broader: zmYu aAM TuF
related: NxXz fBh w7j
related: X1Ac Y9P PJo

Avprovning
type: Concept
in scheme: JobTech Taxonomy - Färdighet
definition: Avprovning avser processen att testa och utvärdera tillverkningsprototyper för att säkerställa att de uppfyller specificerade krav och standarder. Denna kompetens kan innefatta bedömning av kvalitet, passform och funktionalitet i olika plagg och produkter inom konfektionsindustrin.
broader: zmYu aAM TuF
related: mwVN oEH g9k

Eclipselink, ramverk
type: Concept
in scheme: JobTech Taxonomy - Färdighet
definition: Eclipselink, ramverk
broader: srsj GQb CE1
related: D9SL mtn vGM
related: DJh5 yyF hEM
related: UxT1 tPF Kbg
related: 4Jty HpK a3Q
related: UXKZ 3zZ ipB

Kontakttolkning
type: Concept
in scheme: JobTech Taxonomy - Färdighet
definition: Kontakttolkning
broader: zmYu aAM TuF
related: PQDm Z63 zst

Folkhälsovetenskap
type: Concept
in scheme: JobTech Taxonomy - Färdighet
definition: Folkhälsovetenskap avser studiet av befolkningers hälsa och faktorer som påverkar den, med fokus på mönster av sjukdom och hälsa samt åtgärder för att förbättra hälsosituationer på samhällsnivå. Kompetensen omfattar analyser av sociala, ekonomiska och miljömässiga faktorer som påverkar hälsan och utveckling av strategier för att förebygga sjukdomar och främja hälsa.
broader: zmYu aAM TuF
related: FpPP jqK xzT
related: Z2MZ eYc Lfv
related: vPP6 rsw dck
related: Pq5C SPC bRA

Akustikisolering
type: Concept
in scheme: JobTech Taxonomy - Färdighet
definition: Akustikisolering
broader: zmYu aAM TuF
related: cGxX R9c kW1

Yrkesutbildning, plastmaskinställare
type: Concept
in scheme: JobTech Taxonomy - Färdighet
definition: Yrkesutbildning, plastmaskinställare är en yrkeshögskoleutbildning med inriktning till plastmaskinställare.
broader: Yrkesutbildning
related: yPQ4 EaN Dtj

Bioraffinaderi, utveckling
type: Concept
in scheme: JobTech Taxonomy - Färdighet
definition: Bioraffinaderi, utveckling
broader: zmYu aAM TuF
related: qn2U dB9 Cmh
related: PRQn 9yw NJA

Materialflöde
type: Concept
in scheme: JobTech Taxonomy - Färdighet
definition: Materialflöde
broader: zmYu aAM TuF
related: K8yg U4C gkY
related: PRQn 9yw NJA

Svinskötsel
type: Concept
in scheme: JobTech Taxonomy - Färdighet
definition: Svinskötsel
broader: zmYu aAM TuF
related: KYmy iqC xiQ
related: RYCQ ogb uUY

Medieteknik
type: Concept
in scheme: JobTech Taxonomy - Färdighet
definition: Medieteknik
broader: zmYu aAM TuF
related: BAeH eg8 T2d
related: mp2Y vyC RFV
related: DJh5 yyF hEM
related: 4BsK q2C sCL
related: SPYW 7Z1 ShT
related: mpuA s56 Hsy
related: CkRH 4Qn iX3
related: 4Jty HpK a3Q
related: UXKZ 3zZ ipB

Gjutning, klass 2
type: Concept
in scheme: JobTech Taxonomy - Färdighet
definition: Gjutning, klass 2
broader: zmYu aAM TuF
related: thZP oR7 WrY

Turnéläggning
type: Concept
in scheme: JobTech Taxonomy - Färdighet
definition: Turnéläggning
broader: zmYu aAM TuF
related: rYSG 3WJ LmC

Yrkesanalys
type: Concept
in scheme: JobTech Taxonomy - Färdighet
definition: Yrkesanalys
broader: zmYu aAM TuF
related: vPP6 rsw dck

Glasskulptur
type: Concept
in scheme: JobTech Taxonomy - Färdighet
definition: Glasskulptur
broader: zmYu aAM TuF
related: 34Tn BQQ tfo

Körning av kalander
type: Concept
in scheme: JobTech Taxonomy - Färdighet
definition: Körning av kalander
broader: zmYu aAM TuF
related: 1G6H AuG qyy

Ljudboksinläsning
type: Concept
in scheme: JobTech Taxonomy - Färdighet
definition: Ljudboksinläsning
broader: zmYu aAM TuF
related: iBUL s38 izZ
related: PQDm Z63 zst
related: xuSE mtB Mir

Latin, cirkelledning
type: Concept
in scheme: JobTech Taxonomy - Färdighet
definition: Latin, cirkelledning
broader: zmYu aAM TuF
related: 1CX5 mZw Vcq

Yrkesutbildning, bagare och konditor
type: Concept
in scheme: JobTech Taxonomy - Färdighet
definition: Yrkesutbildning, bagare och konditor är en gymnasial eller eftergymnasial yrkesinriktad utbildning med inriktning till bagare och konditor.
broader: Yrkesutbildning
related: 5qT8 z9d 8rw

Inriktning klinisk fysiologi
type: Concept
in scheme: JobTech Taxonomy - Färdighet
definition: Inriktning klinisk fysiologi
broader: zmYu aAM TuF
related: wNrt Ysj WuT

Hållbart skogsbruk
type: Concept
in scheme: JobTech Taxonomy - Färdighet
definition: Förvaltning och nyttjande av skog och skogsmark på ett sådant sätt, och i en sådan takt att dess biologiska mångfald, produktivitet, föryngringskapacitet, vitalitet och förmåga att både nu och i framtiden fylla viktiga ekologiska, ekonomiska och sociala funktioner på lokal, nationell och global nivå bevaras, utan att andra ekosystem skadas. Källa: FN:s jordbruks- och livsmedelsorganisation, FAO
broader: zmYu aAM TuF
related: KwVo sQu G2e
related: yXbD NTH ijE
related: 9QMD sZ3 ZjX
related: 3LdB WEJ 8Ms

Finska, cirkelledning
type: Concept
in scheme: JobTech Taxonomy - Färdighet
definition: Finska, cirkelledning
broader: zmYu aAM TuF
related: 1CX5 mZw Vcq

Bakgrundskontroll vid rekrytering
type: Concept
in scheme: JobTech Taxonomy - Färdighet
definition: Bakgrundskontroll vid rekrytering
broader: zmYu aAM TuF
related: bjqk F3A 5Hk
related: nuXg Wjc JPd

Handvård/Manikyr
type: Concept
in scheme: JobTech Taxonomy - Färdighet
definition: Handvård/Manikyr avser kompetens inom vård och försköning av händer, naglar och nagelband, med fokus på att skapa estetiskt tilltalande och hälsosamma naglar. Denna kompetens omfattar åtgärder såsom nagelklippning, formning, filning och applicering av nagellack, samt behandlingar för att främja nagelhälsa enligt riktlinjer från relevant branschorganisation.
alternative label: Handvård
alternative label: Manikyr
broader: zmYu aAM TuF
related: ezKk kss CiQ
related: xr7w N6Q QMA

VB-script, programmeringsspråk
type: Concept
in scheme: JobTech Taxonomy - Färdighet
definition: VB-script, programmeringsspråk
alternative label: VB-script
broader: Datorspråk
related: BAeH eg8 T2d
related: Fv7d YhP YmS
related: D9SL mtn vGM
related: DJh5 yyF hEM
related: 4Jty HpK a3Q

Flygplanslackering
type: Concept
in scheme: JobTech Taxonomy - Färdighet
definition: Flygplanslackering
broader: zmYu aAM TuF
related: dKUb KBP mw3

Prototyping
type: Concept
in scheme: JobTech Taxonomy - Färdighet
definition: Prototyping
broader: zmYu aAM TuF
related: UxT1 tPF Kbg
related: 4Jty HpK a3Q

3D-grafik-Blender
type: Concept
in scheme: JobTech Taxonomy - Färdighet
definition: 3D-grafik-Blender
broader: Programvara för digitalt skapande
related: 8Bmh vtM zts
related: 34Tn BQQ tfo
related: Q5DF juj 8do
related: 4Jty HpK a3Q
related: LeQV umf wUS
related: Mbt6 3ko DiD

Medicinsk massage
type: Concept
in scheme: JobTech Taxonomy - Färdighet
definition: Medicinsk massage
broader: zmYu aAM TuF
related: uxHV KXc PKD

FPGA, programmerbar krets
type: Concept
in scheme: JobTech Taxonomy - Färdighet
definition: FPGA, programmerbar krets
broader: zmYu aAM TuF
related: nDaB vdy eAy
related: SPYW 7Z1 ShT
related: 4Jty HpK a3Q

Arborrning, konventionell maskin
type: Concept
in scheme: JobTech Taxonomy - Färdighet
definition: Arborrning, konventionell maskin
broader: zmYu aAM TuF
related: vaEp iBS c5h

Klavecin
type: Concept
in scheme: JobTech Taxonomy - Färdighet
definition: Klavecin
broader: wLYs CKS wK8
related: AWJF wqZ va9

Filtersömnad
type: Concept
in scheme: JobTech Taxonomy - Färdighet
definition: Filtersömnad
broader: zmYu aAM TuF
related: skLS kpa Ui1

Etsning
type: Concept
in scheme: JobTech Taxonomy - Färdighet
definition: Etsning
broader: zmYu aAM TuF
related: nwSm phw sPo

Familjerätt
type: Concept
in scheme: JobTech Taxonomy - Färdighet
definition: Familjerätt
broader: zmYu aAM TuF
related: q8wL kdi WaW
related: zKvJ GnC Szx
related: 6aak 8eh iwT
related: DZVN v5g Fco

Asbestsanering, särskild utbildning
type: Concept
in scheme: JobTech Taxonomy - Färdighet
definition: Asbestsanering, särskild utbildning, avser kompetens och kunskap som krävs för att genomföra sanering av asbest i byggnader och andra strukturer. Utbildningen omfattar korrekt hantering av asbestmaterial samt säkerhetsföreskrifter för att minimera risker för både arbetstagare och omgivning.
broader: s48H Sft DTn
related: V79C DD2 3Gj
related: J17g Q2a 2u1
related: idjo 2Wr a3E
related: yXbD NTH ijE
related: iHrC aRv fVm

Filning
type: Concept
in scheme: JobTech Taxonomy - Färdighet
definition: Filning avser processen att forma och bearbeta material, oftast metall eller plast, genom användning av en fil för att uppnå specifika dimensioner och ytkvaliteter. Denna kompetens är relevant inom yrken som verktygsmakare och finmekaniker, där precisionsarbete och justeringar är centrala moment.
broader: zmYu aAM TuF
related: MSnK 3Z8 4qA
related: e6nk AGp y28
related: 4bxV 58E P9N

Lådtillverkning
type: Concept
in scheme: JobTech Taxonomy - Färdighet
definition: Lådtillverkning
broader: zmYu aAM TuF
related: mPzg 93F QEv

Ayurveda
type: Concept
in scheme: JobTech Taxonomy - Färdighet
definition: Ayurveda
broader: zmYu aAM TuF
related: F19Z oB6 pg3

Medicinsk terminologi
type: Concept
in scheme: JobTech Taxonomy - Färdighet
definition: Medicinsk terminologi
broader: zmYu aAM TuF
related: PQDm Z63 zst

Kompetensbevis, industriteknik BAS inriktning automation
type: Concept
in scheme: JobTech Taxonomy - Färdighet
definition: Kompetensbevis, industriteknik BAS inriktning automation
broader: s48H Sft DTn
related: yJk6 azD ywF
related: YiQw N87 zLU
related: ENV6 BNa brP
related: 4obu LL6 RqJ
related: hxm6 xkr dHm
related: LEvM 7Hs w8i
related: rxmK wwM 1NA
related: Vfum e6B 7Bw
related: VKKg e4t t46
related: UdrS qzV P7i
related: 1G6H AuG qyy
related: vaEp iBS c5h
related: yPQ4 EaN Dtj
related: kF59 fge kts
related: iZLB KpD LLo
related: Kxm9 N3V shF
related: o31g CX1 qhQ
related: 4DET dLf iB9
related: skLS kpa Ui1
related: aU9p ekE Fqf
related: UcNa inr snV
related: 4Jty HpK a3Q
related: icae Y69 H8E
related: gJtZ EBc n2z
related: AUs8 M5f dLt

Biologi, undervisning gymnasienivå
type: Concept
in scheme: JobTech Taxonomy - Färdighet
definition: Biologi, undervisning gymnasienivå
broader: Inriktning på lärarkompetens
related: 4KhP FxL uZ5

Utbildning till steriltekniker
type: Concept
in scheme: JobTech Taxonomy - Färdighet
definition: Utbildning till steriltekniker är en yrkeshögskoleutbildning med inriktning till steriltekniker.
broader: Yrkesbevis/examen
related: LP4Z ABV gRm

Biogasuppvärmning
type: Concept
in scheme: JobTech Taxonomy - Färdighet
definition: Biogasuppvärmning
broader: zmYu aAM TuF
related: yXbD NTH ijE
related: fLKb bJ3 69p

Rörläggning, mark
type: Concept
in scheme: JobTech Taxonomy - Färdighet
definition: Rörläggning, mark
broader: zmYu aAM TuF
related: bZ4J riZ zK6

Högskoleingenjörsexamen
type: Concept
in scheme: JobTech Taxonomy - Färdighet
definition: Högskoleingenjörsexamen
broader: Yrkesbevis/examen
related: mis4 feV uex
related: v9nU 6Fw 4Qg
related: 3jEy yuT aVo
related: thZP oR7 WrY
related: w6ud quG dgh
related: K8yg U4C gkY
related: nDaB vdy eAy
related: 39yB xPQ ozd
related: 33Nt DSs YYA
related: ketV G9W GeR
related: dMVD VYy kgg
related: GC7L Yw7 Mfo
related: bExu 8gk azk

Saltbil, körvana
type: Concept
in scheme: JobTech Taxonomy - Färdighet
definition: Saltbil, körvana
broader: zmYu aAM TuF
related: 3MBw pDA P2F

Bygginriktning-husbyggnad, undervisning
type: Concept
in scheme: JobTech Taxonomy - Färdighet
definition: Bygginriktning-husbyggnad, undervisning
broader: Inriktning på lärarkompetens
related: 2x2V UeL 6ke

Svinstyckning
type: Concept
in scheme: JobTech Taxonomy - Färdighet
definition: Svinstyckning avser processen att stycka upp en svinkropp i olika detaljer som kan användas för försäljning eller vidare bearbetning. Kompetensen omfattar kunskap om anatomiska delar av svin och färdigheter i att utföra snitt för att producera olika köttdetaljer och charkuteriprodukter.
broader: zmYu aAM TuF
related: QqHf XKZ eyy

Klottersanering
type: Concept
in scheme: JobTech Taxonomy - Färdighet
definition: Klottersanering avser processen att ta bort klotter och oönskade märkningar från olika ytor, vilket kräver kunskap om olika material och rengöringsmetoder för att undvika skador. Kompetensen omfattar även insikt om korrekt hantering av kemikalier och avfall relaterade till saneringsinsatser.
broader: zmYu aAM TuF
related: idjo 2Wr a3E
related: yXbD NTH ijE

Fysikaliskt laboratoriearbete
type: Concept
in scheme: JobTech Taxonomy - Färdighet
definition: Fysikaliskt laboratoriearbete avser en serie procedurer och tekniker inom fysik som genomförs i laboratoriemiljö för analys och forskning, framför allt inom materialteknik. Kompetensen omfattar hantering av prover, utrustning och olika laboratoriemetoder.
broader: zmYu aAM TuF
related: GiNX ESA AL1
related: 4Jty HpK a3Q
related: bExu 8gk azk

Mosaikläggning
type: Concept
in scheme: JobTech Taxonomy - Färdighet
definition: Mosaikläggning
broader: zmYu aAM TuF
related: NnB3 eWH auo

Musikal
type: Concept
in scheme: JobTech Taxonomy - Färdighet
definition: Musikal
broader: p1WM wCw LTd
related: AWJF wqZ va9
related: rYSG 3WJ LmC

Oboe
type: Concept
in scheme: JobTech Taxonomy - Färdighet
definition: Oboe
broader: wLYs CKS wK8
related: AWJF wqZ va9

Calypso
type: Concept
in scheme: JobTech Taxonomy - Färdighet
definition: Calypso
broader: p1WM wCw LTd
related: AWJF wqZ va9

Läkemedelssanering
type: Concept
in scheme: JobTech Taxonomy - Färdighet
definition: Läkemedelssanering
broader: zmYu aAM TuF
related: idjo 2Wr a3E
related: yXbD NTH ijE

Oljedepåarbete
type: Concept
in scheme: JobTech Taxonomy - Färdighet
definition: Oljedepåarbete
broader: zmYu aAM TuF
related: bwnk nv2 1cR

Butiksbevakning/Butikskontroll
type: Concept
in scheme: JobTech Taxonomy - Färdighet
definition: Butiksbevakning/Butikskontroll avser aktiviteter som syftar till att övervaka och bevaka butiksytor för att förebygga och upptäcka stölder, skadegörelse och oegentligheter. Kompetensen omfattar även att upprätthålla ordning, säkerhet och kundtrygghet i detaljhandelsmiljöer, till exempel genom att observera kunders beteende och agera vid misstanke om brott enligt riktlinjer för säkerhet och trygghet.
broader: zmYu aAM TuF
related: iqZh 3yX i8n

Mast- och stolpintyg
type: Concept
in scheme: JobTech Taxonomy - Färdighet
definition: Mast- och stolpintyg avser ett intyg som bekräftar en persons kompetens och behörighet att arbeta med installation, underhåll och reparation av mast- och stolpinfrastruktur för el- och telekommunikation. Kompetensen inkluderar förståelse för säkerhetsföreskrifter och teknik relaterad till hantering av mast och stolpar.
broader: zmYu aAM TuF
related: MW1P GNJ 4F9
related: fWrt sLg koW
related: KttZ Skc bMR

Boverkets byggregler BBR
type: Concept
in scheme: JobTech Taxonomy - Färdighet
definition: Boverkets byggregler (BBR) utgör den baskompetens som fastställer krav och riktlinjer för byggande och planering av byggnader i Sverige. Dessa regler omfattar aspekter som säkerhet, tillgänglighet, energieffektivitet och människors hälsa och säkerhet, och tillämpas vid nybyggnation samt om- och tillbyggnation.
broader: zmYu aAM TuF
related: wCx8 rY3 XUT
related: thZP oR7 WrY
related: w6ud quG dgh
related: 7mn2 kA9 ftp
related: yXbD NTH ijE
related: Pd51 xnr KCY
related: ketV G9W GeR
related: XeBP nMe pXx
related: 41KB bfk 5jR

Medical care
type: Concept
in scheme: JobTech Taxonomy - Färdighet
definition: Medical care
broader: s48H Sft DTn
related: kZwz D8K bKs
related: kDnq Q98 sD3

Växlingsarbete tåg
type: Concept
in scheme: JobTech Taxonomy - Färdighet
definition: Växlingsarbete tåg avser hantering av tåg vid bangårdar, inklusive åtgärder för att iordningställa och säkerhetskontrollera tåg innan de sätts i trafik. Kompetensen innefattar rangering av vagnar, vagnupptagning, vagnexpediering och godshantering samt enkelt underhåll av fordon.
broader: zmYu aAM TuF
related: nk6Z 5oD QoM
related: UGgc Vm9 Bog

Diplomerad solskyddstekniker
type: Concept
in scheme: JobTech Taxonomy - Färdighet
definition: Diplomerad solskyddstekniker
broader: s48H Sft DTn
related: Kxm9 N3V shF

Maskinskötsel, gummi- och plastindustri
type: Concept
in scheme: JobTech Taxonomy - Färdighet
definition: Maskinskötsel, gummi- och plastindustri avser hantering och drift av maskiner som används för att tillverka produkter och detaljer av gummi och plast. Kompetensen omfattar övervakning av processer som blandar, gjuter och formar material för att säkerställa produktens kvalitet och effektivitet i produktionen.
broader: zmYu aAM TuF
related: ENV6 BNa brP
related: yPQ4 EaN Dtj

Tele, specialisering för officer
type: Concept
in scheme: JobTech Taxonomy - Färdighet
definition: Tele, specialisering för officer
broader: zmYu aAM TuF
related: dhgR 9jk 95r
related: KiVA anS RJh

Instrumentoptik
type: Concept
in scheme: JobTech Taxonomy - Färdighet
definition: Instrumentoptik
broader: zmYu aAM TuF
related: e6nk AGp y28

Plattläggning
type: Concept
in scheme: JobTech Taxonomy - Färdighet
definition: Plattläggning
broader: zmYu aAM TuF
related: bZ4J riZ zK6
related: V79C DD2 3Gj

Akutrekrytering
type: Concept
in scheme: JobTech Taxonomy - Färdighet
definition: Akutrekrytering
broader: zmYu aAM TuF
related: bjqk F3A 5Hk

Tillverkningsindustri-Stheno Pro
type: Concept
in scheme: JobTech Taxonomy - Färdighet
definition: Tillverkningsindustri-Stheno Pro
broader: mTLu uo2 gq2
related: mis4 feV uex
related: xm5G vGn iyk
related: mp2Y vyC RFV
related: 3jEy yuT aVo
related: rwpH 6RA XTT
related: K8yg U4C gkY
related: PRQn 9yw NJA
related: 4Jty HpK a3Q

Manus
type: Concept
in scheme: JobTech Taxonomy - Färdighet
definition: Manus
broader: zmYu aAM TuF
related: SgNH hag n9D
related: zfve s6G tpc
related: rYSG 3WJ LmC

Ljussättning, spelfilm
type: Concept
in scheme: JobTech Taxonomy - Färdighet
definition: Ljussättning, spelfilm
broader: zmYu aAM TuF
related: 4BsK q2C sCL
related: CkRH 4Qn iX3

Fjärrvärmeteknik
type: Concept
in scheme: JobTech Taxonomy - Färdighet
definition: Fjärrvärmeteknik
broader: zmYu aAM TuF
related: K8yg U4C gkY
related: yXbD NTH ijE
related: PRQn 9yw NJA

Elektroniska insprutningssystem
type: Concept
in scheme: JobTech Taxonomy - Färdighet
definition: Elektroniska insprutningssystem
broader: zmYu aAM TuF
related: a75S eLg JWH

Orderplockning
type: Concept
in scheme: JobTech Taxonomy - Färdighet
definition: Orderplockning
broader: zmYu aAM TuF
related: kLyY rwr aJr

Yrkesutbildning, teleteknik
type: Concept
in scheme: JobTech Taxonomy - Färdighet
definition: Yrkesutbildning inom teleteknik kan bland annat erhållas genom gymnasieutbildning och arbetsmarknadsutbildning. Utbildning inom teleteknik ger förutsättningar för att arbeta som Fibertekniker och Signaltekniker.
broader: Yrkesutbildning
related: fWrt sLg koW

Trailerproduktion
type: Concept
in scheme: JobTech Taxonomy - Färdighet
definition: Trailerproduktion
broader: zmYu aAM TuF
related: rYSG 3WJ LmC

Faktureringsvana
type: Concept
in scheme: JobTech Taxonomy - Färdighet
definition: Faktureringsvana avser kompetens inom hantering och utfärdande av fakturor samt registrering och kontroll av ekonomiska transaktioner. Denna kompetens kräver kunskap om faktureringssystem och rutiner för att säkerställa korrekt bokföring och uppföljning av betalningar.
broader: zmYu aAM TuF
related: eQ4M CNm ozj
related: 8A1f sxQ adT
related: 48KE fDE ryL
related: bYde Frc xcB
related: ZQTR hVC QhJ
related: L7eh ihX vM5
related: oEmP NC1 sXE
related: dUuh wwa FGj
related: pwRH MT1 8nR
related: ij8k EwC zyB
related: p16X 44f rwZ

Bossa nova
type: Concept
in scheme: JobTech Taxonomy - Färdighet
definition: Bossa nova
broader: p1WM wCw LTd
related: AWJF wqZ va9

OPERA, hotellbokningssystem
type: Concept
in scheme: JobTech Taxonomy - Färdighet
definition: OPERA, hotellbokningssystem, avser ett digitalt system som används inom hotellbranschen för att hantera bokningar, beläggning, registrering och kundinformation.
alternative label: OPERA
broader: kRoQ fPR 8oK
related: bYde Frc xcB
related: 4Jty HpK a3Q

CUDA, programmeringsspråk
type: Concept
in scheme: JobTech Taxonomy - Färdighet
definition: CUDA, programmeringsspråk
alternative label: CUDA
broader: Datorspråk
related: BAeH eg8 T2d
related: Fv7d YhP YmS
related: 8Bmh vtM zts
related: D9SL mtn vGM
related: DJh5 yyF hEM
related: SPYW 7Z1 ShT
related: 4Jty HpK a3Q
related: Mbt6 3ko DiD

Visum till USA
type: Concept
in scheme: JobTech Taxonomy - Färdighet
definition: Visum till USA
broader: s48H Sft DTn
related: BStc SJh DKG
related: Rsoy sS6 6c4
related: CbQK 7th Tyf
related: Z6TY xDf Yup
related: UjoW meY Zwt
related: KttZ Skc bMR
related: kDnq Q98 sD3
related: a75S eLg JWH
related: XGyi i4B ME7
related: h324 DPT 7Tw

Miljöteknik
type: Concept
in scheme: JobTech Taxonomy - Färdighet
definition: Miljöteknik
broader: zmYu aAM TuF
related: mis4 feV uex
related: v9nU 6Fw 4Qg
related: qn2U dB9 Cmh
related: rwpH 6RA XTT
related: yXbD NTH ijE
related: eofS oZs RZi
related: SPYW 7Z1 ShT
related: XeBP nMe pXx
related: PRQn 9yw NJA

Mästarbrev, skomakare (ortoped)
type: Concept
in scheme: JobTech Taxonomy - Färdighet
definition: Mästarbrev, skomakare (ortoped)
broader: Yrkesbevis/examen
related: vJQk YvC XB7

Testkörning av bilar
type: Concept
in scheme: JobTech Taxonomy - Färdighet
definition: Testkörning av bilar avser aktiviteten att köra och utvärdera fordon för att bedöma deras prestanda, säkerhet och drivsystemets funktionalitet. Kompetensen kräver kunskap om olika fordonstyper och deras egenskaper samt en förmåga att identifiera och rapportera potentiella problem eller förbättringsområden.
broader: zmYu aAM TuF
related: P7Ay ooF pri

Pagemill, HTML-editor
type: Concept
in scheme: JobTech Taxonomy - Färdighet
definition: Pagemill, HTML-editor
alternative label: Pagemill
broader: Programmerings- och systemutvecklingsverktyg
related: D9SL mtn vGM
related: 4Jty HpK a3Q
related: Mbt6 3ko DiD
related: MYAz x9m 2LJ

Sopran
type: Concept
in scheme: JobTech Taxonomy - Färdighet
definition: Sopran
broader: Sång
related: AWJF wqZ va9

Sprit/Vin
type: Concept
in scheme: JobTech Taxonomy - Färdighet
definition: Sprit/Vin
alternative label: Sprit
alternative label: Vin
broader: zmYu aAM TuF
related: oXSW fbY XrY
related: XFXX Jq9 Y2a
related: YKL2 FCB 1yr
related: UjoW meY Zwt
related: 85cq 6uK 4cK

Kommunikation, sjöfart
type: Concept
in scheme: JobTech Taxonomy - Färdighet
definition: Kommunikation, sjöfart
broader: Övriga specialiteter, sjöfart
related: BStc SJh DKG
related: Rsoy sS6 6c4
related: CbQK 7th Tyf
related: UjoW meY Zwt
related: KttZ Skc bMR
related: kDnq Q98 sD3
related: a75S eLg JWH
related: 4Jty HpK a3Q

Teaterkläder, skrädderi
type: Concept
in scheme: JobTech Taxonomy - Färdighet
definition: Teaterkläder, skrädderi
broader: zmYu aAM TuF
related: mwVN oEH g9k

Regler och riktvärden för buller
type: Concept
in scheme: JobTech Taxonomy - Färdighet
definition: Buller är den miljöstörning som berör flest människor i Sverige. Vanliga källor till buller är väg-, spår- och flygtrafik, fläktbuller i fastigheter, industrier och byggnadsarbeten. Regler om buller finns i såväl plan- och bygglagen som miljöbalken och förordningar. För olika kategorier av buller finns också riktvärden för bullernivåer vid bostadsbyggnader. Källa: Folkhälsomyndigheten, Boverket
broader: zmYu aAM TuF
related: Uw64 cuc U3H
related: puim 6PY DGj
related: yXbD NTH ijE
related: Pd51 xnr KCY
related: XeBP nMe pXx
related: 41KB bfk 5jR

Inredningsvana, hotell och restauranger
type: Concept
in scheme: JobTech Taxonomy - Färdighet
definition: Inredningsvana, hotell och restauranger
broader: zmYu aAM TuF
related: 41KB bfk 5jR
related: CSUf ZVM a7Z

EPW, Europeisk plastsvetsare, certifikat
type: Concept
in scheme: JobTech Taxonomy - Färdighet
definition: EPW (European Plastic Welder) är ett certifikat för plastsvetsare som garanterar en internationellt erkänd kompetensnivå. Certifikatet utfärdas efter att man har genomgått en utbildning och klarat både teoretiska och praktiska prov. Det utfärdas i Sverige av Svetskommissionen.
alternative label: EPW
alternative label: Europeisk plastsvetsare
broader: Svets-/lödarmetoder med verifierad kunskap
related: yPQ4 EaN Dtj

Fysisk säkerhet
type: Concept
in scheme: JobTech Taxonomy - Färdighet
definition: Fysisk säkerhet handlar om att skydda byggnader och utrustning från fysiska hot och intrång. Det inkluderar åtgärder som passerkontroll, övervakning, larm, skydd mot sabotage och trygghetsfrämjande insatser för att förebygga och hantera säkerhetsincidenter i en organisation eller verksamhet.
broader: zmYu aAM TuF
related: nuXg Wjc JPd

Mode, damkonfektion/Design, damkonfektion
type: Concept
in scheme: JobTech Taxonomy - Färdighet
definition: Mode, damkonfektion/Design, damkonfektion
alternative label: Design, damkonfektion
alternative label: Mode, damkonfektion
broader: zmYu aAM TuF
related: PF4H kQD zpL

Specialistbehörig inom klinisk vuxenpsykologi
type: Concept
in scheme: JobTech Taxonomy - Färdighet
definition: En specialistbehörighet och en fördjupad specialistkompetens för psykologer inom vuxenpsykologi.
broader: Specialistkompetens för psykologer
related: VYeq GDF a2g

Versionering
type: Concept
in scheme: JobTech Taxonomy - Färdighet
definition: Versionering
broader: zmYu aAM TuF
related: PQDm Z63 zst

Verkstadsmetallarbete
type: Concept
in scheme: JobTech Taxonomy - Färdighet
definition: Verkstadsmetallarbete avser en kompetens som innefattar olika tekniker och processer för att bearbeta och forma metaller i en verkstadsmiljö. Detta arbete kan omfatta aktiviteter såsom slipning, svarvning, fräsning och svetsning, samt användning av olika maskiner och handverktyg för att skapa, reparera eller montera metallprodukter.
broader: zmYu aAM TuF
related: vaEp iBS c5h
related: Kxm9 N3V shF
related: 4bxV 58E P9N

Musikinstrument
type: Concept
in scheme: JobTech Taxonomy - Färdighet
definition: Musikinstrument
broader: zmYu aAM TuF
related: oXSW fbY XrY
related: YKL2 FCB 1yr
related: 85cq 6uK 4cK

Specialpedagogexamen inriktning synskada
type: Concept
in scheme: JobTech Taxonomy - Färdighet
definition: Specialpedagogexamen inriktning synskada är en examen på högskolenivå kopplad till utbildning för specialpedagog med inriktning synskada.
broader: Yrkesbevis/examen
related: 3FP7 4Eg x8P

Erlang, programmeringsspråk
type: Concept
in scheme: JobTech Taxonomy - Färdighet
definition: Erlang, programmeringsspråk
alternative label: Erlang
broader: Datorspråk
related: BAeH eg8 T2d
related: Fv7d YhP YmS
related: D9SL mtn vGM
related: DJh5 yyF hEM
related: 4Jty HpK a3Q

Certifierad ventilationsrengörare
type: Concept
in scheme: JobTech Taxonomy - Färdighet
definition: Certifierad ventilationsrengörare har behörighet att utföra rengöring av ventilationssystem. Det finns nivå N eller K. Certifiering utförs av Kiwa
broader: s48H Sft DTn
related: idjo 2Wr a3E

Områdesansvar, barnomsorg
type: Concept
in scheme: JobTech Taxonomy - Färdighet
definition: Områdesansvar, barnomsorg
broader: zmYu aAM TuF
related: 1uau t1u rDL

Renhållningsbil, körvana
type: Concept
in scheme: JobTech Taxonomy - Färdighet
definition: Renhållningsbil, körvana avser färdigheten att köra och hantera renhållningsfordon i olika miljöer och under varierande trafikförhållanden. Kompetensen innefattar kunskap om de specifika egenskaperna hos renhållningsbilar och krav på säker och effektiv avfallshantering.
broader: zmYu aAM TuF
related: 3MBw pDA P2F

Slöjdlärarexamen
type: Concept
in scheme: JobTech Taxonomy - Färdighet
definition: Slöjdlärarexamen
broader: Yrkesbevis/examen
related: 2x2V UeL 6ke
related: 4KhP FxL uZ5
related: oQUQ D11 HPx

Förbränningsteknik
type: Concept
in scheme: JobTech Taxonomy - Färdighet
definition: Förbränningsteknik
broader: zmYu aAM TuF
related: K8yg U4C gkY

SISÄ-behörighet
type: Concept
in scheme: JobTech Taxonomy - Färdighet
definition: SISÄ-behörighet
broader: s48H Sft DTn
related: fWrt sLg koW

Områdesansvar, skogsvård
type: Concept
in scheme: JobTech Taxonomy - Färdighet
definition: Områdesansvar, skogsvård
broader: zmYu aAM TuF
related: yXbD NTH ijE
related: 9QMD sZ3 ZjX

Arvskifte
type: Concept
in scheme: JobTech Taxonomy - Färdighet
definition: Arvskifte
broader: zmYu aAM TuF
related: zKvJ GnC Szx
related: FfMN Bw1 qYR

Storstädning
type: Concept
in scheme: JobTech Taxonomy - Färdighet
definition: Storstädning avser en omfattande rengöringsprocess där ytor, rum och föremål rengörs grundligt för att säkerställa en hög nivå av hygien och ordning. Detta kan inkludera städning av bostäder, kontor, industrier och andra lokaler samt användning av specifika tekniker och material för effektiv rengöring.
broader: zmYu aAM TuF
related: o1gn FoS fB7
related: Z6TY xDf Yup

Kulturvetenskap
type: Concept
in scheme: JobTech Taxonomy - Färdighet
definition: Kulturvetenskap
broader: zmYu aAM TuF
related: wVfo Njx 1rB
related: Qbvf 6nd Esn

Restaurangekonomi
type: Concept
in scheme: JobTech Taxonomy - Färdighet
definition: Restaurangekonomi
broader: zmYu aAM TuF
related: BStc SJh DKG
related: UjoW meY Zwt
related: hZLv S5f jo2

Drycker, produktkunskap
type: Concept
in scheme: JobTech Taxonomy - Färdighet
definition: Drycker, produktkunskap
broader: zmYu aAM TuF
related: YKL2 FCB 1yr

Arbetsgrupp, erfarenhet
type: Concept
in scheme: JobTech Taxonomy - Färdighet
definition: Arbetsgrupp, erfarenhet
broader: Yrkesövergripande kompetenser

Översättning
type: Concept
in scheme: JobTech Taxonomy - Färdighet
definition: Översättning
broader: zmYu aAM TuF
related: PQDm Z63 zst

Kabinbesättningsintyg
type: Concept
in scheme: JobTech Taxonomy - Färdighet
definition: Kabinbesättningsintyg (CCA) är ett certifikat som krävs för att arbeta som kabinbesättningsmedlem på flygplan i kommersiell trafik inom EU. För att erhålla ett CCA måste sökanden ha genomgått och godkänts på en grundutbildning i enlighet med Del CC, vilken omfattar teoretiska och praktiska moment relaterade till passagerarsäkerhet och hantering av nödsituationer. Intyget har obegränsad giltighetstid men är endast giltigt tillsammans med en medicinsk rapport. Det förblir gällande såvida det inte har upphävts tillfälligt, återkallats eller om innehavaren inte har utövat sina befogenheter på minst en luftfartygstyp under de 60 föregående månaderna. Kabinbesättningsintyget är en värdehandling som, tillsammans med en lista över den aktuella typen eller varianten av luftfartyg, styrker behörigheten att arbeta som kabinbesättningsmedlem i kommersiell luftfart inom EU. Källa: Transportstyrelsen
alternative label: Cabin Crew Attestation
broader: s48H Sft DTn
related: 1Tso 4TB RkE

Limousinekörning
type: Concept
in scheme: JobTech Taxonomy - Färdighet
definition: Limousinekörning
broader: zmYu aAM TuF
related: ffz2 2n3 R7g
related: P7Ay ooF pri

Ljud-Audition
type: Concept
in scheme: JobTech Taxonomy - Färdighet
definition: Ljud-Audition
broader: Programvara för digitalt skapande
related: SgNH hag n9D
related: 4BsK q2C sCL
related: CkRH 4Qn iX3
related: 3J38 DNz YKK
related: PH2M uV4 r72
related: 4Jty HpK a3Q

Domotiksystem/hemautomation/smarta hem
type: Concept
in scheme: JobTech Taxonomy - Färdighet
definition: Domotiksystem/hemautomation/smarta hem liknar fastighetsautomation, men avsedd för bostäder som är privata hem. Fjärrstyrning/automatisering avser till exempel: - belysning - uppvärmning - ventilation - säkerhet Källa: www.wikipedia.se
broader: zmYu aAM TuF
related: nDaB vdy eAy
related: yXbD NTH ijE
related: SPYW 7Z1 ShT
related: fWrt sLg koW
related: 4Jty HpK a3Q

Montering av mekaniska komponenter
type: Concept
in scheme: JobTech Taxonomy - Färdighet
definition: Montering av mekaniska komponenter avser processen att sammanfoga olika mekaniska delar för att skapa en funktionell enhet. Denna kompetens innefattar teknisk förståelse och förmåga att arbeta med olika material och monteringsmetoder, inklusive skruvning, svetsning, lödning, nittning och limning.
broader: zmYu aAM TuF
related: Kxm9 N3V shF
related: shkw ojo UL2

Husbyggnadsteknik
type: Concept
in scheme: JobTech Taxonomy - Färdighet
definition: Husbyggnadsteknik avser kunskaper och färdigheter inom konstruktion av byggnader, säkerställande av byggnormer och effektiva arbetsmetoder för att genomföra byggprojekt. Denna kompetens omfattar områden som planering, projektering, materialval och samordning av olika arbetsmoment inom byggprocessen.
broader: zmYu aAM TuF
related: wCx8 rY3 XUT
related: thZP oR7 WrY
related: w6ud quG dgh
related: XeBP nMe pXx

Vattenvård
type: Concept
in scheme: JobTech Taxonomy - Färdighet
definition: Vattenvård
broader: zmYu aAM TuF
related: XurM DVs ggn
related: yXbD NTH ijE
related: 3LdB WEJ 8Ms

Patenträtt
type: Concept
in scheme: JobTech Taxonomy - Färdighet
definition: Patenträtt
broader: zmYu aAM TuF
related: q8wL kdi WaW
related: 6aak 8eh iwT
related: DZVN v5g Fco

SAS, Data Management
type: Concept
in scheme: JobTech Taxonomy - Färdighet
definition: SAS, statistikprogram
alternative label: SAS, statistikprogram
broader: zmYu aAM TuF
related: jv1x tpK 32p
related: DJh5 yyF hEM
related: 4Jty HpK a3Q
related: WZCM nfS eAk

Trafikövervakning
type: Concept
in scheme: JobTech Taxonomy - Färdighet
definition: Trafikövervakning
broader: zmYu aAM TuF
related: ayQ4 G3W A2w
related: rNcE Zno pD8
related: 4Jty HpK a3Q

Stand-up comedy
type: Concept
in scheme: JobTech Taxonomy - Färdighet
definition: Stand-up comedy
broader: zmYu aAM TuF
related: xuSE mtB Mir

Mastcertifikat
type: Concept
in scheme: JobTech Taxonomy - Färdighet
definition: Mastcertifikat är ett lagkrav vid arbete, över 13m, i alla typer av master, torn, kraftledningsstolpar, tornkranar, belysningsmaster, linbanor, trossar mm. Certifikatet utfärdas av godkänd utbildningsanordnare.
broader: s48H Sft DTn
related: MW1P GNJ 4F9
related: fWrt sLg koW
related: KttZ Skc bMR

Statsrätt
type: Concept
in scheme: JobTech Taxonomy - Färdighet
definition: Statsrätt
broader: zmYu aAM TuF
related: br6a VVS V3y
related: DZVN v5g Fco
related: JfYV ZGg 6rm

Anläggningskonstruktion
type: Concept
in scheme: JobTech Taxonomy - Färdighet
definition: Anläggningskonstruktion
broader: zmYu aAM TuF
related: nDaB vdy eAy
related: SPYW 7Z1 ShT

Mästarbrev, kock
type: Concept
in scheme: JobTech Taxonomy - Färdighet
definition: Mästarbrev, kock
broader: Yrkesbevis/examen
related: BStc SJh DKG

Internetanvändning, undervisning
type: Concept
in scheme: JobTech Taxonomy - Färdighet
definition: Internetanvändning, undervisning
broader: Dataundervisning
related: 1CX5 mZw Vcq
related: 4Jty HpK a3Q

Transportadministration
type: Concept
in scheme: JobTech Taxonomy - Färdighet
definition: Transportadministration omfattar hantering och samordning av administrativa uppgifter kopplade till godstransporter. Kompetensen kan innefatta arbete med bokning av transporter, framtagning och hantering av transportdokument, fakturering, tullhantering, registrering av godsflöden samt avvikelsehantering. Transportadministration kan också innebära löpande kontakt med speditörer, åkerier, terminaler, kunder och myndigheter för att säkerställa att godset transporteras enligt avtalade villkor, lagar och tidplaner. Arbetet sker ofta i digitala transportsystem eller affärssystem och kan omfatta uppföljning av leveranser, transportkostnader samt administration av reklamations- och skadeärenden.
broader: zmYu aAM TuF
related: eQ4M CNm ozj
related: fdLf oPp wVw
related: AuTi FEo j3R
related: 957L kZK rHZ

Oracle, databashanterare
type: Concept
in scheme: JobTech Taxonomy - Färdighet
definition: Oracle, databashanterare
alternative label: Oracle
alternative label: Oracle-kunskaper
alternative label: Oraclekunskap
alternative label: Oracleutveckling
broader: Databaser
related: BAeH eg8 T2d
related: cBBa ngH fCx
related: Fv7d YhP YmS
related: D9SL mtn vGM
related: DJh5 yyF hEM
related: 4Jty HpK a3Q
related: MYAz x9m 2LJ

Studie- och yrkesvägledning
type: Concept
in scheme: JobTech Taxonomy - Färdighet
definition: Studie- och yrkesvägledning avser processen att informera och ge råd till individer om studieval, yrken och yrkesval. Kompetensen innefattar också att organisera arbetsplatspraktik för elever, vilket syftar till att stödja dem i deras utbildnings- och karriärval.
broader: zmYu aAM TuF
related: jJF3 qaQ Zsh
related: oEmP NC1 sXE

Doktorsexamen, geovetenskapliga ämnen
type: Concept
in scheme: JobTech Taxonomy - Färdighet
definition: Doktorsexamen, geovetenskapliga ämnen
broader: Yrkesbevis/examen
related: Gm5j S2Y aTB
related: cYCo PxY zQd

Lokförarbevis
type: Concept
in scheme: JobTech Taxonomy - Färdighet
definition: Lokförarbevis och ett kompletterande intyg behövs, som styrker att du uppfyller vissa minimikrav, för att arbeta som lokförare. Beviset utfärdas av Transportstyrelsen och gäller i hela EU.
broader: Yrkesbevis/examen
related: nk6Z 5oD QoM
related: UGgc Vm9 Bog

Electronic News Gathering/ENG
type: Concept
in scheme: JobTech Taxonomy - Färdighet
definition: Electronic News Gathering/ENG
alternative label: ENG
alternative label: Electronic News Gathering
broader: zmYu aAM TuF
related: 4BsK q2C sCL
related: CkRH 4Qn iX3
related: 4Jty HpK a3Q

Genusvetenskap
type: Concept
in scheme: JobTech Taxonomy - Färdighet
definition: Genusvetenskap
broader: zmYu aAM TuF
related: sXgV QFg vpb

Doktorsexamen, tekniska ämnen
type: Concept
in scheme: JobTech Taxonomy - Färdighet
definition: Doktorsexamen, tekniska ämnen
broader: Yrkesbevis/examen
related: Gm5j S2Y aTB
related: cYCo PxY zQd

Språkstödjare, erfarenhet
type: Concept
in scheme: JobTech Taxonomy - Färdighet
definition: Språkstödjare, erfarenhet
broader: zmYu aAM TuF
related: C2342
related: jY19 knH MJp
related: C2330
related: C2341

Boktryck
type: Concept
in scheme: JobTech Taxonomy - Färdighet
definition: Boktryck
broader: zmYu aAM TuF
related: XeJB bkn mRn

Flygklarering
type: Concept
in scheme: JobTech Taxonomy - Färdighet
definition: Flygklarering innebär samordning och övervakning av flygtrafik, inklusive registrering av starter och landningar samt hantering av gods vid flygterminaler. Denna kompetens omfattar även beräkning av ankomsttider och ansvar för säker och effektiv trafikledning.
broader: zmYu aAM TuF
related: 957L kZK rHZ

Artificial Intelligence/Artificiell intelligens/AI
type: Concept
in scheme: JobTech Taxonomy - Färdighet
definition: Artificial Intelligence/Artificiell intelligens/AI
alternative label: AI
alternative label: Artificial Intelligence
alternative label: Artificiell intelligens
broader: zmYu aAM TuF
related: DJh5 yyF hEM
related: UxT1 tPF Kbg
related: 4Jty HpK a3Q
related: AHmo qSf viN
related: UXKZ 3zZ ipB

Specialisttandvård
type: Concept
in scheme: JobTech Taxonomy - Färdighet
definition: Specialisttandvård
broader: zmYu aAM TuF
related: 5dxv nVQ N8o

Elsäkerhetsledare
type: Concept
in scheme: JobTech Taxonomy - Färdighet
definition: Elsäkerhetsledare
broader: zmYu aAM TuF
related: MW1P GNJ 4F9
related: nDaB vdy eAy
related: SPYW 7Z1 ShT
related: a75S eLg JWH
related: yyF7 jsW EeP

Cello
type: Concept
in scheme: JobTech Taxonomy - Färdighet
definition: Cello
broader: wLYs CKS wK8
related: AWJF wqZ va9

Hunduppfödning
type: Concept
in scheme: JobTech Taxonomy - Färdighet
definition: Hunduppfödning
broader: zmYu aAM TuF
related: MSzH F2n Emb

Retuschering
type: Concept
in scheme: JobTech Taxonomy - Färdighet
definition: Retuschering
broader: zmYu aAM TuF
related: Vfum e6B 7Bw
related: 3J38 DNz YKK
related: 4Jty HpK a3Q

Psykologisk traumabehandling
type: Concept
in scheme: JobTech Taxonomy - Färdighet
definition: Psykologisk traumabehandling
broader: zmYu aAM TuF
related: UUQi UJ5 MSb
related: VYeq GDF a2g

Multimediajournalistik
type: Concept
in scheme: JobTech Taxonomy - Färdighet
definition: Multimediajournalistik
broader: zmYu aAM TuF
related: SgNH hag n9D

Korttidsfokuserad psykodynamisk terapi
type: Concept
in scheme: JobTech Taxonomy - Färdighet
definition: Korttidsfokuserad psykodynamisk terapi
broader: zmYu aAM TuF
related: VYeq GDF a2g

IWT, Internationell svetstekniker, yrkesdiplom
type: Concept
in scheme: JobTech Taxonomy - Färdighet
definition: IWT, Internationell svetstekniker, yrkesdiplom visar på kunskaper inom avancerade svetskonstruktioner. Yrkesdiplomet är för t ex svetsansvarig kontrollant, konstruktör eller de som jobbar med kvalitetssäkring. Yrkesdiplomet utfärdas av Svetskommissionen
alternative label: IWT
alternative label: International Welding Technician
alternative label: Internationell svetstekniker
broader: Svets-/lödarmetoder med verifierad kunskap
related: vaEp iBS c5h
related: wQ1E Bzk ZyA
related: PRQn 9yw NJA

Social service och omsorg, områdeskunskap
type: Concept
in scheme: JobTech Taxonomy - Färdighet
definition: Social service och omsorg, områdeskunskap avser kunskap om de sociala tjänster och omsorgsformer som erbjuds inom ett visst geografiskt område. Detta innefattar insikter om lokala resurser, behov och utmaningar samt potentiella samarbetsmöjligheter med olika aktörer inom socialt arbete och omsorg.
broader: zmYu aAM TuF
related: BWwk fYX S5B
related: coyZ Cyv Srw
related: NxXz fBh w7j
related: dJXy Rpq a2u
related: n6iX f2z XfE
related: wzeq No2 LF1
related: 5uP5 Ugw aVE
related: pok1 ipJ yzD

Folkhögskollärarexamen
type: Concept
in scheme: JobTech Taxonomy - Färdighet
definition: Folkhögskollärarexamenär en yrkesexamen på högskolenivå kopplad till utbildning med inriktning mot folkhögskollärare. Källa: UHR (Universitets- och högskolerådet)
broader: Yrkesbevis/examen
related: 2x2V UeL 6ke
related: 4KhP FxL uZ5

Pappersvaruarbete
type: Concept
in scheme: JobTech Taxonomy - Färdighet
definition: Pappersvaruarbete avser arbete med att tillverka produkter av papper, papp och kartong, vilket innefattar konstruktion och produktion av föremål som påsar, kartonger och kuvert.
broader: zmYu aAM TuF
related: iZLB KpD LLo

Motorcyklar
type: Concept
in scheme: JobTech Taxonomy - Färdighet
definition: Motorcyklar
broader: zmYu aAM TuF
related: Lzpv ofL 3H5
related: YKL2 FCB 1yr

Datorspråk
type: Concept
in scheme: JobTech Taxonomy - Färdighet
top concept of: JobTech Taxonomy - Färdighet
definition: Datorspråk
narrower: DHTML, programmeringsspråk
narrower: Modula-2, programmeringsspråk
narrower: PHP, programmeringsspråk
narrower: tkH5 VYd Y58
narrower: Shell, programmeringsspråk
narrower: JavaScript, programmeringsspråk
narrower: LabView, programmeringsspråk
narrower: PL/1, programmeringsspråk
narrower: wE24 qV6 pJV
narrower: Unix-script, programmeringsspråk
narrower: pwNB ces 8hN
narrower: Datalog, programmeringsspråk
narrower: xPii MYq v9r
narrower: SAS, programmeringsspråk
narrower: o8wR 57f jv9
narrower: z3Ln 9aJ DqN
narrower: Rust, programmeringsspråk
narrower: Clojurescript, programmeringsspråk
narrower: HTML, programmeringsspråk
narrower: Objective-C, programmeringsspråk
narrower: SGML, programmeringsspråk
narrower: Qbasic, programmeringsspråk
narrower: wkT5 VLV Uad
narrower: XUL, programmeringsspråk
narrower: APL, programmeringsspråk
narrower: OCaml, programmeringsspråk
narrower: Fortran, programmeringsspråk
narrower: Prolog, programmeringsspråk
narrower: yXg3 YoW xeC
narrower: rjP6 pCK AMw
narrower: Elixir, programmeringsspråk
narrower: Java Server Pages (JSP), programmeringsspråk
narrower: XAML, programmeringsspråk
narrower: F
narrower: ActionScript, programmeringsspråk
narrower: Interface Definition Language, programspråk
narrower: VHDL, programmeringsspråk
narrower: VB-script, programmeringsspråk
narrower: kUcK d6Y SEr
narrower: Apple-script, programmeringsspråk
narrower: y4QQ Uu9 Spg
narrower: XSD, programmeringsspråk
narrower: xfBk GnW pct
narrower: TypeScript, programmeringsspråk
narrower: AWK, programmeringsspråk
narrower: VRML, programmeringsspråk
narrower: SQL, frågespråk
narrower: FoxPro/xBase, programmeringsspråk
narrower: xLU5 TUM Gtw
narrower: UML, programmeringsspråk
narrower: ASP.NET, programmeringsspråk
narrower: Eiffel, programmeringsspråk
narrower: AJAX, programmeringsspråk
narrower: Java Enterprise Edition, programmeringsspråk
narrower: yNm8 krX usR
narrower: SPARQL, frågespråk
narrower: ADO.NET, programmeringsspråk
narrower: XSL, programmeringsspråk
narrower: Java, programmeringsspråk
narrower: Tcl/Tk, programmeringsspråk
narrower: CSS, stilmall
narrower: Lisp, programmeringsspråk
narrower: qfkh ZRK w4W
narrower: yMYG Niy Wy4
narrower: XSLT, programmeringsspråk
narrower: uLhB Tto EJ2
narrower: Apache Groovy, programmeringsspråk
narrower: Visual Basic.NET, programmeringsspråk
narrower: uX2D jot t1M
narrower: C#, programmeringsspråk
narrower: pKbW MiV xcJ
narrower: WML, programmeringsspråk
narrower: Scheme, programmeringsspråk
narrower: Smalltalk, programmeringsspråk
narrower: CUDA, programmeringsspråk

Bilar, produktkunskap
type: Concept
in scheme: JobTech Taxonomy - Färdighet
definition: Bilar, produktkunskap avser förståelse för olika bilmodeller, deras funktioner och egenskaper, samt information om tillbehör och service. Denna kompetens innefattar även kunskap om marknadstrender och kundpreferenser inom bilbranschen, vilket möjliggör effektiv kommunikation och rådgivning till kunder.
broader: zmYu aAM TuF
related: YKL2 FCB 1yr
related: M47D MU2 dhS

Krogshow
type: Concept
in scheme: JobTech Taxonomy - Färdighet
definition: Krogshow
broader: zmYu aAM TuF
related: AWJF wqZ va9
related: gmRr 7tt eHj

Elektronikkompetenser
type: Concept
in scheme: JobTech Taxonomy - Färdighet
top concept of: JobTech Taxonomy - Färdighet
definition: Elektronikkompetenser
narrower: Digital elektronik
narrower: Radioelektronik
narrower: Bilelektronik
narrower: sDc5 i8t jRg
narrower: z2xC xDc SsU
narrower: xsu7 fqi XH1
narrower: Optoelektronik

Realtidssystem
type: Concept
in scheme: JobTech Taxonomy - Färdighet
definition: Realtidssystem
broader: zmYu aAM TuF
related: nDaB vdy eAy
related: SPYW 7Z1 ShT
related: 4Jty HpK a3Q

Ortoptistutbildning
type: Concept
in scheme: JobTech Taxonomy - Färdighet
definition: Ortoptistutbildning är en vidareutbildning på universitet/högskola för ögonsjuksköterskor och optiker med inriktning mot arbete med samsynsproblematik och synnedsättningar.
broader: Yrkesbevis/examen
related: 6zAR EHM Kwj

Elevhälsa
type: Concept
in scheme: JobTech Taxonomy - Färdighet
definition: Elevhälsa
broader: zmYu aAM TuF
related: TPH4 2AM isT
related: UUQi UJ5 MSb
related: VYeq GDF a2g

Montering av finmekanik
type: Concept
in scheme: JobTech Taxonomy - Färdighet
definition: Montering av finmekanik avser processen att sammanfoga små, precisa komponenter inom finmekaniska system för att skapa funktionella enheter. Kompetensen kräver noggrannhet och precision för att säkerställa att varje del fungerar korrekt i helheten, vilket är avgörande i tillverkningen av tekniska produkter och apparater.
broader: zmYu aAM TuF
related: e6nk AGp y28
related: Kxm9 N3V shF

Mödravårdscentral/MVC
type: Concept
in scheme: JobTech Taxonomy - Färdighet
definition: Mödravårdscentral/MVC
broader: zmYu aAM TuF
related: 7XXd 4St nit

Religionsvetenskap/Teologi
type: Concept
in scheme: JobTech Taxonomy - Färdighet
definition: Religionsvetenskap/Teologi avser studiet av religionens olika aspekter, inklusive dess historiska, kulturella och sociala dimensioner, samt teologiska teorier och praktiker. Denna kompetens omfattar analys av heliga skrifter, religiösa traditioner och deras inverkan på samhällsutvecklingen, samt förmåga att förstå och tolka komplexa religiösa begrepp.
alternative label: Religionsvetenskap
alternative label: Teologi
broader: zmYu aAM TuF
related: x9mo 1VH Rps
related: AWJF wqZ va9
related: 2L2s EU8 PzR
related: sXgV QFg vpb

Asfaltteknik
type: Concept
in scheme: JobTech Taxonomy - Färdighet
definition: Asfaltteknik
broader: zmYu aAM TuF
related: thZP oR7 WrY
related: w6ud quG dgh
related: 7mn2 kA9 ftp
related: XeBP nMe pXx
related: bExu 8gk azk

Upphandlingsbestämmelser
type: Concept
in scheme: JobTech Taxonomy - Färdighet
definition: Upphandlingsbestämmelser avser regler och riktlinjer som styr hur offentlig och privat sektor ska genomföra upphandlingar av varor, tjänster och byggentreprenader.
broader: zmYu aAM TuF
related: 8A1f sxQ adT
related: NQTS fou E6u
related: Fu4x 7KG YgC
related: 8SPu K1k 5qR
related: pf1K PTz frm
related: 48KE fDE ryL
related: vPP6 rsw dck
related: coyZ Cyv Srw
related: NxXz fBh w7j
related: br6a VVS V3y
related: 7mn2 kA9 ftp
related: 33Nt DSs YYA
related: z8di AqX GBr
related: g6eC Fwu B3J
related: dUuh wwa FGj
related: mZsb A1K Gec
related: Pd51 xnr KCY
related: 4GAs rKs 2Ne
related: wby2 mwq fWV
related: uxst tkg zDh
related: X1Ac Y9P PJo
related: hZLv S5f jo2
related: DZVN v5g Fco
related: mpuA s56 Hsy
related: ETAR ggZ Wuw
related: 41KB bfk 5jR
related: sWzF 6pd Y6L
related: JfYV ZGg 6rm
related: 9QMD sZ3 ZjX
related: nNxJ YWy vR2
related: 1uau t1u rDL
related: vCAb uuo ek5
related: 9Mn4 PNA 7Yz
related: 85cq 6uK 4cK

Windows Powershell, systemutvecklingsverktyg
type: Concept
in scheme: JobTech Taxonomy - Färdighet
definition: Windows Powershell, systemutvecklingsverktyg, avser ett kraftfullt kommandoradsgränssnitt och skriptspråk som används för automatisering och hantering av systemadministration och IT-miljöer. Kompetensen omfattar kunskap om hur man skapar skript och använder cmdlets för att förenkla och effektivisera olika IT-processer.
alternative label: Power shell
alternative label: Windows Powershell
broader: Programmerings- och systemutvecklingsverktyg
related: DJh5 yyF hEM
related: 4Jty HpK a3Q
related: 13md uyV BNG
related: UXKZ 3zZ ipB
related: MYAz x9m 2LJ

Brandbevakning
type: Concept
in scheme: JobTech Taxonomy - Färdighet
definition: Brandbevakning
broader: zmYu aAM TuF
related: iqZh 3yX i8n

Yoga, cirkelledning
type: Concept
in scheme: JobTech Taxonomy - Färdighet
definition: Yoga, cirkelledning
broader: zmYu aAM TuF
related: 1CX5 mZw Vcq

Vinkunskap
type: Concept
in scheme: JobTech Taxonomy - Färdighet
definition: Vinkunskap
broader: zmYu aAM TuF
related: XFXX Jq9 Y2a
related: UjoW meY Zwt

Klockspel
type: Concept
in scheme: JobTech Taxonomy - Färdighet
definition: Klockspel
broader: wLYs CKS wK8
related: AWJF wqZ va9

Bild- och funktionsmedicin, specialistkompetens för läkare
type: Concept
in scheme: JobTech Taxonomy - Färdighet
definition: Bild- och funktionsmedicin, specialistkompetens för läkare
broader: Specialistbevis för läkare
related: nu7c QuB KVQ

Bedömning av reell kompetens/Valideringsbedömning
type: Concept
in scheme: JobTech Taxonomy - Färdighet
definition: Bedömning av reell kompetens
alternative label: Bedömning av reell kompetens
alternative label: Valideringsbedömning
broader: zmYu aAM TuF
related: 2x2V UeL 6ke
related: mcRJ kq2 jFr
related: 1CX5 mZw Vcq
related: cYCo PxY zQd
related: RPBE x5M cXX
related: 4KhP FxL uZ5
related: 4Jty HpK a3Q

Entity Framework Core, ramverk
type: Concept
in scheme: JobTech Taxonomy - Färdighet
definition: Entity Framework Core, ramverk
broader: srsj GQb CE1
related: cBBa ngH fCx
related: D9SL mtn vGM
related: DJh5 yyF hEM
related: 4Jty HpK a3Q
related: UXKZ 3zZ ipB

Yrkesmatematik, VVS
type: Concept
in scheme: JobTech Taxonomy - Färdighet
definition: Yrkesmatematik, VVS
broader: zmYu aAM TuF
related: fLKb bJ3 69p
related: 3UzE P8A 9sS
related: 4Jty HpK a3Q
related: bXfo 4hb SXx

Excenterpressning
type: Concept
in scheme: JobTech Taxonomy - Färdighet
definition: Excenterpressning avser en metod för att forma och bearbeta metall genom att applicera tryck med hjälp av en excenterpress.
broader: zmYu aAM TuF
related: vaEp iBS c5h

Trafikövervakarutbildning
type: Concept
in scheme: JobTech Taxonomy - Färdighet
definition: Trafikövervakarutbildning
broader: Yrkesbevis/examen
related: ayQ4 G3W A2w

Liedersång
type: Concept
in scheme: JobTech Taxonomy - Färdighet
definition: Liedersång
broader: Sång
related: AWJF wqZ va9

Plåtbearbetning
type: Concept
in scheme: JobTech Taxonomy - Färdighet
definition: Plåtbearbetning avser bearbetning och tillverkning av detaljer och konstruktioner av plåtmaterial, vilket kan inkludera olika metoder som klippning, formning, svetsning och montering av plåtdetaljer i metallkonstruktioner. Kompetensen omfattar både grovplåt och tunnplåt.
broader: zmYu aAM TuF
related: vaEp iBS c5h
related: wQ1E Bzk ZyA
related: TrwQ RXT W8a
related: q8Ho 3Xw sHq
related: L4hA SJP SFi

Systemintegrering
type: Concept
in scheme: JobTech Taxonomy - Färdighet
definition: Systemintegrering
broader: zmYu aAM TuF
related: cBBa ngH fCx
related: DJh5 yyF hEM
related: UxT1 tPF Kbg
related: 4Jty HpK a3Q
related: UXKZ 3zZ ipB

Logiförmedling
type: Concept
in scheme: JobTech Taxonomy - Färdighet
definition: Logiförmedling
broader: zmYu aAM TuF
related: fdLf oPp wVw

Trombon, undervisning musikskola
type: Concept
in scheme: JobTech Taxonomy - Färdighet
definition: Trombon, undervisning musikskola
broader: zmYu aAM TuF
related: mcRJ kq2 jFr

Sjukvårdsekonomi
type: Concept
in scheme: JobTech Taxonomy - Färdighet
definition: Sjukvårdsekonomi
broader: zmYu aAM TuF
related: WZCM nfS eAk

Verksamhetsledning, trossamfund
type: Concept
in scheme: JobTech Taxonomy - Färdighet
definition: Verksamhetsledning inom trossamfund innebär att leda, planera och samordna verksamheten i en församling eller inom ett trossamfund. Kompetensen omfattar att organisera och följa upp verksamhetens mål, ekonomi och personal samt att säkerställa att arbetet bedrivs i enlighet med trossamfundets värderingar och riktlinjer. Verksamhetsledning innefattar även att utveckla arbetsformer, skapa struktur för beslutsfattande och främja samarbete mellan olika funktioner och medlemmar. I rollen ingår ofta att hantera komplexa relationer mellan ideella och anställda, samt att balansera interna och externa krav, exempelvis från myndigheter eller finansiärer.
broader: zmYu aAM TuF
related: x9mo 1VH Rps

Podcast
type: Concept
in scheme: JobTech Taxonomy - Färdighet
definition: Podcast
broader: zmYu aAM TuF
related: SgNH hag n9D
related: k1Nx auG sNh
related: 4Jty HpK a3Q

Grävlastare
type: Concept
in scheme: JobTech Taxonomy - Färdighet
definition: Grävlastare
broader: zmYu aAM TuF
related: sX9n CWa KVC
related: LEvM 7Hs w8i
related: X7HR rZK 4wj
related: f71c gjL RDq

Auktoriserad Finansanalytiker AFA
type: Concept
in scheme: JobTech Taxonomy - Färdighet
definition: Auktoriserad Finansanalytiker AFA
broader: Yrkesbevis/examen
related: Bbkh nrm 2J8
related: pTr9 RBT 9ur

Concept art
type: Concept
in scheme: JobTech Taxonomy - Färdighet
definition: Concept art
broader: zmYu aAM TuF
related: 4BsK q2C sCL
related: 4Jty HpK a3Q
related: Mbt6 3ko DiD

Borrande skärning
type: Concept
in scheme: JobTech Taxonomy - Färdighet
definition: Borrande skärning
broader: zmYu aAM TuF
related: q2Ge zrQ zJb

Lyrisk koloratursopran
type: Concept
in scheme: JobTech Taxonomy - Färdighet
definition: Lyrisk koloratursopran
broader: Sång
related: AWJF wqZ va9

Kombimaskin
type: Concept
in scheme: JobTech Taxonomy - Färdighet
definition: Kombimaskin
broader: zmYu aAM TuF
related: KwVo sQu G2e

Förgyllning av trä
type: Concept
in scheme: JobTech Taxonomy - Färdighet
definition: Förgyllning av trä avser tekniken att applicera ett lager av guld eller guldliknande material på ytan av träföremål för att skapa dekorativa effekter. Kompetensen kräver noggrannhet och kunskap om olika förgyllningstekniker samt materialen som används för att uppnå önskat estetiskt resultat.
broader: zmYu aAM TuF
related: 34Tn BQQ tfo
related: aKdV u7V R5j
related: v7W3 cLQ q2S
related: 1Nwn GYH wkH
related: AUs8 M5f dLt

Företagsekonomi, undervisning
type: Concept
in scheme: JobTech Taxonomy - Färdighet
definition: Företagsekonomi, undervisning
broader: Inriktning på lärarkompetens
related: 2x2V UeL 6ke
related: 4KhP FxL uZ5

Yrkesutbildning, lokförare
type: Concept
in scheme: JobTech Taxonomy - Färdighet
definition: Yrkesutbildning, lokförare är en yrkeshögskoleutbildning med inriktning till lokförare.
broader: Yrkesutbildning
related: UGgc Vm9 Bog

Smärgelduksarbete
type: Concept
in scheme: JobTech Taxonomy - Färdighet
definition: Smärgelduksarbete
broader: zmYu aAM TuF
related: hxm6 xkr dHm

Mästarbrev, byggnadsplåtslagare
type: Concept
in scheme: JobTech Taxonomy - Färdighet
definition: Mästarbrev, byggnadsplåtslagare
broader: Yrkesbevis/examen
related: L4hA SJP SFi
related: bXfo 4hb SXx

Psykodrama
type: Concept
in scheme: JobTech Taxonomy - Färdighet
definition: Psykodrama
broader: zmYu aAM TuF
related: VYeq GDF a2g

Altfiol
type: Concept
in scheme: JobTech Taxonomy - Färdighet
definition: Altfiol
broader: wLYs CKS wK8
related: AWJF wqZ va9

Italienskt kök
type: Concept
in scheme: JobTech Taxonomy - Färdighet
definition: Italienskt kök
broader: zmYu aAM TuF
related: BStc SJh DKG

Inredningsvana, butiker
type: Concept
in scheme: JobTech Taxonomy - Färdighet
definition: Inredningsvana, butiker
broader: zmYu aAM TuF
related: 41KB bfk 5jR
related: CSUf ZVM a7Z

Smådjur, skötselvana
type: Concept
in scheme: JobTech Taxonomy - Färdighet
definition: Smådjur, skötselvana
broader: zmYu aAM TuF
related: Lrsj wRZ sFV
related: MSzH F2n Emb

IBM MQ
type: Concept
in scheme: JobTech Taxonomy - Färdighet
definition: IBM MQ
broader: Integrationsplattformar
related: BAeH eg8 T2d
related: cBBa ngH fCx
related: D9SL mtn vGM
related: DJh5 yyF hEM
related: 4Jty HpK a3Q
related: UXKZ 3zZ ipB
related: MYAz x9m 2LJ

Golvvård
type: Concept
in scheme: JobTech Taxonomy - Färdighet
definition: Golvvård
broader: zmYu aAM TuF
related: Z6TY xDf Yup

Forskning, erfarenhet
type: Concept
in scheme: JobTech Taxonomy - Färdighet
definition: Kompetens avser erfarenhet av att leda eller delta i forskning enligt vetenskaplig metod.
broader: Yrkesövergripande kompetenser
related: 4Jty HpK a3Q

Cover
type: Concept
in scheme: JobTech Taxonomy - Färdighet
definition: Cover
broader: p1WM wCw LTd
related: AWJF wqZ va9

Hopsättning, plast
type: Concept
in scheme: JobTech Taxonomy - Färdighet
definition: Hopsättning, plast
broader: zmYu aAM TuF
related: yPQ4 EaN Dtj
related: Kxm9 N3V shF

Vårdhygien, specialistkompetens för läkare
type: Concept
in scheme: JobTech Taxonomy - Färdighet
definition: Vårdhygien, specialistkompetens för läkare
broader: Specialistbevis för läkare
related: nu7c QuB KVQ

Reklamfilm, modellvana
type: Concept
in scheme: JobTech Taxonomy - Färdighet
definition: Reklamfilm, modellvana avser förmåga att agera framför kameran och utföra uppdrag som modell i reklamfilmer. Kompetensen inkluderar färdigheter i att framföra emotioner och gestikulera på ett sätt som passar produktens eller varumärkets budskap.
broader: zmYu aAM TuF
related: NCeZ rSk B4D

Cisco Certified Internetwork Expert/CCIE
type: Concept
in scheme: JobTech Taxonomy - Färdighet
definition: Cisco Certified Internetwork Expert/CCIE
alternative label: CCIE
alternative label: Cisco Certified Internetwork Expert
broader: s48H Sft DTn
related: BAeH eg8 T2d
related: Fv7d YhP YmS
related: VCpu 5EN bBt
related: fWrt sLg koW
related: 4Jty HpK a3Q
related: 13md uyV BNG

Eyelashdesign
type: Concept
in scheme: JobTech Taxonomy - Färdighet
definition: Eyelashdesign avser tekniken och färdigheten att skapa och applicera syntetiska eller naturliga fransar för att förbättra ögons utseende genom förlängning, volym eller formning. Kompetensen inkluderar kunskaper om olika fransmaterial, appliceringstekniker samt eftervård och underhåll av fransarna för att säkerställa kvalitet och hållbarhet.
broader: zmYu aAM TuF
related: ezKk kss CiQ

Byggstädning
type: Concept
in scheme: JobTech Taxonomy - Färdighet
definition: Byggstädning avser städ- och rengöringsåtgärder som genomförs efter bygg- eller renoveringsarbeten för att återställa en ren och säker miljö. Detta innefattar borttagning av byggavfall, damm, skräp och andra föroreningar som uppstår under byggprocessen.
broader: zmYu aAM TuF
related: Z6TY xDf Yup

Innovationsledning
type: Concept
in scheme: JobTech Taxonomy - Färdighet
definition: Innovationsledning avser att systematiskt leda och organisera innovationsprocesser inom en verksamhet. Det innebär att utveckla strategier, kulturer och strukturer som främjar nytänkande, kreativitet och kontinuerlig förbättring.
broader: zmYu aAM TuF
related: mp2Y vyC RFV
related: QG4f MCh vND

Saneringsteknik
type: Concept
in scheme: JobTech Taxonomy - Färdighet
definition: Saneringsteknik avser metoder och processer som används för att identifiera, hantera och avlägsna skadliga ämnen eller föroreningar från lokaler och miljöer. Detta inkluderar åtgärder för att sanera platser efter olyckor, utsläpp eller skadeangrepp, samt åtgärder för att avlägsna ohälsosamma material som asbest eller mögel.
broader: zmYu aAM TuF
related: idjo 2Wr a3E
related: yXbD NTH ijE
related: L4hA SJP SFi

Doktorsexamen, data- och systemvetenskapliga ämnen
type: Concept
in scheme: JobTech Taxonomy - Färdighet
definition: Doktorsexamen, data- och systemvetenskapliga ämnen
broader: Yrkesbevis/examen
related: Gm5j S2Y aTB
related: cYCo PxY zQd
related: AHmo qSf viN

Utbildning i diagnostisk cytologi
type: Concept
in scheme: JobTech Taxonomy - Färdighet
definition: Utbildning i diagnostisk cytologi. Utbildningen avser vidareutbildning för biomedicinska analytiker.
broader: Yrkesbevis/examen
related: wNrt Ysj WuT

Caesar, affärssystem
type: Concept
in scheme: JobTech Taxonomy - Färdighet
definition: Caesar, affärssystem
alternative label: Caesar
broader: xSJR 1Kq pxB
related: eQ4M CNm ozj
related: iWcY mko rq2
related: q81z 3oD 1qu
related: ij8k EwC zyB
related: 4Jty HpK a3Q

Tillverkningsvana, inredningssnickerier
type: Concept
in scheme: JobTech Taxonomy - Färdighet
definition: Tillverkningsvana, inredningssnickerier avser färdighet i att tillverka och reparera snickeriarbeten som inredningar och möbler. Kompetensen omfattar arbetet med olika träprodukter och kräver teknisk kunskap samt hantverksmässig skicklighet.
broader: zmYu aAM TuF
related: 1Nwn GYH wkH

Forskningsfinansiering
type: Concept
in scheme: JobTech Taxonomy - Färdighet
definition: Forskningsfinansiering innebär att hantera och navigera processer för att söka och administrera forskningsmedel och bidrag. Det innefattar att kartlägga finansieringsmöjligheter, skriva ansökningar, följa regler och riktlinjer, samt administrera och rapportera på pågående projekt. Kompetensen kräver strategiskt arbete för att säkerställa resurser till forskning och att koordinera kontakter med finansiärer och forskare.
broader: zmYu aAM TuF
related: oEmP NC1 sXE
related: P7eS nP8 3dy

Konfekt, tillverkningsvana
type: Concept
in scheme: JobTech Taxonomy - Färdighet
definition: Konfekt, tillverkningsvana
broader: zmYu aAM TuF
related: 5qT8 z9d 8rw

Active X, standard
type: Concept
in scheme: JobTech Taxonomy - Färdighet
definition: Active X, standard
broader: zmYu aAM TuF
related: DJh5 yyF hEM
related: 4Jty HpK a3Q

Mässförsäljning
type: Concept
in scheme: JobTech Taxonomy - Färdighet
definition: Mässförsäljning
broader: zmYu aAM TuF
related: oXSW fbY XrY

Golfbaneskötsel
type: Concept
in scheme: JobTech Taxonomy - Färdighet
definition: Golfbaneskötsel är det arbete som krävs för att skapa bra spelytor och starkt gräs.
broader: zmYu aAM TuF
related: XBh3 Xrm C4R

Metalltryckning
type: Concept
in scheme: JobTech Taxonomy - Färdighet
definition: Metalltryckning
broader: zmYu aAM TuF
related: vaEp iBS c5h

Barbershop
type: Concept
in scheme: JobTech Taxonomy - Färdighet
definition: Barbershop
broader: p1WM wCw LTd
related: AWJF wqZ va9

Textning, cirkelledning
type: Concept
in scheme: JobTech Taxonomy - Färdighet
definition: Textning, cirkelledning
broader: zmYu aAM TuF
related: 1CX5 mZw Vcq

Garntillverkning
type: Concept
in scheme: JobTech Taxonomy - Färdighet
definition: Garntillverkning
broader: zmYu aAM TuF
related: aKdV u7V R5j
related: skLS kpa Ui1

Prediktiv analys
type: Concept
in scheme: JobTech Taxonomy - Färdighet
definition: Prediktiv analys
broader: zmYu aAM TuF
related: jv1x tpK 32p
related: DJh5 yyF hEM
related: 4Jty HpK a3Q
related: UXKZ 3zZ ipB

Fjällräddarutbildning
type: Concept
in scheme: JobTech Taxonomy - Färdighet
definition: Fjällräddarutbildning
broader: zmYu aAM TuF
related: ayQ4 G3W A2w
related: rNcE Zno pD8

Armeringsbockning, station
type: Concept
in scheme: JobTech Taxonomy - Färdighet
definition: Armeringsbockning, station
broader: zmYu aAM TuF
related: q2Ge zrQ zJb

Församlingsadministration
type: Concept
in scheme: JobTech Taxonomy - Färdighet
definition: Församlingsadministration
broader: zmYu aAM TuF
related: eQ4M CNm ozj

Stränggjutning, plast
type: Concept
in scheme: JobTech Taxonomy - Färdighet
definition: Stränggjutning, plast
broader: zmYu aAM TuF
related: UcNa inr snV

Politisk journalistik
type: Concept
in scheme: JobTech Taxonomy - Färdighet
definition: Politisk journalistik
broader: zmYu aAM TuF
related: SgNH hag n9D

Mono, programmeringsverktyg
type: Concept
in scheme: JobTech Taxonomy - Färdighet
definition: Mono, programmeringsverktyg
alternative label: Mono
broader: Programmerings- och systemutvecklingsverktyg
related: D9SL mtn vGM
related: DJh5 yyF hEM
related: 4Jty HpK a3Q
related: MYAz x9m 2LJ

Ceremoniell musik
type: Concept
in scheme: JobTech Taxonomy - Färdighet
definition: Ceremoniell musik
broader: p1WM wCw LTd
related: AWJF wqZ va9

Datautvinning
type: Concept
in scheme: JobTech Taxonomy - Färdighet
definition: Datautvinning
alternative label: Data mining
alternative label: Information mining
alternative label: Informationsutvinning
broader: zmYu aAM TuF
related: wVfo Njx 1rB
related: jv1x tpK 32p
related: DJh5 yyF hEM
related: WX67 Pfb WMN
related: 4Jty HpK a3Q

Cellulosaprodukter
type: Concept
in scheme: JobTech Taxonomy - Färdighet
definition: Cellulosaprodukter
broader: zmYu aAM TuF
related: oXSW fbY XrY
related: 85cq 6uK 4cK

Epidemiologi
type: Concept
in scheme: JobTech Taxonomy - Färdighet
definition: Epidemiologi
broader: zmYu aAM TuF
related: jv1x tpK 32p
related: puim 6PY DGj
related: rE1E m3d cx1
related: nuXg Wjc JPd
related: sXgV QFg vpb

Bärodling
type: Concept
in scheme: JobTech Taxonomy - Färdighet
definition: Bärodling avser odling av bärväxter för produktion av bär, vilket innefattar hela processen från plantering och skötsel till skörd av bären. Kompetensen omfattar kunskap om olika bärsorter och odlingsmetoder för att optimera avkastningen och bevara bärens kvalitet.
broader: zmYu aAM TuF
related: XBh3 Xrm C4R
related: XurM DVs ggn
related: yXbD NTH ijE
related: 2xQ4 4kh kTZ
related: k3R3 UkC nK2

Skadeståndsrätt
type: Concept
in scheme: JobTech Taxonomy - Färdighet
definition: Skadeståndsrätt
broader: zmYu aAM TuF
related: q8wL kdi WaW
related: br6a VVS V3y
related: 6aak 8eh iwT
related: DZVN v5g Fco
related: JfYV ZGg 6rm

Riggning, ställ
type: Concept
in scheme: JobTech Taxonomy - Färdighet
definition: Riggning, ställ avser den kompetens som innefattar att förbereda och justera maskiner för produktion av olika material, vilket innebär att ställa in och optimera maskiner för att säkerställa korrekt funktion och produktionseffektivitet. Kompetensen omfattar även programering och övervakning av automationssystem som bearbetar arbetsstyckeni.
broader: zmYu aAM TuF
related: vaEp iBS c5h
related: yPQ4 EaN Dtj

Användarsupport, mjukvara
type: Concept
in scheme: JobTech Taxonomy - Färdighet
definition: Användarsupport, mjukvara avser kompetensen att ge hjälp och stöd till användare av mjukvarusystem. Denna kompetens innefattar felsökning, vägledning och utbildning för att säkerställa korrekt användning av mjukvaran och lösa uppkomna problem.
broader: zmYu aAM TuF
related: hmaC cfi UKg
related: df9D e6y 61z
related: 1CX5 mZw Vcq
related: fWrt sLg koW
related: 4Jty HpK a3Q
related: 13md uyV BNG

Internrevision
type: Concept
in scheme: JobTech Taxonomy - Färdighet
definition: Internrevision
broader: zmYu aAM TuF
related: cRmd 536 pT1

Ljusbord-GrandMA
type: Concept
in scheme: JobTech Taxonomy - Färdighet
definition: Ljusbord-GrandMA
broader: zmYu aAM TuF
related: 4BsK q2C sCL

Läkemedelslagstiftning
type: Concept
in scheme: JobTech Taxonomy - Färdighet
definition: Läkemedelslagstiftning
broader: zmYu aAM TuF
related: Fu4x 7KG YgC
related: 41Az ioZ rmH
related: TMsM oNw j6z

Elteknik
type: Concept
in scheme: JobTech Taxonomy - Färdighet
definition: Elteknik
broader: zmYu aAM TuF
related: 4BsK q2C sCL
related: 4Jty HpK a3Q

Daktning
type: Concept
in scheme: JobTech Taxonomy - Färdighet
definition: Daktning avser kriminalteknisk process som innebär registrering och dokumentation av en persons biometriska uppgifter, främst fingeravtryck. Arbetet utförs vanligtvis av polis, arrestantvakter och andra rättsvårdande yrkesgrupper i samband med en brottsutredning eller identitetskontroll.
broader: zmYu aAM TuF
related: hgAg gLr YGg
related: rNcE Zno pD8

Objektorienterad metodik
type: Concept
in scheme: JobTech Taxonomy - Färdighet
definition: Objektorienterad metodik
broader: zmYu aAM TuF
related: cBBa ngH fCx
related: DJh5 yyF hEM
related: UxT1 tPF Kbg
related: 4Jty HpK a3Q
related: UXKZ 3zZ ipB

IWI, Internationell svetsinspektör, yrkesdiplom
type: Concept
in scheme: JobTech Taxonomy - Färdighet
definition: IWI, Internationell svetsinspektör, yrkesdiplom
alternative label: IWI
alternative label: Internationell svetsinspektö
broader: Svets-/lödarmetoder med verifierad kunskap
related: vaEp iBS c5h
related: wQ1E Bzk ZyA
related: PRQn 9yw NJA

Mästarbrev, broderi/konstbroderi
type: Concept
in scheme: JobTech Taxonomy - Färdighet
definition: Mästarbrev, broderi/konstbroderi
alternative label: Mästarbrev, broderi
alternative label: Mästarbrev, konstbroderi
broader: Yrkesbevis/examen
related: UZBj yDX Ctp
related: aKdV u7V R5j

Fartygselektriker (behörighet)
type: Concept
in scheme: JobTech Taxonomy - Färdighet
definition: Fartygselektriker (behörighet)
broader: Behörigheter, sjöfart
related: a75S eLg JWH

Friskvård, professionell rådgivning
type: Concept
in scheme: JobTech Taxonomy - Färdighet
definition: Friskvård, professionell rådgivning innebär att ge vägledning och stöd för att främja individuell hälsa och välbefinnande genom skräddarsydda friskvårdsprogram och livsstilsförändringar. Kompetensen omfattar kunskaper om hälsopromotion och prevention samt förmåga att analysera och utvärdera individuella behov och mål för att utveckla effektiva strategier för hälsofrämjande insatser.
broader: zmYu aAM TuF
related: FpPP jqK xzT
related: vPP6 rsw dck
related: aA2Z 9XX R1v

Bevattningsteknik
type: Concept
in scheme: JobTech Taxonomy - Färdighet
definition: Bevattningsteknik
broader: zmYu aAM TuF
related: XurM DVs ggn
related: fLKb bJ3 69p

Butiksledning, dagligvaror
type: Concept
in scheme: JobTech Taxonomy - Färdighet
definition: Butiksledning, dagligvaror avser processen att leda och organisera verksamheten i butiker som säljer dagligvaror. Kompetensen omfattar ansvar för drift, personalledning, planering och budget, samt strategisk utveckling av verksamheten enligt definierade mål och riktlinjer.
broader: zmYu aAM TuF
related: Fu4x 7KG YgC
related: Fp7x Yqt bx9

Hjärtsjukvård, specialistområde för sjuksköterska
type: Concept
in scheme: JobTech Taxonomy - Färdighet
definition: En fördjupad specialistkompetens för sjuksköterska inom hjärtsjukvård.
broader: Specialistområde för sjuksköterska
related: 6zAR EHM Kwj

Agila arbetsmetoder
type: Concept
in scheme: JobTech Taxonomy - Färdighet
definition: Agila arbetsmetoder avser en flexibel och iterativ metodik för projektledning och produktutveckling där fokus ligger på kontinuerlig förbättring, samarbete och anpassning till förändringar. Kompetensen omfattar principer och tekniker som möjliggör snabbare leverans av värde i projekt genom att involvera kunder tidigt och ofta, vilket leder till mer anpassade och effektiva lösningar inom områden som mjukvaru- och systemutveckling, systemanalys och IT-arkitektur.
broader: Programmerings- och systemutvecklingsverktyg
related: D9SL mtn vGM
related: DJh5 yyF hEM
related: UxT1 tPF Kbg
related: 4Jty HpK a3Q
related: UXKZ 3zZ ipB
related: MYAz x9m 2LJ

Lyftbesiktning
type: Concept
in scheme: JobTech Taxonomy - Färdighet
definition: Lyftbesiktning avser systematisk kontroll och bedömning av lyftanordningar för att säkerställa att dessa uppfyller aktuella säkerhetsstandards och föreskrifter. Kompetensen kräver förståelse för lyftteknik, säkerhetsrisker och tillämpliga lagar och regler som styr lyftverksamheten, enligt Arbetsmiljöverket.
broader: zmYu aAM TuF
related: nuXg Wjc JPd

Modeteckning
type: Concept
in scheme: JobTech Taxonomy - Färdighet
definition: Modeteckning
broader: zmYu aAM TuF
related: 34Tn BQQ tfo

Utbildning, flyget
type: Concept
in scheme: JobTech Taxonomy - Färdighet
definition: Utbildning, flyget
broader: zmYu aAM TuF
related: jXUQ rUV iBv
related: dhgR 9jk 95r
related: KiVA anS RJh

Kristerapi
type: Concept
in scheme: JobTech Taxonomy - Färdighet
definition: Kristerapi
broader: zmYu aAM TuF
related: VYeq GDF a2g

Bröd, produktkunskap/Konditorivaror, produktkunskap
type: Concept
in scheme: JobTech Taxonomy - Färdighet
definition: Bröd, produktkunskap/Konditorivaror, produktkunskap
alternative label: Bröd, produktkunskap
alternative label: Konditorivaror, produktkunskap
broader: zmYu aAM TuF
related: s1Qk o98 2o1
related: 1wqU Jhj amb

Gipsgjutning
type: Concept
in scheme: JobTech Taxonomy - Färdighet
definition: Gipsgjutning
broader: zmYu aAM TuF
related: aKdV u7V R5j
related: o31g CX1 qhQ

Kompetensintyg, träteknisk kompetens
type: Concept
in scheme: JobTech Taxonomy - Färdighet
definition: Kompetensintyg, träteknisk kompetens Källa: www.tracentrum.se
broader: s48H Sft DTn
related: VKKg e4t t46

Partikelfysik
type: Concept
in scheme: JobTech Taxonomy - Färdighet
definition: Partikelfysik
broader: zmYu aAM TuF
related: KM7d Z6Y LCJ

Förvaltningsrätt
type: Concept
in scheme: JobTech Taxonomy - Färdighet
definition: Förvaltningsrätt
broader: zmYu aAM TuF
related: vPP6 rsw dck
related: br6a VVS V3y
related: JfYV ZGg 6rm
related: ZQiZ 6Kd D3a

Marathon, affärssystem
type: Concept
in scheme: JobTech Taxonomy - Färdighet
definition: Marathon, affärssystem
alternative label: Marathon
broader: xSJR 1Kq pxB
related: eQ4M CNm ozj
related: iWcY mko rq2
related: q81z 3oD 1qu
related: ij8k EwC zyB
related: 4Jty HpK a3Q

3D-grafik-Smith Micro Poser Pro
type: Concept
in scheme: JobTech Taxonomy - Färdighet
definition: 3D-grafik-Smith Micro Poser Pro
broader: Programvara för digitalt skapande
related: 8Bmh vtM zts
related: 34Tn BQQ tfo
related: Q5DF juj 8do
related: 4Jty HpK a3Q
related: LeQV umf wUS
related: Mbt6 3ko DiD

Blockkedjeteknik
type: Concept
in scheme: JobTech Taxonomy - Färdighet
definition: Teknik för hantering av blockkedjor. En blockkedja, på engelska blockchain, är en distribuerad (decentraliserad) databas, det vill säga en databas som lagras i många kopior - en på varje nod (dator) i ett peer-to-peer-nätverk.
alternative label: Block Chain
alternative label: Block Chain Technology
alternative label: Blockchain
alternative label: Blockchain Technology
broader: zmYu aAM TuF
related: BAeH eg8 T2d
related: DJh5 yyF hEM
related: 4Jty HpK a3Q
related: UXKZ 3zZ ipB

Hårdslöjd, konsulenterfarenhet
type: Concept
in scheme: JobTech Taxonomy - Färdighet
definition: Hårdslöjd, konsulenterfarenhet
broader: zmYu aAM TuF
related: mcRJ kq2 jFr
related: 1CX5 mZw Vcq

Sprängkort, undervattenssprängning
type: Concept
in scheme: JobTech Taxonomy - Färdighet
definition: Sprängkort, undervattenssprängning
broader: s48H Sft DTn
related: DPPw 4wa AsH

Göteborgska
type: Concept
in scheme: JobTech Taxonomy - Färdighet
definition: Göteborgska
broader: Dialekt
related: iBUL s38 izZ

Sportskytte, instruktör/Sportskytte, tränare
type: Concept
in scheme: JobTech Taxonomy - Färdighet
definition: Sportskytte, instruktör/Sportskytte, tränare
alternative label: Sportskytte, instruktör
alternative label: Sportskytte, tränare
broader: Idrott/aktivitet
related: EA6o N1N QtT

Avslappningsövningar, ledarerfarenhet
type: Concept
in scheme: JobTech Taxonomy - Färdighet
definition: Avslappningsövningar, ledarerfarenhet
broader: zmYu aAM TuF
related: aA2Z 9XX R1v

Föreläsningsvana
type: Concept
in scheme: JobTech Taxonomy - Färdighet
definition: Föreläsningsvana
broader: zmYu aAM TuF
related: iBUL s38 izZ
related: mNoS AN5 drn
related: 34Tn BQQ tfo
related: fsnw ZCu v2U
related: jJF3 qaQ Zsh
related: bjqk F3A 5Hk

Line Maintenance
type: Concept
in scheme: JobTech Taxonomy - Färdighet
definition: Line Maintenance
broader: zmYu aAM TuF
related: iGTu bYL 2T7
related: eRkT cTv H9v

Brottning, instruktör/Brottning, tränare
type: Concept
in scheme: JobTech Taxonomy - Färdighet
definition: Brottning, instruktör/Brottning, tränare
alternative label: Brottning, instruktör
alternative label: Brottning, tränare
broader: Idrott/aktivitet
related: EA6o N1N QtT

Fjärrpilotcertifikat, drönaroperatör, certifierad kategori
type: Concept
in scheme: JobTech Taxonomy - Färdighet
definition: Fjärrpilotcertifikat, drönaroperatör, certifierad kategori
broader: s48H Sft DTn
related: C3153
related: 7n3y FTE qSe
related: 4Jty HpK a3Q

FYSS
type: Concept
in scheme: JobTech Taxonomy - Färdighet
definition: FYSS
broader: zmYu aAM TuF
related: EA6o N1N QtT

Fartygsbefäl klass VII (behörighet)
type: Concept
in scheme: JobTech Taxonomy - Färdighet
definition: Fartygsbefäl klass VII (behörighet)
broader: Behörigheter, sjöfart
related: kZwz D8K bKs
related: FKCE Anf zGH
related: kDnq Q98 sD3

Butiksvana, fackhandel
type: Concept
in scheme: JobTech Taxonomy - Färdighet
definition: Butiksvana, fackhandel avser erfarenhet och kunskap inom detaljhandeln, specifikt i specialiserade butiksmiljöer där varor säljs direkt till konsument. Detta innefattar förståelse för produktutbud, kundinteraktion och försäljningsprocesser, inklusive hantering av varor och betalningar.
broader: zmYu aAM TuF
related: Lzpv ofL 3H5
related: Fp7x Yqt bx9
related: dUuh wwa FGj
related: YKL2 FCB 1yr
related: AQrL tTu Wbg

Applikationsplattformar
type: Concept
in scheme: JobTech Taxonomy - Färdighet
top concept of: JobTech Taxonomy - Färdighet
definition: Applikationsplattformar
narrower: Windows Azure, molnplattform
narrower: mYLj nHM zSE
narrower: oisM 5jo EVb
narrower: Weblogic Server, applikationsplattform
narrower: IBM Cloud, molnplattform
narrower: Oracle JCAPS, applikationsplattform
narrower: Apache Kafka, streaming-plattform
narrower: Google Cloud Platform, molnplattform
narrower: IIS, webbserverprogram
narrower: Sun Java Enterprise System, webbserverprogram
narrower: Office SharePoint Server (MOSS), applikationsplattform
narrower: JBoss Application Server, applikationsplattform
narrower: SAP, applikationsplattform
narrower: Docker, container-plattform
narrower: Amazon Web Services (AWS), molnplattform
narrower: Glassfish Server, applikationsplattform
narrower: Windows Server, applikationsplattform
narrower: IBM WebSphere, applikationsplattform
narrower: Apache Tomcat, webbserverprogram

Ordböcker
type: Concept
in scheme: JobTech Taxonomy - Färdighet
definition: Ordböcker
broader: zmYu aAM TuF
related: PQDm Z63 zst
related: zfve s6G tpc

Neonatologi, specialistkompetens för läkare
type: Concept
in scheme: JobTech Taxonomy - Färdighet
definition: Neonatologi, specialistkompetens för läkare
broader: Specialistbevis för läkare
related: nu7c QuB KVQ

Oförstörande provning: Röntgenprovning (RT)
type: Concept
in scheme: JobTech Taxonomy - Färdighet
definition: Oförstörande provning: Röntgenprovning (RT)
broader: zmYu aAM TuF
related: Lzpv ofL 3H5
related: K8yg U4C gkY
related: iGTu bYL 2T7
related: eRkT cTv H9v

Tankefältsterapi
type: Concept
in scheme: JobTech Taxonomy - Färdighet
definition: Tankefältsterapi
broader: zmYu aAM TuF
related: F19Z oB6 pg3

Påklädning, teater
type: Concept
in scheme: JobTech Taxonomy - Färdighet
definition: Påklädning, teater
broader: zmYu aAM TuF
related: PH2M uV4 r72

Oförstörande provning: Täthetsprovning (LT)
type: Concept
in scheme: JobTech Taxonomy - Färdighet
definition: Oförstörande provning: Täthetsprovning (LT)
broader: zmYu aAM TuF
related: Lzpv ofL 3H5
related: K8yg U4C gkY
related: iGTu bYL 2T7
related: eRkT cTv H9v

Installation av ej EU-typgodkända gasapparater
type: Concept
in scheme: JobTech Taxonomy - Färdighet
definition: Installation av ej EU-typgodkända gasapparater
broader: s48H Sft DTn
related: KttZ Skc bMR

Yrkehögskolesutbildning, fukttekniker
type: Concept
in scheme: JobTech Taxonomy - Färdighet
definition: Yrkehögskolesutbildning, fukttekniker är en yrkeshögskoleutbildning med inriktning till fukttekniker.
broader: Yrkesutbildning
related: wCx8 rY3 XUT

Yrkesutbildning, skomakeri
type: Concept
in scheme: JobTech Taxonomy - Färdighet
definition: Yrkesutbildning, skomakeri är en yrkeshögskoleutbildning med inriktning till skomakare.
broader: Yrkesutbildning
related: vJQk YvC XB7

Rekonditionering av hjälpmedel
type: Concept
in scheme: JobTech Taxonomy - Färdighet
definition: Rekonditionering av hjälpmedel avser processen att återställa och reparera hjälpmedel för att säkerställa deras funktion och säkerhet. Detta inkluderar rengöring, justeringer och reparationer för att förlänga livslängden och förbättra användbarheten av tekniska hjälpmedel för personer med funktionsnedsättning.
broader: zmYu aAM TuF
related: e6nk AGp y28

Portföljvalsteori
type: Concept
in scheme: JobTech Taxonomy - Färdighet
definition: Portföljvalsteori
broader: zmYu aAM TuF
related: WZCM nfS eAk

Övriga specialiteter, sjöfart
type: Concept
in scheme: JobTech Taxonomy - Färdighet
top concept of: JobTech Taxonomy - Färdighet
definition: Övriga specialiteter, sjöfart
narrower: Offshore
narrower: Bogserfartyg
narrower: Städvana, hotell
narrower: Fartygsunderhåll
narrower: VVS, fartygserfarenhet
narrower: tLaY yVU 9uF
narrower: kYXT aUz axk
narrower: Arbetsledning, sjöfart
narrower: Skärgårdsfartyg
narrower: Fartygssäkerhet
narrower: Ombordservicepersonal, sjöfart
narrower: Fartygsstabilitet
narrower: Provianteringsvana, fartygskök
narrower: Isbrytare
narrower: Fartygsel
narrower: Elmaskinisterfarenhet
narrower: Ångfartyg
narrower: Torrlastfartyg
narrower: Administrativt arbete, fartygserfarenhet
narrower: ong5 Wb8 dTU
narrower: Fartygsnavigering
narrower: qukw pxR 7qM
narrower: Passagerarfartyg
narrower: Restaurangvana, fartygserfarenhet
narrower: Butiksvana, fartygserfarenhet
narrower: Hotellvana, fartygserfarenhet
narrower: pERs YHa Ssv
narrower: vxPD 87A wmk
narrower: t6jQ DTS zMr
narrower: Kommunikation, sjöfart
narrower: Segelfartyg
narrower: rdtv EuD NfB
narrower: Köksvana, fartygserfarenhet
narrower: Kockmatros, erfarenhet

Virkessortering
type: Concept
in scheme: JobTech Taxonomy - Färdighet
definition: Virkessortering avser processen att kategorisera och klassificera virke baserat på olika kriterier såsom kvalitet, storlek och typ. Denna kompetens omfattar även kunskap om hantering och lagring av virke för att optimera dess användning.
broader: zmYu aAM TuF
related: UdrS qzV P7i

Dykledning
type: Concept
in scheme: JobTech Taxonomy - Färdighet
definition: Dykledning
broader: zmYu aAM TuF
related: DPPw 4wa AsH
related: EA6o N1N QtT
related: FKCE Anf zGH

IBM Lotus Notes
type: Concept
in scheme: JobTech Taxonomy - Färdighet
definition: IBM Lotus Notes
broader: Allmänna datakunskaper
related: eQ4M CNm ozj
related: Y6yY SuR hVh
related: Uw4n UB2 RCW
related: fdLf oPp wVw
related: vPP6 rsw dck
related: iWcY mko rq2
related: ZQTR hVC QhJ
related: br6a VVS V3y
related: 1CX5 mZw Vcq
related: L7eh ihX vM5
related: MGk3 LvL AU2
related: jJF3 qaQ Zsh
related: oEmP NC1 sXE
related: bjqk F3A 5Hk
related: H2Zj eL9 x28
related: dJXy Rpq a2u
related: pwRH MT1 8nR
related: cRmd 536 pT1
related: zKvJ GnC Szx
related: n6iX f2z XfE
related: DZVN v5g Fco
related: ij8k EwC zyB
related: JfYV ZGg 6rm
related: vCAb uuo ek5
related: 4Jty HpK a3Q
related: p16X 44f rwZ
related: pok1 ipJ yzD

Legitimation som sjukhusfysiker
type: Concept
in scheme: JobTech Taxonomy - Färdighet
definition: Legitimation som krävs för att kunna arbeta som sjukhusfysiker i Sverige. Utfärdas av Socialstyrelsen.
broader: Yrkesbevis/examen
related: 4P8B LtK JgE
related: r1Gk 3EN bpw
related: KM7d Z6Y LCJ

Legitimation som biomedicinsk analytiker
type: Concept
in scheme: JobTech Taxonomy - Färdighet
definition: Legitimation som krävs för att kunna arbeta som biomedicinsk analytiker i Sverige. Utfärdas av Socialstyrelsen.
broader: Yrkesbevis/examen
related: wNrt Ysj WuT
related: 4P8B LtK JgE
related: r1Gk 3EN bpw
related: bExu 8gk azk

Matematisk statistik
type: Concept
in scheme: JobTech Taxonomy - Färdighet
definition: Matematisk statistik
broader: zmYu aAM TuF
related: YHwG fk2 MDL
related: jv1x tpK 32p
related: ZA1N Z2B nFQ
related: 4Jty HpK a3Q

Lärarexamen inr senare år
type: Concept
in scheme: JobTech Taxonomy - Färdighet
definition: Lärarexamen inr senare år
broader: Yrkesbevis/examen
related: 2x2V UeL 6ke
related: oQUQ D11 HPx

Jazzdans
type: Concept
in scheme: JobTech Taxonomy - Färdighet
definition: Jazzdans
broader: Dans
related: gmRr 7tt eHj

Taxiförarlegitimation
type: Concept
in scheme: JobTech Taxonomy - Färdighet
definition: Legitimation som krävs för att kunna arbeta som taxiförare i Sverige. Utfärdas av Transportstyrelsen.
broader: Yrkesbevis/examen
related: ffz2 2n3 R7g
related: 4P8B LtK JgE

Inbrottslarm, installationsvana
type: Concept
in scheme: JobTech Taxonomy - Färdighet
definition: Inbrottslarm, installationsvana avser kompetens inom installation och konfiguration av inbrottslarmssystem. Den innefattar kunskap om elektronik och systemintegration för att säkerställa korrekt drift och funktion av larm och säkerhetssystem.
broader: zmYu aAM TuF
related: fWrt sLg koW
related: 4Jty HpK a3Q

CNC-styrsystem, underhåll
type: Concept
in scheme: JobTech Taxonomy - Färdighet
definition: CNC-styrsystem, underhåll
broader: zmYu aAM TuF
related: KttZ Skc bMR
related: 4Jty HpK a3Q

Gesällbrev, köttyrket i detaljhandeln/köttmästare
type: Concept
in scheme: JobTech Taxonomy - Färdighet
definition: Gesällbrev, köttyrket i detaljhandeln/köttmästare är ett bevis på att en hantverkare har genomgått utbildning och avlagt de delprov som krävs inom det specifika hantverksyrket, och därigenom uppnått ett erkännande av färdigheter och kompetens inom yrket. Utfärdas av Sveriges hantverksråd i samråd med aktuell branschorganisation.
alternative label: Gesällbrev, köttyrket i detaljhandeln
alternative label: Gesällbrev, köttyrket i köttmästare
broader: Yrkesbevis/examen
related: Fp7x Yqt bx9
related: s1Qk o98 2o1

Poseringsvana, kroki
type: Concept
in scheme: JobTech Taxonomy - Färdighet
definition: Poseringsvana, kroki
broader: zmYu aAM TuF
related: NCeZ rSk B4D

Utbildning, särskilda konstruktioner
type: Concept
in scheme: JobTech Taxonomy - Färdighet
definition: Utbildning, särskilda konstruktioner
broader: s48H Sft DTn
related: Y4j1 P17 wVA

Barn- och fritidsprogrammet
type: Concept
in scheme: JobTech Taxonomy - Färdighet
definition: Barn- och fritidsprogrammet är gymnasial yrkesinriktad utbildning med inriktning mot arbete med barn, ungdomar eller vuxna inom pedagogiska och sociala yrkesområden eller i fritids- och friskvårdssektorn. Källa: Skolverket
broader: Yrkesutbildning
related: Hi9c iTe gHH
related: XW9L tA9 WaX
related: aA2Z 9XX R1v
related: CFW8 eBa NaV

Oljemålning, cirkelledning
type: Concept
in scheme: JobTech Taxonomy - Färdighet
definition: Oljemålning, cirkelledning
broader: zmYu aAM TuF
related: 1CX5 mZw Vcq

Insolvensrätt/Obeståndsrätt
type: Concept
in scheme: JobTech Taxonomy - Färdighet
definition: Insolvensrätt/Obeståndsrätt
broader: zmYu aAM TuF
related: q8wL kdi WaW
related: br6a VVS V3y
related: 6aak 8eh iwT
related: DZVN v5g Fco
related: JfYV ZGg 6rm

Processutveckling
type: Concept
in scheme: JobTech Taxonomy - Färdighet
definition: Processutveckling
broader: zmYu aAM TuF
related: Qo7p wjf gtv
related: vPP6 rsw dck

Vårdavdelning/Mottagning
type: Concept
in scheme: JobTech Taxonomy - Färdighet
definition: Vårdavdelning/mottagning avser verksamheten inom hälso- och sjukvård där patienter tas emot, vårdas och behandlas i olika former av avdelningar och mottagningar.
alternative label: Mottagning
alternative label: Vårdavdelning
broader: zmYu aAM TuF
related: bEDv SL7 VrL
related: 6eAB cbY i9T
related: 7fNG sve JWU
related: LP4Z ABV gRm
related: tAJS JNb hDH
related: Z8ci bBE tmx

Friluftsledarutbildning
type: Concept
in scheme: JobTech Taxonomy - Färdighet
definition: Friluftsledarutbildning
broader: Yrkesbevis/examen
related: A6X3 efC VNy

Avancerad tjänstgöring IGF-koden
type: Concept
in scheme: JobTech Taxonomy - Färdighet
definition: Avancerad tjänstgöring IGF-koden
broader: s48H Sft DTn
related: Rsoy sS6 6c4
related: kDnq Q98 sD3

Service och underhåll, bygg
type: Concept
in scheme: JobTech Taxonomy - Färdighet
definition: Service och underhåll, bygg
broader: zmYu aAM TuF
related: 9mJN VwW Xjg

Adobe Analytics/SiteCatalyst
type: Concept
in scheme: JobTech Taxonomy - Färdighet
definition: Adobe Analytics/SiteCatalyst
alternative label: Adobe Analytics
alternative label: SiteCatalyst
broader: zmYu aAM TuF
related: Fv7d YhP YmS
related: WX67 Pfb WMN
related: k1Nx auG sNh
related: 4Jty HpK a3Q

Kantele
type: Concept
in scheme: JobTech Taxonomy - Färdighet
definition: Kantele
broader: wLYs CKS wK8
related: AWJF wqZ va9

Analys/Beräkning-Autodesk Ecotect Analysis
type: Concept
in scheme: JobTech Taxonomy - Färdighet
definition: Analys/Beräkning-Autodesk Ecotect Analysis
alternative label: Analys-Autodesk Ecotect Analysis
alternative label: Beräkning-Autodesk Ecotect Analysis
broader: mTLu uo2 gq2
related: thZP oR7 WrY
related: K8yg U4C gkY
related: Pd51 xnr KCY
related: XeBP nMe pXx
related: PRQn 9yw NJA
related: ETAR ggZ Wuw
related: 41KB bfk 5jR
related: 4Jty HpK a3Q

Återvinning, konstnärlig
type: Concept
in scheme: JobTech Taxonomy - Färdighet
definition: Återvinning, konstnärlig
broader: zmYu aAM TuF
related: 34Tn BQQ tfo

Statsskuldsväxlar
type: Concept
in scheme: JobTech Taxonomy - Färdighet
definition: Statsskuldsväxlar
broader: zmYu aAM TuF
related: aQpg E2T cWq

RTL-kompetens, kamera
type: Concept
in scheme: JobTech Taxonomy - Färdighet
definition: RTL-kompetens, kamera
broader: Yrkesbevis/examen
related: fWrt sLg koW

Snöröjningsmaskin
type: Concept
in scheme: JobTech Taxonomy - Färdighet
definition: Snöröjningsmaskin avser en specialiserad maskin som används för att avlägsna snö från vägar, parkeringsplatser och andra ytor för att säkerställa framkomlighet och säkerhet under vintermånaderna. Denna maskin kan inkludera utrustning såsom plogar och snöslungor, och ofta hanteras den av förare med kompetens inom snöröjning och vägunderhåll.
broader: zmYu aAM TuF
related: 3ZtN hhA SM7
related: KwVo sQu G2e
related: X7HR rZK 4wj
related: bwnk nv2 1cR
related: ieVp d5L rS9

Affärsutveckling
type: Concept
in scheme: JobTech Taxonomy - Färdighet
definition: Affärsutveckling avser processen för att identifiera, skapa och implementera strategier som syftar till att öka verksamhetens tillväxt och lönsamhet. Kompetensen omfattar analyser av marknader, kundbehov och konkurrenssituationer, samt utveckling av nya produkter eller tjänster för att möta dessa behov.
broader: zmYu aAM TuF
related: Y6yY SuR hVh
related: Qo7p wjf gtv
related: WX67 Pfb WMN
related: cRmd 536 pT1

Biomedicin/Molekylär biofysik
type: Concept
in scheme: JobTech Taxonomy - Färdighet
definition: Biomedicin/Molekylär biofysik
alternative label: Biomedicin
alternative label: Molekylär biofysik
broader: zmYu aAM TuF
related: KM7d Z6Y LCJ

Auktoriserad Lönekonsult
type: Concept
in scheme: JobTech Taxonomy - Färdighet
definition: Auktoriserad Lönekonsult
broader: Yrkesbevis/examen
related: L7eh ihX vM5

Adoptionsmedgivande
type: Concept
in scheme: JobTech Taxonomy - Färdighet
definition: Adoptionsmedgivande
broader: zmYu aAM TuF
related: pok1 ipJ yzD

OSPF, routingprotokoll
type: Concept
in scheme: JobTech Taxonomy - Färdighet
definition: OSPF, routingprotokoll
broader: Routingprotokoll
related: nDaB vdy eAy
related: VCpu 5EN bBt
related: fWrt sLg koW
related: 4Jty HpK a3Q

Kvalitetsansvar
type: Concept
in scheme: JobTech Taxonomy - Färdighet
definition: Kvalitetsansvar
broader: zmYu aAM TuF
related: cBBa ngH fCx
related: thZP oR7 WrY
related: w6ud quG dgh
related: 7mn2 kA9 ftp
related: nDaB vdy eAy
related: SPYW 7Z1 ShT
related: XeBP nMe pXx
related: dMVD VYy kgg
related: MYAz x9m 2LJ

Modellgjutning
type: Concept
in scheme: JobTech Taxonomy - Färdighet
definition: Modellgjutning
broader: zmYu aAM TuF
related: aKdV u7V R5j

ROT-jobb
type: Concept
in scheme: JobTech Taxonomy - Färdighet
definition: ROT-jobb avser renovering, ombyggnad och tillbyggnad av bostäder och lokaler, där arbetet ofta inkluderar olika typer av bygg- och anläggningsarbeten. Kompetensen omfattar färdigheter inom områden som snickeri, murverk, måleri och golvläggning, vilket möjliggör genomförande av arbetsuppgifter relaterade till förbättring och underhåll av byggnader.
broader: zmYu aAM TuF
related: V79C DD2 3Gj
related: QKvX v7r PNL
related: q2Ge zrQ zJb
related: 9mJN VwW Xjg
related: AD3U cFH rbe
related: NnB3 eWH auo
related: iHrC aRv fVm

Redovisningsansvar
type: Concept
in scheme: JobTech Taxonomy - Färdighet
definition: Redovisningsansvar
broader: zmYu aAM TuF
related: eQ4M CNm ozj
related: q81z 3oD 1qu
related: vCAb uuo ek5

Verktygsslipning
type: Concept
in scheme: JobTech Taxonomy - Färdighet
definition: Verktygsslipning
broader: zmYu aAM TuF
related: 4bxV 58E P9N

Rational Application Developer, systemutvecklingsverktyg
type: Concept
in scheme: JobTech Taxonomy - Färdighet
definition: Rational Application Developer, systemutvecklingsverktyg
alternative label: Rational Application Developer
broader: Programmerings- och systemutvecklingsverktyg
related: D9SL mtn vGM
related: DJh5 yyF hEM
related: 4Jty HpK a3Q
related: MYAz x9m 2LJ

Segelfartyg
type: Concept
in scheme: JobTech Taxonomy - Färdighet
definition: Segelfartyg
broader: Övriga specialiteter, sjöfart
related: CbQK 7th Tyf
related: KttZ Skc bMR
related: kDnq Q98 sD3

Cylindergravyr
type: Concept
in scheme: JobTech Taxonomy - Färdighet
definition: Cylindergravyr
broader: zmYu aAM TuF
related: LeQV umf wUS

Legitimation som dietist
type: Concept
in scheme: JobTech Taxonomy - Färdighet
definition: Legitimation som krävs för att kunna arbeta som dietist i Sverige. Utfärdas av Socialstyrelsen.
broader: Yrkesbevis/examen
related: Pq5C SPC bRA
related: 4P8B LtK JgE
related: r1Gk 3EN bpw

Friskvårdsfrågor, personalarbete
type: Concept
in scheme: JobTech Taxonomy - Färdighet
definition: Friskvårdsfrågor, personalarbete
broader: zmYu aAM TuF
related: mNoS AN5 drn
related: Fp7x Yqt bx9
related: bjqk F3A 5Hk

Parallell programmering
type: Concept
in scheme: JobTech Taxonomy - Färdighet
definition: Parallell programmering
broader: zmYu aAM TuF
related: DJh5 yyF hEM
related: 4Jty HpK a3Q
related: UXKZ 3zZ ipB

Bastuba, undervisning musikskola
type: Concept
in scheme: JobTech Taxonomy - Färdighet
definition: Bastuba, undervisning musikskola
broader: zmYu aAM TuF
related: mcRJ kq2 jFr

Tillverkning av dragspel
type: Concept
in scheme: JobTech Taxonomy - Färdighet
definition: Tillverkning av dragspel
broader: zmYu aAM TuF
related: aKdV u7V R5j

Neurokirurgi, specialistkompetens för läkare
type: Concept
in scheme: JobTech Taxonomy - Färdighet
definition: Neurokirurgi, specialistkompetens för läkare
broader: Specialistbevis för läkare
related: nu7c QuB KVQ

Marimba, undervisning musikskola
type: Concept
in scheme: JobTech Taxonomy - Färdighet
definition: Marimba, undervisning musikskola
broader: zmYu aAM TuF
related: mcRJ kq2 jFr

Fartygsbefäl klass II (behörighet)
type: Concept
in scheme: JobTech Taxonomy - Färdighet
definition: Fartygsbefäl klass II (behörighet)
broader: Behörigheter, sjöfart
related: kZwz D8K bKs
related: kDnq Q98 sD3

Vinodling
type: Concept
in scheme: JobTech Taxonomy - Färdighet
definition: Vinodling avser praktiken att odla druvor för vinframställning. Kompetensen innefattar kunskaper om odlingsmetoder, skötsel av vinrankor samt förståelse för klimat- och markförhållanden som påverkar druvkvalitet.
broader: zmYu aAM TuF
related: yXbD NTH ijE
related: k3R3 UkC nK2

Tillämpad statistik
type: Concept
in scheme: JobTech Taxonomy - Färdighet
definition: Tillämpad statistik
broader: zmYu aAM TuF
related: vPP6 rsw dck
related: jv1x tpK 32p
related: 4Jty HpK a3Q

Kreditupplysning
type: Concept
in scheme: JobTech Taxonomy - Färdighet
definition: Kreditupplysning
alternative label: Soliditetsupplysning
broader: zmYu aAM TuF
related: eQ4M CNm ozj
related: JAFv ZaP tDG

Flotation, malm
type: Concept
in scheme: JobTech Taxonomy - Färdighet
definition: Flotation, malm avser en process inom malmförädling där mineraler separeras från oönskade material genom att utnyttja skillnader i ytspänning och flytbarhet. Kompetensen omfattar kunskap om och förmåga att hantera flotationsanläggningar samt förståelse för kemiska och fysikaliska principer som påverkar separationsprocessen.
broader: zmYu aAM TuF
related: LEvM 7Hs w8i

Arbetsmarknadsekonomi
type: Concept
in scheme: JobTech Taxonomy - Färdighet
definition: Arbetsmarknadsekonomi
broader: zmYu aAM TuF
related: WZCM nfS eAk

Sitecore, CMS
type: Concept
in scheme: JobTech Taxonomy - Färdighet
definition: Sitecore, CMS/innehållshanteringssystem
alternative label: Sitecore, innehållshanteringssystem
broader: jTAz uCP RNc
related: BAeH eg8 T2d
related: cBBa ngH fCx
related: Fv7d YhP YmS
related: vPP6 rsw dck
related: oEmP NC1 sXE
related: 4Jty HpK a3Q
related: MYAz x9m 2LJ

Momsredovisning
type: Concept
in scheme: JobTech Taxonomy - Färdighet
definition: Momsredovisning
broader: zmYu aAM TuF
related: 4W6S 1kA nrv
related: br6a VVS V3y
related: q81z 3oD 1qu
related: ij8k EwC zyB

Skattehandläggarutbildning
type: Concept
in scheme: JobTech Taxonomy - Färdighet
definition: Skattehandläggarutbildning avser en internutbildning för nyanställda skattehandläggare vid Skatteverket. Det är en intern introduktionsutbildning och med handledare som stöd i arbetet.
broader: Yrkesbevis/examen
related: 4W6S 1kA nrv

Följdverktyg, tillverkning
type: Concept
in scheme: JobTech Taxonomy - Färdighet
definition: Följdverktyg, tillverkning
broader: zmYu aAM TuF
related: MSnK 3Z8 4qA

HACCP
type: Concept
in scheme: JobTech Taxonomy - Färdighet
definition: HAACP står för Hazard Analysis and Critical Control Points och är en systematisk metod för att identifiera, bedöma och kontrollera risker kopplade till livsmedelssäkerhet. Denna kompetens innefattar kunskaper om faror som kan påverka livsmedelsprodukter samt åtgärder för att hantera dessa risker genom att implementera kritiska kontrollpunkter i produktionsprocessen.
broader: Kvalitetssystem
related: BStc SJh DKG
related: QqHf XKZ eyy
related: puim 6PY DGj
related: dAu7 VyL hsy
related: 4DET dLf iB9
related: uxst tkg zDh
related: icae Y69 H8E

Internrevision (skyddsföreskrifter)
type: Concept
in scheme: JobTech Taxonomy - Färdighet
definition: Internrevision (skyddsföreskrifter)
broader: zmYu aAM TuF
related: Uw64 cuc U3H

Microsoft Biztalk, integrationsplattform
type: Concept
in scheme: JobTech Taxonomy - Färdighet
definition: Microsoft Biztalk, integrationsplattform
alternative label: Microsoft Biztalk
broader: Integrationsplattformar
related: BAeH eg8 T2d
related: cBBa ngH fCx
related: D9SL mtn vGM
related: DJh5 yyF hEM
related: 4Jty HpK a3Q
related: UXKZ 3zZ ipB
related: MYAz x9m 2LJ

Budgetuppföljning
type: Concept
in scheme: JobTech Taxonomy - Färdighet
definition: Budgetuppföljning
broader: zmYu aAM TuF
related: eQ4M CNm ozj
related: Y6yY SuR hVh
related: oXSW fbY XrY
related: womV SEj CAH
related: NQTS fou E6u
related: Fu4x 7KG YgC
related: mNoS AN5 drn
related: 8SPu K1k 5qR
related: Uw4n UB2 RCW
related: WhBn FAp ZNW
related: pf1K PTz frm
related: 48KE fDE ryL
related: vPP6 rsw dck
related: ajwx FvL YuY
related: bYde Frc xcB
related: coyZ Cyv Srw
related: QG4f MCh vND
related: NxXz fBh w7j
related: SgNH hag n9D
related: 7mn2 kA9 ftp
related: Pz9M srJ Lc9
related: oEmP NC1 sXE
related: q81z 3oD 1qu
related: Fghp zje WA8
related: Fp7x Yqt bx9
related: 33Nt DSs YYA
related: z8di AqX GBr
related: g6eC Fwu B3J
related: ddGt fEH 432
related: eWiB mGP MjE
related: mZsb A1K Gec
related: U8HK Jdi GuC
related: eX3C MtJ nPA
related: 4GAs rKs 2Ne
related: wby2 mwq fWV
related: AuTi FEo j3R
related: cRmd 536 pT1
related: uxst tkg zDh
related: X1Ac Y9P PJo
related: FfMN Bw1 qYR
related: hZLv S5f jo2
related: mpuA s56 Hsy
related: 3i4a Ufc qpp
related: sWzF 6pd Y6L
related: 9QMD sZ3 ZjX
related: nNxJ YWy vR2
related: 1uau t1u rDL
related: 9Mn4 PNA 7Yz
related: 85cq 6uK 4cK

Byggnadssmide
type: Concept
in scheme: JobTech Taxonomy - Färdighet
definition: Byggnadssmide avser processer och tekniker för att forma järn eller stål i samband med konstruktions- och byggnadsarbete. Kompetensen innefattar tillverkning av detaljer som används i byggnader och konstruktioner, inklusive både strukturella och dekorativa element.
broader: zmYu aAM TuF
related: TrwQ RXT W8a
related: q8Ho 3Xw sHq

Afrikas arkeologi
type: Concept
in scheme: JobTech Taxonomy - Färdighet
definition: Afrikas arkeologi
broader: zmYu aAM TuF
related: sXgV QFg vpb

Outplacement
type: Concept
in scheme: JobTech Taxonomy - Färdighet
definition: Outplacement
broader: zmYu aAM TuF
related: mNoS AN5 drn
related: bjqk F3A 5Hk

Kommunalt boendestöd
type: Concept
in scheme: JobTech Taxonomy - Färdighet
definition: Kommunalt boendestöd
broader: zmYu aAM TuF
related: 7fNG sve JWU

ERP-system, erfarenhet
type: Concept
in scheme: JobTech Taxonomy - Färdighet
definition: ERP-system, erfarenhet
alternative label: Enterprise Resource Planning, erfarenhet
alternative label: Resursplaneringssystem, erfarenhet
broader: zmYu aAM TuF
related: xm5G vGn iyk
related: Fu4x 7KG YgC
related: q81z 3oD 1qu
related: 33Nt DSs YYA
related: eWiB mGP MjE
related: mZsb A1K Gec
related: nNxJ YWy vR2
related: 4Jty HpK a3Q
related: UXKZ 3zZ ipB

Bravo, redovisningssystem
type: Concept
in scheme: JobTech Taxonomy - Färdighet
definition: Bravo, redovisningssystem
alternative label: Bravo
broader: xSJR 1Kq pxB
related: eQ4M CNm ozj
related: q81z 3oD 1qu
related: ij8k EwC zyB
related: 4Jty HpK a3Q

Drivning, ädelmetaller
type: Concept
in scheme: JobTech Taxonomy - Färdighet
definition: Drivning, ädelmetaller
broader: zmYu aAM TuF
related: nwSm phw sPo

Yrkesbevis, bandschaktare
type: Concept
in scheme: JobTech Taxonomy - Färdighet
definition: Yrkesbevis, bandschaktare
broader: Yrkesbevis/examen
related: 3ZtN hhA SM7

Företagshälsovård, specialistkompetens för läkare
type: Concept
in scheme: JobTech Taxonomy - Färdighet
definition: Företagshälsovård, specialistkompetens för läkare
broader: Specialistbevis för läkare
related: nu7c QuB KVQ

Produktionssömnad, arbetskläder
type: Concept
in scheme: JobTech Taxonomy - Färdighet
definition: Produktionssömnad, arbetskläder
broader: zmYu aAM TuF
related: mwVN oEH g9k

Hudsjukvård
type: Concept
in scheme: JobTech Taxonomy - Färdighet
definition: Hudsjukvård
broader: zmYu aAM TuF
related: Z8ci bBE tmx

Ytbehandling av träytor
type: Concept
in scheme: JobTech Taxonomy - Färdighet
definition: Ytbehandling av träytor avser processen att bearbeta och skydda träytor genom applicering av olika material såsom färg, lack eller olja, vilket bidrar till både estetik och hållbarhet. Kompetensen omfattar kunskaper om olika ytbehandlingsmetoder och -material samt insikt i deras påverkan på träets egenskaper och livslängd.
broader: zmYu aAM TuF
related: dKUb KBP mw3
related: v7W3 cLQ q2S
related: 1Nwn GYH wkH
related: AD3U cFH rbe
related: AUs8 M5f dLt

Driftlarm, skötselvana
type: Concept
in scheme: JobTech Taxonomy - Färdighet
definition: Driftlarm, skötselvana
broader: zmYu aAM TuF
related: 4Jty HpK a3Q
related: iqZh 3yX i8n

Brottsutredning
type: Concept
in scheme: JobTech Taxonomy - Färdighet
definition: Brottsutredning
broader: zmYu aAM TuF
related: vPP6 rsw dck
related: 6aak 8eh iwT
related: rNcE Zno pD8

Ljusbord-iO
type: Concept
in scheme: JobTech Taxonomy - Färdighet
definition: Ljusbord-iO
broader: zmYu aAM TuF
related: 4BsK q2C sCL

Fastighetsvärdering
type: Concept
in scheme: JobTech Taxonomy - Färdighet
definition: Fastighetsvärdering avser kompetens att systematiskt bedöma en fastighets ekonomiska värde. Exempel på metoder är ortsprismetoden, avkastningsmetoden samt marknads- och byggnadstekniska analyser. Kompetensen är avgörande för transaktioner, redovisning och investeringsbeslut, och kräver ofta lokal marknadskännedom.
broader: zmYu aAM TuF
related: GMDo DVo Yzh
related: Ru4W zn2 LEz
related: Fghp zje WA8
related: dUuh wwa FGj
related: U8HK Jdi GuC
related: 4GAs rKs 2Ne
related: X1Ac Y9P PJo
related: 9Mn4 PNA 7Yz

Rehabiliteringsmedicin, specialistkompetens för läkare
type: Concept
in scheme: JobTech Taxonomy - Färdighet
definition: Rehabiliteringsmedicin, specialistkompetens för läkare
broader: Specialistbevis för läkare
related: nu7c QuB KVQ

Utbildningsadministration
type: Concept
in scheme: JobTech Taxonomy - Färdighet
definition: Utbildningsadministration omfattar arbetsuppgifter som att hantera elev- och personalregister, rapportera frånvaro, administrera betyg och resultat, samt planera och uppdatera scheman. Det innefattar även att arbeta i digitala administrativa system, kommunicera information till elever, personal och externa kontakter, samt att ge service och stöd i administrativa ärenden. Vidare ingår att sammanställa statistik, följa upp utbildningsprocesser och bidra till att den dagliga verksamheten på utbildningsenheten fungerar smidigt.
broader: zmYu aAM TuF
related: mcRJ kq2 jFr
related: 3FP7 4Eg x8P
related: ZQTR hVC QhJ
related: 1CX5 mZw Vcq
related: oEmP NC1 sXE
related: yVZH zHh 6fG

TypeScript, programmeringsspråk
type: Concept
in scheme: JobTech Taxonomy - Färdighet
definition: TypeScript, programmeringsspråk
alternative label: TypeScript
broader: Datorspråk
related: D9SL mtn vGM
related: DJh5 yyF hEM
related: UxT1 tPF Kbg
related: 4Jty HpK a3Q
related: UXKZ 3zZ ipB

Utvecklingspsykologi
type: Concept
in scheme: JobTech Taxonomy - Färdighet
definition: Utvecklingspsykologi
broader: zmYu aAM TuF
related: VYeq GDF a2g

Doktorsexamen, juridiska ämnen
type: Concept
in scheme: JobTech Taxonomy - Färdighet
definition: Doktorsexamen, juridiska ämnen
broader: Yrkesbevis/examen
related: Gm5j S2Y aTB
related: cYCo PxY zQd

Baristautbildning
type: Concept
in scheme: JobTech Taxonomy - Färdighet
definition: Baristautbildning ger vanligtvis kunskaper i att tillreda och servera olika kaffedrycker med hjälp av espressomaskin och manuella bryggmetoder. Utbildningen omfattar kaffekunskap, maskinhantering, mjölkskumning, hygienrutiner och kundservice, samt grundläggande förståelse för råvaror och smakbalans.
broader: zmYu aAM TuF
related: XFXX Jq9 Y2a

Kockutbildning
type: Concept
in scheme: JobTech Taxonomy - Färdighet
definition: Kockutbildning är en gymnasial eller eftergymnasial yrkesinriktad utbildning med inriktning till kock.
broader: Yrkesbevis/examen
related: BStc SJh DKG

Kraftelektronik
type: Concept
in scheme: JobTech Taxonomy - Färdighet
definition: Kraftelektronik
broader: zmYu aAM TuF
related: nDaB vdy eAy
related: SPYW 7Z1 ShT
related: 4Jty HpK a3Q

Mästarbrev, oljeeldningsinstallatör
type: Concept
in scheme: JobTech Taxonomy - Färdighet
definition: Mästarbrev, oljeeldningsinstallatör
broader: Yrkesbevis/examen
related: fLKb bJ3 69p

Elmontage
type: Concept
in scheme: JobTech Taxonomy - Färdighet
definition: Elmontage
broader: zmYu aAM TuF
related: KttZ Skc bMR

Tillverkning av gipsmodeller
type: Concept
in scheme: JobTech Taxonomy - Färdighet
definition: Tillverkning av gipsmodeller avser processen för att skapa former och modeller av gips för olika användningsområden, såsom inom byggnation, konst eller utbildning. Kompetensen innefattar teknisk skicklighet för att blanda, gjuta och bearbeta gips för att uppnå noggranna och hållbara resultat.
broader: zmYu aAM TuF
related: e6nk AGp y28

Tårtor/Bakelser
type: Concept
in scheme: JobTech Taxonomy - Färdighet
definition: Tårtor/Bakelser
alternative label: Bakelser
alternative label: Tårtor
broader: zmYu aAM TuF
related: 5qT8 z9d 8rw

EASA-certifikat, kategori B1.1 (flyg jetmotor)
type: Concept
in scheme: JobTech Taxonomy - Färdighet
definition: EASA-certifikat, kategori B1.1 (flyg jetmotor)
broader: s48H Sft DTn
related: eRkT cTv H9v

Spikning, konventionell maskin
type: Concept
in scheme: JobTech Taxonomy - Färdighet
definition: Spikning, konventionell maskin
broader: zmYu aAM TuF
related: VKKg e4t t46

Vallodling
type: Concept
in scheme: JobTech Taxonomy - Färdighet
definition: Vallodling
broader: zmYu aAM TuF
related: yXbD NTH ijE
related: 9QMD sZ3 ZjX
related: k3R3 UkC nK2
related: RYCQ ogb uUY

Gospel
type: Concept
in scheme: JobTech Taxonomy - Färdighet
definition: Gospel
broader: p1WM wCw LTd
related: AWJF wqZ va9

Miljöskydd
type: Concept
in scheme: JobTech Taxonomy - Färdighet
definition: Miljöskydd
broader: zmYu aAM TuF
related: rE1E m3d cx1
related: yXbD NTH ijE
related: V7Yz 4WV g4z

Transkribera
type: Concept
in scheme: JobTech Taxonomy - Färdighet
definition: Att överföra tal från ljud- eller videoinspelningar till skrift.
broader: zmYu aAM TuF
related: PQDm Z63 zst
related: 4Jty HpK a3Q

Kontorsvaror, produktkunskap
type: Concept
in scheme: JobTech Taxonomy - Färdighet
definition: Kontorsvaror, produktkunskap
broader: zmYu aAM TuF
related: oXSW fbY XrY
related: YKL2 FCB 1yr

Lättbetongarbete
type: Concept
in scheme: JobTech Taxonomy - Färdighet
definition: Lättbetongarbete
broader: zmYu aAM TuF
related: q2Ge zrQ zJb
related: NnB3 eWH auo

Barn- och ungdomspsykoterapi
type: Concept
in scheme: JobTech Taxonomy - Färdighet
definition: Barn- och ungdomspsykoterapi
broader: zmYu aAM TuF
related: UUQi UJ5 MSb
related: VYeq GDF a2g

Assembler, programmeringsspråk
type: Concept
in scheme: JobTech Taxonomy - Färdighet
definition: Assembler, programmeringsspråk
alternative label: Assembler
alternative label: Assemblerprogrammering
broader: Datorspråk
related: BAeH eg8 T2d
related: Fv7d YhP YmS
related: nDaB vdy eAy
related: D9SL mtn vGM
related: DJh5 yyF hEM
related: SPYW 7Z1 ShT
related: 4Jty HpK a3Q

Byggnadsunderhåll, kyrkogård
type: Concept
in scheme: JobTech Taxonomy - Färdighet
definition: Byggnadsunderhåll, kyrkogård
broader: zmYu aAM TuF
related: XurM DVs ggn

Upphovsrätt
type: Concept
in scheme: JobTech Taxonomy - Färdighet
definition: Upphovsrätt
broader: zmYu aAM TuF
related: q8wL kdi WaW
related: br6a VVS V3y
related: 6aak 8eh iwT
related: DZVN v5g Fco
related: JfYV ZGg 6rm

Naturterapi
type: Concept
in scheme: JobTech Taxonomy - Färdighet
definition: Kompetensen avser att utöva behandlingsformen naturterapi, vilken utgår från människan har inbyggda självläkande egenskaper vilka stimuleras genom behandling.
broader: zmYu aAM TuF
related: F19Z oB6 pg3

Smittskydd
type: Concept
in scheme: JobTech Taxonomy - Färdighet
definition: Smittskydd
broader: zmYu aAM TuF
related: wNrt Ysj WuT
related: puim 6PY DGj
related: rE1E m3d cx1
related: nuXg Wjc JPd
related: cuaN Rj5 YCc
related: WL4E r4b ek4

Anläggning av utemiljöer
type: Concept
in scheme: JobTech Taxonomy - Färdighet
definition: Anläggning av utemiljöer
broader: zmYu aAM TuF
related: XBh3 Xrm C4R

Gesällbrev, rörinstallatör
type: Concept
in scheme: JobTech Taxonomy - Färdighet
definition: Gesällbrev, rörinstallatör
broader: Yrkesbevis/examen
related: fLKb bJ3 69p

Webbtjänster, produktkunskap
type: Concept
in scheme: JobTech Taxonomy - Färdighet
definition: Webbtjänster, produktkunskap
broader: zmYu aAM TuF
related: oXSW fbY XrY
related: 4Jty HpK a3Q

Mängberedning
type: Concept
in scheme: JobTech Taxonomy - Färdighet
definition: Mängberedning
broader: zmYu aAM TuF
related: hxm6 xkr dHm

Sponsorkunskap
type: Concept
in scheme: JobTech Taxonomy - Färdighet
definition: Sponsorkunskap
broader: zmYu aAM TuF
related: rYSG 3WJ LmC

Bildarkivering
type: Concept
in scheme: JobTech Taxonomy - Färdighet
definition: Bildarkivering
broader: zmYu aAM TuF
related: wVfo Njx 1rB
related: TQkt eeK eNp
related: 4Jty HpK a3Q

Fotografering, digitalkamera
type: Concept
in scheme: JobTech Taxonomy - Färdighet
definition: Fotografering, digitalkamera
broader: zmYu aAM TuF
related: 4BsK q2C sCL
related: CkRH 4Qn iX3
related: 3J38 DNz YKK

Styr- och reglerteknik
type: Concept
in scheme: JobTech Taxonomy - Färdighet
definition: Styr- och reglerteknik avser den teknik som används för att styra och reglera olika system och processer inom industri och teknik. Kompetensen omfattar kunskaper om sensorer, reglertekniska metoder och systemteknik för att säkerställa optimal funktion och effektivitet.
broader: zmYu aAM TuF
related: mis4 feV uex
related: 3jEy yuT aVo
related: rwpH 6RA XTT
related: K8yg U4C gkY
related: nDaB vdy eAy
related: SPYW 7Z1 ShT
related: fWrt sLg koW
related: 4Jty HpK a3Q

Dokumentärfotografering
type: Concept
in scheme: JobTech Taxonomy - Färdighet
definition: Dokumentärfotografering
broader: zmYu aAM TuF
related: 3J38 DNz YKK

Telekommunikation
type: Concept
in scheme: JobTech Taxonomy - Färdighet
definition: Telekommunikation avser överföring av information på avstånd genom användning av tekniska verktyg och system, vilket inkluderar telefoner, datornätverk och signalbehandling. Kompetensen omfattar kunskap om tekniska system och metoder som möjliggör effektiv kommunikation och informationsutbyte på olika plattformar.
broader: zmYu aAM TuF
related: nDaB vdy eAy
related: SPYW 7Z1 ShT
related: fWrt sLg koW
related: 4Jty HpK a3Q

Framtagande av utbildningsmaterial
type: Concept
in scheme: JobTech Taxonomy - Färdighet
definition: Framtagande av utbildningsmaterial avser processen att skapa och utveckla pedagogiska resurser och verktyg för att stödja lärande och undervisning. Denna kompetens innefattar analys av målgruppens behov samt utformning av material som främjar effektiv kunskapsöverföring och lärande.
broader: zmYu aAM TuF
related: FpPP jqK xzT
related: vPP6 rsw dck
related: oEmP NC1 sXE
related: aA2Z 9XX R1v

Mästarbrev, urmakare
type: Concept
in scheme: JobTech Taxonomy - Färdighet
definition: Mästarbrev, urmakare
broader: Yrkesbevis/examen
related: e6nk AGp y28

EASA-certifikat, kategori B1.3 (helikopter jetmotor)
type: Concept
in scheme: JobTech Taxonomy - Färdighet
definition: EASA-certifikat, kategori B1.3 (helikopter jetmotor)
broader: s48H Sft DTn
related: eRkT cTv H9v

Plåtskärning
type: Concept
in scheme: JobTech Taxonomy - Färdighet
definition: Plåtskärning
broader: zmYu aAM TuF
related: L4hA SJP SFi
related: bXfo 4hb SXx

Stordjurskirurgi
type: Concept
in scheme: JobTech Taxonomy - Färdighet
definition: Stordjurskirurgi
broader: zmYu aAM TuF
related: WL4E r4b ek4

Svenska, cirkelledning
type: Concept
in scheme: JobTech Taxonomy - Färdighet
definition: Svenska, cirkelledning
broader: zmYu aAM TuF
related: 1CX5 mZw Vcq

Spelmekanik
type: Concept
in scheme: JobTech Taxonomy - Färdighet
definition: Spelmekanik
broader: zmYu aAM TuF
related: 4BsK q2C sCL
related: 4Jty HpK a3Q
related: Mbt6 3ko DiD

Elinriktning-automation, undervisning
type: Concept
in scheme: JobTech Taxonomy - Färdighet
definition: Elinriktning-automation, undervisning
broader: Inriktning på lärarkompetens
related: 2x2V UeL 6ke

Analys/Beräkning-Robot Millenium
type: Concept
in scheme: JobTech Taxonomy - Färdighet
definition: Analys/Beräkning-Robot Millenium
alternative label: Analys-Robot Millenium
alternative label: Beräkning-Robot Millenium
broader: mTLu uo2 gq2
related: thZP oR7 WrY
related: K8yg U4C gkY
related: Pd51 xnr KCY
related: XeBP nMe pXx
related: PRQn 9yw NJA
related: ETAR ggZ Wuw
related: 41KB bfk 5jR
related: 4Jty HpK a3Q

AWK, programmeringsspråk
type: Concept
in scheme: JobTech Taxonomy - Färdighet
definition: AWK, programmeringsspråk
alternative label: AWK
broader: Datorspråk
related: BAeH eg8 T2d
related: Fv7d YhP YmS
related: D9SL mtn vGM
related: DJh5 yyF hEM
related: 4Jty HpK a3Q

Databaser
type: Concept
in scheme: JobTech Taxonomy - Färdighet
top concept of: JobTech Taxonomy - Färdighet
definition: Databaser
narrower: sq2c q5d zXN
narrower: SAP Sybase, databashanterare
narrower: voRm aoU cKB
narrower: NoSQL, databashanterare
narrower: Teradata, databashanterare
narrower: DB2, databashanterare
narrower: nYAH rZC a2F
narrower: MySQL, databashanterare
narrower: Ingres, databashanterare
narrower: Informix, databashanterare
narrower: Oracle, databashanterare
narrower: r6iV q4u a7B
narrower: Lotus Approach, databashanterare
narrower: Progress, databashanterare
narrower: q5Q5 vrp KCS
narrower: PostgreSQL, databashanterare
narrower: Relationsdatabaser
narrower: Access, databashanterare

Konstvetenskap
type: Concept
in scheme: JobTech Taxonomy - Färdighet
definition: Konstvetenskap
broader: zmYu aAM TuF
related: wVfo Njx 1rB
related: mcRJ kq2 jFr
related: sXgV QFg vpb
related: Qbvf 6nd Esn

Tankrengöring
type: Concept
in scheme: JobTech Taxonomy - Färdighet
definition: Tankrengöring
broader: zmYu aAM TuF
related: idjo 2Wr a3E

Gjutkärnetillverkning
type: Concept
in scheme: JobTech Taxonomy - Färdighet
definition: Gjutkärnetillverkning
broader: zmYu aAM TuF
related: J9Vz JxJ Bji

Ompipning
type: Concept
in scheme: JobTech Taxonomy - Färdighet
definition: Ompipning
broader: zmYu aAM TuF
related: e6nk AGp y28

Personbilslackering
type: Concept
in scheme: JobTech Taxonomy - Färdighet
definition: Personbilslackering avser kompetens inom lackering av personbilar och innefattar både förberedelse av ytor samt applicering av olika lacklager för att uppnå önskad finish och skydd.
broader: zmYu aAM TuF
related: dKUb KBP mw3

Hattar, renoveringsvana
type: Concept
in scheme: JobTech Taxonomy - Färdighet
definition: Hattar, renoveringsvana avser kompetens inom reparation och omarbetning av hattar för att återställa deras form och funktion. Denna kompetens omfattar färdigheter i att byta ut material, justera storlek och förbättra hattars estetiska och praktiska egenskaper.
broader: zmYu aAM TuF
related: mwVN oEH g9k

Stunt
type: Concept
in scheme: JobTech Taxonomy - Färdighet
definition: Stunt
broader: zmYu aAM TuF
related: iBUL s38 izZ
related: xuSE mtB Mir

Paleontologi (djur- och växtlämningar)
type: Concept
in scheme: JobTech Taxonomy - Färdighet
definition: Paleontologi (djur- och växtlämningar)
broader: zmYu aAM TuF
related: V7Yz 4WV g4z

Informationsarkitektur
type: Concept
in scheme: JobTech Taxonomy - Färdighet
definition: Informationsarkitektur avser strukturen och organisationen av information i digitala miljöer, med fokus på att förbättra användarupplevelsen och navigeringen. Kompetensen innefattar metoder för att arrangera, klassificera och presentera information på ett sätt som är lättförståeligt och tillgängligt för användare.
broader: zmYu aAM TuF
related: 4Jty HpK a3Q
related: UXKZ 3zZ ipB

Rådgivning om receptfria läkemedel
type: Concept
in scheme: JobTech Taxonomy - Färdighet
definition: Kompetensen innebär att ge kunder vägledning vid val av egenvårdsprodukter utifrån deras behov. Det innefattar att bedöma symtom, informera om användning och biverkningar samt avgöra om kunden bör hänvisas till vården.
broader: zmYu aAM TuF
related: 41Az ioZ rmH

Säkerhetsfrågor, samordning och utveckling
type: Concept
in scheme: JobTech Taxonomy - Färdighet
definition: Förmåga att samordna och utveckla säkerhetsarbetet inom en organisation. Det inkluderar att identifiera risker, utveckla och implementera säkerhetspolicys och rutiner samt att samverka med olika interna och externa aktörer för att stärka säkerheten och beredskapen. Vidare handlar det om att driva förbättringsarbete och säkerställa en kontinuerlig utveckling av säkerhetsfunktionerna.
broader: zmYu aAM TuF
related: nuXg Wjc JPd

Depressionsbehandling
type: Concept
in scheme: JobTech Taxonomy - Färdighet
definition: Depressionsbehandling
broader: zmYu aAM TuF
related: UUQi UJ5 MSb
related: VYeq GDF a2g

Objektorienterad programmering
type: Concept
in scheme: JobTech Taxonomy - Färdighet
definition: Objektorienterad programmering
broader: zmYu aAM TuF
related: DJh5 yyF hEM
related: 4Jty HpK a3Q

Turbinkompressorer, underhåll
type: Concept
in scheme: JobTech Taxonomy - Färdighet
definition: Turbinkompressorer, underhåll
broader: zmYu aAM TuF
related: KttZ Skc bMR

MDX, frågespråk
type: Concept
in scheme: JobTech Taxonomy - Färdighet
definition: MDX, frågespråk
broader: Datorspråk
related: D9SL mtn vGM
related: DJh5 yyF hEM
related: UxT1 tPF Kbg
related: 4Jty HpK a3Q
related: UXKZ 3zZ ipB

Nätmaskiner
type: Concept
in scheme: JobTech Taxonomy - Färdighet
definition: Nätmaskiner
broader: zmYu aAM TuF
related: skLS kpa Ui1

Håruppsättningar
type: Concept
in scheme: JobTech Taxonomy - Färdighet
definition: Håruppsättningar
broader: zmYu aAM TuF
related: mwVN oEH g9k
related: LyBp bY6 bZK

Lufträtt
type: Concept
in scheme: JobTech Taxonomy - Färdighet
definition: Lufträtt
broader: zmYu aAM TuF
related: q8wL kdi WaW
related: 6aak 8eh iwT

Arbetsledning, gruva
type: Concept
in scheme: JobTech Taxonomy - Färdighet
definition: Arbetsledning, gruva
broader: zmYu aAM TuF
related: w6ud quG dgh

Postservice
type: Concept
in scheme: JobTech Taxonomy - Färdighet
definition: Postservice avser hanteringen och distributionen av post och paket, vilket inkluderar insamling, sortering och utdelning till mottagare. Kompetensen omfattar också kunskaper om relaterade tjänster och processer för effektiv och säker posthantering.
broader: zmYu aAM TuF
related: JnTF wXr 6Eh
related: YKL2 FCB 1yr
related: s1Qk o98 2o1
related: 9DdK AZY ZNK
related: xyW2 toA Skh
related: WNVp RYe zLX

Obstetrik, specialistkompetens för fysioterapeuter
type: Concept
in scheme: JobTech Taxonomy - Färdighet
definition: Obstetrik, specialistkompetens för fysioterapeuter
broader: Specialistinriktning inom fysioterapi
related: s7vU FhY L5Z

Kravhantering, systemutveckling
type: Concept
in scheme: JobTech Taxonomy - Färdighet
definition: Kravhantering, systemutveckling
broader: Allmänna datakunskaper
related: BAeH eg8 T2d
related: DJh5 yyF hEM
related: 4Jty HpK a3Q
related: UXKZ 3zZ ipB

Finstyckning
type: Concept
in scheme: JobTech Taxonomy - Färdighet
definition: Finstyckning avser processen att dela upp kött i mindre, mer hanterbara stycken, ofta med fokus på att få fram detaljerade och kvalitativa delar från djurkroppen. Denna kompetens innefattar teknisk kunskap om skärmetoder, köttets struktur och hur olika styckningsalternativ kan påverka tillagning och presentation.
broader: zmYu aAM TuF
related: BStc SJh DKG
related: QqHf XKZ eyy
related: s1Qk o98 2o1

XAML, programmeringsspråk
type: Concept
in scheme: JobTech Taxonomy - Färdighet
definition: XAML, programmeringsspråk
alternative label: XAML
broader: Datorspråk
related: BAeH eg8 T2d
related: Fv7d YhP YmS
related: nDaB vdy eAy
related: D9SL mtn vGM
related: DJh5 yyF hEM
related: SPYW 7Z1 ShT
related: 4Jty HpK a3Q

Gotländska
type: Concept
in scheme: JobTech Taxonomy - Färdighet
definition: Gotländska
broader: Dialekt
related: iBUL s38 izZ

Saxofon, undervisning musikskola
type: Concept
in scheme: JobTech Taxonomy - Färdighet
definition: Saxofon, undervisning musikskola
broader: zmYu aAM TuF
related: mcRJ kq2 jFr

Think Free
type: Concept
in scheme: JobTech Taxonomy - Färdighet
definition: Think Free
broader: Allmänna datakunskaper
related: eQ4M CNm ozj
related: Y6yY SuR hVh
related: Uw4n UB2 RCW
related: fdLf oPp wVw
related: vPP6 rsw dck
related: iWcY mko rq2
related: ZQTR hVC QhJ
related: br6a VVS V3y
related: 1CX5 mZw Vcq
related: L7eh ihX vM5
related: MGk3 LvL AU2
related: jJF3 qaQ Zsh
related: oEmP NC1 sXE
related: bjqk F3A 5Hk
related: H2Zj eL9 x28
related: dJXy Rpq a2u
related: pwRH MT1 8nR
related: cRmd 536 pT1
related: zKvJ GnC Szx
related: n6iX f2z XfE
related: DZVN v5g Fco
related: ij8k EwC zyB
related: JfYV ZGg 6rm
related: vCAb uuo ek5
related: 4Jty HpK a3Q
related: p16X 44f rwZ
related: pok1 ipJ yzD

Rational Rose, systemutvecklingsverktyg
type: Concept
in scheme: JobTech Taxonomy - Färdighet
definition: Rational Rose, systemutvecklingsverktyg
alternative label: Rational Rose
broader: Programmerings- och systemutvecklingsverktyg
related: D9SL mtn vGM
related: DJh5 yyF hEM
related: 4Jty HpK a3Q
related: MYAz x9m 2LJ

Keramik, specialisering tandteknik
type: Concept
in scheme: JobTech Taxonomy - Färdighet
definition: Keramik, specialisering tandteknik
broader: zmYu aAM TuF
related: 39yB xPQ ozd

1-års montör
type: Concept
in scheme: JobTech Taxonomy - Färdighet
definition: 1-års montör
broader: Yrkesbevis/examen
related: a75S eLg JWH
related: yyF7 jsW EeP

Intervjutekniker
type: Concept
in scheme: JobTech Taxonomy - Färdighet
definition: Intervjutekniker
broader: zmYu aAM TuF
related: SgNH hag n9D
related: UxT1 tPF Kbg
related: 83wV GJa vMd

Skrotskärning
type: Concept
in scheme: JobTech Taxonomy - Färdighet
definition: Skrotskärning
broader: zmYu aAM TuF
related: E87t egE pjA
related: UcNa inr snV

Programmerbart styrsystem/PLC
type: Concept
in scheme: JobTech Taxonomy - Färdighet
definition: Programmerbart styrsystem/PLC avser system som används för att styra och automatisera maskiner och processer inom industriell tillverkning och anläggningar. Kompetensen involverar programmering, konfiguration och underhåll av dessa system för att säkerställa effektiv och pålitlig drift.
alternative label: PLC
alternative label: Programmerbart styrsystem
broader: zmYu aAM TuF
related: hxm6 xkr dHm
related: MW1P GNJ 4F9
related: VKKg e4t t46
related: K8yg U4C gkY
related: nDaB vdy eAy
related: yPQ4 EaN Dtj
related: SPYW 7Z1 ShT
related: PRQn 9yw NJA
related: 7Zqy hSM Fig
related: fWrt sLg koW
related: KttZ Skc bMR
related: a75S eLg JWH
related: 4Jty HpK a3Q
related: yyF7 jsW EeP

Analys/Beräkning-Ansys
type: Concept
in scheme: JobTech Taxonomy - Färdighet
definition: Analys/Beräkning-Ansys
alternative label: Analys-Ansys
alternative label: Beräkning-Ansys
broader: mTLu uo2 gq2
related: thZP oR7 WrY
related: K8yg U4C gkY
related: Pd51 xnr KCY
related: XeBP nMe pXx
related: PRQn 9yw NJA
related: ETAR ggZ Wuw
related: 41KB bfk 5jR
related: 4Jty HpK a3Q

Matlagning, cirkelledning
type: Concept
in scheme: JobTech Taxonomy - Färdighet
definition: Matlagning, cirkelledning
broader: zmYu aAM TuF
related: 1CX5 mZw Vcq

Offentlig rätt
type: Concept
in scheme: JobTech Taxonomy - Färdighet
definition: Ett samlingsnamn för stats- och förvaltningsrätt. Statsrätt innehåller grundlagarna och reglerna om statsskicket, medan förvaltningsrätt innehåller rättsregler om myndigheters och kommuners verksamhet. Ibland ingår också folkrätt i begreppet. https://www.aklagare.se/ordlista/o/offentlig-ratt/
broader: zmYu aAM TuF
related: q8wL kdi WaW
related: qsJJ EYo fzA

Marimba
type: Concept
in scheme: JobTech Taxonomy - Färdighet
definition: Marimba
broader: wLYs CKS wK8
related: AWJF wqZ va9

Verktyg inom cybersäkerhet
type: Concept
in scheme: JobTech Taxonomy - Färdighet
definition: Verktyg inom cybersäkerhet avser programvaror och system som används för att skydda information och nätverk mot intrång, attacker och andra säkerhetshot. Kompetensen innefattar kunskap om, urval och implementering av dessa verktyg för att säkerställa en trygg digital miljö.
broader: zmYu aAM TuF
related: BAeH eg8 T2d
related: 4Jty HpK a3Q

Landbaserat vattenbruk
type: Concept
in scheme: JobTech Taxonomy - Färdighet
definition: Landbaserat vattenbruk avser produktion av vattenlevande organismer, såsom fisk och skaldjur, i kontrollerade miljöer på land. Denna kompetens innefattar kunskaper om odlingstekniker, vattenkvalitet, foderhantering och hälsovård för organismerna.
broader: zmYu aAM TuF
related: c8r8 e4L gwj

Ethernet
type: Concept
in scheme: JobTech Taxonomy - Färdighet
definition: Ethernet
broader: nHDU dpj R9H
related: 1CX5 mZw Vcq
related: VCpu 5EN bBt
related: DJh5 yyF hEM
related: fWrt sLg koW
related: 4Jty HpK a3Q
related: 13md uyV BNG

Reparation av cembalin
type: Concept
in scheme: JobTech Taxonomy - Färdighet
definition: Reparation av cembalin
broader: zmYu aAM TuF
related: aKdV u7V R5j

EDGE-system
type: Concept
in scheme: JobTech Taxonomy - Färdighet
definition: EDGE-system
broader: Mobiltelefonsystem
related: nDaB vdy eAy
related: SPYW 7Z1 ShT
related: 4Jty HpK a3Q

Bockningsverktyg, tillverkning
type: Concept
in scheme: JobTech Taxonomy - Färdighet
definition: Bockningsverktyg, tillverkning
broader: zmYu aAM TuF
related: MSnK 3Z8 4qA

e-lärande, erfarenhet
type: Concept
in scheme: JobTech Taxonomy - Färdighet
definition: e-lärande, erfarenhet
broader: zmYu aAM TuF
related: 2x2V UeL 6ke
related: 3FP7 4Eg x8P
related: 1CX5 mZw Vcq
related: oEmP NC1 sXE
related: RPBE x5M cXX
related: 4KhP FxL uZ5
related: oQUQ D11 HPx
related: 4Jty HpK a3Q
related: 5ek3 Cgq WeZ

Flyg, undervisning
type: Concept
in scheme: JobTech Taxonomy - Färdighet
definition: Flyg, undervisning
broader: zmYu aAM TuF
related: 7n3y FTE qSe

Shiatsu
type: Concept
in scheme: JobTech Taxonomy - Färdighet
definition: Kompetensen avser kunskaper om och erfarenhet av att utföra shiatsubehandling. Shiatsu avser en japansk behandlingsmetod som kombinerar mjuk beröring, tryck och sträckningar.
broader: zmYu aAM TuF
related: F19Z oB6 pg3

Beteendeterapi
type: Concept
in scheme: JobTech Taxonomy - Färdighet
definition: Beteendeterapi
broader: zmYu aAM TuF
related: VYeq GDF a2g

Skadereglering, civilförsäkring
type: Concept
in scheme: JobTech Taxonomy - Färdighet
definition: Skadereglering, civilförsäkring
broader: zmYu aAM TuF
related: Ru4W zn2 LEz

C-foto
type: Concept
in scheme: JobTech Taxonomy - Färdighet
definition: C-foto
broader: zmYu aAM TuF
related: 4BsK q2C sCL
related: CkRH 4Qn iX3
related: 3J38 DNz YKK

Avancerad polartjänstgöring
type: Concept
in scheme: JobTech Taxonomy - Färdighet
definition: Avancerad polartjänstgöring
broader: s48H Sft DTn
related: Rsoy sS6 6c4
related: kZwz D8K bKs
related: kDnq Q98 sD3

Biodling
type: Concept
in scheme: JobTech Taxonomy - Färdighet
definition: Biodling
broader: zmYu aAM TuF
related: Lrsj wRZ sFV

PHP on TRAX, programmeringsverktyg
type: Concept
in scheme: JobTech Taxonomy - Färdighet
definition: PHP on TRAX, programmeringsverktyg
alternative label: PHP on TRAX
broader: Programmerings- och systemutvecklingsverktyg
related: D9SL mtn vGM
related: DJh5 yyF hEM
related: 4Jty HpK a3Q
related: MYAz x9m 2LJ

Objective-C, programmeringsspråk
type: Concept
in scheme: JobTech Taxonomy - Färdighet
definition: Objective-C, programmeringsspråk
alternative label: Objective-C
broader: Datorspråk
related: BAeH eg8 T2d
related: Fv7d YhP YmS
related: D9SL mtn vGM
related: DJh5 yyF hEM
related: 4Jty HpK a3Q

Sökmotormarknadsföring/SEM
type: Concept
in scheme: JobTech Taxonomy - Färdighet
definition: Sökmotormarknadsföring/SEM avser strategier och tekniker för att öka synligheten av webbplatser i sökmotorresultat genom betald annonsering. Kompetensen innefattar utveckling och optimering av annonsering i sökmotorer samt analys av resultat för att maximera effektiviteten i marknadsföringsinsatser.
alternative label: SEM
alternative label: Sökmotormarknadsföring
broader: zmYu aAM TuF
related: Fv7d YhP YmS
related: WX67 Pfb WMN
related: k1Nx auG sNh
related: 4Jty HpK a3Q
related: p16X 44f rwZ

Varieténummer
type: Concept
in scheme: JobTech Taxonomy - Färdighet
definition: Varieténummer
broader: zmYu aAM TuF
related: xuSE mtB Mir

Återvinningsprogram
type: Concept
in scheme: JobTech Taxonomy - Färdighet
definition: Återvinningsprogram avser system inom organisationer för identifiera möjligheter till återvinning av material och resurser för att reducera avfall och sänka kostnader. Det kan till exempel innebära: - processer för insamling och bearbetning av avfall - samordna designprocesser av produkter för att öka återvinningsbarhet Källa: ESCO och egen utredning.
broader: zmYu aAM TuF
related: rE1E m3d cx1
related: yXbD NTH ijE

World music
type: Concept
in scheme: JobTech Taxonomy - Färdighet
definition: World music
broader: p1WM wCw LTd
related: AWJF wqZ va9

Annonsproduktion, design
type: Concept
in scheme: JobTech Taxonomy - Färdighet
definition: Annonsproduktion, design
broader: zmYu aAM TuF
related: 8Bmh vtM zts
related: Mbt6 3ko DiD
related: CSUf ZVM a7Z

Geodesi
type: Concept
in scheme: JobTech Taxonomy - Färdighet
definition: Geodesi
broader: zmYu aAM TuF
related: GMDo DVo Yzh
related: ketV G9W GeR

Socialförsäkringsrätt
type: Concept
in scheme: JobTech Taxonomy - Färdighet
definition: Socialförsäkringsrätt
broader: zmYu aAM TuF
related: br6a VVS V3y
related: dJXy Rpq a2u
related: n6iX f2z XfE
related: JfYV ZGg 6rm
related: pok1 ipJ yzD

Scenografi, film
type: Concept
in scheme: JobTech Taxonomy - Färdighet
definition: Scenografi, film
broader: zmYu aAM TuF
related: 4BsK q2C sCL
related: rYSG 3WJ LmC
related: CSUf ZVM a7Z

Massablekning
type: Concept
in scheme: JobTech Taxonomy - Färdighet
definition: Massablekning avser en process inom pappersmassatillverkning där lignin avlägsnas från pappersmassan för att förbättra dess ljushet och kvalitet. Kompetensen omfattar teknisk kunskap om kemiska och mekaniska metoder som används för att behandla pappersmassa i syfte att uppnå önskade egenskaper.
broader: zmYu aAM TuF
related: 4obu LL6 RqJ

Basket, professionell utövning
type: Concept
in scheme: JobTech Taxonomy - Färdighet
definition: Basket, professionell utövning
broader: Idrott/aktivitet
related: AwXA EM4 71n

Sun Certified Architect for Java Technology
type: Concept
in scheme: JobTech Taxonomy - Färdighet
definition: Sun Certified Architect for Java Technology
broader: s48H Sft DTn
related: BAeH eg8 T2d
related: 4Jty HpK a3Q

Spårsvetsning
type: Concept
in scheme: JobTech Taxonomy - Färdighet
definition: Spårsvetsning avser en metod för sammanfogning av metallelement, särskilt inom järnvägsinfrastruktur där den används för att svetsa ihop spår och räls för att säkerställa stabilitet och hållbarhet. Kompetensen kräver kunskap om svetsmetoder och materialegenskaper, samt förståelse för säkerhetsföreskrifter kopplade till arbete med stål och underhåll av järnvägssystem.
broader: on11 B1f LEw
related: bZ4J riZ zK6
related: wQ1E Bzk ZyA

Äldrepsykiatri, specialistkompetens för läkare
type: Concept
in scheme: JobTech Taxonomy - Färdighet
definition: Äldrepsykiatri, specialistkompetens för läkare
broader: Specialistbevis för läkare
related: nu7c QuB KVQ

Operationsplanering
type: Concept
in scheme: JobTech Taxonomy - Färdighet
definition: Operationsplanering
broader: zmYu aAM TuF
related: 6zAR EHM Kwj

Elschema-AutoCAD Electrical
type: Concept
in scheme: JobTech Taxonomy - Färdighet
definition: Elschema-AutoCAD Electrical
broader: mTLu uo2 gq2
related: nDaB vdy eAy
related: SPYW 7Z1 ShT
related: 4Jty HpK a3Q

Konstruktionsmålning
type: Concept
in scheme: JobTech Taxonomy - Färdighet
definition: Konstruktionsmålning
broader: zmYu aAM TuF
related: dKUb KBP mw3

Tennis, professionell utövning
type: Concept
in scheme: JobTech Taxonomy - Färdighet
definition: Tennis, professionell utövning
broader: Idrott/aktivitet
related: AwXA EM4 71n

Ljusbordsprogrammering
type: Concept
in scheme: JobTech Taxonomy - Färdighet
definition: Ljusbordsprogrammering
broader: zmYu aAM TuF
related: 4BsK q2C sCL

OpenUP, utvecklingsmodell
type: Concept
in scheme: JobTech Taxonomy - Färdighet
definition: OpenUP, utvecklingsmodell
alternative label: OpenUP
broader: Styr- och utvecklingsmodeller
related: cBBa ngH fCx
related: DJh5 yyF hEM
related: 4Jty HpK a3Q
related: UXKZ 3zZ ipB

Vävmaskiner
type: Concept
in scheme: JobTech Taxonomy - Färdighet
definition: Vävmaskiner
broader: zmYu aAM TuF
related: skLS kpa Ui1

Specialistbevis veterinär
type: Concept
in scheme: JobTech Taxonomy - Färdighet
definition: Ett bevis som intygar att en veterinär uppnått specialistkompetens inom ett specifikt område efter avslutad relevant utbildning och tjänstgöring. Beviset krävs för att kunna kalla sig specialistveterinär. Utfärdas av Jordbruksverket.
broader: Yrkesbevis/examen
related: WL4E r4b ek4

Speciallärarexamen
type: Concept
in scheme: JobTech Taxonomy - Färdighet
definition: Speciallärarexamen är en examen på högskolenivå kopplad till utbildning med inriktning mot speciallärare.
broader: Yrkesbevis/examen
related: 3FP7 4Eg x8P

AV-hjälpmedel
type: Concept
in scheme: JobTech Taxonomy - Färdighet
definition: AV-hjälpmedel avser tekniska och elektroniska hjälpmedel som används för att främja kommunikation och inlärning, särskilt inom utbildnings- och rehabiliteringsmiljöer. Dessa hjälpmedel kan inkludera ljudsystem, projektorer, datorer och andra enheter som stödjer både presentationer och interaktion i olika sammanhang.
broader: zmYu aAM TuF
related: bYde Frc xcB
related: 9DdK AZY ZNK
related: 4Jty HpK a3Q

Maskinkunskap och maskinunderhåll, industriell tillverkning
type: Concept
in scheme: JobTech Taxonomy - Färdighet
definition: Maskinkunskap och maskinunderhåll, industriell tillverkning, avser förståelse och färdigheter i drift och underhåll av maskiner som används inom industriell produktion. Denna kompetens innefattar både teoretisk kunskap om maskiners funktioner och praktiska färdigheter i att utföra reparationer och service för att säkerställa driftsäkerhet och effektivitet.
broader: zmYu aAM TuF
related: yJk6 azD ywF
related: YiQw N87 zLU
related: sX9n CWa KVC
related: dKUb KBP mw3
related: m8TS hdk pSf
related: HXzD qvt HV6
related: ENV6 BNa brP
related: 4obu LL6 RqJ
related: hxm6 xkr dHm
related: LEvM 7Hs w8i
related: rxmK wwM 1NA
related: Vfum e6B 7Bw
related: VKKg e4t t46
related: MSnK 3Z8 4qA
related: UdrS qzV P7i
related: XeJB bkn mRn
related: 1G6H AuG qyy
related: vaEp iBS c5h
related: 8ddv P8e iYz
related: K8yg U4C gkY
related: yPQ4 EaN Dtj
related: kF59 fge kts
related: SgAJ DW2 FN5
related: iZLB KpD LLo
related: wQ1E Bzk ZyA
related: Kxm9 N3V shF
related: mPzg 93F QEv
related: shkw ojo UL2
related: o31g CX1 qhQ
related: 4DET dLf iB9
related: skLS kpa Ui1
related: J9Vz JxJ Bji
related: aU9p ekE Fqf
related: E87t egE pjA
related: TrwQ RXT W8a
related: vCBT Pnd 8UB
related: UcNa inr snV
related: icae Y69 H8E
related: gJtZ EBc n2z
related: AUs8 M5f dLt
related: L4hA SJP SFi
related: 4bxV 58E P9N

Strålskydd
type: Concept
in scheme: JobTech Taxonomy - Färdighet
definition: Strålskydd avser åtgärder och riktlinjer för att skydda människor och miljön från skadliga effekter av joniserande strålning. Kompetensen innefattar kunskap om strålningsfysik och regler för säkert arbete med och hantering av strålkällor, liksom riskbedömningar och strategier för att minimera strålexponering.
broader: zmYu aAM TuF
related: puim 6PY DGj
related: nuXg Wjc JPd
related: yXbD NTH ijE
related: KM7d Z6Y LCJ

Laboratoriemetodik
type: Concept
in scheme: JobTech Taxonomy - Färdighet
definition: Laboratoriemetodik
broader: zmYu aAM TuF
related: wNrt Ysj WuT
related: 4Jty HpK a3Q

Analytisk kemi
type: Concept
in scheme: JobTech Taxonomy - Färdighet
definition: Kompetens inom analytisk kemi avser kunskaper om och tillämpning av instrument och metoder som används för att skilja åt, identifiera och kvantifiera kemiska komponenter i naturliga och konstgjorda material och lösningar.
broader: zmYu aAM TuF
related: v9nU 6Fw 4Qg
related: qn2U dB9 Cmh
related: eofS oZs RZi
related: 4Jty HpK a3Q
related: bExu 8gk azk

PL/1, programmeringsspråk
type: Concept
in scheme: JobTech Taxonomy - Färdighet
definition: PL/1, programmeringsspråk
alternative label: PL/1
broader: Datorspråk
related: BAeH eg8 T2d
related: Fv7d YhP YmS
related: D9SL mtn vGM
related: DJh5 yyF hEM
related: 4Jty HpK a3Q

Kabelinstallationer
type: Concept
in scheme: JobTech Taxonomy - Färdighet
definition: Kabelinstallationer
broader: zmYu aAM TuF
related: fWrt sLg koW
related: yyF7 jsW EeP

Entré Pro, redovisningssystem
type: Concept
in scheme: JobTech Taxonomy - Färdighet
definition: Entré Pro, redovisningssystem
alternative label: Entré Pro
broader: xSJR 1Kq pxB
related: eQ4M CNm ozj
related: q81z 3oD 1qu
related: ij8k EwC zyB
related: 4Jty HpK a3Q

Maskinbefäl klass VI (behörighet)
type: Concept
in scheme: JobTech Taxonomy - Färdighet
definition: Maskinbefäl klass VI (behörighet)
broader: Behörigheter, sjöfart
related: Rsoy sS6 6c4
related: FKCE Anf zGH

Dos, operativsystem
type: Concept
in scheme: JobTech Taxonomy - Färdighet
definition: Dos, operativsystem
alternative label: Dos
broader: xAWr WYq JPP
related: BAeH eg8 T2d
related: cBBa ngH fCx
related: 1CX5 mZw Vcq
related: D9SL mtn vGM
related: VCpu 5EN bBt
related: DJh5 yyF hEM
related: 4Jty HpK a3Q
related: 13md uyV BNG
related: UXKZ 3zZ ipB
related: MYAz x9m 2LJ

Materialkunskap, industriell tillverkning
type: Concept
in scheme: JobTech Taxonomy - Färdighet
definition: Materialkunskap, industriell tillverkning
broader: zmYu aAM TuF
related: yJk6 azD ywF
related: mis4 feV uex
related: YiQw N87 zLU
related: sX9n CWa KVC
related: dKUb KBP mw3
related: m8TS hdk pSf
related: HXzD qvt HV6
related: ENV6 BNa brP
related: 4obu LL6 RqJ
related: LEvM 7Hs w8i
related: rxmK wwM 1NA
related: Vfum e6B 7Bw
related: VKKg e4t t46
related: MSnK 3Z8 4qA
related: QqHf XKZ eyy
related: UdrS qzV P7i
related: XeJB bkn mRn
related: 1G6H AuG qyy
related: vaEp iBS c5h
related: 8ddv P8e iYz
related: 33Nt DSs YYA
related: yPQ4 EaN Dtj
related: kF59 fge kts
related: SgAJ DW2 FN5
related: dAu7 VyL hsy
related: iZLB KpD LLo
related: wQ1E Bzk ZyA
related: Kxm9 N3V shF
related: mPzg 93F QEv
related: shkw ojo UL2
related: o31g CX1 qhQ
related: 4DET dLf iB9
related: skLS kpa Ui1
related: J9Vz JxJ Bji
related: vCBT Pnd 8UB
related: UcNa inr snV
related: icae Y69 H8E
related: gJtZ EBc n2z
related: AUs8 M5f dLt
related: L4hA SJP SFi
related: 4bxV 58E P9N

Medelhavsarkeologi
type: Concept
in scheme: JobTech Taxonomy - Färdighet
definition: Medelhavsarkeologi
broader: zmYu aAM TuF
related: sXgV QFg vpb

Köprätt
type: Concept
in scheme: JobTech Taxonomy - Färdighet
definition: Köprätt
broader: zmYu aAM TuF
related: q8wL kdi WaW
related: 6aak 8eh iwT

Verksamhetsledning, träningsskola
type: Concept
in scheme: JobTech Taxonomy - Färdighet
definition: Verksamhetsledning, träningsskola
broader: zmYu aAM TuF
related: z8di AqX GBr

Pantomim
type: Concept
in scheme: JobTech Taxonomy - Färdighet
definition: Pantomim
broader: zmYu aAM TuF
related: iBUL s38 izZ
related: xuSE mtB Mir

Film/redigering-Apple Final Cut Pro
type: Concept
in scheme: JobTech Taxonomy - Färdighet
definition: Film/redigering-Apple Final Cut Pro
alternative label: Film-Apple Final Cut Pro
alternative label: redigering-Apple Final Cut Pro
broader: Programvara för digitalt skapande
related: 8Bmh vtM zts
related: SgNH hag n9D
related: 4BsK q2C sCL
related: CkRH 4Qn iX3
related: 3J38 DNz YKK
related: PH2M uV4 r72
related: 4Jty HpK a3Q

Växtekologi
type: Concept
in scheme: JobTech Taxonomy - Färdighet
definition: Växtekologi
broader: zmYu aAM TuF
related: XBh3 Xrm C4R
related: XurM DVs ggn
related: yXbD NTH ijE
related: dsK3 hkt zGy
related: e9FK VKh ahW

Kylcertifikat
type: Concept
in scheme: JobTech Taxonomy - Färdighet
definition: Kylcertifikat
broader: s48H Sft DTn
related: Lzpv ofL 3H5
related: KttZ Skc bMR
related: 3UzE P8A 9sS

Rörelseterapi
type: Concept
in scheme: JobTech Taxonomy - Färdighet
definition: Rörelseterapi
broader: zmYu aAM TuF
related: s7vU FhY L5Z
related: F19Z oB6 pg3

Psykisk funktionsnedsättning, funktionshindersfrågor
type: Concept
in scheme: JobTech Taxonomy - Färdighet
definition: Psykisk funktionsnedsättning, funktionshindersfrågor
broader: zmYu aAM TuF
related: vPP6 rsw dck

JPA, Java Persistence API, ramverk
type: Concept
in scheme: JobTech Taxonomy - Färdighet
definition: JPA, Java Persistence API, ramverk
broader: srsj GQb CE1
related: D9SL mtn vGM
related: DJh5 yyF hEM
related: UxT1 tPF Kbg
related: 4Jty HpK a3Q
related: UXKZ 3zZ ipB

Reparationsvana, stenmaterial
type: Concept
in scheme: JobTech Taxonomy - Färdighet
definition: Reparationsvana, stenmaterial
broader: zmYu aAM TuF
related: NnB3 eWH auo

Europ-klassificering
type: Concept
in scheme: JobTech Taxonomy - Färdighet
definition: Europ-klassificering
broader: zmYu aAM TuF
related: dAu7 VyL hsy

Städbesiktning
type: Concept
in scheme: JobTech Taxonomy - Färdighet
definition: Städbesiktning
broader: zmYu aAM TuF
related: Z6TY xDf Yup
related: FtyZ Joo tB8

Farligt gods, behörighet
type: Concept
in scheme: JobTech Taxonomy - Färdighet
definition: Farligt gods, behörighet
broader: Behörigheter, sjöfart
related: kZwz D8K bKs
related: kDnq Q98 sD3

Träsnideri
type: Concept
in scheme: JobTech Taxonomy - Färdighet
definition: Träsnideri
broader: zmYu aAM TuF
related: aKdV u7V R5j

XUL, programmeringsspråk
type: Concept
in scheme: JobTech Taxonomy - Färdighet
definition: XUL, programmeringsspråk
alternative label: XUL
broader: Datorspråk
related: BAeH eg8 T2d
related: Fv7d YhP YmS
related: nDaB vdy eAy
related: D9SL mtn vGM
related: DJh5 yyF hEM
related: SPYW 7Z1 ShT
related: 4Jty HpK a3Q

Rakning och trimning av skägg
type: Concept
in scheme: JobTech Taxonomy - Färdighet
definition: Rakning och trimning av skägg avser tekniker och metoder för att styla, forma och vårda skägg, vilket inkluderar användning av skärverktyg, rakkniv och trimmer. Kompetensen innefattar kunskap om olika skäggformer samt förmåga att anpassa stilar efter individuella önskemål och ansiktsdrag.
broader: zmYu aAM TuF
related: mwVN oEH g9k
related: LyBp bY6 bZK

Aluminium, materialkunskap
type: Concept
in scheme: JobTech Taxonomy - Färdighet
definition: Aluminium, materialkunskap
broader: Materialkunskap
related: wQ1E Bzk ZyA
related: L4hA SJP SFi
related: bXfo 4hb SXx

Husmontering
type: Concept
in scheme: JobTech Taxonomy - Färdighet
definition: Husmontering
broader: zmYu aAM TuF
related: 9mJN VwW Xjg

Öppna spisar, murningsvana
type: Concept
in scheme: JobTech Taxonomy - Färdighet
definition: Öppna spisar, murningsvana
broader: zmYu aAM TuF
related: NnB3 eWH auo

Quality Function Deployment/QFD
type: Concept
in scheme: JobTech Taxonomy - Färdighet
definition: Quality Function Deployment/QFD
alternative label: QFD
alternative label: Quality Function Deployment
broader: Kvalitetsverktyg
related: Qo7p wjf gtv
related: vPP6 rsw dck
related: dMVD VYy kgg

Företagsekonomi
type: Concept
in scheme: JobTech Taxonomy - Färdighet
definition: Företagsekonomi
broader: zmYu aAM TuF
related: Y6yY SuR hVh
related: XurM DVs ggn
related: Qo7p wjf gtv
related: Fu4x 7KG YgC
related: Bbkh nrm 2J8
related: 8SPu K1k 5qR
related: pf1K PTz frm
related: vPP6 rsw dck
related: 7mn2 kA9 ftp
related: Pz9M srJ Lc9
related: pTr9 RBT 9ur
related: mZsb A1K Gec
related: WX67 Pfb WMN
related: wby2 mwq fWV
related: X1Ac Y9P PJo
related: hZLv S5f jo2
related: 3i4a Ufc qpp
related: 9QMD sZ3 ZjX
related: nNxJ YWy vR2
related: 3LdB WEJ 8Ms
related: 9Mn4 PNA 7Yz

Reklamutdelning
type: Concept
in scheme: JobTech Taxonomy - Färdighet
definition: Reklamutdelning avser verksamhet där försändelser som reklamblad och tidningar distribueras till hushåll och organisationer. Kompetensen omfattar logistik, ruttplanering och uppföljning av utdelningen för att säkerställa korrekt och effektiv distribution.
broader: zmYu aAM TuF
related: gaBh 1vR tNE
related: qhbP JEJ HtK

Tyrolermusik
type: Concept
in scheme: JobTech Taxonomy - Färdighet
definition: Tyrolermusik
broader: p1WM wCw LTd
related: AWJF wqZ va9

Intrastatredovisning
type: Concept
in scheme: JobTech Taxonomy - Färdighet
definition: Intrastatredovisning
broader: zmYu aAM TuF
related: AuTi FEo j3R
related: 957L kZK rHZ

Affärsreseförsäljning
type: Concept
in scheme: JobTech Taxonomy - Färdighet
definition: Affärsreseförsäljning avser kompetens inom att förmedla och sälja affärsrelaterade resor. Detta omfattar kunskaper inom resplanering, bokning av biljetter och logi samt hantering av kundservice och informationsgivning om resor och transportalternativ.
broader: oLM7 u3d yJ5
related: fdLf oPp wVw

B-checker, flyg
type: Concept
in scheme: JobTech Taxonomy - Färdighet
definition: B-checker, flyg
broader: zmYu aAM TuF
related: iGTu bYL 2T7
related: eRkT cTv H9v
related: L4hA SJP SFi

Kontorsservice
type: Concept
in scheme: JobTech Taxonomy - Färdighet
definition: Kontorsservice
broader: zmYu aAM TuF
related: 9DdK AZY ZNK

Estniska, cirkelledning
type: Concept
in scheme: JobTech Taxonomy - Färdighet
definition: Estniska, cirkelledning
broader: zmYu aAM TuF
related: 1CX5 mZw Vcq

Roulette, croupierutbildad
type: Concept
in scheme: JobTech Taxonomy - Färdighet
definition: Roulette, croupierutbildad
broader: Yrkesbevis/examen
related: YHwG fk2 MDL

Avsnittsregi
type: Concept
in scheme: JobTech Taxonomy - Färdighet
definition: Avsnittsregi
broader: zmYu aAM TuF
related: rYSG 3WJ LmC

Ekologisk odling
type: Concept
in scheme: JobTech Taxonomy - Färdighet
definition: Ekologisk odling
broader: zmYu aAM TuF
related: XurM DVs ggn
related: yXbD NTH ijE
related: 2xQ4 4kh kTZ
related: 9QMD sZ3 ZjX
related: k3R3 UkC nK2
related: RYCQ ogb uUY
related: 3LdB WEJ 8Ms

Framtidsforskning
type: Concept
in scheme: JobTech Taxonomy - Färdighet
definition: Framtidsforskning
broader: zmYu aAM TuF
related: sXgV QFg vpb

Försiktig sprängning
type: Concept
in scheme: JobTech Taxonomy - Färdighet
definition: Försiktig sprängning
broader: xKbn JBn EPE
related: sX9n CWa KVC

Gesällbrev, stenhuggare
type: Concept
in scheme: JobTech Taxonomy - Färdighet
definition: Gesällbrev, stenhuggare
broader: Yrkesbevis/examen
related: vCBT Pnd 8UB

Ungdomsmottagning
type: Concept
in scheme: JobTech Taxonomy - Färdighet
definition: Ungdomsmottagning
broader: zmYu aAM TuF
related: 7XXd 4St nit

Telefonrådgivning, sjukvård
type: Concept
in scheme: JobTech Taxonomy - Färdighet
definition: Telefonrådgivning, sjukvård
broader: zmYu aAM TuF
related: Z8ci bBE tmx

Flygtekniska komponenter
type: Concept
in scheme: JobTech Taxonomy - Färdighet
definition: Flygtekniska komponenter avser de delar och system som ingår i flygplan och helikoptrar, inklusive motorer, instrument och manöversystem. Kompetensen omfattar kunskap om och arbete med dessa komponenter för att säkerställa säkerhet och funktionalitet i luftfartyg.
broader: zmYu aAM TuF
related: iGTu bYL 2T7
related: eRkT cTv H9v

Ljud-Pro Tools
type: Concept
in scheme: JobTech Taxonomy - Färdighet
definition: Ljud-Pro Tools
broader: Programvara för digitalt skapande
related: SgNH hag n9D
related: 4BsK q2C sCL
related: CkRH 4Qn iX3
related: 3J38 DNz YKK
related: PH2M uV4 r72
related: 4Jty HpK a3Q

Sportdykning
type: Concept
in scheme: JobTech Taxonomy - Färdighet
definition: Sportdykning
broader: zmYu aAM TuF
related: DPPw 4wa AsH

Italienska, cirkelledning
type: Concept
in scheme: JobTech Taxonomy - Färdighet
definition: Italienska, cirkelledning
broader: zmYu aAM TuF
related: 1CX5 mZw Vcq

Elmotorer, reparationsvana
type: Concept
in scheme: JobTech Taxonomy - Färdighet
definition: Elmotorer, reparationsvana
broader: zmYu aAM TuF
related: Lzpv ofL 3H5
related: yXbD NTH ijE

Gesällbrev, dekopör (intarsia – möbelsnickeri)
type: Concept
in scheme: JobTech Taxonomy - Färdighet
definition: Gesällbrev, dekopör (intarsia – möbelsnickeri)
broader: Yrkesbevis/examen
related: 34Tn BQQ tfo
related: 1Nwn GYH wkH

MSI-paketering
type: Concept
in scheme: JobTech Taxonomy - Färdighet
definition: MSI-paketering
broader: zmYu aAM TuF
related: DJh5 yyF hEM
related: 4Jty HpK a3Q
related: MYAz x9m 2LJ

Dart, programmeringsspråk
type: Concept
in scheme: JobTech Taxonomy - Färdighet
definition: Dart, programmeringsspråk
broader: Datorspråk
related: BAeH eg8 T2d
related: cBBa ngH fCx
related: Q5DF juj 8do
related: D9SL mtn vGM
related: DJh5 yyF hEM
related: UxT1 tPF Kbg
related: UXKZ 3zZ ipB

Underhållsplanering, erfarenhet
type: Concept
in scheme: JobTech Taxonomy - Färdighet
definition: Underhållsplanering, erfarenhet
broader: Yrkesövergripande kompetenser

Fidelio, hotellbokningssystem
type: Concept
in scheme: JobTech Taxonomy - Färdighet
definition: Fidelio, hotellbokningssystem, avser programvara som används för hantering av hotellbokningar, gästregistrering och administrativt stöd inom hotell- och restaurangbranschen.
alternative label: Fidelio
alternative label: Fideliokunskap
broader: kRoQ fPR 8oK
related: bYde Frc xcB
related: 4Jty HpK a3Q

Intarsialäggning
type: Concept
in scheme: JobTech Taxonomy - Färdighet
definition: Intarsialäggning
broader: zmYu aAM TuF
related: V79C DD2 3Gj
related: 1Nwn GYH wkH

EFS (Evangeliska Fosterlandsstiftelsen)
type: Concept
in scheme: JobTech Taxonomy - Färdighet
definition: EFS (Evangeliska Fosterlandsstiftelsen)
alternative label: EFS
alternative label: Evangeliska Fosterlandsstiftelsen
broader: zmYu aAM TuF
related: 2L2s EU8 PzR

Klimatteknik
type: Concept
in scheme: JobTech Taxonomy - Färdighet
definition: Klimatteknik
broader: zmYu aAM TuF
related: yXbD NTH ijE
related: fLKb bJ3 69p
related: fWrt sLg koW
related: 3UzE P8A 9sS

Skördearbete
type: Concept
in scheme: JobTech Taxonomy - Färdighet
definition: Skördearbete avser de åtgärder och aktiviteter som genomförs för att samla in och plocka grödor såsom grönsaker, frukt och bär. Kompetensen innefattar även relaterade arbetsuppgifter som röjning, grävning, plantering, rensning och gallring, samt rengöring av stallar och ladugårdar, ofta med hjälp av handredskap och handverktyg.
broader: zmYu aAM TuF
related: 1EBv UzM ozQ

Bergsäkring
type: Concept
in scheme: JobTech Taxonomy - Färdighet
definition: Bergsäkring
broader: zmYu aAM TuF
related: f71c gjL RDq

Nagelförlängning
type: Concept
in scheme: JobTech Taxonomy - Färdighet
definition: Nagelförlängning avser processen att förlänga och forma naglar med olika metoder och material. Denna kompetens omfattar färdigheter i att använda tekniker för att bygga upp och förstärka naglar samt säkerställa rätt behandling av nagelband och nagelytor.
broader: zmYu aAM TuF
related: ezKk kss CiQ

Kuggfräsning
type: Concept
in scheme: JobTech Taxonomy - Färdighet
definition: Kuggfräsning
broader: zmYu aAM TuF
related: e6nk AGp y28
related: vaEp iBS c5h

Tågmästarutbildning
type: Concept
in scheme: JobTech Taxonomy - Färdighet
definition: Tågmästarutbildning
broader: Yrkesbevis/examen
related: s78G Zp2 dkq

Regi, Film
type: Concept
in scheme: JobTech Taxonomy - Färdighet
definition: Regissera film.
broader: zmYu aAM TuF
related: rYSG 3WJ LmC

Ledningsnät, elkraft
type: Concept
in scheme: JobTech Taxonomy - Färdighet
definition: Ledningsnät, elkraft
broader: zmYu aAM TuF
related: MW1P GNJ 4F9
related: nDaB vdy eAy

Jordbruksmaskiner, reparationsvana
type: Concept
in scheme: JobTech Taxonomy - Färdighet
definition: Jordbruksmaskiner, reparationsvana avser kunskap och färdighet i att analysera fel och utföra reparationer och underhåll av olika typer av jordbruksmaskiner. Kompetensen omfattar även hantering av reservdelar och tillbehör samt service på lantbruks- och entreprenadmaskiner.
broader: zmYu aAM TuF
related: Lzpv ofL 3H5

Hamnlogistik
type: Concept
in scheme: JobTech Taxonomy - Färdighet
definition: Hamnlogistik omfattar planering, koordinering och genomförande av gods- och fartygsflöden i hamnområden. Kompetensen inkluderar kunskap om hur laster hanteras i anslutning till fartygs ankomst, lossning, lastning och vidare transport. Det ingår även förståelse för användning av hamnens infrastruktur, hantering av stuveri- och krantjänster samt samverkan med myndigheter, rederier, transportörer och terminaloperatörer. Hamnlogistik innebär ofta arbete med digitala system för bokning, övervakning och rapportering av fartygsrörelser och godstransporter.
broader: zmYu aAM TuF
related: 33Nt DSs YYA
related: AuTi FEo j3R
related: 957L kZK rHZ

Cylinderlåsteknik
type: Concept
in scheme: JobTech Taxonomy - Färdighet
definition: Cylinderlåsteknik avser kompetensen att arbeta med och hantera cylinderlås, inklusive installation, justering och reparation av dessa låssystem. Kompetensen inkluderar kunskap om låsens konstruktion och funktion samt färdigheter i att tillverka nycklar och utföra service på inpasseringssystem.
broader: zmYu aAM TuF
related: e6nk AGp y28

Hårvårdsprodukter
type: Concept
in scheme: JobTech Taxonomy - Färdighet
definition: Hårvårdsprodukter
broader: zmYu aAM TuF
related: oXSW fbY XrY
related: mwVN oEH g9k
related: LyBp bY6 bZK

Termodynamik
type: Concept
in scheme: JobTech Taxonomy - Färdighet
definition: Termodynamik
broader: zmYu aAM TuF
related: K8yg U4C gkY
related: PRQn 9yw NJA

Handgjort papper
type: Concept
in scheme: JobTech Taxonomy - Färdighet
definition: Handgjort papper
broader: zmYu aAM TuF
related: yXbD NTH ijE
related: mPzg 93F QEv

Film/effekter- Autodesk Flint/Flame/Inferno
type: Concept
in scheme: JobTech Taxonomy - Färdighet
definition: Film/effekter- Autodesk Flint/Flame/Inferno
alternative label: Film- Autodesk Flint/Flame/Inferno
alternative label: effekter- Autodesk Flint/Flame/Inferno
broader: Programvara för digitalt skapande
related: 8Bmh vtM zts
related: 4BsK q2C sCL
related: CkRH 4Qn iX3
related: 3J38 DNz YKK
related: PH2M uV4 r72
related: 4Jty HpK a3Q

Kursintyg, Ansvarig reklamutgivare/ARU
type: Concept
in scheme: JobTech Taxonomy - Färdighet
definition: Kursintyg, Ansvarig reklamutgivare/ARU
broader: zmYu aAM TuF
related: mpuA s56 Hsy
related: rYSG 3WJ LmC

Förarutbildning, tåg
type: Concept
in scheme: JobTech Taxonomy - Färdighet
definition: Förarutbildning, tåg
broader: Yrkesbevis/examen
related: nk6Z 5oD QoM
related: UGgc Vm9 Bog

Ethics, styr- och utvecklingsmodell
type: Concept
in scheme: JobTech Taxonomy - Färdighet
definition: Ethics, styr- och utvecklingsmodell
alternative label: Ethics
broader: Styr- och utvecklingsmodeller
related: cBBa ngH fCx
related: D9SL mtn vGM
related: UxT1 tPF Kbg
related: 4Jty HpK a3Q
related: UXKZ 3zZ ipB

Kvalitetskontrollsystem, erfarenhet
type: Concept
in scheme: JobTech Taxonomy - Färdighet
definition: Kvalitetskontrollsystem, erfarenhet
broader: zmYu aAM TuF
related: mis4 feV uex
related: xm5G vGn iyk
related: v9nU 6Fw 4Qg
related: Qo7p wjf gtv
related: qn2U dB9 Cmh
related: mp2Y vyC RFV
related: 3jEy yuT aVo
related: rwpH 6RA XTT
related: rxmK wwM 1NA
related: Vfum e6B 7Bw
related: Uw64 cuc U3H
related: thZP oR7 WrY
related: w6ud quG dgh
related: K8yg U4C gkY
related: 7mn2 kA9 ftp
related: puim 6PY DGj
related: nDaB vdy eAy
related: D9SL mtn vGM
related: 33Nt DSs YYA
related: rE1E m3d cx1
related: DJh5 yyF hEM
related: SPYW 7Z1 ShT
related: XeBP nMe pXx
related: dMVD VYy kgg
related: PRQn 9yw NJA
related: QEBd qHu vGr
related: UxT1 tPF Kbg
related: 4Jty HpK a3Q
related: UXKZ 3zZ ipB

Krisberedskap
type: Concept
in scheme: JobTech Taxonomy - Färdighet
definition: Krisberedskap
broader: Yrkesövergripande kompetenser

Analys/Beräkning-Nastran
type: Concept
in scheme: JobTech Taxonomy - Färdighet
definition: Analys/Beräkning-Nastran
alternative label: Analys-Nastran
alternative label: Beräkning-Nastran
broader: mTLu uo2 gq2
related: thZP oR7 WrY
related: K8yg U4C gkY
related: Pd51 xnr KCY
related: XeBP nMe pXx
related: PRQn 9yw NJA
related: ETAR ggZ Wuw
related: 41KB bfk 5jR
related: 4Jty HpK a3Q

Netobjects Fusion, HTML-editor
type: Concept
in scheme: JobTech Taxonomy - Färdighet
definition: Netobjects Fusion, HTML-editor
alternative label: Netobjects Fusion
broader: Programmerings- och systemutvecklingsverktyg
related: 8Bmh vtM zts
related: D9SL mtn vGM
related: 4Jty HpK a3Q
related: Mbt6 3ko DiD
related: MYAz x9m 2LJ

Makroekonomi
type: Concept
in scheme: JobTech Taxonomy - Färdighet
definition: Makroekonomi
broader: zmYu aAM TuF
related: WZCM nfS eAk

Transfusionsmedicin, specialistkompetens för läkare
type: Concept
in scheme: JobTech Taxonomy - Färdighet
definition: Transfusionsmedicin, specialistkompetens för läkare
broader: Specialistbevis för läkare
related: nu7c QuB KVQ

Kyl- och frysvaruhantering
type: Concept
in scheme: JobTech Taxonomy - Färdighet
definition: Kyl- och frysvaruhantering
broader: zmYu aAM TuF
related: WhBn FAp ZNW
related: kLyY rwr aJr

Dialekt
type: Concept
in scheme: JobTech Taxonomy - Färdighet
top concept of: JobTech Taxonomy - Färdighet
definition: Dialekt
narrower: Göteborgska
narrower: mYYb Dpc hRz
narrower: Norrländska
narrower: Bohuslänska
narrower: Blekingska
narrower: Gotländska
narrower: nHbt 29n Ae3
narrower: rq9q ZBs uQV
narrower: Pitemål
narrower: wauE xtF SRP
narrower: Finlandssvenska
narrower: Västgötska
narrower: uJWw bc2 XXZ
narrower: Tornedalska
narrower: Skånska
narrower: Rikssvenska
narrower: Östgötska
narrower: zhjc MQC skd

Underklädessömnad
type: Concept
in scheme: JobTech Taxonomy - Färdighet
definition: Underklädessömnad
broader: zmYu aAM TuF
related: mwVN oEH g9k

Administrativt arbete, erfarenhet
type: Concept
in scheme: JobTech Taxonomy - Färdighet
definition: Administrativt arbete, erfarenhet, avser den praktiska kunskapen och färdigheten att utföra olika administrativa uppgifter, som kan inkludera dokumenthantering, datainmatning, schemaläggning, och kundservice. Denna kompetens omfattar även förmågan att organisera och strukturera arbete effektivt för att stödja verksamhetens dagliga funktioner och mål.
broader: Yrkesövergripande kompetenser
related: eQ4M CNm ozj
related: fdLf oPp wVw
related: e6nk AGp y28

Ekonomisk analys
type: Concept
in scheme: JobTech Taxonomy - Färdighet
definition: Ekonomisk analys
broader: zmYu aAM TuF
related: Y6yY SuR hVh
related: Bbkh nrm 2J8
related: Uw4n UB2 RCW
related: vPP6 rsw dck
related: q81z 3oD 1qu
related: JAFv ZaP tDG
related: pTr9 RBT 9ur
related: mZsb A1K Gec
related: cRmd 536 pT1

Medlemskap i Advokatsamfundet
type: Concept
in scheme: JobTech Taxonomy - Färdighet
definition: Ledamot av Sveriges advokatsamfund får kalla sig advokat. Ansökan om inträde prövas av Advokatsamfundets styrelse.
broader: zmYu aAM TuF
related: q8wL kdi WaW
related: 4P8B LtK JgE

Rational Software Architect, systemutvecklingsverktyg
type: Concept
in scheme: JobTech Taxonomy - Färdighet
definition: Rational Software Architect, systemutvecklingsverktyg
alternative label: Rational Software Architect
broader: Programmerings- och systemutvecklingsverktyg
related: D9SL mtn vGM
related: DJh5 yyF hEM
related: 4Jty HpK a3Q
related: MYAz x9m 2LJ

Utbildning i Skydd mot olyckor (SMO)
type: Concept
in scheme: JobTech Taxonomy - Färdighet
definition: Utbildning i Skydd mot olyckor (SMO) är en eftergymnasial yrkesinriktad utbildning mot arbete inom räddningstjänsten.
broader: Yrkesbevis/examen
related: wCx8 rY3 XUT
related: ug5y o6z U3L
related: ayQ4 G3W A2w
related: 3MBw pDA P2F

Internationell ekonomi
type: Concept
in scheme: JobTech Taxonomy - Färdighet
definition: Internationell ekonomi
broader: zmYu aAM TuF
related: WZCM nfS eAk

Brandisolering
type: Concept
in scheme: JobTech Taxonomy - Färdighet
definition: Brandisolering avser åtgärder och material som används för att förhindra spridning av brand och att skydda byggnader och konstruktioner mot värmeskador. Kompetensen omfattar kunskap om olika brandisoleringsmetoder och -material samt deras tillämpning inom bygg- och anläggningssektorn.
broader: zmYu aAM TuF
related: yXbD NTH ijE
related: AD3U cFH rbe
related: cGxX R9c kW1

Filmning, drönare
type: Concept
in scheme: JobTech Taxonomy - Färdighet
definition: Filmning, drönare
broader: zmYu aAM TuF
related: SgNH hag n9D
related: 3J38 DNz YKK
related: 4Jty HpK a3Q

Kvantkemi
type: Concept
in scheme: JobTech Taxonomy - Färdighet
definition: Kvantkemi
broader: zmYu aAM TuF
related: v9nU 6Fw 4Qg
related: qn2U dB9 Cmh
related: eofS oZs RZi
related: KM7d Z6Y LCJ

Ärendehanteringssystem inom kundtjänst
type: Concept
in scheme: JobTech Taxonomy - Färdighet
definition: Ärendehanteringssystem inom kundtjänst avser digitala verktyg och plattformar som används för att registrera, spåra och hantera inkommande ärenden och förfrågningar från kunder. Kompetensen innebär förståelse för systemets funktioner och arbetsflöden samt förmåga att effektivt använda dessa verktyg för att förbättra kundservice och kommunikationen med kunder.
broader: zmYu aAM TuF
related: oEmP NC1 sXE
related: H2Zj eL9 x28
related: pwRH MT1 8nR
related: 4Jty HpK a3Q

Öron-, näs- och halssjukdomar, specialistkompetens för läkare
type: Concept
in scheme: JobTech Taxonomy - Färdighet
definition: Öron-, näs- och halssjukdomar, specialistkompetens för läkare
broader: Specialistbevis för läkare
related: nu7c QuB KVQ

Maskinbefäl klass II (behörighet)
type: Concept
in scheme: JobTech Taxonomy - Färdighet
definition: Maskinbefäl klass II (behörighet)
broader: Behörigheter, sjöfart
related: Rsoy sS6 6c4

TIG-svetsning
type: Concept
in scheme: JobTech Taxonomy - Färdighet
definition: TIG (Tungsten Inert Gas) är en svetsmetod, där en elektrisk ljusbåge upprätthålls mellan en icke smältande elektrod och ett arbetsstycke i en atmosfär av inaktiv gas. Källa: Svetskommissionen
broader: on11 B1f LEw
related: wQ1E Bzk ZyA
related: TrwQ RXT W8a
related: L4hA SJP SFi
related: bXfo 4hb SXx

Montageledning
type: Concept
in scheme: JobTech Taxonomy - Färdighet
definition: Montageledning
broader: zmYu aAM TuF
related: thZP oR7 WrY
related: w6ud quG dgh
related: PRQn 9yw NJA

Löneadministration
type: Concept
in scheme: JobTech Taxonomy - Färdighet
definition: Löneadministration
broader: zmYu aAM TuF
related: eQ4M CNm ozj
related: L7eh ihX vM5

Teckenspråk, cirkelledning
type: Concept
in scheme: JobTech Taxonomy - Färdighet
definition: Teckenspråk, cirkelledning
broader: zmYu aAM TuF
related: mcRJ kq2 jFr

Barn- och skolbiblioteksinriktning
type: Concept
in scheme: JobTech Taxonomy - Färdighet
definition: Barn- och skolbiblioteksinriktning
broader: zmYu aAM TuF
related: wVfo Njx 1rB

Finlandssvenska
type: Concept
in scheme: JobTech Taxonomy - Färdighet
definition: Finlandssvenska
broader: Dialekt
related: iBUL s38 izZ

Synon/2E, programmeringsspråk
type: Concept
in scheme: JobTech Taxonomy - Färdighet
definition: Synon/2E, programmeringsspråk
alternative label: Synon/2E
broader: Datorspråk
related: BAeH eg8 T2d
related: Fv7d YhP YmS
related: D9SL mtn vGM
related: DJh5 yyF hEM
related: 4Jty HpK a3Q

Bortfallsanalys
type: Concept
in scheme: JobTech Taxonomy - Färdighet
definition: Bortfallsanalys
broader: zmYu aAM TuF
related: jv1x tpK 32p
related: 4Jty HpK a3Q

Yrkeshögskoleutbildning, processoperatör inom kemisk industri
type: Concept
in scheme: JobTech Taxonomy - Färdighet
definition: Yrkeshögskoleutbildning, processoperatör inom kemisk industri är en yrkeshögskoleutbildning med inriktning till processoperatör inom kemisk industri.
broader: Yrkesutbildning
related: QEBd qHu vGr

Urmakeri
type: Concept
in scheme: JobTech Taxonomy - Färdighet
definition: Urmakeri avser hantverket att tillverka, reparera och justera klockor och urverk, vilket kräver noggrannhet och precision. Kompetensen omfattar kunskaper i mekaniska system, verktyg och tekniker för att säkerställa korrekt funktion och estetik hos klockor och ur.
broader: zmYu aAM TuF
related: e6nk AGp y28

GeoROG, maskinstyrning
type: Concept
in scheme: JobTech Taxonomy - Färdighet
definition: GeoROG, maskinstyrning
broader: zmYu aAM TuF
related: 3ZtN hhA SM7
related: KwVo sQu G2e
related: 4Jty HpK a3Q

Röntgensjuksköterskeexamen
type: Concept
in scheme: JobTech Taxonomy - Färdighet
definition: Röntgensjuksköterskeexamen är en yrkesexamen på högskolenivå kopplad till utbildning med inriktning mot röntgensjuksköterska. Källa: UHR (Universitets- och högskolerådet)
broader: Yrkesbevis/examen
related: 1tGC fXC mxX

Bas-U/Byggarbetsmiljösamordnaren för utförandet av arbetet
type: Concept
in scheme: JobTech Taxonomy - Färdighet
definition: Byggarbetsmiljösamordnaren för utförandet av arbetet (Bas-U) ska delta i planeringen och samordna olika entreprenörers arbeten i byggskedet så att en entreprenör inte skapar risker för de andra. Källa: Arbetsmiljöverket
alternative label: Bas-U, Byggarbetsmiljösamordnaren för utförandet av arbetet
broader: s48H Sft DTn
related: thZP oR7 WrY
related: w6ud quG dgh

New age
type: Concept
in scheme: JobTech Taxonomy - Färdighet
definition: New age
broader: p1WM wCw LTd
related: AWJF wqZ va9

Byggnadsvård, äldre måleritekniker
type: Concept
in scheme: JobTech Taxonomy - Färdighet
definition: Byggnadsvård, äldre måleritekniker
broader: zmYu aAM TuF
related: QKvX v7r PNL

Digital konstruktion
type: Concept
in scheme: JobTech Taxonomy - Färdighet
definition: Digital konstruktion
broader: zmYu aAM TuF
related: nDaB vdy eAy
related: SPYW 7Z1 ShT
related: 4Jty HpK a3Q

Folkrätt
type: Concept
in scheme: JobTech Taxonomy - Färdighet
definition: Folkrätt
broader: zmYu aAM TuF
related: q8wL kdi WaW
related: br6a VVS V3y
related: 6aak 8eh iwT
related: JfYV ZGg 6rm

Prototyptillverkning
type: Concept
in scheme: JobTech Taxonomy - Färdighet
definition: Prototyptillverkning avser processen att skapa tidiga versioner av produkter för att testa och utvärdera design, funktion och användbarhet innan massproduktion. Denna kompetens involverar kunskap om olika tillverkningsmetoder och material samt förmåga att använda verktyg och maskiner för att producera prototyper inom olika branscher, inklusive metall- och plastindustri.
broader: zmYu aAM TuF
related: MSnK 3Z8 4qA
related: vaEp iBS c5h
related: yPQ4 EaN Dtj
related: 4Jty HpK a3Q

Jägmästarexamen
type: Concept
in scheme: JobTech Taxonomy - Färdighet
definition: Jägmästarexamen
broader: Yrkesbevis/examen
related: yXbD NTH ijE
related: 9QMD sZ3 ZjX
related: 3LdB WEJ 8Ms

Kulturverksamhet, samordnings- och planeringsvana
type: Concept
in scheme: JobTech Taxonomy - Färdighet
definition: Kulturverksamhet, samordnings- och planeringsvana
broader: zmYu aAM TuF
related: vPP6 rsw dck

Utbildningsbevis, fallskydd
type: Concept
in scheme: JobTech Taxonomy - Färdighet
definition: Utbildningsbevis, fallskydd
broader: s48H Sft DTn
related: DPPw 4wa AsH
related: 3ZtN hhA SM7
related: bZ4J riZ zK6
related: J17g Q2a 2u1
related: 3g5x Tm7 8QH
related: QKvX v7r PNL
related: idjo 2Wr a3E
related: Y4j1 P17 wVA
related: q2Ge zrQ zJb
related: SgAJ DW2 FN5
related: 9mJN VwW Xjg
related: XYzP 5Tn 7Ep
related: AD3U cFH rbe
related: f71c gjL RDq
related: fLKb bJ3 69p
related: 3UzE P8A 9sS
related: a75S eLg JWH
related: NnB3 eWH auo
related: iHrC aRv fVm
related: cGxX R9c kW1
related: yyF7 jsW EeP
related: bXfo 4hb SXx

Sjukhusapotek
type: Concept
in scheme: JobTech Taxonomy - Färdighet
definition: Sjukhusapotek avser en enhet inom hälso- och sjukvården som ansvarar för hantering av läkemedel och farmaceutiska tjänster i sjukhusmiljö. Kompetensen omfattar bland annat beredning, distribution och övervakning av läkemedel, samt samarbete med vårdpersonal för att säkerställa säker och effektiv användning av läkemedel.
broader: zmYu aAM TuF
related: 41Az ioZ rmH
related: TMsM oNw j6z
related: XjcN 5LT bWx

Solist
type: Concept
in scheme: JobTech Taxonomy - Färdighet
definition: Solist
broader: zmYu aAM TuF
related: AWJF wqZ va9

Harpa
type: Concept
in scheme: JobTech Taxonomy - Färdighet
definition: Harpa
broader: wLYs CKS wK8
related: AWJF wqZ va9

Thaimassage
type: Concept
in scheme: JobTech Taxonomy - Färdighet
definition: Thaimassage
broader: zmYu aAM TuF
related: uxHV KXc PKD

Ekonomisk rapportering
type: Concept
in scheme: JobTech Taxonomy - Färdighet
definition: Ekonomisk rapportering
broader: zmYu aAM TuF
related: eQ4M CNm ozj
related: Y6yY SuR hVh
related: Uw4n UB2 RCW
related: q81z 3oD 1qu
related: cRmd 536 pT1

Arbetsledning inom skogsvård
type: Concept
in scheme: JobTech Taxonomy - Färdighet
definition: Arbetsledning inom skogsvård innebär att organisera, planera och leda det dagliga arbetet inom skogligt arbete som berör föryngringsarbete, plantering, hjälpplantering och röjning. Kompetensen omfattar att samordna personal och resurser, fördela arbetsuppgifter samt följa upp arbetsresultat och kvalitet.
broader: zmYu aAM TuF
related: qouP wtb 93q

Mästarbrev, modist
type: Concept
in scheme: JobTech Taxonomy - Färdighet
definition: Mästarbrev, modist
broader: Yrkesbevis/examen
related: mwVN oEH g9k

Android, operativsystem
type: Concept
in scheme: JobTech Taxonomy - Färdighet
definition: Android, operativsystem
alternative label: Android
alternative label: Android-utveckling
alternative label: Androidteknik
alternative label: Androidutveckling
broader: xAWr WYq JPP
related: BAeH eg8 T2d
related: cBBa ngH fCx
related: 1CX5 mZw Vcq
related: D9SL mtn vGM
related: VCpu 5EN bBt
related: DJh5 yyF hEM
related: 4Jty HpK a3Q
related: 13md uyV BNG
related: UXKZ 3zZ ipB
related: MYAz x9m 2LJ

Avgångssignalering
type: Concept
in scheme: JobTech Taxonomy - Färdighet
definition: Avgångssignalering avser processen för att signalera och kommunicera avgångstider för transportmedel, såsom tåg och spårvagnar. Denna kompetens innefattar att informera passagerare om avgångar, hantera biljetter och säkerställa en smidig och säker avresa.
broader: zmYu aAM TuF
related: s78G Zp2 dkq

Livsmedel, produktkunskap
type: Concept
in scheme: JobTech Taxonomy - Färdighet
definition: Livsmedel, produktkunskap
broader: zmYu aAM TuF
related: oXSW fbY XrY
related: s1Qk o98 2o1
related: 85cq 6uK 4cK

Grönsaksodling, friland
type: Concept
in scheme: JobTech Taxonomy - Färdighet
definition: Grönsaksodling, friland, avser odling av olika sorters grönsaker utomhus, vilket inkluderar sådd, skötsel och skörd av växter som växer naturligt i jorden. Kompetensen omfattar kunskaper om jordbearbetning, gödsling och ogräsrensning för att optimera produktionen av grönsaker.
broader: zmYu aAM TuF
related: XBh3 Xrm C4R
related: XurM DVs ggn
related: yXbD NTH ijE
related: 2xQ4 4kh kTZ
related: 9QMD sZ3 ZjX
related: k3R3 UkC nK2

Intensivvård, specialistområde för sjuksköterska
type: Concept
in scheme: JobTech Taxonomy - Färdighet
definition: En fördjupad specialistkompetens för sjuksköterska inom intensivvård.
broader: Specialistområde för sjuksköterska
related: PHJN fva yxs
related: dyWo sDb MLQ

Konstinramning
type: Concept
in scheme: JobTech Taxonomy - Färdighet
definition: Konstinramning
broader: zmYu aAM TuF
related: J17g Q2a 2u1

Mapics, affärssystem
type: Concept
in scheme: JobTech Taxonomy - Färdighet
definition: Mapics, affärssystem
alternative label: Mapics
broader: xSJR 1Kq pxB
related: eQ4M CNm ozj
related: xm5G vGn iyk
related: mp2Y vyC RFV
related: iWcY mko rq2
related: AuTi FEo j3R
related: ij8k EwC zyB
related: 4Jty HpK a3Q
related: p16X 44f rwZ

Yrkesbevis, florist
type: Concept
in scheme: JobTech Taxonomy - Färdighet
definition: Yrkesbeviset är ett branschprov för floristelever i slutet av gymnasieutbildningen. Det omfattar praktiska och teoretiska delar utifrån ett case, där floristiskt arbete bedöms utifrån teknik, färg, form och helhet. Presentation sker muntligt och innehåller kalkyl, skiss och fackspråklig beskrivning. Yrkesbeviset är ett steg mot gesällbrev.
broader: Yrkesbevis/examen
related: YKL2 FCB 1yr

Stengravyr
type: Concept
in scheme: JobTech Taxonomy - Färdighet
definition: Stengravyr avser tekniken att dekorera och skapa mönster eller inskriptioner på stenar genom att använda olika verktyg och metoder för att avlägsna material. Kompetensen innefattar noggrann handskicklighet och förståelse för stens egenskaper som påverkar resultatet av gravyren.
broader: zmYu aAM TuF
related: aKdV u7V R5j
related: vCBT Pnd 8UB

Diplomerad ekologisk hudvårdsterapeut
type: Concept
in scheme: JobTech Taxonomy - Färdighet
definition: Diplomerad ekologisk hudvårdsterapeut
broader: s48H Sft DTn
related: ezKk kss CiQ
related: xr7w N6Q QMA

Utlandstjänstgöring, erfarenhet
type: Concept
in scheme: JobTech Taxonomy - Färdighet
definition: Utlandstjänstgöring, erfarenhet
broader: Yrkesövergripande kompetenser

Brandglas, monteringsvana
type: Concept
in scheme: JobTech Taxonomy - Färdighet
definition: Brandglas, monteringsvana
broader: zmYu aAM TuF
related: J17g Q2a 2u1

Arkitekt-Archicad
type: Concept
in scheme: JobTech Taxonomy - Färdighet
definition: Arkitekt-Archicad
broader: mTLu uo2 gq2
related: thZP oR7 WrY
related: w6ud quG dgh
related: Pd51 xnr KCY
related: XeBP nMe pXx
related: ETAR ggZ Wuw
related: 41KB bfk 5jR
related: 4Jty HpK a3Q

Finansieringsalternativ
type: Concept
in scheme: JobTech Taxonomy - Färdighet
definition: Finansieringsalternativ avser olika metoder eller lösningar för att anskaffa kapital eller finansiera investeringar, exempelvis genom lån, avbetalningar, leasing eller egna medel. Kompetensen inkluderar förståelse för dessa alternativ och deras fördelar och nackdelar, vilket är relevant för yrken som butikssäljare i fackhandel som hanterar kunders köp och finansiella erbjudanden.
broader: zmYu aAM TuF
related: YKL2 FCB 1yr

Merförsäljning
type: Concept
in scheme: JobTech Taxonomy - Färdighet
definition: Merförsäljning avser strategi och teknik för att öka försäljningen av varor eller tjänster genom att erbjuda kunder ytterligare produkter eller tjänster utöver deras ursprungliga köpbeslut. Denna kompetens innefattar förståelse för kundens behov och förmåga att kommunicera fördelarna med kompletterande erbjudanden för att effektivt stimulera ytterligare köp.
broader: zmYu aAM TuF
related: YKL2 FCB 1yr

Sågning, konventionell maskin
type: Concept
in scheme: JobTech Taxonomy - Färdighet
definition: Sågning, konventionell maskin
broader: zmYu aAM TuF
related: VKKg e4t t46
related: UdrS qzV P7i

Utvecklingsanalys
type: Concept
in scheme: JobTech Taxonomy - Färdighet
definition: Utvecklingsanalys
broader: zmYu aAM TuF
related: Qo7p wjf gtv
related: vPP6 rsw dck

Kulning
type: Concept
in scheme: JobTech Taxonomy - Färdighet
definition: Kulning
broader: p1WM wCw LTd
related: AWJF wqZ va9

Beroendemedicin, specialistkompetens för läkare
type: Concept
in scheme: JobTech Taxonomy - Färdighet
definition: Beroendemedicin, specialistkompetens för läkare
broader: Specialistbevis för läkare
related: nu7c QuB KVQ

Konstnärlig rådgivning/Konstnärlig konsultation
type: Concept
in scheme: JobTech Taxonomy - Färdighet
definition: Konstnärlig rådgivning/Konstnärlig konsultation
alternative label: Konstnärlig konsultation
alternative label: Konstnärlig rådgivning
broader: zmYu aAM TuF
related: 34Tn BQQ tfo

Efterrätter
type: Concept
in scheme: JobTech Taxonomy - Färdighet
definition: Efterrätter
broader: zmYu aAM TuF
related: BStc SJh DKG

Jordbruksmaskiner
type: Concept
in scheme: JobTech Taxonomy - Färdighet
definition: Jordbruksmaskiner
broader: zmYu aAM TuF
related: oXSW fbY XrY

Museivetenskap
type: Concept
in scheme: JobTech Taxonomy - Färdighet
definition: Museivetenskap
broader: zmYu aAM TuF
related: Qbvf 6nd Esn

Områdesansvar, räddningstjänst
type: Concept
in scheme: JobTech Taxonomy - Färdighet
definition: Områdesansvar, räddningstjänst
broader: zmYu aAM TuF
related: sWzF 6pd Y6L

Installera golvvärme
type: Concept
in scheme: JobTech Taxonomy - Färdighet
definition: Installera golvvärme
broader: zmYu aAM TuF
related: fLKb bJ3 69p
related: yyF7 jsW EeP

Kompetensbevis, CNC teknik trä
type: Concept
in scheme: JobTech Taxonomy - Färdighet
definition: Kompetensbevis, CNC teknik trä Källa: www.tracentrum.se
broader: s48H Sft DTn
related: VKKg e4t t46
related: 4Jty HpK a3Q

Salsa, undervisning
type: Concept
in scheme: JobTech Taxonomy - Färdighet
definition: Salsa, undervisning
broader: zmYu aAM TuF
related: mcRJ kq2 jFr
related: 1CX5 mZw Vcq

Magnetseparering
type: Concept
in scheme: JobTech Taxonomy - Färdighet
definition: Magnetseparering
broader: zmYu aAM TuF
related: LEvM 7Hs w8i

Teaterdekor
type: Concept
in scheme: JobTech Taxonomy - Färdighet
definition: Teaterdekor avser kompetens i att skapa, designa och bygga sceniska miljöer för teaterföreställningar. Detta innefattar arbete med material, färger och former för att förverkliga en visuell berättelse som stödjer föreställningens tema och atmosfär.
broader: zmYu aAM TuF
related: 4BsK q2C sCL
related: 1Nwn GYH wkH
related: xuSE mtB Mir
related: CSUf ZVM a7Z

Tulladministration
type: Concept
in scheme: JobTech Taxonomy - Färdighet
definition: Innefattar arbete med hantering av tullformaliteter i samband med import och export av varor. Omfattar utfärdande och granskning av tullhandlingar, tolkning av tullregler och klassificering av varor enligt tulltaxor. Inbegriper även kontakter med myndigheter, uppföljning av tullärenden samt arbete i digitala tullsystem.
broader: zmYu aAM TuF
related: eQ4M CNm ozj
related: AuTi FEo j3R

Bedrägeriutredning
type: Concept
in scheme: JobTech Taxonomy - Färdighet
definition: Bedrägeriutredning
broader: zmYu aAM TuF
related: pTr9 RBT 9ur
related: FfMN Bw1 qYR

Schemaläggning, skola
type: Concept
in scheme: JobTech Taxonomy - Färdighet
definition: Schemaläggning, skola
broader: zmYu aAM TuF
related: vPP6 rsw dck
related: oEmP NC1 sXE

Apotekarexamen
type: Concept
in scheme: JobTech Taxonomy - Färdighet
definition: Apotekarexamen är en examen på högskolenivå kopplad till utbildning med inriktning mot apotekare.
broader: Yrkesbevis/examen
related: TMsM oNw j6z

Angular, programmeringsspråk
type: Concept
in scheme: JobTech Taxonomy - Färdighet
definition: Angular, programmeringsspråk
broader: Datorspråk
related: D9SL mtn vGM
related: DJh5 yyF hEM
related: UxT1 tPF Kbg

Ortodonti/Tandreglering, specialistkompetens för tandläkare
type: Concept
in scheme: JobTech Taxonomy - Färdighet
definition: Ortodonti/Tandreglering, specialistkompetens för tandläkare
alternative label: Ortodonti
alternative label: Tandreglering
broader: Specialistkompetens för tandläkare
related: HPxT fQJ zwT
related: 5dxv nVQ N8o

Stubbrytning
type: Concept
in scheme: JobTech Taxonomy - Färdighet
definition: Stubbrytning
broader: zmYu aAM TuF
related: KwVo sQu G2e
related: yXbD NTH ijE

Databasadministration, undervisning
type: Concept
in scheme: JobTech Taxonomy - Färdighet
definition: Databasadministration, undervisning
broader: Dataundervisning
related: 1CX5 mZw Vcq
related: 4Jty HpK a3Q

Engelska, cirkelledning
type: Concept
in scheme: JobTech Taxonomy - Färdighet
definition: Engelska, cirkelledning
broader: zmYu aAM TuF
related: 1CX5 mZw Vcq

Områdesansvar, fritidsverksamhet
type: Concept
in scheme: JobTech Taxonomy - Färdighet
definition: Områdesansvar, fritidsverksamhet
broader: zmYu aAM TuF
related: wby2 mwq fWV
related: X1Ac Y9P PJo
related: 1uau t1u rDL

Utlandsinkasso
type: Concept
in scheme: JobTech Taxonomy - Färdighet
definition: Utlandsinkasso
broader: zmYu aAM TuF
related: JAFv ZaP tDG

Eget företagande, bygg
type: Concept
in scheme: JobTech Taxonomy - Färdighet
definition: Eget företagande, bygg
broader: zmYu aAM TuF
related: 7mn2 kA9 ftp

Coda, redovisningssystem
type: Concept
in scheme: JobTech Taxonomy - Färdighet
definition: Coda, redovisningssystem
alternative label: Coda
alternative label: Redovisningssystemet coda
broader: xSJR 1Kq pxB
related: eQ4M CNm ozj
related: Y6yY SuR hVh
related: Uw4n UB2 RCW
related: iWcY mko rq2
related: q81z 3oD 1qu
related: cRmd 536 pT1
related: ij8k EwC zyB
related: 4Jty HpK a3Q

Class Rating/CR
type: Concept
in scheme: JobTech Taxonomy - Färdighet
definition: Class Rating/CR
alternative label: CR
alternative label: Class Rating
broader: s48H Sft DTn
related: 1CX5 mZw Vcq

El, kontaktledningssystem
type: Concept
in scheme: JobTech Taxonomy - Färdighet
definition: El, kontaktledningssystem
broader: Yrkesbevis/examen
related: MW1P GNJ 4F9

Ammunitionskunskap
type: Concept
in scheme: JobTech Taxonomy - Färdighet
definition: Ammunitionskunskap
broader: zmYu aAM TuF
related: Vfum e6B 7Bw
related: e6nk AGp y28

Eftersynk
type: Concept
in scheme: JobTech Taxonomy - Färdighet
definition: Eftersynk
broader: zmYu aAM TuF
related: iBUL s38 izZ
related: 4BsK q2C sCL

Fagott, undervisning musikskola
type: Concept
in scheme: JobTech Taxonomy - Färdighet
definition: Fagott, undervisning musikskola
broader: zmYu aAM TuF
related: mcRJ kq2 jFr

Livvaktutbildning
type: Concept
in scheme: JobTech Taxonomy - Färdighet
definition: Livvaktutbildning
broader: Yrkesbevis/examen
related: rNcE Zno pD8

Verksamhetsledning, film/Verksamhetsledning, TV
type: Concept
in scheme: JobTech Taxonomy - Färdighet
definition: Verksamhetsledning, film/Verksamhetsledning, TV
alternative label: Verksamhetsledning, TV
alternative label: Verksamhetsledning, film
broader: zmYu aAM TuF
related: 3i4a Ufc qpp

Epoxy-utbildning/Härdplastutbildning
type: Concept
in scheme: JobTech Taxonomy - Färdighet
definition: Epoxy-utbildning/Härdplastutbildning
alternative label: Epoxy-utbildning
alternative label: Härdplastutbildning
broader: s48H Sft DTn
related: V79C DD2 3Gj
related: QKvX v7r PNL
related: 7zKm 4NW eey

Nutida dans
type: Concept
in scheme: JobTech Taxonomy - Färdighet
definition: Nutida dans
broader: Dans
related: gmRr 7tt eHj

Virkmaskiner
type: Concept
in scheme: JobTech Taxonomy - Färdighet
definition: Virkmaskiner
broader: zmYu aAM TuF
related: skLS kpa Ui1

Kryptering, datasäkerhet
type: Concept
in scheme: JobTech Taxonomy - Färdighet
definition: Kryptering, datasäkerhet
broader: zmYu aAM TuF
related: BAeH eg8 T2d
related: 4Jty HpK a3Q

Systemgranskare gasinstallationer
type: Concept
in scheme: JobTech Taxonomy - Färdighet
definition: Systemgranskare gasinstallationer
broader: s48H Sft DTn
related: Cppd 9P7 HeR
related: fLKb bJ3 69p

Medicinsk vård, specialistområde för sjuksköterska
type: Concept
in scheme: JobTech Taxonomy - Färdighet
definition: En fördjupad specialistkompetens för sjuksköterska inom medicinsk vård.
broader: Specialistområde för sjuksköterska
related: 6zAR EHM Kwj

TMA-fordon
type: Concept
in scheme: JobTech Taxonomy - Färdighet
definition: En TMA-bil (Truck Mounted Attenuator) är ett fordon utrustat med en energiabsorberande enhet. Den används främst vid vägarbeten för att skydda arbetare och trafikanter. TMA-bilen fungerar som en säkerhetsbarriär, vilket minskar risken för allvarliga olyckor vid kollisioner.
broader: zmYu aAM TuF
related: ayQ4 G3W A2w
related: 3MBw pDA P2F

Konsumentfrågor
type: Concept
in scheme: JobTech Taxonomy - Färdighet
definition: Konsumentfrågor
broader: zmYu aAM TuF
related: vPP6 rsw dck
related: ddGt fEH 432

Bean Machine, HTML-editor
type: Concept
in scheme: JobTech Taxonomy - Färdighet
definition: Bean Machine, HTML-editor
alternative label: Bean Machine
broader: Programmerings- och systemutvecklingsverktyg
related: 8Bmh vtM zts
related: D9SL mtn vGM
related: 4Jty HpK a3Q
related: Mbt6 3ko DiD
related: MYAz x9m 2LJ

Rap
type: Concept
in scheme: JobTech Taxonomy - Färdighet
definition: Rap
broader: p1WM wCw LTd
related: AWJF wqZ va9

Ljudböcker
type: Concept
in scheme: JobTech Taxonomy - Färdighet
definition: Ljudböcker
broader: zmYu aAM TuF
related: SgNH hag n9D
related: zfve s6G tpc

Skulpturmodellering
type: Concept
in scheme: JobTech Taxonomy - Färdighet
definition: Skulpturmodellering
broader: zmYu aAM TuF
related: 34Tn BQQ tfo

Insatspolisutbildning/Piketpolisutbildning
type: Concept
in scheme: JobTech Taxonomy - Färdighet
definition: Piketpolisutbildning
broader: Yrkesbevis/examen
related: rNcE Zno pD8

PET/CT
type: Concept
in scheme: JobTech Taxonomy - Färdighet
definition: PET/CT
alternative label: CT
alternative label: PET
broader: zmYu aAM TuF
related: wNrt Ysj WuT
related: 1tGC fXC mxX
related: 4Jty HpK a3Q

Verksamhetsledning, laboratorium
type: Concept
in scheme: JobTech Taxonomy - Färdighet
definition: Verksamhetsledning, laboratorium
broader: zmYu aAM TuF
related: QG4f MCh vND

Luftkompressorer, underhåll
type: Concept
in scheme: JobTech Taxonomy - Färdighet
definition: Luftkompressorer, underhåll
broader: zmYu aAM TuF
related: KttZ Skc bMR

Transporttjänster, produktkunskap
type: Concept
in scheme: JobTech Taxonomy - Färdighet
definition: Transporttjänster, produktkunskap
broader: zmYu aAM TuF
related: oXSW fbY XrY
related: 85cq 6uK 4cK

Rörelsenedsättning, arbetslivsinriktad rehabilitering
type: Concept
in scheme: JobTech Taxonomy - Färdighet
definition: Rörelsenedsättning, arbetslivsinriktad rehabilitering
broader: zmYu aAM TuF
related: TPH4 2AM isT
related: fsnw ZCu v2U

Ystning, datoriserad
type: Concept
in scheme: JobTech Taxonomy - Färdighet
definition: Ystning, datoriserad
broader: zmYu aAM TuF
related: yJk6 azD ywF

Auktoriserad tolk
type: Concept
in scheme: JobTech Taxonomy - Färdighet
definition: Auktoriserad tolk
broader: Yrkesbevis/examen
related: PQDm Z63 zst

Configuration Management/CM
type: Concept
in scheme: JobTech Taxonomy - Färdighet
definition: Configuration Management/CM
alternative label: CM
alternative label: Configuration Management
alternative label: konfigurationshantering
alternative label: konfigurationsledning
broader: zmYu aAM TuF
related: cBBa ngH fCx
related: DJh5 yyF hEM
related: SPYW 7Z1 ShT
related: 4Jty HpK a3Q
related: UXKZ 3zZ ipB

Kylmontering
type: Concept
in scheme: JobTech Taxonomy - Färdighet
definition: Kylmontering
broader: zmYu aAM TuF
related: 3UzE P8A 9sS

Elektronmikroskopi
type: Concept
in scheme: JobTech Taxonomy - Färdighet
definition: Elektronmikroskopi
broader: zmYu aAM TuF
related: bExu 8gk azk

Bioorganisk kemi
type: Concept
in scheme: JobTech Taxonomy - Färdighet
definition: Bioorganisk kemi
broader: zmYu aAM TuF
related: eofS oZs RZi

Flatstickmaskiner
type: Concept
in scheme: JobTech Taxonomy - Färdighet
definition: Flatstickmaskiner
broader: zmYu aAM TuF
related: skLS kpa Ui1

Funktionsnedsättning, omsorgserfarenhet
type: Concept
in scheme: JobTech Taxonomy - Färdighet
definition: Funktionsnedsättning, omsorgserfarenhet avser kunskap och erfarenhet inom vård och omsorg av personer med olika typer av funktionsnedsättningar. Kompetensen innefattar att ge stöd och hjälp i vardagen, anpassa vård utifrån individuella behov samt att skapa en trygg och stimulerande miljö för personer i behov av omsorg.
broader: zmYu aAM TuF
related: sq3e WVv Fjd
related: jY19 knH MJp
related: tAJS JNb hDH

Avsyning
type: Concept
in scheme: JobTech Taxonomy - Färdighet
definition: Avsyning
broader: zmYu aAM TuF
related: YiQw N87 zLU
related: nwSm phw sPo
related: m8TS hdk pSf
related: HXzD qvt HV6
related: ENV6 BNa brP
related: rxmK wwM 1NA
related: Vfum e6B 7Bw
related: MSnK 3Z8 4qA
related: e6nk AGp y28
related: UZBj yDX Ctp
related: vaEp iBS c5h
related: mwVN oEH g9k
related: 8ddv P8e iYz
related: yPQ4 EaN Dtj
related: aKdV u7V R5j
related: SgAJ DW2 FN5
related: iZLB KpD LLo
related: Kxm9 N3V shF
related: shkw ojo UL2
related: o31g CX1 qhQ
related: 4DET dLf iB9
related: skLS kpa Ui1
related: aU9p ekE Fqf
related: L4hA SJP SFi
related: 4bxV 58E P9N

Office UI Fabric React, ramverk
type: Concept
in scheme: JobTech Taxonomy - Färdighet
definition: Office UI Fabric React, ramverk
broader: srsj GQb CE1
related: DJh5 yyF hEM
related: 4Jty HpK a3Q

Yrkesbevis, beskärning och trädvård
type: Concept
in scheme: JobTech Taxonomy - Färdighet
definition: Yrkesbevis, beskärning och trädvård
broader: Yrkesbevis/examen
related: XBh3 Xrm C4R
related: df9D e6y 61z
related: yXbD NTH ijE
related: 2xQ4 4kh kTZ

Mästarbrev, glasmästaryrket
type: Concept
in scheme: JobTech Taxonomy - Färdighet
definition: Mästarbrev, glasmästaryrket
broader: Yrkesbevis/examen
related: J17g Q2a 2u1

Flight Instructor/FI
type: Concept
in scheme: JobTech Taxonomy - Färdighet
definition: Flight Instructor/FI
alternative label: FI
alternative label: Flight Instructor
broader: s48H Sft DTn
related: 7n3y FTE qSe

Distributionskörning
type: Concept
in scheme: JobTech Taxonomy - Färdighet
definition: Distributionskörning avser färdigheten att köra fordon för att transportera och distribuera gods. Denna kompetens innefattar kunskap om lastbilar, hantering av gods samt beräkning av vikt och volym för effektiv logistik och leverans.
broader: zmYu aAM TuF
related: 3MBw pDA P2F

Kalenderhantering
type: Concept
in scheme: JobTech Taxonomy - Färdighet
definition: Kalenderhantering avser förmåga att effektivt planera, organisera och administrera scheman och möten för en eller flera personer, ofta chefer eller ledare. Det innefattar att boka och koordinera mötestider, hålla koll på deadlines och påminnelser samt hantera förändringar eller konflikter i schemat.
broader: zmYu aAM TuF
related: vCAb uuo ek5

Obduktionsassistentutbildning
type: Concept
in scheme: JobTech Taxonomy - Färdighet
definition: Obduktionsassistentutbildning är en yrkeshögskoleutbildning med inriktning mot arbete med obduktion och rättsmedicin.
broader: Yrkesbevis/examen
related: GiNX ESA AL1

Transportekonomi
type: Concept
in scheme: JobTech Taxonomy - Färdighet
definition: Transportekonomi
broader: zmYu aAM TuF
related: xm5G vGn iyk
related: iWcY mko rq2
related: kLyY rwr aJr

Statlig förvaltning
type: Concept
in scheme: JobTech Taxonomy - Färdighet
definition: Statlig förvaltning avser organisation och administration av offentliga verksamheter inom staten, där beslutsfattande och resursfördelning sker för att tillgodose medborgarnas behov. Denna kompetens innefattar kunskap om lagar och förordningar som styr den statliga verksamheten samt förståelse för hur statliga tjänster kan planeras och genomföras effektivt.
broader: zmYu aAM TuF
related: qVHD Hj5 PXh
related: 4W6S 1kA nrv
related: 8SPu K1k 5qR
related: vPP6 rsw dck
related: NxXz fBh w7j
related: ddGt fEH 432
related: 4GAs rKs 2Ne
related: uxst tkg zDh
related: X1Ac Y9P PJo
related: sWzF 6pd Y6L
related: JfYV ZGg 6rm
related: WZCM nfS eAk

Rörinspektioner
type: Concept
in scheme: JobTech Taxonomy - Färdighet
definition: Rörinspektioner avser tekniken och metoderna för att inspektera inre ytor av rörsystem, vilket inkluderar avloppsrör, vattenrör och ventilationskanaler. Denna kompetens innefattar användning av specialiserade verktyg och utrustning för att identifiera problem såsom blockeringar, läckor eller skador i rörsystem.
broader: zmYu aAM TuF
related: idjo 2Wr a3E
related: 3MBw pDA P2F

Gruppbostad
type: Concept
in scheme: JobTech Taxonomy - Färdighet
definition: Gruppbostad
broader: zmYu aAM TuF
related: bEDv SL7 VrL
related: 7fNG sve JWU
related: jY19 knH MJp
related: tAJS JNb hDH

The Seven Quality Management Tools/7QM
type: Concept
in scheme: JobTech Taxonomy - Färdighet
definition: The Seven Quality Management Tools/7QM
alternative label: 7QM
alternative label: The Seven Quality Management Tools
broader: Kvalitetsverktyg
related: Qo7p wjf gtv
related: vPP6 rsw dck
related: dMVD VYy kgg

Husbyggnad
type: Concept
in scheme: JobTech Taxonomy - Färdighet
definition: Husbyggnad
broader: zmYu aAM TuF
related: 41KB bfk 5jR

Hörselskadade, arbetslivsinriktad rehab/Döva, arbetslivsinriktad rehab
type: Concept
in scheme: JobTech Taxonomy - Färdighet
definition: Hörselskadade, arbetslivsinriktad rehab/Döva, arbetslivsinriktad rehab
alternative label: Döva, arbetslivsinriktad rehab
alternative label: Hörselskadade, arbetslivsinriktad rehab
broader: zmYu aAM TuF
related: fsnw ZCu v2U
related: pok1 ipJ yzD

Väderobservationer
type: Concept
in scheme: JobTech Taxonomy - Färdighet
definition: Väderobservationer avser insamling och registrering av atmosfäriska data för att analysera väderförhållanden och förutsäga vädermönster. Kompetensen innefattar kunskaper i att identifiera och mäta variabler såsom temperatur, nederbörd, vindhastighet och luftfuktighet på olika platser och tidsintervall.
broader: zmYu aAM TuF
related: ieVp d5L rS9

Portionering
type: Concept
in scheme: JobTech Taxonomy - Färdighet
definition: Portionering
broader: zmYu aAM TuF
related: tPox ie4 X9X

3D-printning
type: Concept
in scheme: JobTech Taxonomy - Färdighet
definition: 3D-printning
broader: zmYu aAM TuF
related: ezKk kss CiQ
related: DqLe pH6 jyj
related: 4BsK q2C sCL
related: PF4H kQD zpL
related: 3J38 DNz YKK
related: PH2M uV4 r72
related: 4Jty HpK a3Q
related: CSUf ZVM a7Z

Matsedelsplanering
type: Concept
in scheme: JobTech Taxonomy - Färdighet
definition: Matsedelsplanering avser processen att skapa och organisera en plan för måltider, vilket inkluderar val av rätter, ingredienser och portionering. Denna kompetens involverar både kreativitet och kunskap om kost och näring för att möta behov och preferenser hos olika grupper, som exempelvis vid cateringverksamhet eller inom restaurangbranschen.
broader: zmYu aAM TuF
related: BStc SJh DKG
related: UjoW meY Zwt
related: XGyi i4B ME7
related: h324 DPT 7Tw

Färdtjänstkörning
type: Concept
in scheme: JobTech Taxonomy - Färdighet
definition: Färdtjänstkörning avser körning av fordon för att transportera personer som har särskilda behov av att resa, exempelvis på grund av funktionsnedsättning. Denna kompetens innefattar kunskap passagerarsäkerhet samt förmåga att ge assistans till passagerare när det är nödvändigt.
broader: zmYu aAM TuF
related: ffz2 2n3 R7g
related: FiDm 2S8 gx7

Svensktextning
type: Concept
in scheme: JobTech Taxonomy - Färdighet
definition: Svensktextning
broader: zmYu aAM TuF
related: PQDm Z63 zst
related: 4Jty HpK a3Q

Specialpedagogexamen inriktning dövhet eller hörselskada
type: Concept
in scheme: JobTech Taxonomy - Färdighet
definition: Specialpedagogexamen inriktning dövhet eller hörselskada är en examen på högskolenivå kopplad till utbildning för specialpedagog med inriktning dövhet eller hörselskada.
broader: Yrkesbevis/examen
related: 3FP7 4Eg x8P

Stråksättning
type: Concept
in scheme: JobTech Taxonomy - Färdighet
definition: Stråksättning
broader: zmYu aAM TuF
related: AWJF wqZ va9

Machine learning/Maskininlärning
type: Concept
in scheme: JobTech Taxonomy - Färdighet
definition: Machine learning/Maskininlärning
alternative label: Machine learning
alternative label: Maskininlärning
broader: zmYu aAM TuF
related: DJh5 yyF hEM
related: UxT1 tPF Kbg
related: 4Jty HpK a3Q
related: AHmo qSf viN
related: UXKZ 3zZ ipB

Speciallärarexamen inriktning dövhet eller hörselskada
type: Concept
in scheme: JobTech Taxonomy - Färdighet
definition: Speciallärarexamen inriktning dövhet eller hörselskada är en examen på högskolenivå kopplad till utbildning för speciallärare med inriktning dövhet eller hörselskada.
broader: Yrkesbevis/examen
related: 3FP7 4Eg x8P

Färgborttagning
type: Concept
in scheme: JobTech Taxonomy - Färdighet
definition: Färgborttagning
broader: zmYu aAM TuF
related: idjo 2Wr a3E

IVF-behandling
type: Concept
in scheme: JobTech Taxonomy - Färdighet
definition: IVF-behandling
broader: zmYu aAM TuF
related: 7XXd 4St nit

Släp, körvana
type: Concept
in scheme: JobTech Taxonomy - Färdighet
definition: Släp, körvana
broader: zmYu aAM TuF
related: FiDm 2S8 gx7
related: 3MBw pDA P2F

Utbildad dramapedagog
type: Concept
in scheme: JobTech Taxonomy - Färdighet
definition: Utbildad dramapedagog
broader: Yrkesbevis/examen
related: mcRJ kq2 jFr
related: 1CX5 mZw Vcq

Indiskt kök
type: Concept
in scheme: JobTech Taxonomy - Färdighet
definition: Indiskt kök
broader: zmYu aAM TuF
related: BStc SJh DKG

Elcyklar, reparationsvana
type: Concept
in scheme: JobTech Taxonomy - Färdighet
definition: Elcyklar, reparationsvana avser kompetensen att analysera, underhålla och reparera elcyklar, vilket inkluderar arbete med eldrivna komponenter, batterisystem och mekaniska delar.
broader: zmYu aAM TuF
related: Lzpv ofL 3H5
related: yXbD NTH ijE

Certifikat, IPC-specialist på IPC-A-610
type: Concept
in scheme: JobTech Taxonomy - Färdighet
definition: Certifikat, IPC-specialist på IPC-A-610
broader: s48H Sft DTn
related: SgAJ DW2 FN5
related: Kxm9 N3V shF
related: shkw ojo UL2

Bostadsområdesbevakning
type: Concept
in scheme: JobTech Taxonomy - Färdighet
definition: Bostadsområdesbevakning
broader: zmYu aAM TuF
related: iqZh 3yX i8n

2D-grafik-Corel Painter
type: Concept
in scheme: JobTech Taxonomy - Färdighet
definition: 2D-grafik-Corel Painter
broader: Programvara för digitalt skapande
related: 8Bmh vtM zts
related: 34Tn BQQ tfo
related: 4Jty HpK a3Q
related: LeQV umf wUS
related: Mbt6 3ko DiD

Design/Visualisering-Autodesk Alias
type: Concept
in scheme: JobTech Taxonomy - Färdighet
definition: Design/Visualisering-Autodesk Alias
alternative label: Design-Autodesk Alias
alternative label: Visualisering-Autodesk Alias
broader: mTLu uo2 gq2
related: DqLe pH6 jyj
related: K8yg U4C gkY
related: SgNH hag n9D
related: Pd51 xnr KCY
related: PRQn 9yw NJA
related: zfve s6G tpc
related: ETAR ggZ Wuw
related: 41KB bfk 5jR
related: PF4H kQD zpL
related: 4Jty HpK a3Q

Fartygsunderhåll
type: Concept
in scheme: JobTech Taxonomy - Färdighet
definition: Fartygsunderhåll
broader: Övriga specialiteter, sjöfart
related: Rsoy sS6 6c4
related: CbQK 7th Tyf
related: KttZ Skc bMR
related: kDnq Q98 sD3
related: a75S eLg JWH

Filmproduktion
type: Concept
in scheme: JobTech Taxonomy - Färdighet
definition: Filmproduktion
broader: zmYu aAM TuF
related: SgNH hag n9D

ITIL Lifecycle modules
type: Concept
in scheme: JobTech Taxonomy - Färdighet
definition: ITIL Lifecycle modules
broader: zmYu aAM TuF
related: BAeH eg8 T2d
related: 4Jty HpK a3Q

Specialistområde för arbetsterapeut
type: Concept
in scheme: JobTech Taxonomy - Färdighet
top concept of: JobTech Taxonomy - Färdighet
definition: Specialistområde för arbetsterapeut
narrower: Aktivitet och hälsa vid varaktig funktionsnedsättning, specialistområde för arbetsterapeut
narrower: Aktivitet och hälsa i arbetsliv och utbildning, specialistområde för arbetsterapeut
narrower: Aktivitet och hälsa för äldre personer, specialistområde för arbetsterapeut
narrower: Aktivitet och psykisk hälsa, specialistområde för arbetsterapeut
narrower: Aktivitet och folkhälsa, specialistområde för arbetsterapeut
narrower: ymzF Sqz 6uh
narrower: Aktivitet och hälsa för barn och unga personer, specialistområde för arbetsterapeut

Telefonväxlar
type: Concept
in scheme: JobTech Taxonomy - Färdighet
top concept of: JobTech Taxonomy - Färdighet
definition: Telefonväxlar
narrower: Fenix, telefonväxel
narrower: Cosmos 2000, telefonväxel
narrower: Philips, telefonväxel
narrower: Vision 80/20, telefonväxel
narrower: vnsR 9UF m4M
narrower: Parlando, telefonväxel
narrower: Centrex, telefonväxel
narrower: Meridian, telefonväxel
narrower: Alcatel, telefonväxel
narrower: TouchPoint Plus, telefonväxel
narrower: Doro, telefonväxel
narrower: Sopho, telefonväxel
narrower: vbYK yRG kbd
narrower: MD 110, telefonväxel

Affärs- och redovisningssystem, undervisning
type: Concept
in scheme: JobTech Taxonomy - Färdighet
definition: Affärs- och redovisningssystem, undervisning
broader: Dataundervisning
related: 1CX5 mZw Vcq
related: 4Jty HpK a3Q

Lastning
type: Concept
in scheme: JobTech Taxonomy - Färdighet
definition: Lastning avser processen att fylla och placera gods på fordon eller i lagringsutrymmen för att förbereda för transport eller lagerhållning. Kompetensen omfattar kunskaper om säkerhetsaspekter, vikthantering och organisatoriska metoder för effektiv lastning av olika typer av gods.
broader: zmYu aAM TuF
related: SZ7Q 2zF nFy
related: DxiF hTo b3X
related: X7HR rZK 4wj
related: 3MBw pDA P2F
related: bwnk nv2 1cR
related: qhbP JEJ HtK
related: ieVp d5L rS9

Försöksdjur, skötselvana
type: Concept
in scheme: JobTech Taxonomy - Färdighet
definition: Försöksdjur, skötselvana avser kunskaper och färdigheter i omvårdnad och hantering av djur som används i försöksverksamhet. Kompetensen inkluderar förståelse för djurens behov, hanteringstekniker och etiska aspekter relaterade till djurhållning inom forskning och experimenterande.
broader: zmYu aAM TuF
related: Lrsj wRZ sFV
related: yXbD NTH ijE

Bensinmotorrenovering
type: Concept
in scheme: JobTech Taxonomy - Färdighet
definition: Bensinmotorrenovering
broader: zmYu aAM TuF
related: KttZ Skc bMR

Kulturmiljövård
type: Concept
in scheme: JobTech Taxonomy - Färdighet
definition: Kulturmiljövård
broader: zmYu aAM TuF
related: XurM DVs ggn
related: sXgV QFg vpb
related: 3LdB WEJ 8Ms
related: Qbvf 6nd Esn

Informix, databashanterare
type: Concept
in scheme: JobTech Taxonomy - Färdighet
definition: Informix, databashanterare
alternative label: Ibm informix
alternative label: Informix
broader: Databaser
related: BAeH eg8 T2d
related: cBBa ngH fCx
related: Fv7d YhP YmS
related: D9SL mtn vGM
related: DJh5 yyF hEM
related: 4Jty HpK a3Q
related: MYAz x9m 2LJ

Telia Centrex, hänvisningssystem
type: Concept
in scheme: JobTech Taxonomy - Färdighet
definition: Telia Centrex, hänvisningssystem
broader: Hänvisningsdatorer
related: 4aPu 2nd 8X6
related: ByrL ANp UwV
related: 4Jty HpK a3Q

Biopati (biologiska medel)
type: Concept
in scheme: JobTech Taxonomy - Färdighet
definition: Biopati (biologiska medel)
broader: zmYu aAM TuF
related: F19Z oB6 pg3

Inbyggda system/Embedded system
type: Concept
in scheme: JobTech Taxonomy - Färdighet
definition: Inbyggda system/Embedded system
alternative label: Embedded system
alternative label: Inbyggda system
broader: zmYu aAM TuF
related: cBBa ngH fCx
related: nDaB vdy eAy
related: DJh5 yyF hEM
related: SPYW 7Z1 ShT
related: 4Jty HpK a3Q

Listpåsättning
type: Concept
in scheme: JobTech Taxonomy - Färdighet
definition: Listpåsättning
broader: zmYu aAM TuF
related: hxm6 xkr dHm

Tungt underhåll, flyg
type: Concept
in scheme: JobTech Taxonomy - Färdighet
definition: Tungt underhåll, flyg
broader: zmYu aAM TuF
related: iGTu bYL 2T7
related: eRkT cTv H9v

Robotteknik
type: Concept
in scheme: JobTech Taxonomy - Färdighet
definition: Robotteknik avser utveckling och tillämpning av robotik och automatisering för att konstruktions- och produktionsprocesser ska kunna effektiviseras. Kompetensen omfattar kunskap inom programmering, mekanik, elektronik och systemintegration för att skapa och underhålla robotiserade system.
broader: zmYu aAM TuF
related: vaEp iBS c5h
related: K8yg U4C gkY
related: nDaB vdy eAy
related: SPYW 7Z1 ShT
related: PRQn 9yw NJA
related: 4Jty HpK a3Q

Symbian OS, operativsystem
type: Concept
in scheme: JobTech Taxonomy - Färdighet
definition: Symbian OS, operativsystem
alternative label: Symbian OS
broader: xAWr WYq JPP
related: BAeH eg8 T2d
related: cBBa ngH fCx
related: D9SL mtn vGM
related: VCpu 5EN bBt
related: DJh5 yyF hEM
related: 4Jty HpK a3Q
related: 13md uyV BNG
related: MYAz x9m 2LJ

Gipskonst
type: Concept
in scheme: JobTech Taxonomy - Färdighet
definition: Gipskonst
broader: zmYu aAM TuF
related: 34Tn BQQ tfo

Häftning, bokbinderi
type: Concept
in scheme: JobTech Taxonomy - Färdighet
definition: Häftning, bokbinderi, avser tekniken och processerna för att binda samman papper och andra material för att skapa böcker, broschyrer, och tidskrifter. Kompetensen omfattar kunskaper om olika häftningsmetoder, inklusive både maskinell och hantverksmässig bokbindning, samt användning av relevant utrustning som skärmaskiner och pappersklippare.
broader: zmYu aAM TuF
related: mPzg 93F QEv

Ekonomisk brottslighet/Ekobrott
type: Concept
in scheme: JobTech Taxonomy - Färdighet
definition: Ekonomisk brottslighet, också kallad ekobrott, är ett samlingsbegrepp som innehåller olika typer av brott. De två vanligaste ekobrotten är skattebrott och bokföringsbrott. https://www.ekobrottsmyndigheten.se/om-ekobrott/
alternative label: Ekonomisk brottslighet, Ekobrott
broader: zmYu aAM TuF
related: q8wL kdi WaW
related: 6aak 8eh iwT
related: qsJJ EYo fzA
related: rNcE Zno pD8

Komposition, folkmusik
type: Concept
in scheme: JobTech Taxonomy - Färdighet
definition: Komposition, folkmusik
broader: zmYu aAM TuF
related: AWJF wqZ va9

Stresshantering
type: Concept
in scheme: JobTech Taxonomy - Färdighet
definition: Stresshantering
broader: zmYu aAM TuF
related: FpPP jqK xzT
related: aA2Z 9XX R1v
related: F19Z oB6 pg3

Oracle Data Integrator, integrationsplattform
type: Concept
in scheme: JobTech Taxonomy - Färdighet
definition: Oracle Data Integrator, integrationsplattform
broader: Integrationsplattformar
related: BAeH eg8 T2d
related: cBBa ngH fCx
related: D9SL mtn vGM
related: DJh5 yyF hEM
related: UxT1 tPF Kbg
related: 4Jty HpK a3Q
related: UXKZ 3zZ ipB

Hyvling, CNC
type: Concept
in scheme: JobTech Taxonomy - Färdighet
definition: Hyvling, CNC avser processen att bearbeta material, vanligtvis trä eller metall, med hjälp av datorstyrda maskiner för att uppnå precisa dimensioner och ytkvalitet. Kompetensen omfattar förmågan att ställa in och programmera CNC-maskiner för hyvling, vilket innefattar övervakning och justering av maskinens arbete för att säkerställa korrekt utförande enligt angivna specifikationer.
broader: zmYu aAM TuF
related: VKKg e4t t46
related: vaEp iBS c5h
related: 4Jty HpK a3Q
related: 4bxV 58E P9N

Skadedjursbekämpning
type: Concept
in scheme: JobTech Taxonomy - Färdighet
definition: Skadedjursbekämpning avser åtgärder och metoder för att hantera och kontrollera skadedjur som kan påverka hälsa, säkerhet och miljö. Denna kompetens omfattar kunskaper om olika skadedjur, identifiering av angrepp och tillämpning av effektiva bekämpningsmetoder samt efterlevnad av relevanta föreskrifter och säkerhetsstandarder.
broader: zmYu aAM TuF
related: idjo 2Wr a3E
related: puim 6PY DGj
related: nuXg Wjc JPd
related: yXbD NTH ijE

Socialpolitik
type: Concept
in scheme: JobTech Taxonomy - Färdighet
definition: Socialpolitik
broader: zmYu aAM TuF
related: WZCM nfS eAk

Kotlin, programmeringsspråk
type: Concept
in scheme: JobTech Taxonomy - Färdighet
definition: Kotlin, programmeringsspråk
alternative label: Kotlin
broader: Datorspråk
related: D9SL mtn vGM
related: UxT1 tPF Kbg
related: 4Jty HpK a3Q

SNA, kommunikationsprotokoll
type: Concept
in scheme: JobTech Taxonomy - Färdighet
definition: SNA, kommunikationsprotokoll
alternative label: SNA
broader: Kommunikationsprotokoll
related: BAeH eg8 T2d
related: cBBa ngH fCx
related: D9SL mtn vGM
related: VCpu 5EN bBt
related: fWrt sLg koW
related: 4Jty HpK a3Q
related: 13md uyV BNG
related: MYAz x9m 2LJ

Bangolf, instruktör/Bangolf, tränare
type: Concept
in scheme: JobTech Taxonomy - Färdighet
definition: Bangolf, instruktör/Bangolf, tränare
alternative label: Bangolf, instruktör
alternative label: Bangolf, tränare
broader: Idrott/aktivitet
related: EA6o N1N QtT

Frigivningsplanering
type: Concept
in scheme: JobTech Taxonomy - Färdighet
definition: Frigivningsplanering avser processen för att förbereda och organisera en individs återanpassning till samhället efter avtjänad strafftid. Kompetensen innebär att skapa individuella planer som skräddarsys för att stödja och underlätta frigivning samt att koordinera insatser med relevanta aktörer inom kriminalvård och socialt arbete.
broader: zmYu aAM TuF
related: hgAg gLr YGg
related: n6iX f2z XfE

Ortodonti, specialisering tandteknik
type: Concept
in scheme: JobTech Taxonomy - Färdighet
definition: Ortodonti, specialisering tandteknik
broader: zmYu aAM TuF
related: 39yB xPQ ozd

Klövvårdskunskap
type: Concept
in scheme: JobTech Taxonomy - Färdighet
definition: Klövvårdskunskap avser den kompetens som krävs för att vårda och underhålla klövar hos djur, särskilt hästar, för att säkerställa deras hälsa och välbefinnande. Kompetensen omfattar kunskaper om klövstruktur, vårdmetoder och eventuell behandling av klövsjukdomar.
broader: zmYu aAM TuF
related: KYmy iqC xiQ

Energirådgivning
type: Concept
in scheme: JobTech Taxonomy - Färdighet
definition: Energirådgivning avser kompetens att ge råd och vägledning om energieffektivisering och hållbar energianvändning. Denna kompetens omfattar analys av energiflöden, identifiering av energibesparande åtgärder och stöd till hushåll och företag i deras energival.
broader: zmYu aAM TuF
related: wCx8 rY3 XUT
related: XurM DVs ggn
related: thZP oR7 WrY
related: yXbD NTH ijE

Plexiglas, monteringsvana
type: Concept
in scheme: JobTech Taxonomy - Färdighet
definition: Plexiglas, monteringsvana
broader: zmYu aAM TuF
related: J17g Q2a 2u1

Segling, instruktör/Segling, tränare
type: Concept
in scheme: JobTech Taxonomy - Färdighet
definition: Segling, instruktör/Segling, tränare
alternative label: Segling, instruktör
alternative label: Segling, tränare
broader: Idrott/aktivitet
related: EA6o N1N QtT
related: A6X3 efC VNy

Mark/infrastruktur-AutoCAD Civil 3D
type: Concept
in scheme: JobTech Taxonomy - Färdighet
definition: Mark/infrastruktur-AutoCAD Civil 3D
alternative label: Infrastruktur-AutoCAD Civil 3D
alternative label: Mark-AutoCAD Civil 3D
broader: mTLu uo2 gq2
related: 3jEy yuT aVo
related: rwpH 6RA XTT
related: GMDo DVo Yzh
related: thZP oR7 WrY
related: w6ud quG dgh
related: K8yg U4C gkY
related: ketV G9W GeR
related: XeBP nMe pXx
related: PRQn 9yw NJA
related: 4Jty HpK a3Q

ActionScript, programmeringsspråk
type: Concept
in scheme: JobTech Taxonomy - Färdighet
definition: ActionScript, programmeringsspråk
alternative label: ActionScript
broader: Datorspråk
related: BAeH eg8 T2d
related: Fv7d YhP YmS
related: D9SL mtn vGM
related: DJh5 yyF hEM
related: 4Jty HpK a3Q

Inriktning på högskolelärarkompetens
type: Concept
in scheme: JobTech Taxonomy - Färdighet
top concept of: JobTech Taxonomy - Färdighet
definition: Inriktning på högskolelärarkompetens
narrower: snfZ N1g wrT
narrower: Naturbruk, undervisning högskolenivå
narrower: Ekonomi, undervisning högskolenivå
narrower: Hälso- och sjukvård, undervisning högskolenivå
narrower: tYTv fLA EV5
narrower: Data och teknik, undervisning högskolenivå
narrower: uwXg zmB Pdk
narrower: Samhällsvetenskap, undervisning högskolenivå
narrower: xE6k qAE vrk
narrower: pamn k5z ByJ
narrower: Idrott, undervisning högskolenivå
narrower: Humaniora och teologi, undervisning högskolenivå
narrower: ppnH 9N4 FE2
narrower: Konst, undervisning högskolenivå

CDMA-system
type: Concept
in scheme: JobTech Taxonomy - Färdighet
definition: CDMA-system
broader: Mobiltelefonsystem
related: nDaB vdy eAy
related: SPYW 7Z1 ShT
related: 4Jty HpK a3Q

Metallsågning
type: Concept
in scheme: JobTech Taxonomy - Färdighet
definition: Metallsågning
broader: zmYu aAM TuF
related: vaEp iBS c5h

Bokkonservering
type: Concept
in scheme: JobTech Taxonomy - Färdighet
definition: Bokkonservering
broader: zmYu aAM TuF
related: 34Tn BQQ tfo
related: mPzg 93F QEv

Plastikkirurgi, specialistkompetens för läkare
type: Concept
in scheme: JobTech Taxonomy - Färdighet
definition: Plastikkirurgi, specialistkompetens för läkare
broader: Specialistbevis för läkare
related: nu7c QuB KVQ

Anestesisjukvård, specialistområde för sjuksköterska
type: Concept
in scheme: JobTech Taxonomy - Färdighet
definition: En fördjupad specialistkompetens för sjuksköterska inom anestesisjukvård.
broader: Specialistområde för sjuksköterska
related: nrVt xUL KdQ

Möbelstoppning
type: Concept
in scheme: JobTech Taxonomy - Färdighet
definition: Möbelstoppning
broader: zmYu aAM TuF
related: vhUJ LyD XWc

SQL, frågespråk
type: Concept
in scheme: JobTech Taxonomy - Färdighet
definition: SQL, frågespråk, avser ett strukturerat frågespråk som används för att kommunicera med databaser. Denna kompetens innefattar kunskaper i att skapa, läsa, uppdatera och radera data i relationella databaser genom att formulera specifika frågor och kommandon.
alternative label: SQL
broader: Datorspråk
related: BAeH eg8 T2d
related: Fv7d YhP YmS
related: D9SL mtn vGM
related: DJh5 yyF hEM
related: 4Jty HpK a3Q
related: MYAz x9m 2LJ

Grovslipning
type: Concept
in scheme: JobTech Taxonomy - Färdighet
definition: Grovslipning
broader: zmYu aAM TuF
related: 4bxV 58E P9N

Privata reguljärresor, reseproduktion
type: Concept
in scheme: JobTech Taxonomy - Färdighet
definition: Privata reguljärresor, reseproduktion
broader: zmYu aAM TuF
related: 48KE fDE ryL

Flygtekniska verktyg
type: Concept
in scheme: JobTech Taxonomy - Färdighet
definition: Flygtekniska verktyg avser specialiserade verktyg och utrustning som används inom flygindustrin för underhåll och reparation av flygmotorer, flygplan och helikoptrar. Denna kompetens innefattar kunskaper om specifika verktyg och tekniker som är nödvändiga för att säkerställa korrekt funktion och säkerhet i luftfartyg.
broader: zmYu aAM TuF
related: iGTu bYL 2T7
related: eRkT cTv H9v

Driftansvar, bygg
type: Concept
in scheme: JobTech Taxonomy - Färdighet
definition: Driftansvar, bygg
broader: zmYu aAM TuF
related: thZP oR7 WrY
related: w6ud quG dgh
related: 7mn2 kA9 ftp
related: XeBP nMe pXx

Korttidshem/Korttidsboende, LSS
type: Concept
in scheme: JobTech Taxonomy - Färdighet
definition: Korttidshem/Korttidsboende, LSS
alternative label: Korttidsboende, LSS
alternative label: Korttidshem
broader: zmYu aAM TuF
related: BWwk fYX S5B
related: jY19 knH MJp
related: 7pz9 eY9 D2s
related: tAJS JNb hDH
related: 5uP5 Ugw aVE

Teknisk upphandling
type: Concept
in scheme: JobTech Taxonomy - Färdighet
definition: Teknisk upphandling avser inköp av tekniska produkter, system eller konsulttjänster där kravställningen fokuserar på funktion, prestanda, gränssnitt och tekniska egenskaper.
broader: zmYu aAM TuF
related: SPYW 7Z1 ShT
related: XeBP nMe pXx
related: PRQn 9yw NJA
related: GC7L Yw7 Mfo
related: 4Jty HpK a3Q

Mattvätt
type: Concept
in scheme: JobTech Taxonomy - Färdighet
definition: Mattvätt
broader: zmYu aAM TuF
related: 4DET dLf iB9

Mindre däggdjur, konservering
type: Concept
in scheme: JobTech Taxonomy - Färdighet
definition: Mindre däggdjur, konservering
broader: zmYu aAM TuF
related: 34Tn BQQ tfo

Flygfotografering
type: Concept
in scheme: JobTech Taxonomy - Färdighet
definition: Flygfotografering
broader: zmYu aAM TuF
related: 3J38 DNz YKK

Kandidatexamen med inriktning scenografi
type: Concept
in scheme: JobTech Taxonomy - Färdighet
definition: Kandidatexamen med inriktning scenografi.
broader: Yrkesbevis/examen
related: CSUf ZVM a7Z

Elschemaläsning
type: Concept
in scheme: JobTech Taxonomy - Färdighet
definition: Elschemaläsning
broader: zmYu aAM TuF
related: Lzpv ofL 3H5
related: MW1P GNJ 4F9
related: e6nk AGp y28
related: K8yg U4C gkY
related: SgAJ DW2 FN5
related: fWrt sLg koW

Software AG Integration Suite, integrationsplattform
type: Concept
in scheme: JobTech Taxonomy - Färdighet
definition: Software AG Integration Suite, integrationsplattform
alternative label: Software AG Integration Suite
broader: Integrationsplattformar
related: BAeH eg8 T2d
related: cBBa ngH fCx
related: D9SL mtn vGM
related: DJh5 yyF hEM
related: 4Jty HpK a3Q
related: UXKZ 3zZ ipB
related: MYAz x9m 2LJ

Gesällbrev, billackerare
type: Concept
in scheme: JobTech Taxonomy - Färdighet
definition: Gesällbrev, billackerare
broader: Yrkesbevis/examen
related: dKUb KBP mw3

Lagerstyrning
type: Concept
in scheme: JobTech Taxonomy - Färdighet
definition: Lagerstyrning avser hantering och optimering av lagerprocesser för att säkerställa effektivt flöde av varor och material inom en organisation. Kompetensen innefattar planering, kontroll och samordning av lagerhållning, samt övervakning av inventarier för att maximera lagerkapacitet och minimera kostnader.
broader: zmYu aAM TuF
related: WhBn FAp ZNW
related: iWcY mko rq2
related: kLyY rwr aJr
related: yXbD NTH ijE
related: nNxJ YWy vR2
related: 4Jty HpK a3Q

Datorkommunikation, undervisning
type: Concept
in scheme: JobTech Taxonomy - Färdighet
definition: Datorkommunikation, undervisning
broader: Dataundervisning
related: 1CX5 mZw Vcq
related: 4Jty HpK a3Q

Pappersskärning, bokbinderi
type: Concept
in scheme: JobTech Taxonomy - Färdighet
definition: Pappersskärning, bokbinderi avser processen att skära och förbereda papper för bokbinderi, vilket innefattar användning av skärmaskiner och andra verktyg för att bearbeta pappersmaterial i känslighet att skapa broschyrer och böcker. Kompetensen omfattar kunskaper inom både tekniska och hantverksmässiga aspekter av bokbindning.
broader: zmYu aAM TuF
related: 34Tn BQQ tfo
related: mPzg 93F QEv

Patientadministration
type: Concept
in scheme: JobTech Taxonomy - Färdighet
definition: Patientadministration avser processen för hantering av patientinformation och dokumentation inom vården. Kompetensen omfattar skrivande och bearbetande av patientjournaler baserat på information från läkare eller andra vårdgivare, administration och remisshantering samt mottagande av patienter.
broader: zmYu aAM TuF
related: 2kLc pto DpV
related: GiNX ESA AL1

Komposition, klassisk musik
type: Concept
in scheme: JobTech Taxonomy - Färdighet
definition: Komposition, klassisk musik
broader: zmYu aAM TuF
related: AWJF wqZ va9

Rotationstryckning
type: Concept
in scheme: JobTech Taxonomy - Färdighet
definition: Rotationstryckning
broader: zmYu aAM TuF
related: XeJB bkn mRn

Allergivård
type: Concept
in scheme: JobTech Taxonomy - Färdighet
definition: Allergivård
broader: zmYu aAM TuF
related: oj4c P4b cja

Båtar, produktkunskap
type: Concept
in scheme: JobTech Taxonomy - Färdighet
definition: Båtar, produktkunskap avser förståelse och kunskap om olika typer av båtar, inklusive deras konstruktion, funktioner, drift och underhåll. Denna kompetens innefattar också insikter i material och utrustning som används vid tillverkning och drift av båtar, samt kunskap om relaterade produkter och tjänster.
broader: zmYu aAM TuF
related: YKL2 FCB 1yr
related: M47D MU2 dhS

Vivaldi, hotellbokningssystem
type: Concept
in scheme: JobTech Taxonomy - Färdighet
definition: Vivaldi, hotellbokningssystem
alternative label: Vivaldi
broader: kRoQ fPR 8oK
related: bYde Frc xcB
related: 4Jty HpK a3Q

JBuilder, programmeringsverktyg
type: Concept
in scheme: JobTech Taxonomy - Färdighet
definition: JBuilder, programmeringsverktyg
alternative label: JBuilder
broader: Programmerings- och systemutvecklingsverktyg
related: D9SL mtn vGM
related: DJh5 yyF hEM
related: 4Jty HpK a3Q
related: MYAz x9m 2LJ

Hållbar produktutveckling
type: Concept
in scheme: JobTech Taxonomy - Färdighet
definition: Hållbar produktutveckling
broader: zmYu aAM TuF
related: mis4 feV uex
related: xm5G vGn iyk
related: v9nU 6Fw 4Qg
related: qn2U dB9 Cmh
related: mp2Y vyC RFV
related: 3jEy yuT aVo
related: rwpH 6RA XTT
related: thZP oR7 WrY
related: K8yg U4C gkY
related: nDaB vdy eAy
related: 33Nt DSs YYA
related: yXbD NTH ijE
related: ketV G9W GeR
related: SPYW 7Z1 ShT
related: XeBP nMe pXx
related: PRQn 9yw NJA

Yrkesutbildning, husdjurstekniker
type: Concept
in scheme: JobTech Taxonomy - Färdighet
definition: Yrkesutbildning, husdjurstekniker är en eftergymnasial yrkesutbildning med inriktning mot arbete inom vård och skötsel av husdjur.
broader: Yrkesutbildning
related: KYmy iqC xiQ

Härdning, glas/Härdning, keramik
type: Concept
in scheme: JobTech Taxonomy - Färdighet
definition: Härdning, glas/Härdning, keramik
alternative label: Härdning, glas
alternative label: Härdning, keramik
broader: zmYu aAM TuF
related: hxm6 xkr dHm

Fatservering
type: Concept
in scheme: JobTech Taxonomy - Färdighet
definition: Fatservering
broader: zmYu aAM TuF
related: UjoW meY Zwt

Böcker/Tidskrifter
type: Concept
in scheme: JobTech Taxonomy - Färdighet
definition: Böcker/Tidskrifter
alternative label: Böcker
alternative label: Tidskrifter
broader: zmYu aAM TuF
related: YKL2 FCB 1yr

Nickel, materialkunskap
type: Concept
in scheme: JobTech Taxonomy - Färdighet
definition: Nickel, materialkunskap
broader: Materialkunskap
related: wQ1E Bzk ZyA
related: L4hA SJP SFi
related: bXfo 4hb SXx

Polisexamen
type: Concept
in scheme: JobTech Taxonomy - Färdighet
definition: Polisexamen
broader: Yrkesbevis/examen
related: rNcE Zno pD8

Layout-Adobe InDesign
type: Concept
in scheme: JobTech Taxonomy - Färdighet
definition: Layout-Adobe InDesign avser kompetensen att använda programmet Adobe InDesign för att skapa och designa layout för tryckt och digital media. Denna kompetens innefattar färdigheter i att organisera text och bilder, samt i att välja typografi och färgscheman för att producera visuellt tilltalande och funktionella dokument.
broader: Programvara för digitalt skapande
related: 8Bmh vtM zts
related: zfve s6G tpc
related: k1Nx auG sNh
related: 4Jty HpK a3Q
related: LeQV umf wUS
related: Mbt6 3ko DiD
related: p16X 44f rwZ

Personaluthyrningsvana
type: Concept
in scheme: JobTech Taxonomy - Färdighet
definition: Personaluthyrningsvana
broader: zmYu aAM TuF
related: bjqk F3A 5Hk
related: H2Zj eL9 x28
related: dMVD VYy kgg

Balans, redovisningssystem
type: Concept
in scheme: JobTech Taxonomy - Färdighet
definition: Balans, redovisningssystem
alternative label: Balans
broader: xSJR 1Kq pxB
related: eQ4M CNm ozj
related: q81z 3oD 1qu
related: ij8k EwC zyB
related: 4Jty HpK a3Q

Godkännande som utbildningsledare inom trafikskola
type: Concept
in scheme: JobTech Taxonomy - Färdighet
definition: Godkännande som utbildningsledare inom trafikskola utfärdas av Transportstyrelsen.
broader: Yrkesbevis/examen
related: 4P8B LtK JgE
related: yVZH zHh 6fG

Transportledning, vägtrafik
type: Concept
in scheme: JobTech Taxonomy - Färdighet
definition: Transportledning, vägtrafik avser samordning och övervakning av person- och godstrafik, samt utarbetande och justering av transportscheman. Kompetensen innefattar ansvar för tågtrafik, dirigerande av trafik enligt säkerhetsbestämmelser och tidtabeller, samt övervakning av trafik på flygplatser.
broader: zmYu aAM TuF
related: 4Jty HpK a3Q
related: 957L kZK rHZ

Auktoriserad fartygsagent
type: Concept
in scheme: JobTech Taxonomy - Färdighet
definition: Auktoriserad fartygsagent
broader: Yrkesbevis/examen
related: AuTi FEo j3R

Hundförareutbildning
type: Concept
in scheme: JobTech Taxonomy - Färdighet
definition: Hundförareutbildning för väktare att använda hund. Kräver tidigare genomgången utbildning för väktare, ordningsvakt eller skyddsvakt.
broader: Yrkesbevis/examen
related: FKCE Anf zGH
related: rNcE Zno pD8
related: iqZh 3yX i8n

Ekonomiska prognoser
type: Concept
in scheme: JobTech Taxonomy - Färdighet
definition: Ekonomiska prognoser
broader: zmYu aAM TuF
related: Y6yY SuR hVh
related: Bbkh nrm 2J8
related: Uw4n UB2 RCW
related: vPP6 rsw dck
related: Fp7x Yqt bx9
related: pTr9 RBT 9ur
related: mZsb A1K Gec
related: cRmd 536 pT1
related: WZCM nfS eAk

Grovarbete, bygg
type: Concept
in scheme: JobTech Taxonomy - Färdighet
definition: Grovarbete, bygg avser det fysiska arbetet på byggarbetsplatser som inkluderar röjning, rivning och hantering av material. I denna kompetens ingår även assistans vid maskinellt schaktarbete.
broader: zmYu aAM TuF
related: iHrC aRv fVm

Panflöjt
type: Concept
in scheme: JobTech Taxonomy - Färdighet
definition: Panflöjt
broader: wLYs CKS wK8
related: AWJF wqZ va9

VVS-artiklar
type: Concept
in scheme: JobTech Taxonomy - Färdighet
definition: VVS-artiklar
broader: zmYu aAM TuF
related: oXSW fbY XrY
related: YKL2 FCB 1yr
related: 85cq 6uK 4cK

R, programmeringsspråk
type: Concept
in scheme: JobTech Taxonomy - Färdighet
definition: R, programmeringsspråk
alternative label: R
broader: Datorspråk
related: jv1x tpK 32p
related: D9SL mtn vGM
related: DJh5 yyF hEM
related: UxT1 tPF Kbg
related: 4Jty HpK a3Q
related: UXKZ 3zZ ipB

Skogsförvaltning
type: Concept
in scheme: JobTech Taxonomy - Färdighet
definition: Skogsförvaltning
broader: zmYu aAM TuF
related: yXbD NTH ijE
related: 3LdB WEJ 8Ms

Skötsel och underhåll av utemiljöer
type: Concept
in scheme: JobTech Taxonomy - Färdighet
definition: Skötsel och underhåll av utemiljöer innebär åtgärder för att säkerställa en god och funktionell utomhusmiljö. Denna kompetens omfattar aspekter av planering, anläggning, underhåll och förnyelse av vegetation, ytor och infrastruktur i parker, trädgårdar och andra offentliga eller privata utemiljöer.
broader: zmYu aAM TuF
related: XBh3 Xrm C4R
related: df9D e6y 61z
related: yXbD NTH ijE

Arbete inom återbrukshantering
type: Concept
in scheme: JobTech Taxonomy - Färdighet
definition: Arbete inom återbrukshantering
broader: zmYu aAM TuF
related: X7HR rZK 4wj
related: yXbD NTH ijE
related: YKL2 FCB 1yr

Oförstörande provning: Penetrantprovning (PT)
type: Concept
in scheme: JobTech Taxonomy - Färdighet
definition: Oförstörande provning: Penetrantprovning (PT)
broader: zmYu aAM TuF
related: Lzpv ofL 3H5
related: K8yg U4C gkY
related: iGTu bYL 2T7
related: eRkT cTv H9v

Kompressionsteknik
type: Concept
in scheme: JobTech Taxonomy - Färdighet
definition: Kompressionsteknik
broader: zmYu aAM TuF
related: K8yg U4C gkY
related: PRQn 9yw NJA

Hybridmotorer, reparationsvana
type: Concept
in scheme: JobTech Taxonomy - Färdighet
definition: Hybridmotorer, reparationsvana
broader: zmYu aAM TuF
related: Lzpv ofL 3H5
related: yXbD NTH ijE

Embryologi
type: Concept
in scheme: JobTech Taxonomy - Färdighet
definition: Embryologi
broader: zmYu aAM TuF
related: Z2MZ eYc Lfv

Planeringssamordning för scen, ljus och ljudteknik
type: Concept
in scheme: JobTech Taxonomy - Färdighet
definition: Planeringssamordning för scen, ljus och ljudteknik
broader: zmYu aAM TuF
related: 4BsK q2C sCL
related: 3J38 DNz YKK
related: PH2M uV4 r72
related: 4Jty HpK a3Q

Arkitekt-AutoCAD Architecture
type: Concept
in scheme: JobTech Taxonomy - Färdighet
definition: Arkitekt-AutoCAD Architecture
broader: mTLu uo2 gq2
related: thZP oR7 WrY
related: w6ud quG dgh
related: Pd51 xnr KCY
related: XeBP nMe pXx
related: ETAR ggZ Wuw
related: 41KB bfk 5jR
related: 4Jty HpK a3Q

Samordning/Granskning-Autodesk Navisworks Simulate
type: Concept
in scheme: JobTech Taxonomy - Färdighet
definition: Samordning/Granskning-Autodesk Navisworks Simulate
alternative label: Granskning-Autodesk Navisworks Simulate
alternative label: Samordning-Autodesk Navisworks Simulate
broader: mTLu uo2 gq2
related: 3jEy yuT aVo
related: thZP oR7 WrY
related: w6ud quG dgh
related: K8yg U4C gkY
related: nDaB vdy eAy
related: 33Nt DSs YYA
related: Pd51 xnr KCY
related: ketV G9W GeR
related: SPYW 7Z1 ShT
related: XeBP nMe pXx
related: PRQn 9yw NJA
related: ETAR ggZ Wuw
related: 41KB bfk 5jR
related: 4Jty HpK a3Q

Fiol, undervisning musikskola
type: Concept
in scheme: JobTech Taxonomy - Färdighet
definition: Fiol, undervisning musikskola
broader: zmYu aAM TuF
related: mcRJ kq2 jFr

Buktaleri
type: Concept
in scheme: JobTech Taxonomy - Färdighet
definition: Buktaleri
broader: zmYu aAM TuF
related: iBUL s38 izZ
related: xuSE mtB Mir

Härdplaster, materialkunskap/Isocyanater, materialkunskap
type: Concept
in scheme: JobTech Taxonomy - Färdighet
definition: Härdplaster, materialkunskap/Isocyanater, materialkunskap
alternative label: Härdplaster, materialkunskap
alternative label: Isocyanater, materialkunskap
broader: zmYu aAM TuF
related: dKUb KBP mw3
related: yPQ4 EaN Dtj
related: L4hA SJP SFi

Köldmedieteknisk kurs
type: Concept
in scheme: JobTech Taxonomy - Färdighet
definition: Köldmedieteknisk kurs
broader: s48H Sft DTn
related: Rsoy sS6 6c4

PGA tränarassistentutbildning
type: Concept
in scheme: JobTech Taxonomy - Färdighet
definition: PGA tränarassistentutbildning är en grundläggande yrkesinriktad utbildning med inriktning till golftränare.
broader: s48H Sft DTn
related: EA6o N1N QtT

TV
type: Concept
in scheme: JobTech Taxonomy - Färdighet
definition: TV
broader: zmYu aAM TuF
related: ezKk kss CiQ
related: zfve s6G tpc
related: 3i4a Ufc qpp
related: rYSG 3WJ LmC

Ljudtak
type: Concept
in scheme: JobTech Taxonomy - Färdighet
definition: Ljudtak
broader: zmYu aAM TuF
related: 3g5x Tm7 8QH

Hemelektronik, installation och reparation
type: Concept
in scheme: JobTech Taxonomy - Färdighet
definition: Hemelektronik, installation och reparation avser kompetens relaterad till installation och reparation av hemelektroniska apparater och system, inklusive data- och telenät, larm och signalsystem. Kompetensen omfattar även service av hemelektronik för att säkerställa korrekt funktion och säkerhet.
broader: zmYu aAM TuF
related: fWrt sLg koW

Trädgårdsanläggning
type: Concept
in scheme: JobTech Taxonomy - Färdighet
definition: Trädgårdsanläggning inkluderar att utforma, arrangera, anlägga och underhålla utemiljöer som trädgårdar, parker och grönytor.
broader: zmYu aAM TuF
related: XBh3 Xrm C4R
related: df9D e6y 61z
related: yXbD NTH ijE
related: 2xQ4 4kh kTZ

Skadereglering, motorfordonsförsäkring
type: Concept
in scheme: JobTech Taxonomy - Färdighet
definition: Skadereglering, motorfordonsförsäkring
broader: zmYu aAM TuF
related: Ru4W zn2 LEz

Norrländska
type: Concept
in scheme: JobTech Taxonomy - Färdighet
definition: Norrländska
broader: Dialekt
related: iBUL s38 izZ

Räddningstjänst, erfarenhet
type: Concept
in scheme: JobTech Taxonomy - Färdighet
definition: Räddningstjänst, erfarenhet
broader: zmYu aAM TuF
related: ug5y o6z U3L

Materialteknik
type: Concept
in scheme: JobTech Taxonomy - Färdighet
definition: Kompetensen avser kunskaper och tillämpning inom materialteknik, det vill säga studiet av befintliga material och ämnens egenskaper för att producera nya material eller förbättra flera befintliga egenskaper såsom kemiska eller fysikaliska egenskaper. Det inbegriper kunskap om strukturen, om prestandan hos olika material och om möjligheten att överföra nya eller förbättrade material till olika industrier.
broader: zmYu aAM TuF
related: mis4 feV uex
related: xm5G vGn iyk
related: mp2Y vyC RFV
related: K8yg U4C gkY
related: SPYW 7Z1 ShT
related: PRQn 9yw NJA
related: bExu 8gk azk

Klockor
type: Concept
in scheme: JobTech Taxonomy - Färdighet
definition: Klockor
broader: zmYu aAM TuF
related: e6nk AGp y28
related: JAFv ZaP tDG
related: YKL2 FCB 1yr

Anorexi, behandlingserfarenhet/Bulimi, behandlingserfarenhet
type: Concept
in scheme: JobTech Taxonomy - Färdighet
definition: Anorexi, behandlingserfarenhet/Bulimi, behandlingserfarenhet
alternative label: Anorexi, behandlingserfarenhet
alternative label: Bulimi, behandlingserfarenhet
broader: zmYu aAM TuF
related: UUQi UJ5 MSb
related: VYeq GDF a2g

Myntvärdering
type: Concept
in scheme: JobTech Taxonomy - Färdighet
definition: Myntvärdering
broader: zmYu aAM TuF
related: Ru4W zn2 LEz
related: dUuh wwa FGj

Total Quality Management/TQM
type: Concept
in scheme: JobTech Taxonomy - Färdighet
definition: Total Quality Management/TQM
alternative label: TQM
alternative label: Total Quality Management
broader: Kvalitetsverktyg
related: mis4 feV uex
related: xm5G vGn iyk
related: v9nU 6Fw 4Qg
related: qn2U dB9 Cmh
related: mp2Y vyC RFV
related: 3jEy yuT aVo
related: K8yg U4C gkY
related: nDaB vdy eAy
related: 33Nt DSs YYA
related: SPYW 7Z1 ShT
related: XeBP nMe pXx
related: dMVD VYy kgg
related: PRQn 9yw NJA

Hudvård
type: Concept
in scheme: JobTech Taxonomy - Färdighet
definition: Hudvård omfattar behandlingar som syftar till att rengöra, vårda och bevara hudens funktion och hälsa. Kompetensen innefattar kunskap om hudens uppbyggnad, olika hudtyper och anpassning av produkter och behandlingsmetoder efter individuella behov. Vanliga moment inkluderar ansiktsrengöring, peeling, massage, återfuktning, masker samt rådgivning om daglig hudvård och produktval.
broader: zmYu aAM TuF
related: xr7w N6Q QMA

Butikskontrollantsutbildning
type: Concept
in scheme: JobTech Taxonomy - Färdighet
definition: Tilläggsutbildning till grundutbildade väktare som krävs för att få arbeta som butikskontrollant.
broader: Yrkesbevis/examen
related: iqZh 3yX i8n

Kammarmusik
type: Concept
in scheme: JobTech Taxonomy - Färdighet
definition: Kammarmusik
broader: p1WM wCw LTd
related: AWJF wqZ va9

Paketering
type: Concept
in scheme: JobTech Taxonomy - Färdighet
definition: Paketering avser processen att fylla, tillsluta och förbereda förpackningar för olika produkter, vilket inkluderar etikettering, packning och sortering. Denna kompetens omfattar även hantering och rengöring av material och produkter som är kopplade till tillverkningsprocessen.
broader: zmYu aAM TuF
related: DxiF hTo b3X

Ljussättning, TV-produktion
type: Concept
in scheme: JobTech Taxonomy - Färdighet
definition: Ljussättning, TV-produktion
broader: zmYu aAM TuF
related: 4BsK q2C sCL
related: CkRH 4Qn iX3

OpenJPA, ramverk
type: Concept
in scheme: JobTech Taxonomy - Färdighet
definition: OpenJPA, ramverk
broader: srsj GQb CE1
related: D9SL mtn vGM
related: DJh5 yyF hEM
related: UxT1 tPF Kbg
related: 4Jty HpK a3Q
related: UXKZ 3zZ ipB

Patrullstädning
type: Concept
in scheme: JobTech Taxonomy - Färdighet
definition: Patrullstädning
broader: zmYu aAM TuF
related: Z6TY xDf Yup

Webbdesign
type: Concept
in scheme: JobTech Taxonomy - Färdighet
definition: Webbdesign avser processen att skapa och utforma webbsidor och webbapplikationer, vilket innefattar layout, visuell framställning och användarupplevelse. Kompetensen omfattar kunskaper om grafisk design, användargränssnitt och webbutveckling för att implementera funktionella och estetiska webblösningar.
broader: zmYu aAM TuF
related: 8Bmh vtM zts
related: UxT1 tPF Kbg
related: 4Jty HpK a3Q
related: Mbt6 3ko DiD

Yrkesbevis, lekredskap, träarbeten
type: Concept
in scheme: JobTech Taxonomy - Färdighet
definition: Yrkesbevis, lekredskap, träarbeten
broader: Yrkesbevis/examen
related: XBh3 Xrm C4R
related: df9D e6y 61z

PHP Developer Certification
type: Concept
in scheme: JobTech Taxonomy - Färdighet
definition: PHP Developer Certification
broader: s48H Sft DTn
related: BAeH eg8 T2d
related: cBBa ngH fCx
related: Q5DF juj 8do
related: D9SL mtn vGM
related: DJh5 yyF hEM
related: UxT1 tPF Kbg
related: 4Jty HpK a3Q
related: UXKZ 3zZ ipB

Dragshow
type: Concept
in scheme: JobTech Taxonomy - Färdighet
definition: Drag show
broader: zmYu aAM TuF
related: iBUL s38 izZ

D-AMPS-system
type: Concept
in scheme: JobTech Taxonomy - Färdighet
definition: D-AMPS-system
broader: Mobiltelefonsystem
related: nDaB vdy eAy
related: SPYW 7Z1 ShT
related: 4Jty HpK a3Q

Verksamhetsansvar
type: Concept
in scheme: JobTech Taxonomy - Färdighet
definition: Verksamhetsansvar avser ansvaret för att planera, leda och samordna verksamhet inom en organisation, inklusive formulering av mål och strategier samt uppföljning av verksamhetens resultat. Denna kompetens inkluderar också ansvar för budgethantering och personalledning enligt riktlinjer fastställda av styrelse eller ledning.
broader: zmYu aAM TuF
related: NQTS fou E6u
related: coyZ Cyv Srw
related: NxXz fBh w7j
related: z8di AqX GBr
related: g6eC Fwu B3J
related: eWiB mGP MjE
related: 4GAs rKs 2Ne
related: uxst tkg zDh
related: X1Ac Y9P PJo
related: 3i4a Ufc qpp

Gjuteriteknik
type: Concept
in scheme: JobTech Taxonomy - Färdighet
definition: Gjuteriteknik avser processen och metoderna för att forma material, oftast metall, genom att smälta det och hälla det i en form. Kompetensen innefattar kunskap om uppvärmning, smältning, gjutning och efterföljande bearbetning för att producera olika metallprodukter.
broader: zmYu aAM TuF
related: 3jEy yuT aVo
related: rwpH 6RA XTT
related: E87t egE pjA
related: UcNa inr snV

Psykosomatik, psykologisk behandlingserfarenhet
type: Concept
in scheme: JobTech Taxonomy - Färdighet
definition: Psykosomatik, psykologisk behandlingserfarenhet
broader: zmYu aAM TuF
related: VYeq GDF a2g

Certifierad kontrollansvarig
type: Concept
in scheme: JobTech Taxonomy - Färdighet
definition: Certifierad kontrollansvarig
broader: s48H Sft DTn
related: thZP oR7 WrY
related: 7mn2 kA9 ftp
related: XeBP nMe pXx
related: 41KB bfk 5jR

Akutsjukvård, sjukhus
type: Concept
in scheme: JobTech Taxonomy - Färdighet
definition: Akutsjukvård, sjukhus, avser den medicinska vård som ges till patienter med akuta och ofta livshotande tillstånd inom sjukhusmiljö. Kompetensen innefattar snabb bedömning, diagnostik och behandling av allvarliga sjukdomar och skador, samt samordning av vårdinsatser för att säkerställa effektiv och säker vård under kritiska situationer.
broader: zmYu aAM TuF
related: LP4Z ABV gRm
related: kHgb AHf vrY

Sales
type: Concept
in scheme: JobTech Taxonomy - Färdighet
definition: Sales
broader: zmYu aAM TuF
related: aQpg E2T cWq

Habilitering
type: Concept
in scheme: JobTech Taxonomy - Färdighet
definition: Habilitering
broader: zmYu aAM TuF
related: pzch NRY 9ZF
related: sq3e WVv Fjd
related: TPH4 2AM isT
related: jY19 knH MJp
related: 7pz9 eY9 D2s
related: tAJS JNb hDH

Växter, skötselvana
type: Concept
in scheme: JobTech Taxonomy - Färdighet
definition: Växter, skötselvana avser kunskap och färdigheter i att ta hand om och vårda växter, vilket inkluderar att förstår deras behov av ljus, vatten och näring. Kompetensen kan också innefatta insikter om odling, beskärning och förebyggande av sjukdomar för att främja växternas hälsa och tillväxt.
broader: zmYu aAM TuF
related: XBh3 Xrm C4R
related: yXbD NTH ijE
related: YKL2 FCB 1yr
related: 2xQ4 4kh kTZ
related: 1EBv UzM ozQ

Elektroniska tändsystem
type: Concept
in scheme: JobTech Taxonomy - Färdighet
definition: Elektroniska tändsystem
broader: zmYu aAM TuF
related: a75S eLg JWH

Hyvling, konventionell maskin
type: Concept
in scheme: JobTech Taxonomy - Färdighet
definition: Hyvling, konventionell maskin avser processen att bearbeta material, oftast trä eller metall, med hjälp av en hyvlarmaskin för att ge en jämn ochhet och specifik form. Denna kompetens omfattar användning och inställning av konventionella hyvlarmaskiner samt förståelse för materialens egenskaper och beteende vid bearbetning.
broader: zmYu aAM TuF
related: VKKg e4t t46
related: vaEp iBS c5h
related: 4bxV 58E P9N

Måleriarbete, bygg
type: Concept
in scheme: JobTech Taxonomy - Färdighet
definition: Måleriarbete, bygg
broader: zmYu aAM TuF
related: QKvX v7r PNL

Vapenutbildning
type: Concept
in scheme: JobTech Taxonomy - Färdighet
definition: Vapenutbildning
broader: Yrkesbevis/examen
related: iqZh 3yX i8n

Industriell miljöteknik
type: Concept
in scheme: JobTech Taxonomy - Färdighet
definition: Industriell miljöteknik
broader: zmYu aAM TuF
related: rE1E m3d cx1
related: yXbD NTH ijE

Entertainerprogram
type: Concept
in scheme: JobTech Taxonomy - Färdighet
definition: Entertainerprogram
broader: zmYu aAM TuF
related: AWJF wqZ va9
related: gmRr 7tt eHj

Kantpressning
type: Concept
in scheme: JobTech Taxonomy - Färdighet
definition: Kantpressning avser processen att forma metallplåtar genom att använda en kantpress, där det uppnås önskade vinklar och former. Kompetensen innefattar förståelse för maskininställningar och materialegenskaper för att säkerställa precision och kvalitet i de producerade detaljerna.
broader: zmYu aAM TuF
related: vaEp iBS c5h
related: TrwQ RXT W8a

Banktjänster
type: Concept
in scheme: JobTech Taxonomy - Färdighet
definition: Banktjänster avser kompetensen att hantera och administrera bankers kärnverksamhet, såsom kontoöppningar, betalningar, in- och utlåning samt transaktioner för privatpersoner och företag. Det kan även inkludera kundservice, hantering av värdepapper, krediter och efterlevnad av finansiella regelverk.
broader: zmYu aAM TuF
related: FfMN Bw1 qYR
related: WNVp RYe zLX

Miljögestaltning, konstnärlig
type: Concept
in scheme: JobTech Taxonomy - Färdighet
definition: Miljögestaltning, konstnärlig
broader: zmYu aAM TuF
related: 34Tn BQQ tfo

Magnetkontroll av metallprodukter
type: Concept
in scheme: JobTech Taxonomy - Färdighet
definition: Magnetkontroll av metallprodukter
broader: zmYu aAM TuF
related: 4bxV 58E P9N

Avfallshantering
type: Concept
in scheme: JobTech Taxonomy - Färdighet
definition: Avfallshantering avser processerna för insamling, transport, bearbetning och avfallshantering för att hantera avfall på ett effektivt och miljövänligt sätt. Kompetensen omfattar kunskap om gällande lagar och förordningar kring avfallshantering samt metoder för att minimera avfall och maximera återvinning.
broader: zmYu aAM TuF
related: 3ZtN hhA SM7
related: df9D e6y 61z
related: puim 6PY DGj
related: X7HR rZK 4wj
related: rE1E m3d cx1
related: yXbD NTH ijE
related: 3MBw pDA P2F

Gränskontroll
type: Concept
in scheme: JobTech Taxonomy - Färdighet
definition: Gränskontroll
broader: zmYu aAM TuF
related: rNcE Zno pD8

Pedagogisk verksamhet, naturskola
type: Concept
in scheme: JobTech Taxonomy - Färdighet
definition: Pedagogisk verksamhet, naturskola
broader: zmYu aAM TuF
related: mcRJ kq2 jFr
related: 1CX5 mZw Vcq

Gravstenstillverkning
type: Concept
in scheme: JobTech Taxonomy - Färdighet
definition: Gravstenstillverkning avser processen att skapa gravstenar, vilket innefattar arbete med olika typer av stenar som granit och marmor. Kompetensen kräver kunskaper om stenhuggning, bearbetning och gravyr för att producera gravstenar som uppfyller specifika krav och designönskemål.
broader: zmYu aAM TuF
related: vCBT Pnd 8UB

Show
type: Concept
in scheme: JobTech Taxonomy - Färdighet
definition: Show
broader: zmYu aAM TuF
related: iBUL s38 izZ
related: xuSE mtB Mir
related: gmRr 7tt eHj

Socialrätt
type: Concept
in scheme: JobTech Taxonomy - Färdighet
definition: Socialrätt avser de rättsliga normer och bestämmelser som reglerar sociala rättigheter och skyldigheter i samhället, inklusive frågor om socialförsäkringar, socialtjänst och stödinsatser. Kompetensen innefattar förståelse för hur lagar och föreskrifter påverkar individers och gruppers sociala situation och rätt till hjälp och stöd.
broader: zmYu aAM TuF
related: eQ4M CNm ozj
related: q8wL kdi WaW
related: BWwk fYX S5B
related: br6a VVS V3y
related: dJXy Rpq a2u
related: 6aak 8eh iwT
related: n6iX f2z XfE
related: DZVN v5g Fco
related: JfYV ZGg 6rm
related: pok1 ipJ yzD

Betonginklädning
type: Concept
in scheme: JobTech Taxonomy - Färdighet
definition: Betonginklädning
broader: zmYu aAM TuF
related: f71c gjL RDq

Mikrovågsteknik
type: Concept
in scheme: JobTech Taxonomy - Färdighet
definition: Mikrovågsteknik
broader: zmYu aAM TuF
related: nDaB vdy eAy
related: SPYW 7Z1 ShT

Avloppsreningsanläggning, underhåll
type: Concept
in scheme: JobTech Taxonomy - Färdighet
definition: Avloppsreningsanläggning, underhåll
broader: zmYu aAM TuF
related: idjo 2Wr a3E
related: Cppd 9P7 HeR

Landningsställ, underhåll
type: Concept
in scheme: JobTech Taxonomy - Färdighet
definition: Landningsställ, underhåll
broader: zmYu aAM TuF
related: iGTu bYL 2T7

Vägbevakning
type: Concept
in scheme: JobTech Taxonomy - Färdighet
definition: Vägbevakning
broader: zmYu aAM TuF
related: ayQ4 G3W A2w

Gesällbrev, frisör
type: Concept
in scheme: JobTech Taxonomy - Färdighet
definition: Gesällbrev, frisör är ett bevis på att en hantverkare har genomgått utbildning och avlagt de delprov som krävs inom det specifika hantverksyrket, och därigenom uppnått ett erkännande av färdigheter och kompetens inom yrket. Utfärdas av Sveriges hantverksråd i samråd med aktuell branschorganisation.
broader: Yrkesbevis/examen
related: mwVN oEH g9k
related: LyBp bY6 bZK

Taekwondo, instruktör/Taekwondo, tränare
type: Concept
in scheme: JobTech Taxonomy - Färdighet
definition: Taekwondo, instruktör/Taekwondo, tränare
alternative label: Taekwondo, instruktör
alternative label: Taekwondo, tränare
broader: Idrott/aktivitet
related: EA6o N1N QtT

Dykarskötare, erfarenhet
type: Concept
in scheme: JobTech Taxonomy - Färdighet
definition: Dykarskötare, erfarenhet
broader: zmYu aAM TuF
related: DPPw 4wa AsH

Fenix, telefonväxel
type: Concept
in scheme: JobTech Taxonomy - Färdighet
definition: Fenix, telefonväxel
broader: Telefonväxlar
related: 4aPu 2nd 8X6
related: ByrL ANp UwV
related: 4Jty HpK a3Q

Microsoft Dynamics NAV, affärssystem
type: Concept
in scheme: JobTech Taxonomy - Färdighet
definition: Microsoft Dynamics NAV, affärssystem
alternative label: Microsoft Dynamics NAV
broader: xSJR 1Kq pxB
related: eQ4M CNm ozj
related: Y6yY SuR hVh
related: Uw4n UB2 RCW
related: iWcY mko rq2
related: q81z 3oD 1qu
related: cRmd 536 pT1
related: ij8k EwC zyB
related: 4Jty HpK a3Q

Varubelåning
type: Concept
in scheme: JobTech Taxonomy - Färdighet
definition: Varubelåning
broader: zmYu aAM TuF
related: JAFv ZaP tDG

Film/redigering-Lightworks
type: Concept
in scheme: JobTech Taxonomy - Färdighet
definition: Film/redigering-Lightworks
alternative label: Film-Lightworks
alternative label: redigering-Lightworks
broader: Programvara för digitalt skapande
related: 8Bmh vtM zts
related: 4BsK q2C sCL
related: CkRH 4Qn iX3
related: 3J38 DNz YKK
related: PH2M uV4 r72
related: 4Jty HpK a3Q

Driftplanering, data
type: Concept
in scheme: JobTech Taxonomy - Färdighet
definition: Driftplanering, data
broader: zmYu aAM TuF
related: 4Jty HpK a3Q
related: 13md uyV BNG

Arkskärning
type: Concept
in scheme: JobTech Taxonomy - Färdighet
definition: Arkskärning
broader: zmYu aAM TuF
related: 1G6H AuG qyy

Modersmål, undervisning gymnasienivå
type: Concept
in scheme: JobTech Taxonomy - Färdighet
definition: Modersmål, undervisning gymnasienivå
broader: Inriktning på lärarkompetens
related: 4KhP FxL uZ5

Mästarbrev, silversmed
type: Concept
in scheme: JobTech Taxonomy - Färdighet
definition: Mästarbrev, silversmed
broader: Yrkesbevis/examen
related: nwSm phw sPo

Påbyggnadsutbildning i räddningstjänst för brandingenjörer
type: Concept
in scheme: JobTech Taxonomy - Färdighet
definition: Påbyggnadsutbildning i räddningstjänst för brandingenjörer är en yrkesinriktad vidareutbildning till räddningsledare.
broader: Yrkesbevis/examen
related: wCx8 rY3 XUT

Luta
type: Concept
in scheme: JobTech Taxonomy - Färdighet
definition: Luta
broader: wLYs CKS wK8
related: AWJF wqZ va9

Bakning, cirkelledning
type: Concept
in scheme: JobTech Taxonomy - Färdighet
definition: Bakning, cirkelledning
broader: zmYu aAM TuF
related: 1CX5 mZw Vcq

Ortopedi, specialistkompetens för läkare
type: Concept
in scheme: JobTech Taxonomy - Färdighet
definition: Ortopedi, specialistkompetens för läkare
broader: Specialistbevis för läkare
related: nu7c QuB KVQ

JBoss Application Server, applikationsplattform
type: Concept
in scheme: JobTech Taxonomy - Färdighet
definition: JBoss Application Server, applikationsplattform
alternative label: JBoss Application Server
broader: Applikationsplattformar
related: BAeH eg8 T2d
related: cBBa ngH fCx
related: D9SL mtn vGM
related: DJh5 yyF hEM
related: UxT1 tPF Kbg
related: 4Jty HpK a3Q
related: UXKZ 3zZ ipB
related: MYAz x9m 2LJ

Möbeltapetsering, cirkelledning
type: Concept
in scheme: JobTech Taxonomy - Färdighet
definition: Möbeltapetsering, cirkelledning
broader: zmYu aAM TuF
related: 1CX5 mZw Vcq

Certifikat för fartygskock
type: Concept
in scheme: JobTech Taxonomy - Färdighet
definition: Certifikat för fartygskock
broader: Behörigheter, sjöfart
related: BStc SJh DKG
related: eX3C MtJ nPA

Byggkonstruktion-IMPACT Precast
type: Concept
in scheme: JobTech Taxonomy - Färdighet
definition: Byggkonstruktion-IMPACT Precast
broader: mTLu uo2 gq2
related: thZP oR7 WrY
related: w6ud quG dgh
related: Pd51 xnr KCY
related: XeBP nMe pXx
related: ETAR ggZ Wuw
related: 41KB bfk 5jR
related: 4Jty HpK a3Q

Hästdressyr, instruktör/Hästdressyr, tränare
type: Concept
in scheme: JobTech Taxonomy - Färdighet
definition: Hästdressyr, instruktör/Hästdressyr, tränare
alternative label: Hästdressyr, instruktör
alternative label: Hästdressyr, tränare
broader: Idrott/aktivitet
related: EA6o N1N QtT
related: KYmy iqC xiQ

Gjutlegeringar
type: Concept
in scheme: JobTech Taxonomy - Färdighet
definition: Gjutlegeringar
broader: zmYu aAM TuF
related: UcNa inr snV

Kvartärgeologi (grus, sand, lösa avlagringar)
type: Concept
in scheme: JobTech Taxonomy - Färdighet
definition: Kvartärgeologi (grus, sand, lösa avlagringar)
broader: zmYu aAM TuF
related: yXbD NTH ijE
related: V7Yz 4WV g4z

Hydroponik
type: Concept
in scheme: JobTech Taxonomy - Färdighet
definition: Odling av växter utan jord med hjälp av minerallösningar. Källa: ESCO
broader: zmYu aAM TuF
related: XBh3 Xrm C4R
related: yXbD NTH ijE
related: 2xQ4 4kh kTZ
related: RYCQ ogb uUY

Yrkesbevis, bandlastare
type: Concept
in scheme: JobTech Taxonomy - Färdighet
definition: Yrkesbevis, bandlastare
broader: Yrkesbevis/examen
related: 3ZtN hhA SM7

Äldreomsorg
type: Concept
in scheme: JobTech Taxonomy - Färdighet
definition: Äldreomsorg
broader: zmYu aAM TuF
related: coyZ Cyv Srw
related: sq3e WVv Fjd
related: jY19 knH MJp
related: tAJS JNb hDH

Yrkesutbildning
type: Concept
in scheme: JobTech Taxonomy - Färdighet
top concept of: JobTech Taxonomy - Färdighet
definition: Allmänna benämningar för yrkesutbildningar på yrkeshögskolenivå, gymnasienivå och eftergymnasial nivå. Enskilda utbildningar har allmänna benämningar för utbildningsområde och eller yrkesområde. Specifika benämningar för utbildningar från enskilda utbildningsanordnare specificeras inte.
narrower: Yrkesutbildning, dekorationsmålare/förgyllare
narrower: Yrkesutbildning, tågtekniker
narrower: kVEj sCw Wj8
narrower: Barnskötarutbildning
narrower: Yrkesutbildning, lokförare
narrower: Yrkesutbildning, grafik och trycksaksproduktion
narrower: Barn- och fritidsprogrammet
narrower: Yrkesutbildning, processoperatör inom kemisk industri
narrower: Yrkesutbildning, plastmaskinställare
narrower: Yrkesutbildning, medicinsk fotvård
narrower: Yrkesutbildning, bagare och konditor
narrower: Yrkehögskolesutbildning, fukttekniker
narrower: Yrkesutbildning, ambulanssjukvårdare
narrower: Yrkeshögskoleutbildning, Paralegal
narrower: Yrkesutbildning, bryggeritekniker
narrower: Yrkesutbildning, trafiklärare
narrower: Yrkesutbildning, hovslagare
narrower: Yrkesutbildning, skomakeri
narrower: Yrkeshögskoleutbildning, Flygtekniker
narrower: wVZP gRS 52W
narrower: Flygteknikutbildning
narrower: Yrkesutbildning, Bygglovshandläggare
narrower: Yrkesutbildning, processoperatör inom textilindustri
narrower: Yrkesutbildning, bantekniker
narrower: koCo NrJ W83
narrower: Yrkesutbildning, klövvårdare
narrower: Yrkeshögskoleutbildning, drifttekniker vid vatten- och avloppsanläggning
narrower: Yrkesutbildning, akupunktör
narrower: Yrkesutbildning, medicinsk massageterapeut
narrower: Yrkesutbildning, trädgårdsmästare
narrower: kJRF aBo YL2
narrower: ko4c YUz 9rj
narrower: Yrkeshögskoleutbildning, marintekniker
narrower: Yrkeshögskoleutbildning, processoperatör inom kemisk industri
narrower: Yrkesutbildning, husdjurstekniker
narrower: rZy7 aHP 1aj
narrower: Yrkesutbildning, vårdbiträde
narrower: Yrkesutbildning, lager- och terminalarbete
narrower: yTVh vYt 9WY
narrower: Yrkesutbildning, Bilskadereparatör
narrower: Yrkesutbildning, teleteknik

Lagbaserfarenhet
type: Concept
in scheme: JobTech Taxonomy - Färdighet
definition: Lagbaserfarenhet
broader: zmYu aAM TuF
related: bZ4J riZ zK6
related: QKvX v7r PNL
related: Y4j1 P17 wVA
related: q2Ge zrQ zJb
related: 9mJN VwW Xjg
related: AD3U cFH rbe
related: f71c gjL RDq
related: NnB3 eWH auo
related: iHrC aRv fVm
related: L4hA SJP SFi
related: yyF7 jsW EeP
related: bXfo 4hb SXx

Kiropraktorexamen
type: Concept
in scheme: JobTech Taxonomy - Färdighet
definition: Kiropraktorexamen är en examen på högskolenivå kopplad till utbildning med inriktning mot kiropraktor.
broader: Yrkesbevis/examen
related: aWki 4uA adn

Betalsystem/Betalningssystem
type: Concept
in scheme: JobTech Taxonomy - Färdighet
definition: Betalsystem/Betalningssystem
alternative label: Betalningssystem
alternative label: Betalsystem
broader: zmYu aAM TuF
related: Fp7x Yqt bx9
related: YKL2 FCB 1yr
related: s1Qk o98 2o1
related: xyW2 toA Skh
related: 4Jty HpK a3Q
related: WNVp RYe zLX

Vegetarisk matlagning, cirkelledning
type: Concept
in scheme: JobTech Taxonomy - Färdighet
definition: Vegetarisk matlagning, cirkelledning
broader: zmYu aAM TuF
related: 1CX5 mZw Vcq

Industridesign
type: Concept
in scheme: JobTech Taxonomy - Färdighet
definition: Industridesign
broader: zmYu aAM TuF
related: DqLe pH6 jyj

Fotsjukvård
type: Concept
in scheme: JobTech Taxonomy - Färdighet
definition: Fotsjukvård
broader: zmYu aAM TuF
related: HATH AfN RRz
related: vTgW pnr QMp

Symaskiner, reparationsvana
type: Concept
in scheme: JobTech Taxonomy - Färdighet
definition: Symaskiner, reparationsvana
broader: zmYu aAM TuF
related: yXbD NTH ijE
related: fWrt sLg koW

Tillverkningsindustri-Medusa
type: Concept
in scheme: JobTech Taxonomy - Färdighet
definition: Tillverkningsindustri-Medusa
broader: mTLu uo2 gq2
related: mis4 feV uex
related: xm5G vGn iyk
related: mp2Y vyC RFV
related: 3jEy yuT aVo
related: rwpH 6RA XTT
related: K8yg U4C gkY
related: PRQn 9yw NJA
related: 4Jty HpK a3Q

Kopparlegeringar, materialkunskap svets
type: Concept
in scheme: JobTech Taxonomy - Färdighet
definition: Kopparlegeringar, materialkunskap svets
broader: Materialkunskap
related: wQ1E Bzk ZyA

Järnvägslagstiftning
type: Concept
in scheme: JobTech Taxonomy - Färdighet
definition: Järnvägslagstiftning
broader: zmYu aAM TuF
related: thZP oR7 WrY
related: XeBP nMe pXx
related: nNxJ YWy vR2
related: 957L kZK rHZ

Materialplanering, hantverk
type: Concept
in scheme: JobTech Taxonomy - Färdighet
definition: Materialplanering, hantverk
broader: zmYu aAM TuF
related: nwSm phw sPo
related: J17g Q2a 2u1
related: UZBj yDX Ctp
related: mwVN oEH g9k
related: aKdV u7V R5j
related: v7W3 cLQ q2S
related: vJQk YvC XB7
related: 1Nwn GYH wkH
related: vhUJ LyD XWc
related: q8Ho 3Xw sHq

Konst
type: Concept
in scheme: JobTech Taxonomy - Färdighet
definition: Konst
broader: zmYu aAM TuF
related: rYSG 3WJ LmC

Sänkgnistning
type: Concept
in scheme: JobTech Taxonomy - Färdighet
definition: Sänkgnistning
broader: zmYu aAM TuF
related: vaEp iBS c5h

Forskningsadministration
type: Concept
in scheme: JobTech Taxonomy - Färdighet
definition: Forskningsadministration innebär att utföra administrativa arbetsuppgifter som stödjer forskning och forskningsprojekt. Detta innefattar bland annat att administrera forskningsansökningar, rapportering och kommunikation med forskare och andra intressenter samt doktorandelaterad administration.
broader: zmYu aAM TuF
related: oEmP NC1 sXE

Opinionsjournalistik
type: Concept
in scheme: JobTech Taxonomy - Färdighet
definition: Opinionsjournalistik
broader: zmYu aAM TuF
related: SgNH hag n9D

Kondenserade materiens fysik
type: Concept
in scheme: JobTech Taxonomy - Färdighet
definition: Kondenserade materiens fysik
broader: zmYu aAM TuF
related: KM7d Z6Y LCJ

U-landsfrågor, cirkelledning
type: Concept
in scheme: JobTech Taxonomy - Färdighet
definition: U-landsfrågor, cirkelledning
broader: zmYu aAM TuF
related: 1CX5 mZw Vcq

Raffinering av biomassa
type: Concept
in scheme: JobTech Taxonomy - Färdighet
definition: Raffinering av biomassa
broader: zmYu aAM TuF
related: yXbD NTH ijE
related: Cppd 9P7 HeR
related: QEBd qHu vGr

Mark/infrastruktur-Novapoint Virtual Map
type: Concept
in scheme: JobTech Taxonomy - Färdighet
definition: Mark/infrastruktur-Novapoint Virtual Map
alternative label: Mark
alternative label: infrastruktur-Novapoint Virtual Map
broader: mTLu uo2 gq2
related: 3jEy yuT aVo
related: rwpH 6RA XTT
related: GMDo DVo Yzh
related: thZP oR7 WrY
related: w6ud quG dgh
related: K8yg U4C gkY
related: ketV G9W GeR
related: XeBP nMe pXx
related: PRQn 9yw NJA
related: 4Jty HpK a3Q

Manus, TV
type: Concept
in scheme: JobTech Taxonomy - Färdighet
definition: Skriva manus för TV.
broader: zmYu aAM TuF
related: zfve s6G tpc

Psykomotorisk fysioterapi
type: Concept
in scheme: JobTech Taxonomy - Färdighet
definition: Psykomotorisk fysioterapi
broader: zmYu aAM TuF
related: s7vU FhY L5Z

Silver, formgivning
type: Concept
in scheme: JobTech Taxonomy - Färdighet
definition: Silver, formgivning
broader: zmYu aAM TuF
related: nwSm phw sPo

Marknadsanalys
type: Concept
in scheme: JobTech Taxonomy - Färdighet
definition: Marknadsanalys avser processen att samla in, bearbeta och analysera information om marknader för att göra prognoser om framtida trender och identifiera marknadsmöjligheter. Kompetensen innebär att tillhandahålla insikter och rekommendationer för att stödja strategiska beslut inom försäljning och marknadsföring.
broader: zmYu aAM TuF
related: Qo7p wjf gtv
related: Pz9M srJ Lc9
related: mZsb A1K Gec
related: WX67 Pfb WMN
related: eX3C MtJ nPA
related: 4Jty HpK a3Q

EASA-certifikat, kategori B1.4 (helikopter kolvmotor)
type: Concept
in scheme: JobTech Taxonomy - Färdighet
definition: EASA-certifikat, kategori B1.4 (helikopter kolvmotor)
broader: s48H Sft DTn
related: eRkT cTv H9v

Jonglering
type: Concept
in scheme: JobTech Taxonomy - Färdighet
definition: Jonglering
broader: zmYu aAM TuF
related: iBUL s38 izZ
related: xuSE mtB Mir

Arbetsledning vid flygplatsramp
type: Concept
in scheme: JobTech Taxonomy - Färdighet
definition: Arbetsledning vid flygplatsramp avser att leda och samordna operativ verksamhet på flygplatsers rampområde, inklusive lastning och lossning av bagage, positionering av flygplan, och säkerhetsrelaterade arbetsmoment. Innefattar personalplanering, kommunikation med flygplansbesättning samt efterlevnad av säkerhets- och tidsscheman.
broader: zmYu aAM TuF
related: 957L kZK rHZ

Viltbruksplaner
type: Concept
in scheme: JobTech Taxonomy - Färdighet
definition: Viltbruksplaner
broader: zmYu aAM TuF
related: yXbD NTH ijE
related: 3LdB WEJ 8Ms

Elbehörigheter
type: Concept
in scheme: JobTech Taxonomy - Färdighet
top concept of: JobTech Taxonomy - Färdighet
definition: Elbehörigheter
narrower: AL - Auktorisation lågspänning
narrower: A - Fullständig auktorisation
narrower: B - Begränsad auktorisation

Router, installation och underhåll
type: Concept
in scheme: JobTech Taxonomy - Färdighet
definition: Router, installation och underhåll
broader: Hårdvara
related: 1CX5 mZw Vcq
related: nDaB vdy eAy
related: VCpu 5EN bBt
related: fWrt sLg koW
related: 4Jty HpK a3Q
related: 13md uyV BNG

Fordonsskadebesiktning, privat
type: Concept
in scheme: JobTech Taxonomy - Färdighet
definition: Fordonsskadebesiktning, privat
broader: zmYu aAM TuF
related: Lzpv ofL 3H5
related: Ru4W zn2 LEz

Ordermottagning
type: Concept
in scheme: JobTech Taxonomy - Färdighet
definition: Ordermottagning avser processen för att ta emot och bearbeta kundorder, vilket inkluderar registrering av beställningar, kontroll av lagerstatus och samordning med leverantörer för att säkerställa att order snabbt och korrekt uppfylls. Kompetensen innebär också kommunikation med kunder och interna avdelningar för att hantera frågor och uppdateringar relaterade till beställningar.
broader: zmYu aAM TuF
related: oXSW fbY XrY
related: 8A1f sxQ adT
related: WhBn FAp ZNW
related: iWcY mko rq2
related: kLyY rwr aJr
related: dUuh wwa FGj
related: AuTi FEo j3R

LDAP, frågespråk
type: Concept
in scheme: JobTech Taxonomy - Färdighet
definition: LDAP, frågespråk
broader: Datorspråk
related: D9SL mtn vGM
related: DJh5 yyF hEM
related: UxT1 tPF Kbg
related: 4Jty HpK a3Q
related: UXKZ 3zZ ipB

Hissmontering
type: Concept
in scheme: JobTech Taxonomy - Färdighet
definition: Hissmontering
broader: zmYu aAM TuF
related: a75S eLg JWH

Film/effekter-Autodesk Combustion
type: Concept
in scheme: JobTech Taxonomy - Färdighet
definition: Film/effekter-Autodesk Combustion
alternative label: Film-Autodesk Combustion
alternative label: effekter-Autodesk Combustion
broader: Programvara för digitalt skapande
related: 8Bmh vtM zts
related: 4BsK q2C sCL
related: CkRH 4Qn iX3
related: 3J38 DNz YKK
related: PH2M uV4 r72
related: 4Jty HpK a3Q

Bohuslänska
type: Concept
in scheme: JobTech Taxonomy - Färdighet
definition: Bohuslänska
broader: Dialekt
related: iBUL s38 izZ

Glastak, monteringsvana
type: Concept
in scheme: JobTech Taxonomy - Färdighet
definition: Glastak, monteringsvana
broader: zmYu aAM TuF
related: J17g Q2a 2u1

Redovisning/2, redovisningssystem
type: Concept
in scheme: JobTech Taxonomy - Färdighet
definition: Redovisning/2, redovisningssystem
alternative label: Redovisning/2
broader: xSJR 1Kq pxB
related: eQ4M CNm ozj
related: Y6yY SuR hVh
related: Uw4n UB2 RCW
related: iWcY mko rq2
related: q81z 3oD 1qu
related: cRmd 536 pT1
related: ij8k EwC zyB
related: 4Jty HpK a3Q

Mönsterkonstruktion-Lectra Modaris
type: Concept
in scheme: JobTech Taxonomy - Färdighet
definition: Mönsterkonstruktion-Lectra Modaris
broader: mTLu uo2 gq2
related: mwVN oEH g9k
related: 4Jty HpK a3Q

Rostskyddsmålning
type: Concept
in scheme: JobTech Taxonomy - Färdighet
definition: Rostskyddsmålning avser processen att applicera skyddande beläggningar på metallytor för att förhindra rost och korrosion. Kompetensen omfattar kunskap om olika typer av färger och metoder samt korrekt förberedelse och appliceringsteknik för att säkerställa ytans hållbarhet och livslängd.
broader: zmYu aAM TuF
related: dKUb KBP mw3
related: QKvX v7r PNL

Odontologisk radiologi/Tandröntgen, specialistkompetens för tandläkare
type: Concept
in scheme: JobTech Taxonomy - Färdighet
definition: Odontologisk radiologi/Tandröntgen, specialistkompetens för tandläkare
alternative label: Odontologisk radiologi
alternative label: Tandröntgen
broader: Specialistkompetens för tandläkare
related: HPxT fQJ zwT

Gesällbrev, handvävare
type: Concept
in scheme: JobTech Taxonomy - Färdighet
definition: Gesällbrev, handvävare
broader: Yrkesbevis/examen
related: aKdV u7V R5j

Amadeus, resebokningssystem
type: Concept
in scheme: JobTech Taxonomy - Färdighet
definition: Amadeus, resebokningssystem, avser en programvara som används för att hantera och boka resor inom resebranschen.
alternative label: Amadeus
alternative label: Amadeuskompetens
alternative label: Amadeuskunskap
broader: kRoQ fPR 8oK
related: fdLf oPp wVw
related: 4Jty HpK a3Q

Insjöfiske
type: Concept
in scheme: JobTech Taxonomy - Färdighet
definition: Insjöfiske
broader: zmYu aAM TuF
related: XurM DVs ggn
related: Lm3Z gek GYc

Fartygsbevakning
type: Concept
in scheme: JobTech Taxonomy - Färdighet
definition: Fartygsbevakning
broader: zmYu aAM TuF
related: iqZh 3yX i8n

Kinesiskt kök
type: Concept
in scheme: JobTech Taxonomy - Färdighet
definition: Kinesiskt kök
broader: zmYu aAM TuF
related: BStc SJh DKG

Hydrokemi
type: Concept
in scheme: JobTech Taxonomy - Färdighet
definition: Hydrokemi
broader: zmYu aAM TuF
related: V7Yz 4WV g4z

Kandidatexamen i mimskådespeleri
type: Concept
in scheme: JobTech Taxonomy - Färdighet
definition: Kandidatexamen i mimskådespeleri
broader: Yrkesbevis/examen
related: iBUL s38 izZ

Arkivpedagogik
type: Concept
in scheme: JobTech Taxonomy - Färdighet
definition: Arkivpedagogik är ett område inom arkivverksamheten där man på ett metodiskt sätt arbetar med att möjliggöra lärande om och genom arkiv. På ett aktivt sätt kommuniceras arkivens syfte, funktion och innehåll. Genom t ex visningar, föreläsningar, kurser, workshops, och diskussionsforum inspireras besökaren att använda arkivmaterial. Arkivpedagogen utgår från målgruppen och knyter genom pedagogiska urval samman olika informationskällor för att tydliggöra sambandet mellan dåtid, nutid och framtid.
broader: zmYu aAM TuF
related: wVfo Njx 1rB

Vyper, programmeringsspråk
type: Concept
in scheme: JobTech Taxonomy - Färdighet
definition: Vyper, programmeringsspråk
broader: Datorspråk
related: D9SL mtn vGM
related: DJh5 yyF hEM
related: UxT1 tPF Kbg
related: 4Jty HpK a3Q
related: UXKZ 3zZ ipB

Tunnelkonstruktioner
type: Concept
in scheme: JobTech Taxonomy - Färdighet
definition: Tunnelkonstruktioner
broader: zmYu aAM TuF
related: thZP oR7 WrY
related: w6ud quG dgh
related: XeBP nMe pXx

Concorde, redovisningssystem
type: Concept
in scheme: JobTech Taxonomy - Färdighet
definition: Concorde, redovisningssystem
alternative label: Concorde
broader: xSJR 1Kq pxB
related: eQ4M CNm ozj
related: Y6yY SuR hVh
related: Uw4n UB2 RCW
related: iWcY mko rq2
related: q81z 3oD 1qu
related: cRmd 536 pT1
related: ij8k EwC zyB
related: 4Jty HpK a3Q

Bärplockning
type: Concept
in scheme: JobTech Taxonomy - Färdighet
definition: Bärplockning avser processen att samla in bär från buskar och växter. Kompetensen innefattar att kunna identifiera mogna bär, använda lämplig teknik för plockning och säkerställa att bären hanteras på ett sätt som bevarar deras kvalitet.
broader: zmYu aAM TuF
related: 1EBv UzM ozQ

Triggerpunktsbehandling
type: Concept
in scheme: JobTech Taxonomy - Färdighet
definition: Triggerpunktsbehandling
broader: zmYu aAM TuF
related: uxHV KXc PKD

RTL-kompetens, audio
type: Concept
in scheme: JobTech Taxonomy - Färdighet
definition: RTL-kompetens, audio
broader: Yrkesbevis/examen
related: fWrt sLg koW

Skatterätt
type: Concept
in scheme: JobTech Taxonomy - Färdighet
definition: Skatterätt avser den del av juridiken som reglerar skattesystemet och tillämpningen av skatterelaterade lagar och förordningar. Kompetensen inbegriper kunskap om beskattning, skatteplanering och förståelse för hur olika skattebestämmelser påverkar individer och företag.
broader: zmYu aAM TuF
related: q8wL kdi WaW
related: 4W6S 1kA nrv
related: br6a VVS V3y
related: 6aak 8eh iwT
related: DZVN v5g Fco
related: JfYV ZGg 6rm

Evenemangssäkerhet
type: Concept
in scheme: JobTech Taxonomy - Färdighet
definition: Evenemangssäkerhet avser planering och genomförande av åtgärder för att skydda deltagare och arrangörer under olika typer av evenemang. Kompetensen innefattar kunskaper om riskbedömning, säkerhetspolicys och evakueringsplaner.
broader: zmYu aAM TuF
related: ieVp d5L rS9

Lindans
type: Concept
in scheme: JobTech Taxonomy - Färdighet
definition: Lindans
broader: zmYu aAM TuF
related: xuSE mtB Mir

Verktygsbyten, industrirobot
type: Concept
in scheme: JobTech Taxonomy - Färdighet
definition: Verktygsbyten, industrirobot
broader: zmYu aAM TuF
related: 7Zqy hSM Fig
related: 4Jty HpK a3Q

SSG Entre
type: Concept
in scheme: JobTech Taxonomy - Färdighet
definition: SSG Entre
broader: s48H Sft DTn
related: Lzpv ofL 3H5
related: m8TS hdk pSf
related: LEvM 7Hs w8i
related: V79C DD2 3Gj
related: QKvX v7r PNL
related: e6nk AGp y28
related: wQ1E Bzk ZyA
related: ketV G9W GeR
related: o31g CX1 qhQ
related: 7Zqy hSM Fig
related: E87t egE pjA
related: TrwQ RXT W8a
related: fWrt sLg koW
related: KttZ Skc bMR
related: 3UzE P8A 9sS
related: a75S eLg JWH
related: UcNa inr snV
related: q8Ho 3Xw sHq
related: L4hA SJP SFi
related: yyF7 jsW EeP

Fiskbiologi
type: Concept
in scheme: JobTech Taxonomy - Färdighet
definition: Fiskbiologi
broader: zmYu aAM TuF
related: e9FK VKh ahW

Smärgling
type: Concept
in scheme: JobTech Taxonomy - Färdighet
definition: Smärgling
broader: zmYu aAM TuF
related: 4bxV 58E P9N

Mästarbrev, golvläggaryrket
type: Concept
in scheme: JobTech Taxonomy - Färdighet
definition: Mästarbrev, golvläggaryrket
broader: Yrkesbevis/examen
related: V79C DD2 3Gj

Transkulturell psykologi
type: Concept
in scheme: JobTech Taxonomy - Färdighet
definition: Transkulturell psykologi
broader: zmYu aAM TuF
related: VYeq GDF a2g

Korkvaruarbete
type: Concept
in scheme: JobTech Taxonomy - Färdighet
definition: Korkvaruarbete
broader: zmYu aAM TuF
related: DxiF hTo b3X

Fjäderfäskötsel
type: Concept
in scheme: JobTech Taxonomy - Färdighet
definition: Fjäderfäskötsel
broader: zmYu aAM TuF
related: KYmy iqC xiQ

Porträttmålning
type: Concept
in scheme: JobTech Taxonomy - Färdighet
definition: Porträttmålning
broader: zmYu aAM TuF
related: 34Tn BQQ tfo

Dekorsnickeri
type: Concept
in scheme: JobTech Taxonomy - Färdighet
definition: Dekorsnickeri avser konsten att skapa detaljer och dekorationer i trä för att förbättra estetik och funktionalitet i olika miljöer. Denna kompetens innefattar kunskap om snickeritekniker, material och designprinciper för att producera skräddarsydda lösningar för inredning och scenografi.
broader: zmYu aAM TuF
related: 1Nwn GYH wkH
related: CSUf ZVM a7Z

Stadsbrevbäring
type: Concept
in scheme: JobTech Taxonomy - Färdighet
definition: Stadsbrevbäring avser den kompetens och arbete som innefattar distribution av post inom stadsområden. Arbetet inkluderar förberedelse av distribution samt utdelning av brev och andra försändelser till hushåll och företag.
broader: zmYu aAM TuF
related: gaBh 1vR tNE

Vegetationsbyggnad
type: Concept
in scheme: JobTech Taxonomy - Färdighet
definition: Vegetationsbyggnad
broader: zmYu aAM TuF
related: XBh3 Xrm C4R
related: XurM DVs ggn
related: yXbD NTH ijE

Jordbruksturism
type: Concept
in scheme: JobTech Taxonomy - Färdighet
definition: Jordbruksturism
broader: zmYu aAM TuF
related: fdLf oPp wVw
related: A6X3 efC VNy
related: yXbD NTH ijE
related: RYCQ ogb uUY

Pälsrengöring
type: Concept
in scheme: JobTech Taxonomy - Färdighet
definition: Pälsrengöring
broader: zmYu aAM TuF
related: mwVN oEH g9k

Persontrafik
type: Concept
in scheme: JobTech Taxonomy - Färdighet
definition: Persontrafik
broader: zmYu aAM TuF
related: nNxJ YWy vR2

Certifierad Besiktningstekniker
type: Concept
in scheme: JobTech Taxonomy - Färdighet
definition: Certifierad Besiktningstekniker avser kunskaper inom teknik, fordon, förvaltningsrätt och regelverk samt kunskaper och färdighet i fordonsbesiktning. Certifieringen utförs av ackrediterat certifieringsorgan. Källa: Transportstyrelsen
broader: s48H Sft DTn
related: nuXg Wjc JPd
related: 4P8B LtK JgE

MS-700: Managing Microsoft Teams
type: Concept
in scheme: JobTech Taxonomy - Färdighet
definition: MS-700: Managing Microsoft Teams
broader: s48H Sft DTn
related: cBBa ngH fCx
related: VCpu 5EN bBt
related: 4Jty HpK a3Q
related: MYAz x9m 2LJ

Avsyning, gjutgods
type: Concept
in scheme: JobTech Taxonomy - Färdighet
definition: Avsyning, gjutgods
broader: zmYu aAM TuF
related: 4bxV 58E P9N

Processmetallurgi
type: Concept
in scheme: JobTech Taxonomy - Färdighet
definition: Processmetallurgi
broader: zmYu aAM TuF
related: 3jEy yuT aVo
related: rwpH 6RA XTT

OS/390, operativsystem
type: Concept
in scheme: JobTech Taxonomy - Färdighet
definition: OS/390, operativsystem
alternative label: OS/390
broader: xAWr WYq JPP
related: BAeH eg8 T2d
related: cBBa ngH fCx
related: D9SL mtn vGM
related: VCpu 5EN bBt
related: DJh5 yyF hEM
related: 4Jty HpK a3Q
related: 13md uyV BNG
related: UXKZ 3zZ ipB
related: MYAz x9m 2LJ

Ansvarsfull alkoholservering, utbildning
type: Concept
in scheme: JobTech Taxonomy - Färdighet
definition: Ansvarsfull alkoholservering, utbildning, refererar till kompetens inom säkert och etiskt framställande av alkohol i samband med servering. Denna utbildning syftar till att säkerställa att personal inom restaurang- och hotellbranschen har kunskap om lagar och riktlinjer gällande alkoholservering samt om hur man hanterar situationer och gäster på ett ansvarsfullt sätt.
broader: s48H Sft DTn
related: XFXX Jq9 Y2a
related: UjoW meY Zwt

Yrkeshögskoleutbildning, marintekniker
type: Concept
in scheme: JobTech Taxonomy - Färdighet
definition: Yrkeshögskoleutbildning, marintekniker är en yrkeshögskoleutbildning med inriktning till marintekniker.
broader: Yrkesutbildning
related: Lzpv ofL 3H5

Film/effekter-Autodesk Cleaner
type: Concept
in scheme: JobTech Taxonomy - Färdighet
definition: Film/effekter-Autodesk Cleaner
alternative label: Film-Autodesk Cleaner
alternative label: effekter-Autodesk Cleaner
broader: Programvara för digitalt skapande
related: 8Bmh vtM zts
related: 4BsK q2C sCL
related: CkRH 4Qn iX3
related: 3J38 DNz YKK
related: PH2M uV4 r72
related: 4Jty HpK a3Q

Litium, CMS
type: Concept
in scheme: JobTech Taxonomy - Färdighet
definition: Litium Studio, CMS/innehållshanteringssystem
alternative label: Litium, innehållshanteringssystem
broader: jTAz uCP RNc
related: BAeH eg8 T2d
related: cBBa ngH fCx
related: Fv7d YhP YmS
related: vPP6 rsw dck
related: oEmP NC1 sXE
related: 4Jty HpK a3Q
related: MYAz x9m 2LJ

PCB-sanering
type: Concept
in scheme: JobTech Taxonomy - Färdighet
definition: PCB-sanering
broader: zmYu aAM TuF
related: idjo 2Wr a3E
related: yXbD NTH ijE
related: NnB3 eWH auo

Hälso- och sjukvård, undervisning högskolenivå
type: Concept
in scheme: JobTech Taxonomy - Färdighet
definition: Hälso- och sjukvård, undervisning högskolenivå
broader: Inriktning på högskolelärarkompetens
related: Gm5j S2Y aTB
related: NNK9 F1o pK5
related: cYCo PxY zQd
related: dsK3 hkt zGy
related: RPBE x5M cXX
related: P7eS nP8 3dy

Folkhälsofrågor
type: Concept
in scheme: JobTech Taxonomy - Färdighet
definition: Folkhälsofrågor avser kunskap och förståelse för faktorer som påverkar befolkningens hälsa och välbefinnande, inklusive sjukdomsförebyggande arbeten och hälsosamma livsmiljöer. Kompetensen innefattar analys av epidemiologiska data, utveckling av hälsofrämjande strategier och samarbete med olika aktörer inom offentlig och privat sektor för att främja befolkningens hälsa.
broader: zmYu aAM TuF
related: vPP6 rsw dck

Naturbruksinriktning, undervisning
type: Concept
in scheme: JobTech Taxonomy - Färdighet
definition: Naturbruksinriktning, undervisning
broader: Inriktning på lärarkompetens
related: 2x2V UeL 6ke

Bruksföremål, design
type: Concept
in scheme: JobTech Taxonomy - Färdighet
definition: Bruksföremål, design
broader: zmYu aAM TuF
related: DqLe pH6 jyj
related: PF4H kQD zpL

Terminer
type: Concept
in scheme: JobTech Taxonomy - Färdighet
definition: Terminer
broader: zmYu aAM TuF
related: aQpg E2T cWq

Microsoft Axapta, affärssystem
type: Concept
in scheme: JobTech Taxonomy - Färdighet
definition: Microsoft Axapta, affärssystem
alternative label: Affärssystemet axapta
alternative label: Microsoft Axapta
alternative label: Microsoft axapta
broader: xSJR 1Kq pxB
related: eQ4M CNm ozj
related: iWcY mko rq2
related: q81z 3oD 1qu
related: ij8k EwC zyB
related: 4Jty HpK a3Q

Docker, container-plattform
type: Concept
in scheme: JobTech Taxonomy - Färdighet
definition: Docker, container-plattform
alternative label: Docker
broader: Applikationsplattformar
related: D9SL mtn vGM
related: DJh5 yyF hEM
related: UxT1 tPF Kbg
related: 4Jty HpK a3Q
related: UXKZ 3zZ ipB

Cirkusmusik
type: Concept
in scheme: JobTech Taxonomy - Färdighet
definition: Cirkusmusik
broader: p1WM wCw LTd
related: AWJF wqZ va9

Socialpedagogik
type: Concept
in scheme: JobTech Taxonomy - Färdighet
definition: Socialpedagogik avser det teoretiska och praktiska arbetet som syftar till att stödja individer i deras sociala utveckling och livssituation, framför allt genom särskilda metoder och insatser i relation till deras behov och omgivning. Kompetensen omfattar både kunskaper om sociala strukturer och förmågan att tillämpa dessa i arbetet med människor som behöver stöd.
broader: zmYu aAM TuF
related: BWwk fYX S5B
related: dJXy Rpq a2u
related: n6iX f2z XfE
related: pok1 ipJ yzD

A-truckar
type: Concept
in scheme: JobTech Taxonomy - Färdighet
definition: A-truckar avser en typ av motordrivna fordon som används för att transportera och hantera gods inom lager och terminaler. Kompetensen omfattar kunskap om säker och effektiv användning av A-truckar, inklusive lastning, lossning och stapling av varor.
broader: zmYu aAM TuF
related: WhBn FAp ZNW
related: kLyY rwr aJr
related: 3MBw pDA P2F
related: MrcX RDn N53

Swappar
type: Concept
in scheme: JobTech Taxonomy - Färdighet
definition: Swappar
broader: zmYu aAM TuF
related: aQpg E2T cWq

Elmotorteknik
type: Concept
in scheme: JobTech Taxonomy - Färdighet
definition: Elmotorteknik
broader: zmYu aAM TuF
related: nDaB vdy eAy
related: yXbD NTH ijE
related: SPYW 7Z1 ShT

Intensivvård, medicintekniskt område ingenjör
type: Concept
in scheme: JobTech Taxonomy - Färdighet
definition: Intensivvård, medicintekniskt område ingenjör
broader: zmYu aAM TuF
related: GC7L Yw7 Mfo

Psykodynamisk psykoterapi
type: Concept
in scheme: JobTech Taxonomy - Färdighet
definition: Psykodynamisk psykoterapi
broader: zmYu aAM TuF
related: UUQi UJ5 MSb
related: VYeq GDF a2g

Svenska, undervisning gymnasienivå
type: Concept
in scheme: JobTech Taxonomy - Färdighet
definition: Svenska, undervisning gymnasienivå
broader: Inriktning på lärarkompetens
related: 4KhP FxL uZ5

Asfaltisolering
type: Concept
in scheme: JobTech Taxonomy - Färdighet
definition: Asfaltisolering
broader: zmYu aAM TuF
related: bZ4J riZ zK6

Varuautomater, produktkunskap
type: Concept
in scheme: JobTech Taxonomy - Färdighet
definition: Varuautomater, produktkunskap
broader: zmYu aAM TuF
related: oXSW fbY XrY

Tcl/Tk, programmeringsspråk
type: Concept
in scheme: JobTech Taxonomy - Färdighet
definition: Tcl/Tk, programmeringsspråk
alternative label: Tcl/Tk
broader: Datorspråk
related: BAeH eg8 T2d
related: Fv7d YhP YmS
related: D9SL mtn vGM
related: DJh5 yyF hEM
related: 4Jty HpK a3Q

Nyhetstextning
type: Concept
in scheme: JobTech Taxonomy - Färdighet
definition: Nyhetstextning
broader: zmYu aAM TuF
related: PQDm Z63 zst
related: 4Jty HpK a3Q

Sjukhem/Särskilt boende
type: Concept
in scheme: JobTech Taxonomy - Färdighet
definition: Sjukhem/Särskilt boende
alternative label: Sjukhem
alternative label: Särskilt boende
broader: zmYu aAM TuF
related: 6eAB cbY i9T
related: jY19 knH MJp
related: tAJS JNb hDH

Kakel och klinker, plattsättningsvana
type: Concept
in scheme: JobTech Taxonomy - Färdighet
definition: Kakel och klinker, plattsättningsvana
broader: zmYu aAM TuF
related: V79C DD2 3Gj
related: 9mJN VwW Xjg
related: NnB3 eWH auo

Fräsning, konventionell maskin
type: Concept
in scheme: JobTech Taxonomy - Färdighet
definition: Fräsning, konventionell maskin
broader: zmYu aAM TuF
related: VKKg e4t t46
related: vaEp iBS c5h
related: yPQ4 EaN Dtj
related: o31g CX1 qhQ

Stickning
type: Concept
in scheme: JobTech Taxonomy - Färdighet
definition: Stickning
broader: zmYu aAM TuF
related: aKdV u7V R5j

Enkätundersökning
type: Concept
in scheme: JobTech Taxonomy - Färdighet
definition: Enkätundersökning
broader: zmYu aAM TuF
related: jv1x tpK 32p
related: WX67 Pfb WMN

Gipsteknisk utbildning
type: Concept
in scheme: JobTech Taxonomy - Färdighet
definition: Gipsteknisk utbildning är en eftergymnasial vidareutbildning med inriktning mot gipsteknik inom hälso- och sjukvård.
broader: Yrkesbevis/examen
related: LP4Z ABV gRm
related: GiNX ESA AL1

Bygginriktning-måleri, undervisning
type: Concept
in scheme: JobTech Taxonomy - Färdighet
definition: Bygginriktning-måleri, undervisning
broader: Inriktning på lärarkompetens
related: 2x2V UeL 6ke

Lagerinventering
type: Concept
in scheme: JobTech Taxonomy - Färdighet
definition: Lagerinventering är en process för att systematiskt registrera och kontrollera mängden och tillståndet av varor som finns i ett lager. Kompetensen omfattar tekniker och metoder för att säkerställa korrekthet i lagersaldon och hantering av materialflöden.
broader: zmYu aAM TuF
related: kLyY rwr aJr

Våtblästring
type: Concept
in scheme: JobTech Taxonomy - Färdighet
definition: Våtblästring
broader: zmYu aAM TuF
related: idjo 2Wr a3E

Visor
type: Concept
in scheme: JobTech Taxonomy - Färdighet
definition: Visor
broader: p1WM wCw LTd
related: AWJF wqZ va9

Borrning, konventionell maskin
type: Concept
in scheme: JobTech Taxonomy - Färdighet
definition: Borrning, konventionell maskin
broader: zmYu aAM TuF
related: VKKg e4t t46
related: vaEp iBS c5h
related: o31g CX1 qhQ

Telefonväxelvana
type: Concept
in scheme: JobTech Taxonomy - Färdighet
definition: Telefonväxelvana avser kompetensen att effektivt hantera och förmedla telefonsamtal inom en organisation eller företag. Detta inkluderar även förmågan att ge information, ta emot meddelanden samt använda och administrera växelsystem.
broader: zmYu aAM TuF
related: eQ4M CNm ozj
related: 4aPu 2nd 8X6
related: bYde Frc xcB
related: PxXc 16t oZo
related: kZwz D8K bKs
related: ByrL ANp UwV
related: zKvJ GnC Szx
related: 4Jty HpK a3Q
related: p16X 44f rwZ
related: iqZh 3yX i8n

Pedagogiskt utvecklingsarbete
type: Concept
in scheme: JobTech Taxonomy - Färdighet
definition: Pedagogiskt utvecklingsarbete
broader: zmYu aAM TuF
related: 3FP7 4Eg x8P

Cocktails/Drinkar
type: Concept
in scheme: JobTech Taxonomy - Färdighet
definition: Cocktails/Drinkar avser kunskap och färdigheter relaterade till tillverkning och servering av olika typer av cocktails och drinkar. Kompetensen omfattar receptkunskap, teknik för blandning, samt förståelse för ingredienser och presentation för att skapa meningsfulla och tilltalande drycker.
alternative label: Cocktails
alternative label: Drinkar
broader: zmYu aAM TuF
related: XFXX Jq9 Y2a
related: DSGC nw7 WnH
related: UjoW meY Zwt

Arbetsmiljö, journalistik
type: Concept
in scheme: JobTech Taxonomy - Färdighet
definition: Arbetsmiljö, journalistik
broader: zmYu aAM TuF
related: SgNH hag n9D

Bussar, produktkunskap
type: Concept
in scheme: JobTech Taxonomy - Färdighet
definition: Bussar, produktkunskap
broader: zmYu aAM TuF
related: YKL2 FCB 1yr

Installatörsbehörighet
type: Concept
in scheme: JobTech Taxonomy - Färdighet
definition: Installatörsbehörighet
broader: Yrkesbevis/examen
related: nDaB vdy eAy

VM/CMS, operativsystem
type: Concept
in scheme: JobTech Taxonomy - Färdighet
definition: VM/CMS, operativsystem
alternative label: VM/CMS
broader: xAWr WYq JPP
related: BAeH eg8 T2d
related: cBBa ngH fCx
related: D9SL mtn vGM
related: VCpu 5EN bBt
related: DJh5 yyF hEM
related: 4Jty HpK a3Q
related: 13md uyV BNG
related: UXKZ 3zZ ipB
related: MYAz x9m 2LJ

Revenue Management/Yield management
type: Concept
in scheme: JobTech Taxonomy - Färdighet
definition: Revenue Management/Yield management
alternative label: Revenue Management
alternative label: Yield management
broader: zmYu aAM TuF
related: NQTS fou E6u
related: Pz9M srJ Lc9
related: eX3C MtJ nPA
related: 957L kZK rHZ

Webbredigering
type: Concept
in scheme: JobTech Taxonomy - Färdighet
definition: Webbredigering
broader: zmYu aAM TuF
related: Fv7d YhP YmS
related: SgNH hag n9D
related: rYSG 3WJ LmC
related: 4Jty HpK a3Q

Personalansvar
type: Concept
in scheme: JobTech Taxonomy - Färdighet
definition: Personalansvar avser åtagande att leda och övervaka personal inom en organisation, vilket inkluderar rekrytering, utbildning, utveckling och uppföljning av medarbetare. Kompetensen omfattar även ansvar för att säkerställa en trygg och effektiv arbetsmiljö samt att hantera personalfrågor enligt gällande lagar och avtalsvillkor.
broader: zmYu aAM TuF
related: x9mo 1VH Rps
related: mis4 feV uex
related: v9nU 6Fw 4Qg
related: XBh3 Xrm C4R
related: womV SEj CAH
related: NQTS fou E6u
related: Fu4x 7KG YgC
related: mNoS AN5 drn
related: XFXX Jq9 Y2a
related: BStc SJh DKG
related: 3jEy yuT aVo
related: 8SPu K1k 5qR
related: pf1K PTz frm
related: ajwx FvL YuY
related: bYde Frc xcB
related: coyZ Cyv Srw
related: QG4f MCh vND
related: NxXz fBh w7j
related: qouP wtb 93q
related: w6ud quG dgh
related: K8yg U4C gkY
related: 7mn2 kA9 ftp
related: Pz9M srJ Lc9
related: nDaB vdy eAy
related: Fp7x Yqt bx9
related: 33Nt DSs YYA
related: z8di AqX GBr
related: g6eC Fwu B3J
related: ddGt fEH 432
related: PHJN fva yxs
related: H2Zj eL9 x28
related: eWiB mGP MjE
related: nuXg Wjc JPd
related: mZsb A1K Gec
related: U8HK Jdi GuC
related: 7XXd 4St nit
related: UjoW meY Zwt
related: eX3C MtJ nPA
related: 4GAs rKs 2Ne
related: wby2 mwq fWV
related: 2xQ4 4kh kTZ
related: nrVt xUL KdQ
related: uxst tkg zDh
related: dMVD VYy kgg
related: X1Ac Y9P PJo
related: FfMN Bw1 qYR
related: hZLv S5f jo2
related: mpuA s56 Hsy
related: 3i4a Ufc qpp
related: sWzF 6pd Y6L
related: 9QMD sZ3 ZjX
related: nNxJ YWy vR2
related: 1uau t1u rDL
related: dyWo sDb MLQ
related: XGyi i4B ME7
related: h324 DPT 7Tw
related: 9Mn4 PNA 7Yz
related: 957L kZK rHZ
related: FtyZ Joo tB8

Plattsättning
type: Concept
in scheme: JobTech Taxonomy - Färdighet
definition: Plattsättning
broader: zmYu aAM TuF
related: NnB3 eWH auo

Virkeskunskap
type: Concept
in scheme: JobTech Taxonomy - Färdighet
definition: Virkeskunskap
broader: zmYu aAM TuF
related: UdrS qzV P7i
related: 3LdB WEJ 8Ms

UMTS-system
type: Concept
in scheme: JobTech Taxonomy - Färdighet
definition: UMTS-system
broader: Mobiltelefonsystem
related: nDaB vdy eAy
related: SPYW 7Z1 ShT
related: 4Jty HpK a3Q

Kvalitetssäkring
type: Concept
in scheme: JobTech Taxonomy - Färdighet
definition: Kvalitetssäkring
broader: zmYu aAM TuF
related: mis4 feV uex
related: xm5G vGn iyk
related: cBBa ngH fCx
related: v9nU 6Fw 4Qg
related: wNrt Ysj WuT
related: Qo7p wjf gtv
related: qn2U dB9 Cmh
related: mp2Y vyC RFV
related: K8yg U4C gkY
related: nDaB vdy eAy
related: 33Nt DSs YYA
related: TMsM oNw j6z
related: SPYW 7Z1 ShT
related: 1tGC fXC mxX
related: dMVD VYy kgg
related: PRQn 9yw NJA
related: XjcN 5LT bWx
related: MYAz x9m 2LJ

3D-grafik-Maxon Cinema 4D
type: Concept
in scheme: JobTech Taxonomy - Färdighet
definition: 3D-grafik-Maxon Cinema 4D
broader: Programvara för digitalt skapande
related: 8Bmh vtM zts
related: 34Tn BQQ tfo
related: Q5DF juj 8do
related: 4Jty HpK a3Q
related: LeQV umf wUS
related: Mbt6 3ko DiD

Homesite, HTML-editor
type: Concept
in scheme: JobTech Taxonomy - Färdighet
definition: Homesite, HTML-editor
alternative label: Homesite
broader: Programmerings- och systemutvecklingsverktyg
related: 8Bmh vtM zts
related: D9SL mtn vGM
related: 4Jty HpK a3Q
related: Mbt6 3ko DiD
related: MYAz x9m 2LJ

Godot, spelmotor
type: Concept
in scheme: JobTech Taxonomy - Färdighet
definition: Godot, spelmotor
broader: Spelmotorer
related: Q5DF juj 8do
related: Mbt6 3ko DiD

Skånska
type: Concept
in scheme: JobTech Taxonomy - Färdighet
definition: Skånska
broader: Dialekt
related: iBUL s38 izZ

Jiggborrning
type: Concept
in scheme: JobTech Taxonomy - Färdighet
definition: Jiggborrning
broader: zmYu aAM TuF
related: vaEp iBS c5h

Microsoft Certified System Engineer + Internet/MCSE + I
type: Concept
in scheme: JobTech Taxonomy - Färdighet
definition: Microsoft Certified System Engineer + Internet/MCSE + I
broader: s48H Sft DTn
related: 1CX5 mZw Vcq
related: VCpu 5EN bBt
related: 13md uyV BNG

Industristädning
type: Concept
in scheme: JobTech Taxonomy - Färdighet
definition: Industristädning avser åtgärder och rutiner för rengöring och underhåll av industrianläggningar och produktionsmiljöer. Kompetensen omfattar kunskap om lämpliga städmetoder och hygienstandarder för att säkerställa en säker och effektiv arbetsmiljö.
broader: zmYu aAM TuF
related: Z6TY xDf Yup

Vegetabilgarvning
type: Concept
in scheme: JobTech Taxonomy - Färdighet
definition: Vegetabilgarvning avser processen att garva hudar med hjälp av vegetabiliska ämnen, vilket resulterar i läderprodukter med speciella egenskaper och hållbarhet. Kompetensen innefattar kunskap om olika växtbaserade garvningsmetoder och deras påverkan på lädrets kvalitet och användningsområden.
broader: zmYu aAM TuF
related: yXbD NTH ijE
related: skLS kpa Ui1
related: vJQk YvC XB7

Maskinskötsel, grafisk industri/Maskinskötsel, pappervaruindustri
type: Concept
in scheme: JobTech Taxonomy - Färdighet
definition: Maskinskötsel, grafisk industri/Maskinskötsel, pappervaruindustri avser kompetens att sköta, ställa in och övervaka maskiner inom grafisk produktion och tillverkning av pappersprodukter. Denna kompetens omfattar även anpassning av utrustning samt övervakning av produktionsprocesser för att säkerställa kvalitet och effektivitet i produktionen.
alternative label: Maskinskötsel, grafisk industri
alternative label: Maskinskötsel, pappervaruindustri
broader: zmYu aAM TuF
related: XeJB bkn mRn
related: iZLB KpD LLo
related: 4Jty HpK a3Q

Vägledande arbetssätt
type: Concept
in scheme: JobTech Taxonomy - Färdighet
definition: Vägledande arbetssätt
broader: zmYu aAM TuF
related: BWwk fYX S5B

Balsamering
type: Concept
in scheme: JobTech Taxonomy - Färdighet
definition: Balsamering
broader: zmYu aAM TuF
related: R8bW rsJ b2G

Sjöfartsskydd
type: Concept
in scheme: JobTech Taxonomy - Färdighet
definition: Sjöfartsskydd
broader: s48H Sft DTn
related: BStc SJh DKG
related: Rsoy sS6 6c4
related: kZwz D8K bKs
related: CbQK 7th Tyf
related: Z6TY xDf Yup
related: UjoW meY Zwt
related: tPox ie4 X9X
related: KttZ Skc bMR
related: kDnq Q98 sD3
related: a75S eLg JWH
related: XGyi i4B ME7
related: h324 DPT 7Tw

Microsoft Certified System Engineer/MCSE
type: Concept
in scheme: JobTech Taxonomy - Färdighet
definition: Microsoft Certified System Engineer/MCSE
alternative label: MCSE
alternative label: Microsoft Certified System Engineer
broader: s48H Sft DTn
related: BAeH eg8 T2d
related: 1CX5 mZw Vcq
related: VCpu 5EN bBt
related: 13md uyV BNG
related: UXKZ 3zZ ipB

Operativ ledning
type: Concept
in scheme: JobTech Taxonomy - Färdighet
definition: Operativ ledning
broader: zmYu aAM TuF
related: rNcE Zno pD8

Datortomografi/DT
type: Concept
in scheme: JobTech Taxonomy - Färdighet
definition: Datortomografi/DT
alternative label: DT
alternative label: Datortomografi
broader: zmYu aAM TuF
related: 1tGC fXC mxX
related: 4Jty HpK a3Q

Spellagstifning
type: Concept
in scheme: JobTech Taxonomy - Färdighet
definition: Spellagstifning
broader: zmYu aAM TuF
related: NQTS fou E6u
related: YHwG fk2 MDL

SQLite, programmeringsverktyg
type: Concept
in scheme: JobTech Taxonomy - Färdighet
definition: SQLite, programmeringsverktyg
alternative label: SQLite
broader: Programmerings- och systemutvecklingsverktyg
related: D9SL mtn vGM
related: DJh5 yyF hEM
related: 4Jty HpK a3Q
related: MYAz x9m 2LJ

Film/effekter-The Foundry Nuke
type: Concept
in scheme: JobTech Taxonomy - Färdighet
definition: Film/effekter-The Foundry Nuke
alternative label: Film-The Foundry Nuke
alternative label: effekter-The Foundry Nuke
broader: Programvara för digitalt skapande
related: 8Bmh vtM zts
related: 4BsK q2C sCL
related: CkRH 4Qn iX3
related: 3J38 DNz YKK
related: PH2M uV4 r72
related: 4Jty HpK a3Q

Fritidspedagogiska området
type: Concept
in scheme: JobTech Taxonomy - Färdighet
definition: Fritidspedagogiska området
broader: Inriktning på lärarkompetens
related: CFW8 eBa NaV

Koreanskt kök
type: Concept
in scheme: JobTech Taxonomy - Färdighet
definition: Koreanskt kök
broader: zmYu aAM TuF
related: BStc SJh DKG

Värdetransportör, behörighet
type: Concept
in scheme: JobTech Taxonomy - Färdighet
definition: Värdetransportör, behörighet
broader: Yrkesbevis/examen
related: iqZh 3yX i8n

Filmblåsning
type: Concept
in scheme: JobTech Taxonomy - Färdighet
definition: Filmblåsning
broader: zmYu aAM TuF
related: yPQ4 EaN Dtj

Legitimation som logoped
type: Concept
in scheme: JobTech Taxonomy - Färdighet
definition: Legitimation som krävs för att kunna arbeta som logoped i Sverige. Utfärdas av Socialstyrelsen.
broader: Yrkesbevis/examen
related: pzch NRY 9ZF
related: 4P8B LtK JgE
related: r1Gk 3EN bpw

Petrologi (läran om bergarter)
type: Concept
in scheme: JobTech Taxonomy - Färdighet
definition: Petrologi (läran om bergarter)
broader: zmYu aAM TuF
related: V7Yz 4WV g4z

MovieMagic, budget- och schemaläggningsprogram
type: Concept
in scheme: JobTech Taxonomy - Färdighet
definition: MovieMagic, budget- och schemaläggningsprogram
broader: zmYu aAM TuF
related: rYSG 3WJ LmC
related: 4Jty HpK a3Q

Rostfritt stål, materialkunskap
type: Concept
in scheme: JobTech Taxonomy - Färdighet
definition: Rostfritt stål, materialkunskap
broader: Materialkunskap
related: wQ1E Bzk ZyA
related: L4hA SJP SFi
related: bXfo 4hb SXx

Processövervakning
type: Concept
in scheme: JobTech Taxonomy - Färdighet
definition: Processövervakning avser övervakning och styrning av produktionsprocesser inom olika industrier. Denna kompetens omfattar bland annat insyn i processflöden, systemövervakning samt säkerställande av kvalitet och effektivitet i produktionen.
broader: zmYu aAM TuF
related: yJk6 azD ywF
related: YiQw N87 zLU
related: m8TS hdk pSf
related: ENV6 BNa brP
related: 4obu LL6 RqJ
related: hxm6 xkr dHm
related: LEvM 7Hs w8i
related: rxmK wwM 1NA
related: Vfum e6B 7Bw
related: R8bW rsJ b2G
related: VKKg e4t t46
related: UdrS qzV P7i
related: 1G6H AuG qyy
related: kF59 fge kts
related: iZLB KpD LLo
related: o31g CX1 qhQ
related: 7Zqy hSM Fig
related: QEBd qHu vGr
related: E87t egE pjA
related: UcNa inr snV
related: 4Jty HpK a3Q
related: icae Y69 H8E
related: gJtZ EBc n2z

Emalj
type: Concept
in scheme: JobTech Taxonomy - Färdighet
definition: Emalj
broader: zmYu aAM TuF
related: 34Tn BQQ tfo

Grundförstärkning
type: Concept
in scheme: JobTech Taxonomy - Färdighet
definition: Grundförstärkning
broader: zmYu aAM TuF
related: bZ4J riZ zK6
related: iHrC aRv fVm

Gesällbrev, guldsmed
type: Concept
in scheme: JobTech Taxonomy - Färdighet
definition: Gesällbrev, guldsmed är ett bevis på att en hantverkare har genomgått utbildning och avlagt de delprov som krävs inom det specifika hantverksyrket, och därigenom uppnått ett erkännande av färdigheter och kompetens inom yrket. Utfärdas av Sveriges hantverksråd i samråd med aktuell branschorganisation.
broader: Yrkesbevis/examen
related: nwSm phw sPo

Kapitalmarknadsanalys
type: Concept
in scheme: JobTech Taxonomy - Färdighet
definition: Kapitalmarknadsanalys
broader: zmYu aAM TuF
related: WZCM nfS eAk

Pressvetsning
type: Concept
in scheme: JobTech Taxonomy - Färdighet
definition: Pressvetsning används, liksom punkt- och sömsvetsning, för hopfogning av överlappade tunnplåtar. Källa: Svetskommissionen
broader: on11 B1f LEw
related: vaEp iBS c5h
related: wQ1E Bzk ZyA

Ritningsläsning
type: Concept
in scheme: JobTech Taxonomy - Färdighet
definition: Ritningsläsning avser förmågan att förstå och tolka tekniska ritningar och scheman inom olika branscher, vilket kräver kunskaper om symboler, mått och specifikationer. Kompetensen omfattar även förmåga att identifiera relevanta detaljer och instruktioner som är avgörande för arbetsuppgifter och projektens genomförande.
broader: zmYu aAM TuF
related: Lzpv ofL 3H5
related: DPPw 4wa AsH
related: m8TS hdk pSf
related: 3ZtN hhA SM7
related: bZ4J riZ zK6
related: V79C DD2 3Gj
related: J17g Q2a 2u1
related: 3g5x Tm7 8QH
related: MW1P GNJ 4F9
related: VKKg e4t t46
related: MSnK 3Z8 4qA
related: e6nk AGp y28
related: vaEp iBS c5h
related: Y4j1 P17 wVA
related: 33Nt DSs YYA
related: aKdV u7V R5j
related: q2Ge zrQ zJb
related: 9mJN VwW Xjg
related: wQ1E Bzk ZyA
related: Kxm9 N3V shF
related: 4BsK q2C sCL
related: shkw ojo UL2
related: iGTu bYL 2T7
related: dMVD VYy kgg
related: 7Zqy hSM Fig
related: 1Nwn GYH wkH
related: AD3U cFH rbe
related: 3J38 DNz YKK
related: fLKb bJ3 69p
related: TrwQ RXT W8a
related: fWrt sLg koW
related: KttZ Skc bMR
related: 3UzE P8A 9sS
related: PH2M uV4 r72
related: a75S eLg JWH
related: NnB3 eWH auo
related: UcNa inr snV
related: 4Jty HpK a3Q
related: cGxX R9c kW1
related: eRkT cTv H9v
related: q8Ho 3Xw sHq
related: L4hA SJP SFi
related: yyF7 jsW EeP
related: CSUf ZVM a7Z
related: 4bxV 58E P9N
related: bXfo 4hb SXx

Skyddsglas, monteringsvana
type: Concept
in scheme: JobTech Taxonomy - Färdighet
definition: Skyddsglas, monteringsvana
broader: zmYu aAM TuF
related: J17g Q2a 2u1

Linux Professional Institute Certification/LPIC
type: Concept
in scheme: JobTech Taxonomy - Färdighet
definition: Linux Professional Institute Certification/LPIC
broader: s48H Sft DTn
related: cBBa ngH fCx
related: 4Jty HpK a3Q

Demokratifrågor
type: Concept
in scheme: JobTech Taxonomy - Färdighet
definition: Demokratifrågor
broader: zmYu aAM TuF
related: vPP6 rsw dck

Byggkonstruktion-AutoCAD Structure Detailing
type: Concept
in scheme: JobTech Taxonomy - Färdighet
definition: Byggkonstruktion-AutoCAD Structure Detailing
broader: mTLu uo2 gq2
related: thZP oR7 WrY
related: w6ud quG dgh
related: Pd51 xnr KCY
related: XeBP nMe pXx
related: ETAR ggZ Wuw
related: 41KB bfk 5jR
related: 4Jty HpK a3Q

Transportteknik
type: Concept
in scheme: JobTech Taxonomy - Färdighet
definition: Transportteknik
broader: zmYu aAM TuF
related: mp2Y vyC RFV

REBAS, redovisningssystem
type: Concept
in scheme: JobTech Taxonomy - Färdighet
definition: REBAS, redovisningssystem
alternative label: REBAS
broader: xSJR 1Kq pxB
related: eQ4M CNm ozj
related: q81z 3oD 1qu
related: ij8k EwC zyB
related: 4Jty HpK a3Q

Layoutprogram, undervisning
type: Concept
in scheme: JobTech Taxonomy - Färdighet
definition: Layoutprogram, undervisning
broader: Dataundervisning
related: 1CX5 mZw Vcq
related: 4Jty HpK a3Q

Bildemontering
type: Concept
in scheme: JobTech Taxonomy - Färdighet
definition: Bildemontering avser processen att nedmontera uttjänta fordon, maskiner och andra apparater för att återvinna delar och komponenter. Kompetensen omfattar kunskaper och färdigheter i att identifiera, plocka isär och sortera olika delar för att möjliggöra effektiv återvinning.
broader: zmYu aAM TuF
related: X7HR rZK 4wj

ADHD, specialpedagogik
type: Concept
in scheme: JobTech Taxonomy - Färdighet
definition: ADHD, specialpedagogik
broader: zmYu aAM TuF
related: 3FP7 4Eg x8P

Karusellsvarvning
type: Concept
in scheme: JobTech Taxonomy - Färdighet
definition: Karusellsvarvning avser en specifik process inom metallbearbetning där en karusellsvarv används för att forma och bearbeta arbetsstycken. Kompetensen omfattar förmågan att hantera och styra maskiner som utför svarvning, vilket innefattar att ställa in och justera parametrar för att uppnå önskad precision och kvalitet i det färdiga produkten.
broader: zmYu aAM TuF
related: vaEp iBS c5h

Handelsrätt
type: Concept
in scheme: JobTech Taxonomy - Färdighet
definition: Handelsrätt
broader: zmYu aAM TuF
related: q8wL kdi WaW
related: br6a VVS V3y
related: 6aak 8eh iwT
related: DZVN v5g Fco
related: JfYV ZGg 6rm

Kundtjänst
type: Concept
in scheme: JobTech Taxonomy - Färdighet
definition: Kundtjänst avser den kompetens som involverar att ge råd och upplysningar samt besvara frågor om produkter, tjänster eller policys inom ett företag eller en organisation. Kompetensen innefattar kommunikation med kunder och hantering av deras förfrågningar på ett professionellt sätt.
broader: zmYu aAM TuF
related: fdLf oPp wVw
related: PxXc 16t oZo
related: oEmP NC1 sXE
related: dUuh wwa FGj
related: H2Zj eL9 x28
related: pwRH MT1 8nR
related: FfMN Bw1 qYR
related: ZQiZ 6Kd D3a
related: 9dLz BCK oDA
related: 83wV GJa vMd
related: 4Jty HpK a3Q
related: p16X 44f rwZ

Maskinell posthanteringsvana
type: Concept
in scheme: JobTech Taxonomy - Färdighet
definition: Maskinell posthanteringsvana
broader: zmYu aAM TuF
related: gaBh 1vR tNE
related: 4Jty HpK a3Q

Xylofon
type: Concept
in scheme: JobTech Taxonomy - Färdighet
definition: Xylofon
broader: wLYs CKS wK8
related: AWJF wqZ va9

IW, Internationell svetsare, yrkesdiplom
type: Concept
in scheme: JobTech Taxonomy - Färdighet
definition: IW, Internationell svetsare, yrkesdiplom
alternative label: IW
alternative label: International Welder
alternative label: Internationell svetsare
broader: Svets-/lödarmetoder med verifierad kunskap
related: vaEp iBS c5h
related: wQ1E Bzk ZyA
related: PRQn 9yw NJA

Inredningsvana, privathem
type: Concept
in scheme: JobTech Taxonomy - Färdighet
definition: Inredningsvana, privathem
broader: zmYu aAM TuF
related: 41KB bfk 5jR
related: CSUf ZVM a7Z

Saxofon
type: Concept
in scheme: JobTech Taxonomy - Färdighet
definition: Saxofon
broader: wLYs CKS wK8
related: AWJF wqZ va9

Homeopati
type: Concept
in scheme: JobTech Taxonomy - Färdighet
definition: Homeopati
broader: zmYu aAM TuF
related: F19Z oB6 pg3

Stödterapi
type: Concept
in scheme: JobTech Taxonomy - Färdighet
definition: Stödterapi
broader: zmYu aAM TuF
related: VYeq GDF a2g

Oljeraffinering
type: Concept
in scheme: JobTech Taxonomy - Färdighet
definition: Oljeraffinering
broader: zmYu aAM TuF
related: QEBd qHu vGr

Radiologi, medicintekniskt område ingenjör
type: Concept
in scheme: JobTech Taxonomy - Färdighet
definition: Radiologi, medicintekniskt område ingenjör
broader: zmYu aAM TuF
related: GC7L Yw7 Mfo
related: 4Jty HpK a3Q

Verksamhetsledning, turism
type: Concept
in scheme: JobTech Taxonomy - Färdighet
definition: Verksamhetsledning, turism
broader: zmYu aAM TuF
related: NQTS fou E6u

ROC-behörighet
type: Concept
in scheme: JobTech Taxonomy - Färdighet
definition: ROC-behörighet
broader: Behörigheter, sjöfart
related: kZwz D8K bKs
related: kDnq Q98 sD3

Smittförande avfall och biologiskt avfall från hälso- och sjukvården
type: Concept
in scheme: JobTech Taxonomy - Färdighet
definition: Smittförande avfall och biologiskt avfall från hälso- och sjukvården
broader: zmYu aAM TuF
related: wNrt Ysj WuT
related: 8q1B 5AR CEM
related: idjo 2Wr a3E
related: X7HR rZK 4wj
related: PHJN fva yxs
related: yXbD NTH ijE
related: dsK3 hkt zGy
related: nrVt xUL KdQ
related: 1tGC fXC mxX
related: cuaN Rj5 YCc
related: dyWo sDb MLQ
related: bExu 8gk azk
related: 6zAR EHM Kwj
related: Z8ci bBE tmx

Hållbar finansiering
type: Concept
in scheme: JobTech Taxonomy - Färdighet
definition: Integration av miljö-, samhällsansvars- och bolagsstyrningsfrågor i samband med affärs- eller investeringsbeslut, vilket leder till större långsiktiga investeringar i hållbara ekonomiska verksamheter och projekt. Källa: ESCO
broader: zmYu aAM TuF
related: QG4f MCh vND
related: aQpg E2T cWq
related: pTr9 RBT 9ur
related: yXbD NTH ijE
related: mZsb A1K Gec
related: 9Mn4 PNA 7Yz

Lågtrycksgjutning
type: Concept
in scheme: JobTech Taxonomy - Färdighet
definition: Lågtrycksgjutning
broader: zmYu aAM TuF
related: UcNa inr snV

Corel WordPerfect Office
type: Concept
in scheme: JobTech Taxonomy - Färdighet
definition: Corel WordPerfect Office
broader: Allmänna datakunskaper
related: eQ4M CNm ozj
related: Y6yY SuR hVh
related: Uw4n UB2 RCW
related: fdLf oPp wVw
related: vPP6 rsw dck
related: iWcY mko rq2
related: ZQTR hVC QhJ
related: br6a VVS V3y
related: 1CX5 mZw Vcq
related: L7eh ihX vM5
related: MGk3 LvL AU2
related: jJF3 qaQ Zsh
related: oEmP NC1 sXE
related: bjqk F3A 5Hk
related: H2Zj eL9 x28
related: dJXy Rpq a2u
related: pwRH MT1 8nR
related: cRmd 536 pT1
related: zKvJ GnC Szx
related: n6iX f2z XfE
related: DZVN v5g Fco
related: ij8k EwC zyB
related: JfYV ZGg 6rm
related: vCAb uuo ek5
related: 4Jty HpK a3Q
related: p16X 44f rwZ
related: pok1 ipJ yzD

Brandingenjörsexamen
type: Concept
in scheme: JobTech Taxonomy - Färdighet
definition: Brandingenjörsexamenär en yrkesexamen på högskolenivå kopplad till utbildning med inriktning mot brandingenjör. Källa: UHR (Universitets- och högskolerådet)
broader: Yrkesbevis/examen
related: wCx8 rY3 XUT

Komposition, konstmusik
type: Concept
in scheme: JobTech Taxonomy - Färdighet
definition: Komposition, konstmusik
broader: zmYu aAM TuF
related: AWJF wqZ va9
related: 4Jty HpK a3Q

Grovkrossning av malm
type: Concept
in scheme: JobTech Taxonomy - Färdighet
definition: Grovkrossning av malm
broader: zmYu aAM TuF
related: LEvM 7Hs w8i

Arbete med personer i utsatta situationer
type: Concept
in scheme: JobTech Taxonomy - Färdighet
definition: Kompetensen innebär att ge respektfullt och rättssäkert stöd till människor som befinner sig i utsatta situationer, så som kris, beroende- eller våldsrelationer, hemlöshet, psykisk ohälsa eller annan social och existentiell utsatthet.
broader: zmYu aAM TuF
related: BWwk fYX S5B
related: vPP6 rsw dck
related: 7fNG sve JWU
related: rNcE Zno pD8
related: pok1 ipJ yzD

Kommunikationsstrategi
type: Concept
in scheme: JobTech Taxonomy - Färdighet
definition: Kommunikationsstrategi
broader: zmYu aAM TuF
related: SgNH hag n9D
related: mpuA s56 Hsy
related: k1Nx auG sNh
related: 4Jty HpK a3Q

Halvledarteknik
type: Concept
in scheme: JobTech Taxonomy - Färdighet
definition: Halvledarteknik
broader: zmYu aAM TuF
related: nDaB vdy eAy
related: SgAJ DW2 FN5
related: SPYW 7Z1 ShT

Google Ads
type: Concept
in scheme: JobTech Taxonomy - Färdighet
definition: Google Ads avser plattformen för digital annonsering som används för att skapa, hantera och optimera annonser på olika Google-tjänster samt på partnerwebbplatser. Kompetensen omfattar kunskap om sökmotormarknadsföring, budgethantering, målgruppsanalys och annonseringsformat för att effektivt nå ut till avsedda användare.
broader: zmYu aAM TuF
related: Fv7d YhP YmS
related: WX67 Pfb WMN
related: k1Nx auG sNh
related: 4Jty HpK a3Q

Mekanisk mätning
type: Concept
in scheme: JobTech Taxonomy - Färdighet
definition: Mekanisk mätning
broader: zmYu aAM TuF
related: L4hA SJP SFi

Bilelektronik
type: Concept
in scheme: JobTech Taxonomy - Färdighet
definition: Bilelektronik
broader: Elektronikkompetenser
related: nDaB vdy eAy
related: SPYW 7Z1 ShT
related: 4Jty HpK a3Q

Djursjukhus, vårdarerfarenhet
type: Concept
in scheme: JobTech Taxonomy - Färdighet
definition: Djursjukhus, vårdarerfarenhet
broader: zmYu aAM TuF
related: 8q1B 5AR CEM

Diplommålning, utbildning inom järnmålning
type: Concept
in scheme: JobTech Taxonomy - Färdighet
definition: Diplommålning, utbildning inom järnmålning
broader: Yrkesbevis/examen
related: dKUb KBP mw3

Electronic Field Production/EFP
type: Concept
in scheme: JobTech Taxonomy - Färdighet
definition: Electronic Field Production/EFP
alternative label: EFP
alternative label: Electronic Field Production
broader: zmYu aAM TuF
related: 4BsK q2C sCL
related: CkRH 4Qn iX3
related: 4Jty HpK a3Q

pm3, förvaltningsmodell
type: Concept
in scheme: JobTech Taxonomy - Färdighet
definition: pm3, förvaltningsmodell
broader: zmYu aAM TuF
related: cBBa ngH fCx
related: DJh5 yyF hEM
related: UxT1 tPF Kbg
related: 4Jty HpK a3Q
related: UXKZ 3zZ ipB

Formsättning
type: Concept
in scheme: JobTech Taxonomy - Färdighet
definition: Formsättning avser arbetet med att skapa och montera formar för gjutning av betongkonstruktioner. Denna kompetens innefattar design och konstruktion av formverktyg som används för att ge betongen dess önskade form och strukturella egenskaper.
broader: zmYu aAM TuF
related: bZ4J riZ zK6
related: q2Ge zrQ zJb
related: 9mJN VwW Xjg
related: o31g CX1 qhQ

OpenGL, programmeringsspråk
type: Concept
in scheme: JobTech Taxonomy - Färdighet
definition: OpenGL, programmeringsspråk
alternative label: OpenGL
broader: Datorspråk
related: BAeH eg8 T2d
related: Fv7d YhP YmS
related: 8Bmh vtM zts
related: D9SL mtn vGM
related: DJh5 yyF hEM
related: SPYW 7Z1 ShT
related: 4Jty HpK a3Q
related: Mbt6 3ko DiD

Visual merchandising
type: Concept
in scheme: JobTech Taxonomy - Färdighet
definition: Visual merchandising
broader: zmYu aAM TuF
related: YKL2 FCB 1yr
related: s1Qk o98 2o1
related: k1Nx auG sNh
related: CSUf ZVM a7Z

Fjärrstyrningssystem
type: Concept
in scheme: JobTech Taxonomy - Färdighet
definition: Fjärrstyrningssystem
broader: zmYu aAM TuF
related: nDaB vdy eAy
related: SPYW 7Z1 ShT
related: 4Jty HpK a3Q

Loggning
type: Concept
in scheme: JobTech Taxonomy - Färdighet
definition: Loggning
broader: zmYu aAM TuF
related: 4BsK q2C sCL
related: CkRH 4Qn iX3
related: 3J38 DNz YKK

Avfuktning
type: Concept
in scheme: JobTech Taxonomy - Färdighet
definition: Avfuktning avser processen att reducera och kontrollera fuktighet i olika miljöer för att förhindra eller åtgärda skador orsakade av överflödig fukt. Kompetensen innefattar metoder och tekniker för att effektivt avlägsna fukt från byggnader och utrymmen, vilket är centralt för att upprätthålla strukturell integritet och inomhusmiljö.
broader: zmYu aAM TuF
related: wCx8 rY3 XUT
related: idjo 2Wr a3E

Kläder/Mode
type: Concept
in scheme: JobTech Taxonomy - Färdighet
definition: Kläder/Mode
alternative label: Kläder
alternative label: Mode
broader: zmYu aAM TuF
related: oXSW fbY XrY
related: YKL2 FCB 1yr
related: 85cq 6uK 4cK

Svetsteknik
type: Concept
in scheme: JobTech Taxonomy - Färdighet
definition: Svetsteknik
broader: zmYu aAM TuF
related: K8yg U4C gkY
related: PRQn 9yw NJA

Byggkonstruktion-RCAD
type: Concept
in scheme: JobTech Taxonomy - Färdighet
definition: Byggkonstruktion-RCAD
broader: mTLu uo2 gq2
related: thZP oR7 WrY
related: w6ud quG dgh
related: Pd51 xnr KCY
related: XeBP nMe pXx
related: ETAR ggZ Wuw
related: 41KB bfk 5jR
related: 4Jty HpK a3Q

Fälttävlan, instruktör/Fälttävlan, tränare
type: Concept
in scheme: JobTech Taxonomy - Färdighet
definition: Fälttävlan, instruktör/Fälttävlan, tränare
alternative label: Fälttävlan, instruktör
alternative label: Fälttävlan, tränare
broader: Idrott/aktivitet
related: EA6o N1N QtT
related: KYmy iqC xiQ

Föräldrakooperativ, erfarenhet
type: Concept
in scheme: JobTech Taxonomy - Färdighet
definition: Föräldrakooperativ, erfarenhet
broader: zmYu aAM TuF
related: Hi9c iTe gHH

Lotus Approach, databashanterare
type: Concept
in scheme: JobTech Taxonomy - Färdighet
definition: Lotus Approach, databashanterare
alternative label: Lotus Approach
broader: Databaser
related: BAeH eg8 T2d
related: cBBa ngH fCx
related: Fv7d YhP YmS
related: D9SL mtn vGM
related: DJh5 yyF hEM
related: 4Jty HpK a3Q
related: MYAz x9m 2LJ

Programplanering, TV
type: Concept
in scheme: JobTech Taxonomy - Färdighet
definition: Programplanering, TV
broader: zmYu aAM TuF
related: SgNH hag n9D

Förordnad besiktningsman
type: Concept
in scheme: JobTech Taxonomy - Färdighet
definition: Förordnad besiktningsman
broader: Yrkesbevis/examen
related: Ru4W zn2 LEz

Munspel
type: Concept
in scheme: JobTech Taxonomy - Färdighet
definition: Munspel
broader: wLYs CKS wK8
related: AWJF wqZ va9

Franskt kök
type: Concept
in scheme: JobTech Taxonomy - Färdighet
definition: Franskt kök
broader: zmYu aAM TuF
related: BStc SJh DKG

Rehabilitering
type: Concept
in scheme: JobTech Taxonomy - Färdighet
definition: Rehabilitering avser insatser och åtgärder för att återfå eller förbättra en individs funktion och livskvalitet efter skada, sjukdom eller funktionsnedsättning. Denna kompetens omfattar planering, genomförande och uppföljning av rehabiliteringsprogram som kan inkludera både fysiska och psykiska aspekter, och involverar ofta en tvärvetenskaplig samverkan inom hälso- och sjukvård.
broader: zmYu aAM TuF
related: BWwk fYX S5B
related: pzch NRY 9ZF
related: sq3e WVv Fjd
related: 7fNG sve JWU
related: TPH4 2AM isT
related: s7vU FhY L5Z
related: jY19 knH MJp
related: LP4Z ABV gRm
related: F19Z oB6 pg3
related: 7pz9 eY9 D2s
related: tAJS JNb hDH
related: aWki 4uA adn
related: 6zAR EHM Kwj
related: uxHV KXc PKD
related: vTgW pnr QMp

Wireframe
type: Concept
in scheme: JobTech Taxonomy - Färdighet
definition: Wireframe
broader: zmYu aAM TuF
related: DJh5 yyF hEM
related: UxT1 tPF Kbg
related: 4Jty HpK a3Q

Testkoordinering
type: Concept
in scheme: JobTech Taxonomy - Färdighet
definition: Testkoordinering
broader: zmYu aAM TuF
related: cBBa ngH fCx
related: D9SL mtn vGM
related: DJh5 yyF hEM
related: 4Jty HpK a3Q

IT-tjänstedesign, kundresor/IT-tjänstedesign, customer journey
type: Concept
in scheme: JobTech Taxonomy - Färdighet
definition: IT-tjänstedesign, kundresor/IT-tjänstedesign, customer journey
alternative label: IT-tjänstedesign, customer journey
alternative label: IT-tjänstedesign, kundresor/
broader: zmYu aAM TuF
related: UxT1 tPF Kbg
related: 4Jty HpK a3Q

Energikartläggare
type: Concept
in scheme: JobTech Taxonomy - Färdighet
definition: Energikartläggare
broader: s48H Sft DTn
related: wCx8 rY3 XUT
related: K8yg U4C gkY
related: yXbD NTH ijE
related: PRQn 9yw NJA

AXE-växlar, utveckling och konstruktion
type: Concept
in scheme: JobTech Taxonomy - Färdighet
definition: AXE-växlar, utveckling och konstruktion
broader: zmYu aAM TuF
related: nDaB vdy eAy
related: SPYW 7Z1 ShT
related: 4Jty HpK a3Q

Basket, instruktör/Basket, tränare
type: Concept
in scheme: JobTech Taxonomy - Färdighet
definition: Basket, instruktör/Basket, tränare
alternative label: Basket, instruktör
alternative label: Basket, tränare
broader: Idrott/aktivitet
related: EA6o N1N QtT

Bättre arbetsmiljö/BAM
type: Concept
in scheme: JobTech Taxonomy - Färdighet
definition: Bättre arbetsmiljö/BAM
alternative label: BAM
broader: zmYu aAM TuF
related: Uw64 cuc U3H

Access, databashanterare
type: Concept
in scheme: JobTech Taxonomy - Färdighet
definition: Access, databashanterare
alternative label: Access
broader: Databaser
related: BAeH eg8 T2d
related: cBBa ngH fCx
related: Fv7d YhP YmS
related: D9SL mtn vGM
related: DJh5 yyF hEM
related: 4Jty HpK a3Q
related: MYAz x9m 2LJ

Barn- och ungdomsallergologi, specialistkompetens för läkare
type: Concept
in scheme: JobTech Taxonomy - Färdighet
definition: Barn- och ungdomsallergologi, specialistkompetens för läkare
broader: Specialistbevis för läkare
related: nu7c QuB KVQ

Musikproduktion
type: Concept
in scheme: JobTech Taxonomy - Färdighet
definition: Musikproduktion
broader: zmYu aAM TuF
related: iBUL s38 izZ

Sättfiskodling
type: Concept
in scheme: JobTech Taxonomy - Färdighet
definition: Sättfiskodling
broader: zmYu aAM TuF
related: c8r8 e4L gwj

Ljud-Steinberg Cubase
type: Concept
in scheme: JobTech Taxonomy - Färdighet
definition: Ljud-Steinberg Cubase
broader: Programvara för digitalt skapande
related: SgNH hag n9D
related: 4BsK q2C sCL
related: CkRH 4Qn iX3
related: 3J38 DNz YKK
related: PH2M uV4 r72
related: 4Jty HpK a3Q

Begravningstjänster
type: Concept
in scheme: JobTech Taxonomy - Färdighet
definition: Begravningstjänster innefattar de tjänster och uppgifter som relaterar till förberedelser och genomförande av begravningsceremonier, jordfästningar, kremeringar och gravsättningar. Kompetensen är kopplad till begravnings- och krematoriepersonal som ansvarar för att arrangera och utföra dessa ceremonier, vilket kan inkludera både praktiska och emotionella aspekter av sorgprocessen.
broader: zmYu aAM TuF
related: R8bW rsJ b2G

Kulning, glasbearbetning
type: Concept
in scheme: JobTech Taxonomy - Färdighet
definition: Kulning, glasbearbetning
broader: zmYu aAM TuF
related: aKdV u7V R5j

Sportfiske, instruktör
type: Concept
in scheme: JobTech Taxonomy - Färdighet
definition: Sportfiske, instruktör
broader: Idrott/aktivitet
related: EA6o N1N QtT

Elorgel
type: Concept
in scheme: JobTech Taxonomy - Färdighet
definition: Elorgel
broader: wLYs CKS wK8
related: AWJF wqZ va9

Renhållningsmaskin
type: Concept
in scheme: JobTech Taxonomy - Färdighet
definition: Renhållningsmaskin
broader: zmYu aAM TuF
related: 3ZtN hhA SM7
related: X7HR rZK 4wj

CABAS
type: Concept
in scheme: JobTech Taxonomy - Färdighet
definition: CABAS är ett kalkyleringssystem som används på skadeverkstäder för att beräkna reparationstiden och kostnader för skador på fordon, inklusive glas-, plåt-, lack-, plast- samt maskinskador.
broader: zmYu aAM TuF
related: Lzpv ofL 3H5
related: Ru4W zn2 LEz
related: dUuh wwa FGj

Valsslipning
type: Concept
in scheme: JobTech Taxonomy - Färdighet
definition: Valsslipning
broader: zmYu aAM TuF
related: 4bxV 58E P9N

Tank- och bulkbil, körvana
type: Concept
in scheme: JobTech Taxonomy - Färdighet
definition: Tank- och bulkbil, körvana avser kompetensen att köra och hantera tank- och bulkbilar för transport av vätskor eller lösa partiklar. Denna kompetens omfattar kunskap om säker hantering av farligt gods och specifika krav relaterade till beredskap för väg- och transportförhållanden.
broader: zmYu aAM TuF
related: 3MBw pDA P2F

Projektledning, kultur
type: Concept
in scheme: JobTech Taxonomy - Färdighet
definition: Projektledning, kultur
broader: zmYu aAM TuF
related: 34Tn BQQ tfo
related: rYSG 3WJ LmC

Hydroterapi
type: Concept
in scheme: JobTech Taxonomy - Färdighet
definition: Hydroterapi
broader: zmYu aAM TuF
related: F19Z oB6 pg3

Förnickling
type: Concept
in scheme: JobTech Taxonomy - Färdighet
definition: Förnickling
broader: zmYu aAM TuF
related: YiQw N87 zLU

Metallskulptur
type: Concept
in scheme: JobTech Taxonomy - Färdighet
definition: Metallskulptur
broader: zmYu aAM TuF
related: 34Tn BQQ tfo

Dragbil, körvana/Trailer, körvana
type: Concept
in scheme: JobTech Taxonomy - Färdighet
definition: Dragbil, körvana/Trailer, körvana
alternative label: Dragbil, körvana
alternative label: Trailer, körvana
broader: zmYu aAM TuF
related: 3MBw pDA P2F

Ekonomistyrning
type: Concept
in scheme: JobTech Taxonomy - Färdighet
definition: Kompetensen avser kunskaper om och tillämpning av metoder för ekonomisk styrning inom organisationer. Det innefattar bedömning av ekonomiskt nuläge, definiering av mål, resursfördelning, budgetering, uppföljning av resultat samt analys för beslutsfattande och värdeskapande.
broader: zmYu aAM TuF
related: Y6yY SuR hVh
related: Uw4n UB2 RCW
related: vPP6 rsw dck
related: q81z 3oD 1qu
related: mZsb A1K Gec
related: cRmd 536 pT1

Solcellsmontering/Solcellsmontage
type: Concept
in scheme: JobTech Taxonomy - Färdighet
definition: Solcellsmontering/Solcellsmontage
alternative label: Solcellsmontage
alternative label: Solcellsmontering
broader: zmYu aAM TuF
related: 3g5x Tm7 8QH
related: SgAJ DW2 FN5
related: 9mJN VwW Xjg
related: yXbD NTH ijE
related: AD3U cFH rbe
related: a75S eLg JWH
related: iHrC aRv fVm
related: yyF7 jsW EeP

Besiktningsman, järnväg (certifikat)
type: Concept
in scheme: JobTech Taxonomy - Färdighet
definition: Besiktningsman, järnväg (certifikat)
broader: s48H Sft DTn
related: bZ4J riZ zK6

Utbildning, marinen
type: Concept
in scheme: JobTech Taxonomy - Färdighet
definition: Utbildning, marinen
broader: zmYu aAM TuF
related: jXUQ rUV iBv
related: dhgR 9jk 95r
related: KiVA anS RJh

Gymnasieexamen naturbruk, inriktning hästhållning
type: Concept
in scheme: JobTech Taxonomy - Färdighet
definition: Gymnasieexamen naturbruk, inriktning hästhållning är en examen på gymnasial nivå med inriktning mot naturbruk och hästhållning.
broader: Yrkesbevis/examen
related: KYmy iqC xiQ

Social dokumentation
type: Concept
in scheme: JobTech Taxonomy - Färdighet
definition: Social dokumentation avser registrering och beskrivning av sociala insatser och händelser som rör individer i behov av stöd och hjälp. Kompetensen omfattar förmågan att dokumentera och följa upp insatser, vilket är centralt för att säkerställa kvalitet och kontinuitet i vård och stödåtgärder.
broader: zmYu aAM TuF
related: eQ4M CNm ozj
related: BWwk fYX S5B
related: sq3e WVv Fjd
related: 7pz9 eY9 D2s
related: 5uP5 Ugw aVE
related: pok1 ipJ yzD

Gesällbrev, fotograf
type: Concept
in scheme: JobTech Taxonomy - Färdighet
definition: Gesällbrev, fotograf
broader: Yrkesbevis/examen
related: 4BsK q2C sCL
related: CkRH 4Qn iX3
related: 3J38 DNz YKK

Nagelskulptur
type: Concept
in scheme: JobTech Taxonomy - Färdighet
definition: Nagelskulptur avser en teknik som används inom nagelvård och innefattar skapandet av konstverk på naglar genom olika metoder och material, såsom akryl eller gel. Denna kompetens kräver noggrannhet och kreativitet för att forma, förlänga och dekorera naglar, vilket bidrar till estetiskt tilltalande resultat.
broader: zmYu aAM TuF
related: ezKk kss CiQ
related: xr7w N6Q QMA

Utbildning och skola, områdeskunskap
type: Concept
in scheme: JobTech Taxonomy - Färdighet
definition: Utbildning och skola, områdeskunskap
broader: zmYu aAM TuF
related: vPP6 rsw dck
related: z8di AqX GBr

Akutsjukvård, specialistområde för sjuksköterska
type: Concept
in scheme: JobTech Taxonomy - Färdighet
definition: En fördjupad specialistkompetens för sjuksköterska inom akutsjukvård.
broader: Specialistområde för sjuksköterska
related: PHJN fva yxs
related: dyWo sDb MLQ

Simuleringsteknik
type: Concept
in scheme: JobTech Taxonomy - Färdighet
definition: Simuleringsteknik
broader: zmYu aAM TuF
related: nDaB vdy eAy
related: SPYW 7Z1 ShT

Arkeologisk guidning
type: Concept
in scheme: JobTech Taxonomy - Färdighet
definition: Arkeologisk guidning
broader: zmYu aAM TuF
related: A6X3 efC VNy

EASA-certifikat, kategori B1.2 (flyg kolvmotor)
type: Concept
in scheme: JobTech Taxonomy - Färdighet
definition: EASA-certifikat, kategori B1.2 (flyg kolvmotor)
broader: s48H Sft DTn
related: eRkT cTv H9v

3D-grafik-ZBrush
type: Concept
in scheme: JobTech Taxonomy - Färdighet
definition: 3D-grafik-ZBrush
broader: Programvara för digitalt skapande
related: 8Bmh vtM zts
related: 34Tn BQQ tfo
related: Q5DF juj 8do
related: 4Jty HpK a3Q
related: LeQV umf wUS
related: Mbt6 3ko DiD

Pedodonti/Barntandvård, specialistkompetens för tandläkare
type: Concept
in scheme: JobTech Taxonomy - Färdighet
definition: Pedodonti/Barntandvård, specialistkompetens för tandläkare
alternative label: Barntandvård
alternative label: Pedodonti
broader: Specialistkompetens för tandläkare
related: HPxT fQJ zwT

Gesällbrev, konstgjutare
type: Concept
in scheme: JobTech Taxonomy - Färdighet
definition: Gesällbrev, konstgjutare är ett bevis på att en hantverkare har genomgått utbildning och avlagt de delprov som krävs inom det specifika hantverksyrket, och därigenom uppnått ett erkännande av färdigheter och kompetens inom yrket. Utfärdas av Sveriges hantverksråd i samråd med aktuell branschorganisation.
broader: Yrkesbevis/examen
related: J9Vz JxJ Bji

A-checker, flyg
type: Concept
in scheme: JobTech Taxonomy - Färdighet
definition: A-checker, flyg
broader: zmYu aAM TuF
related: iGTu bYL 2T7
related: eRkT cTv H9v
related: L4hA SJP SFi

Scenografi, TV
type: Concept
in scheme: JobTech Taxonomy - Färdighet
definition: Scenografi, TV
broader: zmYu aAM TuF
related: 4BsK q2C sCL
related: rYSG 3WJ LmC
related: CSUf ZVM a7Z

Byggnadsunderhåll, lantbruk
type: Concept
in scheme: JobTech Taxonomy - Färdighet
definition: Byggnadsunderhåll, lantbruk
broader: zmYu aAM TuF
related: KYmy iqC xiQ
related: 9QMD sZ3 ZjX
related: k3R3 UkC nK2
related: RYCQ ogb uUY

Skogsvetarexamen
type: Concept
in scheme: JobTech Taxonomy - Färdighet
definition: Skogsvetarexamen
broader: Yrkesbevis/examen
related: yXbD NTH ijE
related: 9QMD sZ3 ZjX
related: 3LdB WEJ 8Ms

Konsulterfarenhet
type: Concept
in scheme: JobTech Taxonomy - Färdighet
definition: Konsulterfarenhet innebär kompetens från arbete som extern expert på uppdrag hos kunder inom olika branscher och områden. Det kan innebära att sätta sig in i kundens verksamhet, lösa specifika problem, leverera råd och resultat samt hantera projekt självständigt och i samarbete med andra.
broader: zmYu aAM TuF
related: q81z 3oD 1qu
related: DJh5 yyF hEM
related: cRmd 536 pT1
related: JfYV ZGg 6rm

Brodyrmaskin
type: Concept
in scheme: JobTech Taxonomy - Färdighet
definition: Brodyrmaskin
broader: zmYu aAM TuF
related: skLS kpa Ui1

Förordnande som sjöfarts- och hamnskyddskontrollant
type: Concept
in scheme: JobTech Taxonomy - Färdighet
definition: Förordnande som sjöfarts- och hamnskyddskontrollant utfärdas av Polisen efter genomgången utbildning.
broader: s48H Sft DTn
related: ayQ4 G3W A2w

Dubbning
type: Concept
in scheme: JobTech Taxonomy - Färdighet
definition: Dubbning
broader: zmYu aAM TuF
related: iBUL s38 izZ
related: xuSE mtB Mir

Kemisk farmacevtisk dokumentation
type: Concept
in scheme: JobTech Taxonomy - Färdighet
definition: Kemisk farmacevtisk dokumentation
broader: zmYu aAM TuF
related: v9nU 6Fw 4Qg

Natur- och kulturhänsyn - Röjning/Förröjning
type: Concept
in scheme: JobTech Taxonomy - Färdighet
definition: Natur- och kulturhänsyn - Röjning/Förröjning
broader: Yrkesbevis/examen
related: qouP wtb 93q
related: KwVo sQu G2e

Vetenskapsjournalistik
type: Concept
in scheme: JobTech Taxonomy - Färdighet
definition: Vetenskapsjournalistik
broader: zmYu aAM TuF
related: SgNH hag n9D

Clojurescript, programmeringsspråk
type: Concept
in scheme: JobTech Taxonomy - Färdighet
definition: Clojurescript, programmeringsspråk
alternative label: Clojurescript
broader: Datorspråk
related: D9SL mtn vGM
related: DJh5 yyF hEM
related: UxT1 tPF Kbg
related: 4Jty HpK a3Q
related: UXKZ 3zZ ipB

Stroppekurs G11
type: Concept
in scheme: JobTech Taxonomy - Färdighet
definition: Stroppekurs G11
broader: s48H Sft DTn
related: CbQK 7th Tyf
related: KttZ Skc bMR

Elektromekanisk konstruktion
type: Concept
in scheme: JobTech Taxonomy - Färdighet
definition: Elektromekanisk konstruktion
broader: zmYu aAM TuF
related: K8yg U4C gkY
related: nDaB vdy eAy
related: SPYW 7Z1 ShT
related: PRQn 9yw NJA
related: 4Jty HpK a3Q

Skivtäckning
type: Concept
in scheme: JobTech Taxonomy - Färdighet
definition: Skivtäckning
broader: zmYu aAM TuF
related: 3g5x Tm7 8QH
related: bXfo 4hb SXx

Luftinjustering
type: Concept
in scheme: JobTech Taxonomy - Färdighet
definition: Luftinjustering
broader: zmYu aAM TuF
related: yXbD NTH ijE
related: fLKb bJ3 69p
related: 3UzE P8A 9sS
related: L4hA SJP SFi
related: bXfo 4hb SXx

Maskinskötsel, textilindustrin
type: Concept
in scheme: JobTech Taxonomy - Färdighet
definition: Maskinskötsel inom textilindustrin avser hantering och drift av olika maskiner som används för att bearbeta textil- och läderprodukter. Kompetensen inkluderar kunskaper om maskinens funktioner och inställningar, samt förmåga att övervaka och justera maskiner för att säkerställa kvalitativa resultat och effektiv produktion.
broader: zmYu aAM TuF
related: skLS kpa Ui1
related: 4Jty HpK a3Q

3D-grafik-Smith Micro Anime Studio Pro
type: Concept
in scheme: JobTech Taxonomy - Färdighet
definition: 3D-grafik-Smith Micro Anime Studio Pro
broader: Programvara för digitalt skapande
related: 8Bmh vtM zts
related: 34Tn BQQ tfo
related: Q5DF juj 8do
related: 4Jty HpK a3Q
related: LeQV umf wUS
related: Mbt6 3ko DiD

GNU, operativsystem
type: Concept
in scheme: JobTech Taxonomy - Färdighet
definition: GNU, operativsystem
alternative label: GNU
broader: xAWr WYq JPP
related: BAeH eg8 T2d
related: cBBa ngH fCx
related: 1CX5 mZw Vcq
related: D9SL mtn vGM
related: VCpu 5EN bBt
related: DJh5 yyF hEM
related: 4Jty HpK a3Q
related: 13md uyV BNG
related: UXKZ 3zZ ipB
related: MYAz x9m 2LJ

Alternativ och kompletterande kommunikation/AKK
type: Concept
in scheme: JobTech Taxonomy - Färdighet
definition: Alternativ och kompletterande kommunikation, AKK, innebär metoder och tekniker som används för att stödja och underlätta kommunikation för individer med kommunikationssvårigheter. AKK omfattar både visuella och taktil kommunikationssystem samt hjälpmedel som symboler, bilder och teknologiska apparater för att förbättra interaktionen och förståelsen mellan människor.
alternative label: AKK
alternative label: Alternativ och kompletterande kommunikation
broader: zmYu aAM TuF
related: BWwk fYX S5B
related: Hi9c iTe gHH
related: sq3e WVv Fjd
related: XW9L tA9 WaX
related: jY19 knH MJp
related: 7pz9 eY9 D2s
related: tAJS JNb hDH
related: 5ek3 Cgq WeZ

Hygienartiklar
type: Concept
in scheme: JobTech Taxonomy - Färdighet
definition: Hygienartiklar
broader: zmYu aAM TuF
related: oXSW fbY XrY
related: YKL2 FCB 1yr
related: 85cq 6uK 4cK

Stilhistoria
type: Concept
in scheme: JobTech Taxonomy - Färdighet
definition: Stilhistoria
broader: zmYu aAM TuF
related: iBUL s38 izZ
related: 34Tn BQQ tfo
related: 4BsK q2C sCL
related: PH2M uV4 r72

Dialysteknik, medicintekniskt område ingenjör
type: Concept
in scheme: JobTech Taxonomy - Färdighet
definition: Dialysteknik, medicintekniskt område ingenjör
broader: zmYu aAM TuF
related: GC7L Yw7 Mfo

Wok
type: Concept
in scheme: JobTech Taxonomy - Färdighet
definition: Wok
broader: zmYu aAM TuF
related: BStc SJh DKG

Yrkesutbildning, processoperatör inom kemisk industri
type: Concept
in scheme: JobTech Taxonomy - Färdighet
definition: Yrkesutbildning, processoperatör inom kemisk industri är en gymnasial yrkesutbildning med inriktning till processoperatör inom kemisk industri.
broader: Yrkesutbildning
related: hxm6 xkr dHm
related: rxmK wwM 1NA
related: QEBd qHu vGr

Godkänd elutbildning
type: Concept
in scheme: JobTech Taxonomy - Färdighet
definition: Godkänd elutbildning
broader: Yrkesbevis/examen
related: a75S eLg JWH
related: yyF7 jsW EeP

Centrex, telefonväxel
type: Concept
in scheme: JobTech Taxonomy - Färdighet
definition: Centrex, telefonväxel
broader: Telefonväxlar
related: 4aPu 2nd 8X6
related: ByrL ANp UwV
related: 4Jty HpK a3Q

Riskhantering/Risk management
type: Concept
in scheme: JobTech Taxonomy - Färdighet
definition: Riskhantering avser processen för att identifiera, analysera och hantera osäkerheter och risker som kan påverka en organisations mål och resurser. Denna kompetens omfattar utveckling av strategier och åtgärder för att minimera negativa konsekvenser och maximera positiva möjligheter.
alternative label: Risk management
alternative label: Riskhantering
broader: zmYu aAM TuF
related: Y6yY SuR hVh
related: Uw4n UB2 RCW
related: nuXg Wjc JPd
related: pTr9 RBT 9ur
related: mZsb A1K Gec
related: cRmd 536 pT1
related: 9Mn4 PNA 7Yz

Kärnkraftteknik
type: Concept
in scheme: JobTech Taxonomy - Färdighet
definition: Kärnkraftteknik
broader: zmYu aAM TuF
related: K8yg U4C gkY
related: PRQn 9yw NJA

Unified Modeling Language, modelleringsspråk
type: Concept
in scheme: JobTech Taxonomy - Färdighet
definition: Unified Modeling Language, modelleringsspråk
alternative label: UML
broader: Programmerings- och systemutvecklingsverktyg
related: D9SL mtn vGM
related: DJh5 yyF hEM
related: 4Jty HpK a3Q
related: UXKZ 3zZ ipB

Certified Lotus Professional/CLP
type: Concept
in scheme: JobTech Taxonomy - Färdighet
definition: Certified Lotus Professional/CLP
alternative label: CLP
alternative label: Certified Lotus Professional
broader: s48H Sft DTn
related: BAeH eg8 T2d
related: Fv7d YhP YmS
related: hmaC cfi UKg
related: 1CX5 mZw Vcq
related: VCpu 5EN bBt
related: 13md uyV BNG

VMS, operativsystem
type: Concept
in scheme: JobTech Taxonomy - Färdighet
definition: VMS, operativsystem
alternative label: VMS
broader: xAWr WYq JPP
related: BAeH eg8 T2d
related: cBBa ngH fCx
related: D9SL mtn vGM
related: VCpu 5EN bBt
related: DJh5 yyF hEM
related: 4Jty HpK a3Q
related: 13md uyV BNG
related: UXKZ 3zZ ipB
related: MYAz x9m 2LJ

Fiskeriekonomi
type: Concept
in scheme: JobTech Taxonomy - Färdighet
definition: Fiskeriekonomi
broader: zmYu aAM TuF
related: WZCM nfS eAk

Tidsserieanalys
type: Concept
in scheme: JobTech Taxonomy - Färdighet
definition: Tidsserieanalys
broader: zmYu aAM TuF
related: jv1x tpK 32p
related: ZA1N Z2B nFQ
related: 4Jty HpK a3Q

Transaktionsmonitorering
type: Concept
in scheme: JobTech Taxonomy - Färdighet
definition: Transaktionsmonitorering
broader: zmYu aAM TuF
related: Uw4n UB2 RCW

Radioelektronik
type: Concept
in scheme: JobTech Taxonomy - Färdighet
definition: Radioelektronik
broader: Elektronikkompetenser
related: nDaB vdy eAy
related: SPYW 7Z1 ShT
related: 4Jty HpK a3Q

Unity, spelmotor
type: Concept
in scheme: JobTech Taxonomy - Färdighet
definition: Unity, spelmotor
alternative label: Unity
broader: Spelmotorer
related: Q5DF juj 8do
related: 4Jty HpK a3Q
related: Mbt6 3ko DiD

Diplomerad aromaterapeut
type: Concept
in scheme: JobTech Taxonomy - Färdighet
definition: Diplomerad aromaterapeut visar på kunskaper om och behandling genom aromaterapi enligt branschstandarder. Diplomering utförs av olika utbildningsföretag.
broader: s48H Sft DTn
related: F19Z oB6 pg3

Yrkesbevis, träarbetare
type: Concept
in scheme: JobTech Taxonomy - Färdighet
definition: Yrkesbevis snickare visar att yrkesarbetaren har, för branschen och yrket i fråga, en godkänd yrkesteoretisk utbildning och en godkänd praktisk utbildning. Yrkesbeviset utfärdas av BYN
broader: Yrkesbevis/examen
related: 9mJN VwW Xjg

Emaljering
type: Concept
in scheme: JobTech Taxonomy - Färdighet
definition: Emaljering
broader: zmYu aAM TuF
related: nwSm phw sPo
related: dKUb KBP mw3
related: aKdV u7V R5j

Parfym/Kosmetika
type: Concept
in scheme: JobTech Taxonomy - Färdighet
definition: Parfym/Kosmetika
alternative label: Kosmetika
alternative label: Parfym
broader: zmYu aAM TuF
related: oXSW fbY XrY
related: ezKk kss CiQ
related: YKL2 FCB 1yr
related: xr7w N6Q QMA
related: 85cq 6uK 4cK

Biosäkerhet vid djurhantering
type: Concept
in scheme: JobTech Taxonomy - Färdighet
definition: Biosäkerhet vid djurhantering innebär allt som djurägare gör för att minska risken för att smittor kommer in i, utvecklas och sprids i djurbesättningar. Det inkluderar till exempel: - var och hur stallar är byggda - dagliga skötsel- och hygienrutiner - rutiner vid inköp av djur - skadedjursbekämpning - hantering av gödsel
broader: zmYu aAM TuF
related: c8r8 e4L gwj
related: Lrsj wRZ sFV
related: 8q1B 5AR CEM
related: KYmy iqC xiQ
related: yXbD NTH ijE
related: RYCQ ogb uUY
related: WL4E r4b ek4

Serigrafi
type: Concept
in scheme: JobTech Taxonomy - Färdighet
definition: Serigrafi
broader: zmYu aAM TuF
related: XeJB bkn mRn

Stenålderns arkeologi
type: Concept
in scheme: JobTech Taxonomy - Färdighet
definition: Stenålderns arkeologi
broader: zmYu aAM TuF
related: sXgV QFg vpb

Jazzdans, undervisning
type: Concept
in scheme: JobTech Taxonomy - Färdighet
definition: Jazzdans, undervisning
broader: zmYu aAM TuF
related: mcRJ kq2 jFr

ADO.NET, programmeringsspråk
type: Concept
in scheme: JobTech Taxonomy - Färdighet
definition: ADO.NET, programmeringsspråk
alternative label: ADO.NET
broader: Datorspråk
related: BAeH eg8 T2d
related: Fv7d YhP YmS
related: D9SL mtn vGM
related: DJh5 yyF hEM
related: 4Jty HpK a3Q

Bokbuss, körvana
type: Concept
in scheme: JobTech Taxonomy - Färdighet
definition: Bokbuss, körvana avser kompetens att köra och hantera en bokbuss, vilket inkluderar navigering och säker drift av fordonet i olika miljöer. Denna kompetens omfattar även förståelse för transport av böcker och andra medier samt samverkan med kommuner och bibliotek för att tillhandahålla litteratur till olika samhällsgrupper.
broader: zmYu aAM TuF
related: 3MBw pDA P2F

Kriminaljournalistik
type: Concept
in scheme: JobTech Taxonomy - Färdighet
definition: Kriminaljournalistik
broader: zmYu aAM TuF
related: SgNH hag n9D

Token Ring
type: Concept
in scheme: JobTech Taxonomy - Färdighet
definition: Token Ring
broader: nHDU dpj R9H
related: 1CX5 mZw Vcq
related: VCpu 5EN bBt
related: DJh5 yyF hEM
related: fWrt sLg koW
related: 4Jty HpK a3Q
related: 13md uyV BNG

Mönsterrätt
type: Concept
in scheme: JobTech Taxonomy - Färdighet
definition: Mönsterrätt
broader: zmYu aAM TuF
related: mp2Y vyC RFV

Cello, undervisning musikskola
type: Concept
in scheme: JobTech Taxonomy - Färdighet
definition: Cello, undervisning musikskola
broader: zmYu aAM TuF
related: mcRJ kq2 jFr

Sakral musik
type: Concept
in scheme: JobTech Taxonomy - Färdighet
definition: Sakral musik
broader: p1WM wCw LTd
related: AWJF wqZ va9

Galileo, resebokningssystem
type: Concept
in scheme: JobTech Taxonomy - Färdighet
definition: Galileo, resebokningssystem
alternative label: Galileo
broader: kRoQ fPR 8oK
related: fdLf oPp wVw
related: 4Jty HpK a3Q

Gesällbrev, gravör (blankstick/silver/skylt-stans och stämpelgravör)
type: Concept
in scheme: JobTech Taxonomy - Färdighet
definition: Gesällbrev, gravör (blankstick/silver/skylt-stans och stämpelgravör) är ett bevis på att en hantverkare har genomgått utbildning och avlagt de delprov som krävs inom det specifika hantverksyrket, och därigenom uppnått ett erkännande av färdigheter och kompetens inom yrket. Utfärdas av Sveriges hantverksråd i samråd med aktuell branschorganisation.
alternative label: Gesällbrev, gravör (blankstick
alternative label: silver
alternative label: skylt-stans och stämpelgravör)
broader: Yrkesbevis/examen
related: nwSm phw sPo
related: aKdV u7V R5j

Hotellvana, fartygserfarenhet
type: Concept
in scheme: JobTech Taxonomy - Färdighet
definition: Hotellvana, fartygserfarenhet
broader: Övriga specialiteter, sjöfart
related: UjoW meY Zwt

Flygelhorn
type: Concept
in scheme: JobTech Taxonomy - Färdighet
definition: Flygelhorn
broader: wLYs CKS wK8
related: AWJF wqZ va9

Bergtruck
type: Concept
in scheme: JobTech Taxonomy - Färdighet
definition: Bergtruck
broader: zmYu aAM TuF
related: f71c gjL RDq

Affischklistring/Affischering
type: Concept
in scheme: JobTech Taxonomy - Färdighet
definition: Affischklistring/Affischering avser processen att montera affischer på olika ytor för att informera och marknadsföra evenemang, produkter eller tjänster. Kompetensen innefattar kunskap om val av material och tekniker för att säkerställa korrekt och hållbar applicering av affischer.
alternative label: Affischering
alternative label: Affischklistring
broader: zmYu aAM TuF
related: ieVp d5L rS9

Maskinskötsel, keramisk industri
type: Concept
in scheme: JobTech Taxonomy - Färdighet
definition: Maskinskötsel, keramisk industri, avser kompetens inom drift och övervakning av maskiner i den keramiska produktionen. Detta innefattar hantering av olika typer av maskiner och anläggningar för tillverkning av keramiska produkter, vilket kräver kunskap om processer och principer inom maskinteknik och materialhantering.
broader: zmYu aAM TuF
related: hxm6 xkr dHm

Visual Basic, programmeringsspråk
type: Concept
in scheme: JobTech Taxonomy - Färdighet
definition: Visual Basic, programmeringsspråk
alternative label: Visual Basic
broader: Datorspråk
related: BAeH eg8 T2d
related: Fv7d YhP YmS
related: nDaB vdy eAy
related: D9SL mtn vGM
related: DJh5 yyF hEM
related: SPYW 7Z1 ShT
related: 4Jty HpK a3Q

Idéhistoria
type: Concept
in scheme: JobTech Taxonomy - Färdighet
definition: Idéhistoria
broader: zmYu aAM TuF
related: sXgV QFg vpb

Radioloksutbildning
type: Concept
in scheme: JobTech Taxonomy - Färdighet
definition: Radioloksutbildning är en yrkesutbildning med inriktning mot att köra tåg via radiolänk.
broader: Yrkesbevis/examen
related: nk6Z 5oD QoM

Underhåll av likströmssystem
type: Concept
in scheme: JobTech Taxonomy - Färdighet
definition: Underhåll av likströmssystem
broader: zmYu aAM TuF
related: MW1P GNJ 4F9

Sensorteknik
type: Concept
in scheme: JobTech Taxonomy - Färdighet
definition: Sensorteknik
broader: zmYu aAM TuF
related: nDaB vdy eAy
related: SPYW 7Z1 ShT
related: 4Jty HpK a3Q

Transport av farligt gods
type: Concept
in scheme: JobTech Taxonomy - Färdighet
definition: Farligt gods avser ämnen och föremål som sådana farliga egenskaper att de kan orsaka skador på människor, miljö eller egendom, om de inte hanteras rätt under en transport. Källa: www.msb.se
broader: zmYu aAM TuF
related: nuXg Wjc JPd
related: yXbD NTH ijE
related: 3MBw pDA P2F
related: nNxJ YWy vR2
related: 957L kZK rHZ

Filmframkallningsmaskin, skötselvana
type: Concept
in scheme: JobTech Taxonomy - Färdighet
definition: Filmframkallningsmaskin, skötselvana avser färdigheten att hantera och underhålla maskiner som används för framkallning av film. Kompetensen innefattar kunskaper om maskinens funktioner och rutiner för korrekt drift och underhåll för att säkerställa kvalitativa resultat i bildframställning.
broader: zmYu aAM TuF
related: Vfum e6B 7Bw
related: 3J38 DNz YKK

Utbildning på motorsåg
type: Concept
in scheme: JobTech Taxonomy - Färdighet
definition: Utbildning på motorsåg avser kompetens inom hantering och säker användning av motorsågar för olika typer av arbete, inklusive avverkning och underhåll av träd och vegetation. Utbildningen lägger vikt vid säkerhetsföreskrifter, korrekt teknik och underhåll av utrustningen för att minimera risker och säkerställa effektivt arbete.
broader: Yrkesbevis/examen
related: XBh3 Xrm C4R
related: qouP wtb 93q
related: 2xQ4 4kh kTZ

Spannmålsodling
type: Concept
in scheme: JobTech Taxonomy - Färdighet
definition: Spannmålsodling
broader: zmYu aAM TuF
related: 9QMD sZ3 ZjX
related: k3R3 UkC nK2
related: RYCQ ogb uUY

ATV, reparationsvana
type: Concept
in scheme: JobTech Taxonomy - Färdighet
definition: ATV, reparationsvana avser färdigheten att underhålla och reparera all-terrain vehicles (ATV) för att säkerställa deras funktionalitet och säkerhet. Kompetensen omfattar kunskap om mekaniska system, elektriska system och specifika reparationsmetoder för olika typer av ATV, vilket är relevant för yrkesgrupper som motorfordonsmekaniker och fordonsreparatörer.
broader: zmYu aAM TuF
related: Lzpv ofL 3H5

Återvinningsarbete
type: Concept
in scheme: JobTech Taxonomy - Färdighet
definition: Återvinningsarbete avser aktiviteter och processer som syftar till att samla in, sortera och återvinna material för att minska avfallet och främja en cirkulär ekonomi. Detta arbete innefattar hantering av olika typer av avfall, inklusive metall, plast, och papper, samt nedmontering av uttjänta fordon och apparater för att återvinna användbara delar.
broader: zmYu aAM TuF
related: df9D e6y 61z
related: X7HR rZK 4wj
related: yXbD NTH ijE
related: 3MBw pDA P2F

Oracle Content Management, CMS
type: Concept
in scheme: JobTech Taxonomy - Färdighet
definition: Oracle, CMS/innehållshanteringssystem
alternative label: Oracle Content Management, innehållshanteringssystem
alternative label: Oracle-kunskaper
alternative label: Oraclekunskap
alternative label: Oracleutveckling
broader: jTAz uCP RNc
related: BAeH eg8 T2d
related: cBBa ngH fCx
related: Fv7d YhP YmS
related: vPP6 rsw dck
related: oEmP NC1 sXE
related: D9SL mtn vGM
related: 4Jty HpK a3Q
related: MYAz x9m 2LJ

Yogamassage
type: Concept
in scheme: JobTech Taxonomy - Färdighet
definition: Yogamassage
broader: zmYu aAM TuF
related: F19Z oB6 pg3
related: uxHV KXc PKD

Kontorsstädning
type: Concept
in scheme: JobTech Taxonomy - Färdighet
definition: Kontorsstädning avser att utföra städ- och rengöringsåtgärder i kontorsmiljöer för att upprätthålla en ren och hälsosam arbetsplats. Kompetensen omfattar bland annat dammsugning, moppning, ytdesinfektion och borttagning av skräp.
broader: zmYu aAM TuF
related: Z6TY xDf Yup

3D-grafik-Carrara
type: Concept
in scheme: JobTech Taxonomy - Färdighet
definition: 3D-grafik-Carrara
broader: Programvara för digitalt skapande
related: 8Bmh vtM zts
related: 34Tn BQQ tfo
related: Q5DF juj 8do
related: 4Jty HpK a3Q
related: LeQV umf wUS
related: Mbt6 3ko DiD

Legitimation som kiropraktor
type: Concept
in scheme: JobTech Taxonomy - Färdighet
definition: Legitimation som krävs för att kunna arbeta som kiropraktor i Sverige. Utfärdas av Socialstyrelsen.
broader: Yrkesbevis/examen
related: 4P8B LtK JgE
related: r1Gk 3EN bpw
related: aWki 4uA adn

Butiksekonomikunskap
type: Concept
in scheme: JobTech Taxonomy - Färdighet
definition: Butiksekonomikunskap avser kunskaper inom ekonomiska aspekter som är relevanta för driften av butikverksamhet. Detta inkluderar förståelse för försäljning, lagerhantering, budgetering och kostnadskontroll för att optimera butikens resultat och effektivitet.
broader: zmYu aAM TuF
related: Fp7x Yqt bx9

Klagomålshantering
type: Concept
in scheme: JobTech Taxonomy - Färdighet
definition: Klagomålshantering
broader: zmYu aAM TuF
related: 4W6S 1kA nrv
related: fsnw ZCu v2U
related: Fghp zje WA8
related: UjoW meY Zwt
related: FfMN Bw1 qYR
related: FKCE Anf zGH
related: XGyi i4B ME7

Finblästring
type: Concept
in scheme: JobTech Taxonomy - Färdighet
definition: Finblästring
broader: zmYu aAM TuF
related: idjo 2Wr a3E

Områdesansvar, kulturfrågor
type: Concept
in scheme: JobTech Taxonomy - Färdighet
definition: Områdesansvar, kulturfrågor
broader: zmYu aAM TuF
related: sWzF 6pd Y6L

Byggkonstruktion-AutoCAD Revit Structure Suite
type: Concept
in scheme: JobTech Taxonomy - Färdighet
definition: Byggkonstruktion-AutoCAD Revit Structure Suite
broader: mTLu uo2 gq2
related: thZP oR7 WrY
related: w6ud quG dgh
related: Pd51 xnr KCY
related: XeBP nMe pXx
related: ETAR ggZ Wuw
related: 41KB bfk 5jR
related: 4Jty HpK a3Q

Entreprenörskap, undervisning gymnasienivå
type: Concept
in scheme: JobTech Taxonomy - Färdighet
definition: Entreprenörskap, undervisning gymnasienivå
broader: Inriktning på lärarkompetens
related: 2x2V UeL 6ke

Piercing
type: Concept
in scheme: JobTech Taxonomy - Färdighet
definition: Piercing avser en kompetens inom kroppskonst där man utför håltagning av olika delar av kroppen för att sätta in smycken. Kompetensen inkluderar tekniker för säker och hygienisk utförande av piercings, samt kunskap om eftervård och riskhantering.
broader: zmYu aAM TuF
related: ezKk kss CiQ

Lärarexamen, grundskolans senare år och gymnasieskolan
type: Concept
in scheme: JobTech Taxonomy - Färdighet
definition: Lärarexamen, grundskolans senare år och gymnasieskolan
broader: Yrkesbevis/examen
related: 2x2V UeL 6ke
related: 4KhP FxL uZ5

Kognitiv psykoterapi
type: Concept
in scheme: JobTech Taxonomy - Färdighet
definition: Kognitiv psykoterapi
broader: zmYu aAM TuF
related: UUQi UJ5 MSb
related: VYeq GDF a2g

Signalställverk, installation och underhåll
type: Concept
in scheme: JobTech Taxonomy - Färdighet
definition: Signalställverk, installation och underhåll avser den kompetens som omfattar installation, underhåll och reparation av signalställverk inom transportsystem, specifikt inom järnvägstrafik. Kompetensen innefattar kännedom om elektriska och elektroniska system som styr och övervakar trafiksignalering för att säkerställa säker och effektiv drift.
broader: zmYu aAM TuF
related: fWrt sLg koW

Gesällbrev, tapetserare
type: Concept
in scheme: JobTech Taxonomy - Färdighet
definition: Gesällbrev, tapetserare är ett bevis på att en hantverkare har genomgått utbildning och avlagt de delprov som krävs inom det specifika hantverksyrket, och därigenom uppnått ett erkännande av färdigheter och kompetens inom yrket. Utfärdas av Sveriges hantverksråd i samråd med aktuell branschorganisation.
broader: Yrkesbevis/examen
related: vhUJ LyD XWc

Filmvetenskap
type: Concept
in scheme: JobTech Taxonomy - Färdighet
definition: Filmvetenskap
broader: zmYu aAM TuF
related: iBUL s38 izZ
related: sXgV QFg vpb

Mästarbrev, möbelsnickare
type: Concept
in scheme: JobTech Taxonomy - Färdighet
definition: Mästarbrev, möbelsnickare
broader: Yrkesbevis/examen
related: 1Nwn GYH wkH

Evergreens
type: Concept
in scheme: JobTech Taxonomy - Färdighet
definition: Evergreens
broader: p1WM wCw LTd
related: AWJF wqZ va9

Förarbevis för skylift
type: Concept
in scheme: JobTech Taxonomy - Färdighet
definition: Förarbevis för skylift
broader: s48H Sft DTn
related: bZ4J riZ zK6
related: Y4j1 P17 wVA
related: q2Ge zrQ zJb
related: 9mJN VwW Xjg
related: AD3U cFH rbe
related: fLKb bJ3 69p
related: NnB3 eWH auo
related: L4hA SJP SFi
related: bXfo 4hb SXx

Lastbilar, produktkunskap
type: Concept
in scheme: JobTech Taxonomy - Färdighet
definition: Lastbilar, produktkunskap, avser den kunskap och förståelse som krävs för att hantera och informera om olika typer av lastbilar, deras specifikationer, funktioner och användningsområden. Kompetensen innefattar insikt i tekniska egenskaper, bränsleeffektivitet och servicebehov, vilket är väsentligt för att stödja kunder i deras val och användning av lastbilar.
broader: zmYu aAM TuF
related: oXSW fbY XrY
related: YKL2 FCB 1yr

Bagagehantering
type: Concept
in scheme: JobTech Taxonomy - Färdighet
definition: Bagagehantering omfattar hantering av resenärers bagage. Kompetensen innebär att registrera, märka och spåra bagage samt att säkerställa att det hanteras korrekt och enligt gällande regler och rutiner. Det inkluderar arbete med specialbagage, exempelvis skrymmande gods eller föremål med särskilda hanteringskrav, samt hantering av borttappat, skadat eller försenat bagage.
broader: zmYu aAM TuF
related: fdLf oPp wVw
related: s78G Zp2 dkq

Java Server Pages (JSP), programmeringsspråk
type: Concept
in scheme: JobTech Taxonomy - Färdighet
definition: Java Server Pages (JSP), programmeringsspråk
alternative label: JSP
alternative label: Java Server Pages
alternative label: Java Server Pages (JSP)
broader: Datorspråk
related: BAeH eg8 T2d
related: Fv7d YhP YmS
related: 8Bmh vtM zts
related: D9SL mtn vGM
related: DJh5 yyF hEM
related: 4Jty HpK a3Q
related: Mbt6 3ko DiD
related: UXKZ 3zZ ipB

Byggnadsrådgivning
type: Concept
in scheme: JobTech Taxonomy - Färdighet
definition: Byggnadsrådgivning
broader: zmYu aAM TuF
related: XurM DVs ggn
related: 3LdB WEJ 8Ms

Robotövervakning
type: Concept
in scheme: JobTech Taxonomy - Färdighet
definition: Robotövervakning avser kompetens i att styra och övervaka robotar och automatiserade system inom industriell produktion. Detta inkluderar övervakning av robotar i deras arbetsuppgifter, säkerställande av precision och kvalitet, samt att kunna programmera och justera maskiner efter behov.
broader: zmYu aAM TuF
related: dKUb KBP mw3
related: vaEp iBS c5h
related: 7Zqy hSM Fig
related: 4Jty HpK a3Q

IIS, webbserverprogram
type: Concept
in scheme: JobTech Taxonomy - Färdighet
definition: IIS, webbserverprogram
alternative label: IIS
broader: Applikationsplattformar
related: BAeH eg8 T2d
related: cBBa ngH fCx
related: D9SL mtn vGM
related: DJh5 yyF hEM
related: UxT1 tPF Kbg
related: 4Jty HpK a3Q
related: UXKZ 3zZ ipB
related: MYAz x9m 2LJ

Eternellodling
type: Concept
in scheme: JobTech Taxonomy - Färdighet
definition: Eternellodling
broader: zmYu aAM TuF
related: XBh3 Xrm C4R
related: yXbD NTH ijE
related: 2xQ4 4kh kTZ

Infektionssjukvård
type: Concept
in scheme: JobTech Taxonomy - Färdighet
definition: Infektionssjukvård
broader: zmYu aAM TuF
related: Z8ci bBE tmx

Naturvetenskaplig inriktning, undervisning
type: Concept
in scheme: JobTech Taxonomy - Färdighet
definition: Naturvetenskaplig inriktning, undervisning
broader: Inriktning på lärarkompetens
related: 2x2V UeL 6ke
related: 4KhP FxL uZ5

Ventilationsplåtslagning
type: Concept
in scheme: JobTech Taxonomy - Färdighet
definition: Ventilationsplåtslagning
broader: zmYu aAM TuF
related: L4hA SJP SFi
related: bXfo 4hb SXx

Teknisk förvaltning av fastigheter
type: Concept
in scheme: JobTech Taxonomy - Färdighet
definition: Teknisk förvaltning av fastigheter
broader: zmYu aAM TuF
related: U8HK Jdi GuC

Passersystem, installationsvana
type: Concept
in scheme: JobTech Taxonomy - Färdighet
definition: Passersystem, installationsvana avser kunskaper och färdigheter för att installera och underhålla passersystem, inklusive elektroniska lås och kontrollsystem för tillträde. Kompetensen innefattar även förståelse för tekniska specifikationer och arbetsmetoder kopplade till säkerhet och funktionalitet hos sådana system.
broader: zmYu aAM TuF
related: e6nk AGp y28
related: fWrt sLg koW
related: 4Jty HpK a3Q

Bageriarbete
type: Concept
in scheme: JobTech Taxonomy - Färdighet
definition: Bageriarbete avser processer och tekniker för att skapa olika typer av bröd och bakverk, vilket inkluderar både matbröd och kaffebröd. Kompetensen omfattar även tillverkning av tårtor, bakelser, kakor, desserter samt handgjord choklad och konfekt.
broader: zmYu aAM TuF
related: 5qT8 z9d 8rw

Vuxenpsykiatri
type: Concept
in scheme: JobTech Taxonomy - Färdighet
definition: Vuxenpsykiatri
broader: zmYu aAM TuF
related: dJXy Rpq a2u
related: pok1 ipJ yzD

B-certifikat, dykning, 50 m, luft
type: Concept
in scheme: JobTech Taxonomy - Färdighet
definition: B-certifikat, dykning, 50 m, luft
broader: s48H Sft DTn
related: DPPw 4wa AsH
related: EA6o N1N QtT
related: A6X3 efC VNy
related: sXgV QFg vpb
related: FKCE Anf zGH

Marinarkeologi
type: Concept
in scheme: JobTech Taxonomy - Färdighet
definition: Marinarkeologi
broader: zmYu aAM TuF
related: sXgV QFg vpb

Apache Ant, programmeringsverktyg
type: Concept
in scheme: JobTech Taxonomy - Färdighet
definition: Apache Ant, programmeringsverktyg
alternative label: Apache Ant
alternative label: Apache ant
broader: Programmerings- och systemutvecklingsverktyg
related: D9SL mtn vGM
related: DJh5 yyF hEM
related: 4Jty HpK a3Q
related: MYAz x9m 2LJ

SGML, programmeringsspråk
type: Concept
in scheme: JobTech Taxonomy - Färdighet
definition: SGML, programmeringsspråk
alternative label: SGML
broader: Datorspråk
related: BAeH eg8 T2d
related: Fv7d YhP YmS
related: 8Bmh vtM zts
related: D9SL mtn vGM
related: DJh5 yyF hEM
related: 4Jty HpK a3Q
related: Mbt6 3ko DiD

Mästarbrev, pianotekniker
type: Concept
in scheme: JobTech Taxonomy - Färdighet
definition: Mästarbrev, pianotekniker
broader: Yrkesbevis/examen
related: aKdV u7V R5j

Sommelierkompetens
type: Concept
in scheme: JobTech Taxonomy - Färdighet
definition: Sommelierkompetens avser kunskap och färdighet i att hantera och rekommendera vin och andra drycker i olika mat- och serveringssammanhang. Kompetensen omfattar bland annat vinets ursprung, smakprofil, och hur det kompletterar maträtter, samt förmåga att skapa en välgenomtänkt dryckeslista.
broader: zmYu aAM TuF
related: XFXX Jq9 Y2a
related: UjoW meY Zwt

Maskinskötsel, förpacknings- och påfyllningsmaskiner
type: Concept
in scheme: JobTech Taxonomy - Färdighet
definition: Maskinskötsel, förpacknings- och påfyllningsmaskiner avser förmåga att övervaka och styra maskiner som används för att fylla, förpacka och märka produkter. Kompetensen innefattar kunskap om maskinens funktioner och inställningar samt underhåll av utrustningen för att säkerställa effektiv produktion.
broader: zmYu aAM TuF
related: aU9p ekE Fqf

Analysverktyg
type: Concept
in scheme: JobTech Taxonomy - Färdighet
definition: Analysverktyg
broader: zmYu aAM TuF
related: mis4 feV uex
related: v9nU 6Fw 4Qg
related: qn2U dB9 Cmh
related: 3jEy yuT aVo
related: rwpH 6RA XTT
related: K8yg U4C gkY
related: nDaB vdy eAy
related: 33Nt DSs YYA
related: nuXg Wjc JPd
related: SPYW 7Z1 ShT
related: PRQn 9yw NJA
related: 4Jty HpK a3Q

Mästarbrev, skomakare (reparation)
type: Concept
in scheme: JobTech Taxonomy - Färdighet
definition: Mästarbrev, skomakare (reparation)
broader: Yrkesbevis/examen
related: vJQk YvC XB7

Diarieföringsvana
type: Concept
in scheme: JobTech Taxonomy - Färdighet
definition: Diarieföringsvana avser kompetens inom registrering och hantering av dokument och ärenden i enlighet med gällande rutiner och riktlinjer. Denna kompetens innefattar kunskap om diarieföringssystem och regler för dokumentation, vilket är relevant i många administrativa roller.
broader: zmYu aAM TuF
related: 2kLc pto DpV
related: eQ4M CNm ozj
related: ZQTR hVC QhJ
related: PxXc 16t oZo
related: MGk3 LvL AU2
related: oEmP NC1 sXE
related: zKvJ GnC Szx
related: p16X 44f rwZ

Film/redigering-Media 100
type: Concept
in scheme: JobTech Taxonomy - Färdighet
definition: Film/redigering-Media 100
alternative label: Film-media 100
alternative label: Redigering-media 100
broader: Programvara för digitalt skapande
related: 8Bmh vtM zts
related: 4BsK q2C sCL
related: CkRH 4Qn iX3
related: 3J38 DNz YKK
related: PH2M uV4 r72
related: 4Jty HpK a3Q

A - Fullständig auktorisation
type: Concept
in scheme: JobTech Taxonomy - Färdighet
definition: A - Fullständig auktorisation
broader: Elbehörigheter
related: MW1P GNJ 4F9
related: Rsoy sS6 6c4
related: df9D e6y 61z
related: e6nk AGp y28
related: nDaB vdy eAy
related: 4BsK q2C sCL
related: Cppd 9P7 HeR
related: SPYW 7Z1 ShT
related: fLKb bJ3 69p
related: TrwQ RXT W8a
related: fWrt sLg koW
related: KttZ Skc bMR
related: 3UzE P8A 9sS
related: a75S eLg JWH
related: L4hA SJP SFi
related: yyF7 jsW EeP

Verksamhetsledning, lantbruksföretag
type: Concept
in scheme: JobTech Taxonomy - Färdighet
definition: Verksamhetsledning, lantbruksföretag avser den kompetens som innefattar ansvar för strategisk planering och vägledning av verksamheter inom lantbruk och relaterade sektorer. Denna kompetens omfattar formulering av mål och strategier, resursfördelning, budgetansvar samt uppföljning och utvärdering av verksamhetens resultat.
broader: zmYu aAM TuF
related: yXbD NTH ijE
related: 9QMD sZ3 ZjX

Mark/infrastruktur-Autodesk MapGuide Enterprise
type: Concept
in scheme: JobTech Taxonomy - Färdighet
definition: Mark/infrastruktur-Autodesk MapGuide Enterprise
alternative label: Mark
alternative label: infrastruktur-Autodesk MapGuide Enterprise
broader: mTLu uo2 gq2
related: 3jEy yuT aVo
related: rwpH 6RA XTT
related: GMDo DVo Yzh
related: thZP oR7 WrY
related: w6ud quG dgh
related: K8yg U4C gkY
related: ketV G9W GeR
related: XeBP nMe pXx
related: PRQn 9yw NJA
related: 4Jty HpK a3Q

Forskningsdokumentation
type: Concept
in scheme: JobTech Taxonomy - Färdighet
definition: Forskningsdokumentation avser insamling, systematisering och presentation av data och information kopplad till forskningsaktiviteter. Kompetensen omfattar färdigheter att skapa tydliga och korrekta dokument som dokumenterar forskningsprocesser och resultat för att möjliggöra återanvändning och granskning av forskning.
broader: zmYu aAM TuF
related: HPxT fQJ zwT
related: XurM DVs ggn
related: Z2MZ eYc Lfv
related: mp2Y vyC RFV
related: mcRJ kq2 jFr
related: oEmP NC1 sXE
related: rE1E m3d cx1
related: cYCo PxY zQd
related: PQDm Z63 zst
related: sXgV QFg vpb
related: dsK3 hkt zGy
related: SPYW 7Z1 ShT
related: RPBE x5M cXX
related: UxT1 tPF Kbg
related: e9FK VKh ahW
related: 4Jty HpK a3Q
related: 6zAR EHM Kwj
related: P7eS nP8 3dy

Auktoriserad besiktningsman, fartyg
type: Concept
in scheme: JobTech Taxonomy - Färdighet
definition: Auktoriserad besiktningsman, fartyg
broader: Yrkesbevis/examen
related: nuXg Wjc JPd

Stansning, bokbinderi
type: Concept
in scheme: JobTech Taxonomy - Färdighet
definition: Stansning, bokbinderi, avser tekniken att skapa specifika former och hål i papper eller kartong genom att använda stansningsmaskiner i bokbinderiprocessen. Kompetensen omfattar kunskap om maskiner samt materialens egenskaper och kvaliteter som påverkar stansningsresultatet.
broader: zmYu aAM TuF
related: mPzg 93F QEv

Factoring
type: Concept
in scheme: JobTech Taxonomy - Färdighet
definition: Factoring
broader: zmYu aAM TuF
related: Y6yY SuR hVh
related: Uw4n UB2 RCW
related: cRmd 536 pT1

Mjuklödning
type: Concept
in scheme: JobTech Taxonomy - Färdighet
definition: Mjuklödning
broader: on11 B1f LEw
related: e6nk AGp y28
related: wQ1E Bzk ZyA
related: fWrt sLg koW
related: bXfo 4hb SXx

Kryptoteknik
type: Concept
in scheme: JobTech Taxonomy - Färdighet
definition: Kryptoteknik
broader: zmYu aAM TuF
related: nDaB vdy eAy
related: DJh5 yyF hEM
related: SPYW 7Z1 ShT
related: 4Jty HpK a3Q

Cylinderborrning
type: Concept
in scheme: JobTech Taxonomy - Färdighet
definition: Cylinderborrning
broader: zmYu aAM TuF
related: vaEp iBS c5h

Bettfysiologi, specialistkompetens för tandläkare
type: Concept
in scheme: JobTech Taxonomy - Färdighet
definition: Bettfysiologi, specialistkompetens för tandläkare
broader: Specialistkompetens för tandläkare
related: HPxT fQJ zwT

Microsoft Intune, systemutvecklingsverktyg
type: Concept
in scheme: JobTech Taxonomy - Färdighet
definition: Microsoft Intune, systemutvecklingsverktyg
alternative label: Microsoft Intune
broader: Programmerings- och systemutvecklingsverktyg
related: DJh5 yyF hEM
related: 4Jty HpK a3Q
related: UXKZ 3zZ ipB

Signalsystem inom järnväg, installation och underhåll
type: Concept
in scheme: JobTech Taxonomy - Färdighet
definition: Signalsystem inom järnväg, installation och underhåll avser kompetensen att installera, underhålla och reparera signalsystem som används för att styra och övervaka järnvägstrafik. Denna kompetens inkluderar även kunskap om elektroniska och kommunikationstekniska system som är avgörande för säker och effektiv drift av järnvägsinfrastruktur.
broader: zmYu aAM TuF
related: fWrt sLg koW

Mästarbrev, trädgårdsanläggare
type: Concept
in scheme: JobTech Taxonomy - Färdighet
definition: Mästarbrev, trädgårdsanläggare
broader: Yrkesbevis/examen
related: XBh3 Xrm C4R
related: yXbD NTH ijE

Strängsprutning-profil
type: Concept
in scheme: JobTech Taxonomy - Färdighet
definition: Strängsprutning-profil
broader: zmYu aAM TuF
related: yPQ4 EaN Dtj

Besiktningsman, gas
type: Concept
in scheme: JobTech Taxonomy - Färdighet
definition: Besiktningsman, gas
broader: s48H Sft DTn
related: KttZ Skc bMR

Sjökapten (behörighet)
type: Concept
in scheme: JobTech Taxonomy - Färdighet
definition: Sjökapten (behörighet)
broader: Behörigheter, sjöfart
related: kZwz D8K bKs
related: kDnq Q98 sD3

Marmorskulptur
type: Concept
in scheme: JobTech Taxonomy - Färdighet
definition: Marmorskulptur
broader: zmYu aAM TuF
related: 34Tn BQQ tfo

Bildoptimering vid röntgendiagnostik
type: Concept
in scheme: JobTech Taxonomy - Färdighet
definition: Bildoptimering vid röntgendiagnostik
broader: zmYu aAM TuF
related: 1tGC fXC mxX
related: 4Jty HpK a3Q

Textilblekning
type: Concept
in scheme: JobTech Taxonomy - Färdighet
definition: Textilblekning
broader: zmYu aAM TuF
related: 4DET dLf iB9

Rörställning
type: Concept
in scheme: JobTech Taxonomy - Färdighet
definition: Rörställning
broader: zmYu aAM TuF
related: Y4j1 P17 wVA

Skolfotografering
type: Concept
in scheme: JobTech Taxonomy - Färdighet
definition: Skolfotografering
broader: zmYu aAM TuF
related: 3J38 DNz YKK

Eko, redovisningssystem
type: Concept
in scheme: JobTech Taxonomy - Färdighet
definition: Eko, redovisningssystem
alternative label: Eko
broader: xSJR 1Kq pxB
related: eQ4M CNm ozj
related: q81z 3oD 1qu
related: ij8k EwC zyB
related: 4Jty HpK a3Q

Kostymformgivning
type: Concept
in scheme: JobTech Taxonomy - Färdighet
definition: Kostymformgivning
broader: zmYu aAM TuF
related: iBUL s38 izZ
related: PH2M uV4 r72

Scheme, programmeringsspråk
type: Concept
in scheme: JobTech Taxonomy - Färdighet
definition: Scheme, programmeringsspråk
alternative label: Scheme
broader: Datorspråk
related: BAeH eg8 T2d
related: Fv7d YhP YmS
related: D9SL mtn vGM
related: DJh5 yyF hEM
related: 4Jty HpK a3Q

Synthesizer, undervisning musikskola
type: Concept
in scheme: JobTech Taxonomy - Färdighet
definition: Synthesizer, undervisning musikskola
broader: zmYu aAM TuF
related: mcRJ kq2 jFr

Tillverkningsindustri-Solid Edge
type: Concept
in scheme: JobTech Taxonomy - Färdighet
definition: Tillverkningsindustri-Solid Edge
broader: mTLu uo2 gq2
related: mis4 feV uex
related: xm5G vGn iyk
related: mp2Y vyC RFV
related: 3jEy yuT aVo
related: rwpH 6RA XTT
related: K8yg U4C gkY
related: PRQn 9yw NJA
related: 4Jty HpK a3Q

Fordonsteknik
type: Concept
in scheme: JobTech Taxonomy - Färdighet
definition: Fordonsteknik
broader: zmYu aAM TuF
related: K8yg U4C gkY
related: yXbD NTH ijE
related: PRQn 9yw NJA
related: 4Jty HpK a3Q

Rekryteringsvana
type: Concept
in scheme: JobTech Taxonomy - Färdighet
definition: Rekryteringsvana
broader: zmYu aAM TuF
related: mNoS AN5 drn
related: vPP6 rsw dck
related: bjqk F3A 5Hk

Annonstjänster, produktkunskap
type: Concept
in scheme: JobTech Taxonomy - Färdighet
definition: Annonstjänster, produktkunskap
broader: zmYu aAM TuF
related: dUuh wwa FGj
related: p16X 44f rwZ

Diplomerad installatör, utvändigt solskydd
type: Concept
in scheme: JobTech Taxonomy - Färdighet
definition: Diplomerad installatör, utvändigt solskydd
broader: s48H Sft DTn
related: Kxm9 N3V shF

Ortoser/Kroppsburna hjälpmedel
type: Concept
in scheme: JobTech Taxonomy - Färdighet
definition: Kompetens inom ortoser/kroppsburna hjälpmedel innebär förmåga att tillverka, anpassa och underhålla hjälpmedel som stödjer eller ersätter en kroppsdel. Det inkluderar arbete med individuellt utformade ortoser och proteser, kunskap om material och konstruktion, samt förståelse för patientens behov.
alternative label: Kroppsburna hjälpmedel
alternative label: Ortoser
broader: zmYu aAM TuF
related: 39yB xPQ ozd

Arabiska, cirkelledning
type: Concept
in scheme: JobTech Taxonomy - Färdighet
definition: Arabiska, cirkelledning
broader: zmYu aAM TuF
related: 1CX5 mZw Vcq

Arbetsledning inom hotellreception
type: Concept
in scheme: JobTech Taxonomy - Färdighet
definition: Arbetsledning inom hotellreception innebär att organisera, leda och utveckla receptionens dagliga verksamhet på hotell eller boendeanläggningar. Arbetsledaren för hotellreception planerar bemanning, schemalägger personal och introducerar nya medarbetare i arbetsflödet. Arbetsledaren hanterar och fördelar arbetsuppgifter, övervakar kvalitetsrutiner och koordinerar samarbete mellan reception och andra avdelningar som städ, kök och konferensservice. Arbetsledaren arbetar nära med teamet, coachar i gästmöte, implementerar rutiner för effektivitet och gästnöjdhet samt löser problem och reklamationer. Kontinuerlig kommunikation och uppföljning av resultat och service är central. Administrativa uppgifter som lönerapportering, systemhantering och budgetarbete ingår vanligtvis i rollen.
broader: zmYu aAM TuF
related: bYde Frc xcB

Infektionssjukdomar, specialistområde för sjuksköterska
type: Concept
in scheme: JobTech Taxonomy - Färdighet
definition: En fördjupad specialistkompetens för sjuksköterska inom infektionssjukdomar.
broader: Specialistområde för sjuksköterska
related: 6zAR EHM Kwj

Körledning
type: Concept
in scheme: JobTech Taxonomy - Färdighet
definition: Körledning
broader: zmYu aAM TuF
related: mcRJ kq2 jFr
related: AWJF wqZ va9

Mästarbrev, låssmed
type: Concept
in scheme: JobTech Taxonomy - Färdighet
definition: Mästarbrev, låssmed
broader: Yrkesbevis/examen
related: e6nk AGp y28

Oracle JCAPS, applikationsplattform
type: Concept
in scheme: JobTech Taxonomy - Färdighet
definition: Oracle JCAPS, applikationsplattform
alternative label: Oracle JCAPS
alternative label: Oracle-kunskaper
alternative label: Oraclekunskap
alternative label: Oracleutveckling
broader: Applikationsplattformar
related: BAeH eg8 T2d
related: cBBa ngH fCx
related: D9SL mtn vGM
related: DJh5 yyF hEM
related: UxT1 tPF Kbg
related: 4Jty HpK a3Q
related: UXKZ 3zZ ipB
related: MYAz x9m 2LJ

Trav, professionell utövning
type: Concept
in scheme: JobTech Taxonomy - Färdighet
definition: Trav, professionell utövning
broader: Idrott/aktivitet
related: AwXA EM4 71n

Skorstensbesiktning
type: Concept
in scheme: JobTech Taxonomy - Färdighet
definition: Skorstensbesiktning
broader: zmYu aAM TuF
related: SUfj 4D9 FNx

Certifikat, sakkunnig av tillgänglighet
type: Concept
in scheme: JobTech Taxonomy - Färdighet
definition: Certifikat, sakkunnig av tillgänglighet visar på kunskaper om gällande lagstiftning och regelverk för att kunna avgöra om bygglagstiftningens tillgänglighetskrav är uppfyllda eller inte. Boverket anger vilka kompetenskrav som ska ställas på en certifierad sakkunnig av tillgänglighet. Certifiering utförs av ackrediterat certifieringsorgan.
broader: s48H Sft DTn
related: wCx8 rY3 XUT
related: thZP oR7 WrY
related: w6ud quG dgh
related: 41KB bfk 5jR

Maskininläsning/Optisk teckenläsning
type: Concept
in scheme: JobTech Taxonomy - Färdighet
definition: Maskininläsning/Optisk teckenläsning
alternative label: OCR (Optical Character Recognition)
broader: zmYu aAM TuF
related: UxT1 tPF Kbg
related: 4Jty HpK a3Q

Drift och underhåll bioraffinaderi
type: Concept
in scheme: JobTech Taxonomy - Färdighet
definition: Drift och underhåll bioraffinaderi avser processer involverade i drift och underhåll av anläggningar för produktion av biobaserade bränslen och råvaror genom kemiska och fysiska processer. Kompetensen omfattar kunskaper och färdigheter kring övervakning, styrning och optimering av processer.
broader: zmYu aAM TuF
related: yXbD NTH ijE
related: QEBd qHu vGr

Kabel-TV/Satellit-TV
type: Concept
in scheme: JobTech Taxonomy - Färdighet
definition: Kabel-TV/Satellit-TV
alternative label: Kabel-TV
alternative label: Satellit-TV
broader: zmYu aAM TuF
related: oXSW fbY XrY

Ledbygge, klättring
type: Concept
in scheme: JobTech Taxonomy - Färdighet
definition: Ledbygge, klättring
broader: zmYu aAM TuF
related: XBh3 Xrm C4R
related: EA6o N1N QtT
related: df9D e6y 61z
related: C3422
related: C9629
related: C6113
related: ieVp d5L rS9
related: C5153

Skyddsansvarig ombord
type: Concept
in scheme: JobTech Taxonomy - Färdighet
definition: Skyddsansvarig ombord
broader: s48H Sft DTn
related: Rsoy sS6 6c4
related: kZwz D8K bKs
related: kDnq Q98 sD3

Rational ClearCase, versionshanteringssystem
type: Concept
in scheme: JobTech Taxonomy - Färdighet
definition: Rational ClearCase, versionshanteringssystem
alternative label: Rational ClearCase
broader: Programmerings- och systemutvecklingsverktyg
related: D9SL mtn vGM
related: DJh5 yyF hEM
related: 4Jty HpK a3Q
related: MYAz x9m 2LJ

Stenografivana
type: Concept
in scheme: JobTech Taxonomy - Färdighet
definition: Stenografivana
broader: zmYu aAM TuF
related: 2kLc pto DpV
related: eQ4M CNm ozj
related: oEmP NC1 sXE

Kompetensbevis, djurtransporter
type: Concept
in scheme: JobTech Taxonomy - Färdighet
definition: Kompetensbevis, djurtransporter (Djurkompetensbevis), visar att en individ har nödvändiga kunskaper och färdigheterna för att genomföra transporter av djur. Kravet om kompetensbevis bygger på EU-förordningen om skydd av djur under transport EG nr 1/2005. Kompetensbeviset utfärdas av ackrediterad utbildninganordnare.
broader: Yrkesbevis/examen
related: 3MBw pDA P2F

Försöksdjurskunskap, utbildning
type: Concept
in scheme: JobTech Taxonomy - Färdighet
definition: Försöksdjurskunskap, utbildning är en utbildning på universitet/högskola med inriktning mot arbete med försökdjur.
broader: Yrkesbevis/examen
related: Lrsj wRZ sFV

Finansiering
type: Concept
in scheme: JobTech Taxonomy - Färdighet
definition: Finansiering
broader: zmYu aAM TuF
related: Y6yY SuR hVh
related: pTr9 RBT 9ur

Brandteknik
type: Concept
in scheme: JobTech Taxonomy - Färdighet
definition: Brandteknik avser studier och tillämpningar relaterade till brandsäkerhet och brandförebyggande åtgärder i byggnader och anläggningar. Kompetensen innefattar inspektion av brandskyddssystem, rådgivning vid ny- och ombyggnationer samt genomförande av olycksutredningar.
broader: zmYu aAM TuF
related: wCx8 rY3 XUT
related: nuXg Wjc JPd

Internationella frågor
type: Concept
in scheme: JobTech Taxonomy - Färdighet
definition: Internationella frågor
broader: zmYu aAM TuF
related: vPP6 rsw dck
related: SgNH hag n9D
related: ddGt fEH 432
related: X1Ac Y9P PJo

Ämneslärarexamen
type: Concept
in scheme: JobTech Taxonomy - Färdighet
definition: Ämneslärarexamen
broader: Yrkesbevis/examen
related: 2x2V UeL 6ke
related: 4KhP FxL uZ5
related: oQUQ D11 HPx

Prydnadsväxtodling
type: Concept
in scheme: JobTech Taxonomy - Färdighet
definition: Prydnadsväxtodling
broader: zmYu aAM TuF
related: XBh3 Xrm C4R
related: yXbD NTH ijE
related: 2xQ4 4kh kTZ

Slamsugning
type: Concept
in scheme: JobTech Taxonomy - Färdighet
definition: Slamsugning avser processen att suga upp och transportera bort slam och andra avfallsmaterial från olika typer av avloppssystem och tankar. Kompetensen inkluderar kunskap om hantering av slamsugningsutrustning samt förståelse för säkerhetsföreskrifter och miljölagstiftning relaterad till avfallshantering.
broader: zmYu aAM TuF
related: idjo 2Wr a3E
related: yXbD NTH ijE
related: 3MBw pDA P2F

XML Web Services
type: Concept
in scheme: JobTech Taxonomy - Färdighet
definition: XML Web Services
broader: Kommunikationsprotokoll
related: BAeH eg8 T2d
related: cBBa ngH fCx
related: nDaB vdy eAy
related: D9SL mtn vGM
related: DJh5 yyF hEM
related: SPYW 7Z1 ShT
related: 4Jty HpK a3Q
related: 13md uyV BNG
related: UXKZ 3zZ ipB
related: MYAz x9m 2LJ

Forensisk biologi
type: Concept
in scheme: JobTech Taxonomy - Färdighet
definition: Kompetensen avser vetenskaplig tillämpning och analys av biologiska spår från blod, saliv, hår och hudceller i brottsutredningar. Det innehåller bland annat spårsäkring, DNA-analys och handläggning av prover.
broader: zmYu aAM TuF
related: Z2MZ eYc Lfv
related: bExu 8gk azk

ICF PCC/ICF Professional Certified coach
type: Concept
in scheme: JobTech Taxonomy - Färdighet
definition: ICF PCC/ICF Professional Certified coach
alternative label: ICF PCC
alternative label: ICF Professional Certified coach
broader: s48H Sft DTn
related: Qo7p wjf gtv
related: vPP6 rsw dck
related: 1CX5 mZw Vcq
related: jJF3 qaQ Zsh
related: bjqk F3A 5Hk

Trålfiske
type: Concept
in scheme: JobTech Taxonomy - Färdighet
definition: Trålfiske
broader: zmYu aAM TuF
related: Lm3Z gek GYc

Registrerad fastighetsmäklare
type: Concept
in scheme: JobTech Taxonomy - Färdighet
definition: Kompetensen den formella kvalifikationen för att lagligen få arbeta som fastighetsmäklare i Sverige, utfärdad av Fastighetsmäklarinspektionen (FMI)
broader: s48H Sft DTn
related: Fghp zje WA8
related: 4P8B LtK JgE

Underhållstjänst, specialisering för officer
type: Concept
in scheme: JobTech Taxonomy - Färdighet
definition: Underhållstjänst, specialisering för officer
broader: zmYu aAM TuF
related: dhgR 9jk 95r
related: KiVA anS RJh

Spelförsäljning, onlinespelsterminal (Spectra)
type: Concept
in scheme: JobTech Taxonomy - Färdighet
definition: Spelförsäljning, onlinespelsterminal (Spectra)
alternative label: Spectra
broader: zmYu aAM TuF
related: JnTF wXr 6Eh
related: xyW2 toA Skh

Ämneslärarexamen årskurs 7–9
type: Concept
in scheme: JobTech Taxonomy - Färdighet
definition: Ämneslärarexamen årskurs 7–9
broader: Yrkesbevis/examen
related: oQUQ D11 HPx

Byggnadsmaterialteknik
type: Concept
in scheme: JobTech Taxonomy - Färdighet
definition: Byggnadsmaterialteknik
broader: zmYu aAM TuF
related: thZP oR7 WrY
related: w6ud quG dgh
related: XeBP nMe pXx

Mamut, redovisningssystem
type: Concept
in scheme: JobTech Taxonomy - Färdighet
definition: Mamut, redovisningssystem
alternative label: Mamut
alternative label: Redovisningssystemet mamut
broader: xSJR 1Kq pxB
related: eQ4M CNm ozj
related: iWcY mko rq2
related: q81z 3oD 1qu
related: ij8k EwC zyB
related: 4Jty HpK a3Q

CASE-verktyg
type: Concept
in scheme: JobTech Taxonomy - Färdighet
definition: CASE-verktyg
broader: zmYu aAM TuF
related: DJh5 yyF hEM
related: 4Jty HpK a3Q
related: UXKZ 3zZ ipB

Sweet
type: Concept
in scheme: JobTech Taxonomy - Färdighet
definition: Sweet
broader: p1WM wCw LTd
related: AWJF wqZ va9

Socialantropologi
type: Concept
in scheme: JobTech Taxonomy - Färdighet
definition: Socialantropologi
broader: zmYu aAM TuF
related: sXgV QFg vpb

Drift och underhåll av elanläggningar
type: Concept
in scheme: JobTech Taxonomy - Färdighet
definition: Drift och underhåll av elanläggningar avser hantering och skötsel av elektriska system och utrustningar för att säkerställa deras funktionalitet och säkerhet. Kompetensen omfattar inspektion, reparation och förebyggande åtgärder för att upprätthålla elanläggningars driftseffektivitet och livslängd.
broader: zmYu aAM TuF
related: w6ud quG dgh
related: nDaB vdy eAy
related: SPYW 7Z1 ShT

Apache Groovy, programmeringsspråk
type: Concept
in scheme: JobTech Taxonomy - Färdighet
definition: Apache Groovy, programmeringsspråk
broader: Datorspråk
related: DJh5 yyF hEM
related: 4Jty HpK a3Q

Dödsbon med lantbruk
type: Concept
in scheme: JobTech Taxonomy - Färdighet
definition: Dödsbon med lantbruk
broader: zmYu aAM TuF
related: zKvJ GnC Szx

Konceptutveckling, UX
type: Concept
in scheme: JobTech Taxonomy - Färdighet
definition: Konceptutveckling, UX
broader: zmYu aAM TuF
related: UxT1 tPF Kbg
related: 4Jty HpK a3Q

Klinisk farmakologi, specialistkompetens för läkare
type: Concept
in scheme: JobTech Taxonomy - Färdighet
definition: Klinisk farmakologi, specialistkompetens för läkare
broader: Specialistbevis för läkare
related: nu7c QuB KVQ
related: dsK3 hkt zGy
related: gXqW s5Q ZjN

Första hjälpen i skidbacken
type: Concept
in scheme: JobTech Taxonomy - Färdighet
definition: Första hjälpen i skidbacken avser den kompetens och kunskap som krävs för att ge omedelbar medicinsk hjälp vid olyckor och skador som kan uppstå i samband med skidåkning. Denna kompetens innefattar identifiering av skador, grundläggande livräddande åtgärder och korrekt hantering av nödsituationer i skidmiljöer, vilket är viktigt för att säkerställa skadades välbefinnande tills professionell medicinsk hjälp anländer.
broader: s48H Sft DTn
related: EA6o N1N QtT
related: ayQ4 G3W A2w

Mjölkproduktion
type: Concept
in scheme: JobTech Taxonomy - Färdighet
definition: Mjölkproduktion avser processen för att producera mjölk från mjölkkor eller andra mjölkdjur, vilket innefattar avel, utfodring, skötsel och mjölkning av djuren. Denna kompetens omfattar även kunskap om djurens hälsa och välbefinnande samt hantering av mjölkbehandlingssystem för att säkerställa kvalitet och livsmedelssäkerhet.
broader: zmYu aAM TuF
related: KYmy iqC xiQ
related: RYCQ ogb uUY

Basic ATS/ATC/FIS-utbildning
type: Concept
in scheme: JobTech Taxonomy - Färdighet
definition: Grundläggande utbildning inom Air Traffic Safety (ATS), Air Traffic Control (ATC) respektive FIS (Flight Information Service). Utbildningar ger grundläggande kunskaper om bland annat flygtrafiktjänst, flygtrafikregler, flygnavigation och flygmeteorologi.
broader: s48H Sft DTn
related: yct8 Pun DWd

Gästhamnsarbete
type: Concept
in scheme: JobTech Taxonomy - Färdighet
definition: Kompetensen innefattar att ta emot och assistera båtgäster vid ankomst och avfärd, inklusive hjälp med förtöjning och anvisning av båtplats. Arbetet omfattar även hantering av hamnavgifter, underhåll av hamnområdet, städning, sophantering och skötsel av grönområden.
broader: zmYu aAM TuF
related: ieVp d5L rS9

Debattstenografi
type: Concept
in scheme: JobTech Taxonomy - Färdighet
definition: Debattstenografi
broader: zmYu aAM TuF
related: oEmP NC1 sXE

Sång
type: Concept
in scheme: JobTech Taxonomy - Färdighet
top concept of: JobTech Taxonomy - Färdighet
definition: Sång
narrower: xXHm aE3 rHT
narrower: Baryton
narrower: Liedersång
narrower: A cappella
narrower: Lyrisk koloratursopran
narrower: zwGC jkQ Fm3
narrower: Tenor
narrower: Mezzosopran
narrower: Bas
narrower: qfY7 bRf Qaf
narrower: Sopran
narrower: Körsång
narrower: qyJt 5ot aNy
narrower: Wagnersång

Lysrörsproduktion
type: Concept
in scheme: JobTech Taxonomy - Färdighet
definition: Lysrörsproduktion
broader: zmYu aAM TuF
related: QEBd qHu vGr

Specialistbevis tandläkare
type: Concept
in scheme: JobTech Taxonomy - Färdighet
definition: Ett bevis som intygar att en tandläkare uppnått specialistkompetens inom ett specifikt område efter avslutad relevant utbildning och ST-tjänstgöring. Beviset krävs för att kunna kalla sig specialisttandläkare. Utfärdas av Socialstyrelsen.
broader: Yrkesbevis/examen
related: HPxT fQJ zwT
related: 4P8B LtK JgE

Sjömätning
type: Concept
in scheme: JobTech Taxonomy - Färdighet
definition: Sjömätning
broader: zmYu aAM TuF
related: ketV G9W GeR

Aktivitet och hälsa vid varaktig funktionsnedsättning, specialistområde för arbetsterapeut
type: Concept
in scheme: JobTech Taxonomy - Färdighet
definition: Ett specialistområde och en fördjupad specialistkompetens för arbetsterapeut inom aktivitet och hälsa vid varaktig funktionsnedsättning.
broader: Specialistområde för arbetsterapeut
related: TPH4 2AM isT

Restaurang- och livsmedelsinriktning, undervisning
type: Concept
in scheme: JobTech Taxonomy - Färdighet
definition: Restaurang- och livsmedelsinriktning, undervisning
broader: Inriktning på lärarkompetens
related: 2x2V UeL 6ke

Dans
type: Concept
in scheme: JobTech Taxonomy - Färdighet
top concept of: JobTech Taxonomy - Färdighet
definition: Dans
narrower: Flamencodans
narrower: Nutida dans
narrower: znQu uHh eo6
narrower: Modern dans
narrower: Steppdans
narrower: Orientalisk dans
narrower: Showdans
narrower: Karaktärsdans
narrower: yrLR nvE 6nV
narrower: wX3G TCG s47
narrower: Latinamerikansk dans
narrower: Spansk dans
narrower: Jazzdans
narrower: Afrikansk dans
narrower: nKaF nH6 E9b

Tillverkningsindustri-AutoCAD Mechanical
type: Concept
in scheme: JobTech Taxonomy - Färdighet
definition: Tillverkningsindustri-AutoCAD Mechanical
broader: mTLu uo2 gq2
related: mis4 feV uex
related: xm5G vGn iyk
related: mp2Y vyC RFV
related: 3jEy yuT aVo
related: rwpH 6RA XTT
related: K8yg U4C gkY
related: PRQn 9yw NJA
related: 4Jty HpK a3Q

Barnpsykiatri/Ungdomspsykiatri
type: Concept
in scheme: JobTech Taxonomy - Färdighet
definition: Barnpsykiatri/Ungdomspsykiatri
alternative label: Barnpsykiatri
alternative label: Ungdomspsykiatri
broader: zmYu aAM TuF
related: NFUg y9y 1TY
related: bEDv SL7 VrL
related: 7fNG sve JWU
related: LP4Z ABV gRm
related: pok1 ipJ yzD

Artistförmedling
type: Concept
in scheme: JobTech Taxonomy - Färdighet
definition: Artistförmedling avser processen att boka engagemang för artister, musiker, författare och idrottsutövare samt att förhandla kontrakt och skapa samarbeten inom olika kulturella och underhållningssektorer. Kompetensen omfattar även förmågan att representera och marknadsföra konstnärer samt att hantera relationer mellan olika aktörer i branschen, vilket bidrar till att möjliggöra framträdanden och projekt.
broader: zmYu aAM TuF
related: dUuh wwa FGj

Mästarbrev, möbelrenoverare
type: Concept
in scheme: JobTech Taxonomy - Färdighet
definition: Mästarbrev, möbelrenoverare
broader: Yrkesbevis/examen
related: 34Tn BQQ tfo
related: 1Nwn GYH wkH

Pressning, konventionell maskin
type: Concept
in scheme: JobTech Taxonomy - Färdighet
definition: Pressning, konventionell maskin avser en metod för att forma metall eller liknande material genom att använda en pressmaskin för att utöva kraft på arbetsstycken.
broader: zmYu aAM TuF
related: vaEp iBS c5h

Glödgning
type: Concept
in scheme: JobTech Taxonomy - Färdighet
definition: Glödgning
broader: zmYu aAM TuF
related: UcNa inr snV

JD Edwards, affärssystem
type: Concept
in scheme: JobTech Taxonomy - Färdighet
definition: JD Edwards, affärssystem
alternative label: JD Edwards
broader: xSJR 1Kq pxB
related: eQ4M CNm ozj
related: Y6yY SuR hVh
related: Uw4n UB2 RCW
related: iWcY mko rq2
related: q81z 3oD 1qu
related: cRmd 536 pT1
related: ij8k EwC zyB
related: 4Jty HpK a3Q

Fastighetsautomation
type: Concept
in scheme: JobTech Taxonomy - Färdighet
definition: Fastighetsautomation
broader: zmYu aAM TuF
related: yXbD NTH ijE
related: PRQn 9yw NJA
related: 4Jty HpK a3Q
related: yyF7 jsW EeP

Geriatrisk omvårdnad
type: Concept
in scheme: JobTech Taxonomy - Färdighet
definition: Geriatrisk omvårdnad avser kompetens inom vård och omsorg av äldre personer med fokus på att hantera åldersrelaterade hälsoproblem och stödja deras livskvalitet. Den omfattar kunskaper om medicinska, psykologiska och sociala aspekter av vård, vilket gör det möjligt att anpassa omvårdnad och behandling utifrån individens behov.
broader: zmYu aAM TuF
related: BWwk fYX S5B
related: 6eAB cbY i9T
related: sq3e WVv Fjd
related: 7fNG sve JWU
related: TPH4 2AM isT
related: 5dxv nVQ N8o
related: jY19 knH MJp
related: LP4Z ABV gRm
related: 7pz9 eY9 D2s
related: tAJS JNb hDH
related: 5uP5 Ugw aVE

Yrkesutbildning, medicinsk massageterapeut
type: Concept
in scheme: JobTech Taxonomy - Färdighet
definition: Yrkesutbildning, medicinsk massageterapeut är en yrkeshögskoleutbildning eller en eftergymnasial yrkesutbildning med inriktning till medicinsk massageterapeut.
broader: Yrkesutbildning
related: uxHV KXc PKD

Plasmaskärning
type: Concept
in scheme: JobTech Taxonomy - Färdighet
definition: Plasmaskärning
broader: zmYu aAM TuF
related: vaEp iBS c5h

Fordonsvård
type: Concept
in scheme: JobTech Taxonomy - Färdighet
definition: Fordonsvård avser åtgärder och rutiner för att underhålla och rengöra fordon, vilket inkluderar både invändig och utvändig rengöring samt rekonditionering av bilens ytstruktur. Kompetensen kan omfatta arbetsmoment som rengöring av fönster och fönsterputsning, samt andra relaterade rengöringsarbeten.
broader: zmYu aAM TuF
related: FjdF H2e tAG

Biofloc
type: Concept
in scheme: JobTech Taxonomy - Färdighet
definition: Biofloc
broader: zmYu aAM TuF
related: c8r8 e4L gwj

Handkirurgi, specialistkompetens för läkare
type: Concept
in scheme: JobTech Taxonomy - Färdighet
definition: Handkirurgi, specialistkompetens för läkare
broader: Specialistbevis för läkare
related: nu7c QuB KVQ

Hydrologi
type: Concept
in scheme: JobTech Taxonomy - Färdighet
definition: Hydrologi
broader: zmYu aAM TuF
related: yXbD NTH ijE
related: sXgV QFg vpb
related: XeBP nMe pXx
related: V7Yz 4WV g4z
related: bExu 8gk azk

Immaterialrätt
type: Concept
in scheme: JobTech Taxonomy - Färdighet
definition: Immaterialrätt
broader: zmYu aAM TuF
related: br6a VVS V3y
related: DZVN v5g Fco

Psykisk funktionsnedsättning, omsorgserfarenhet
type: Concept
in scheme: JobTech Taxonomy - Färdighet
definition: Psykisk funktionsnedsättning, omsorgserfarenhet avser den kunskap och erfarenhet som krävs för att stödja och ge omsorg till personer med psykisk funktionsnedsättning. Kompetensen innefattar förståelse för olika psykiska tillstånd och förmågan att tillämpa lämpliga omsorgsinsatser inom vård och rehabilitering.
broader: zmYu aAM TuF
related: BWwk fYX S5B
related: sq3e WVv Fjd
related: jY19 knH MJp
related: 7pz9 eY9 D2s
related: tAJS JNb hDH

Yttrande till domstol
type: Concept
in scheme: JobTech Taxonomy - Färdighet
definition: Yttrande till domstol
broader: zmYu aAM TuF
related: dJXy Rpq a2u
related: n6iX f2z XfE
related: pok1 ipJ yzD

Rådgivning, frivård
type: Concept
in scheme: JobTech Taxonomy - Färdighet
definition: Rådgivning, frivård
broader: zmYu aAM TuF
related: n6iX f2z XfE

Fastighetsteknik
type: Concept
in scheme: JobTech Taxonomy - Färdighet
definition: Fastighetsteknik avser kunskap och färdigheter relaterade till skötsel och underhåll av byggnader och anläggningar. Detta inkluderar övervakning av tekniska system, utförande av reparationer, samt service och support för hyresgäster och besökare.
broader: zmYu aAM TuF
related: df9D e6y 61z

Katalogiseringsvana, museum
type: Concept
in scheme: JobTech Taxonomy - Färdighet
definition: Katalogiseringsvana, museum
broader: zmYu aAM TuF
related: 4Jty HpK a3Q
related: Qbvf 6nd Esn

Ekonomiplanering
type: Concept
in scheme: JobTech Taxonomy - Färdighet
definition: Ekonomiplanering
broader: zmYu aAM TuF
related: XurM DVs ggn

Violin
type: Concept
in scheme: JobTech Taxonomy - Färdighet
definition: Violin
broader: wLYs CKS wK8
related: AWJF wqZ va9

Sport- och fritidsutrustning
type: Concept
in scheme: JobTech Taxonomy - Färdighet
definition: Kompetensen innebär kunskap om olika typer av utrustning för sport- och friluftsaktiviteter, såsom cyklar, skidor och skyddsutrustning. Kompetensen omfattar att kunna välja, anpassa och underhålla utrustningen efter kundens behov samt utföra enklare reparationer.
broader: zmYu aAM TuF
related: YKL2 FCB 1yr
related: M47D MU2 dhS
related: 85cq 6uK 4cK

Intyg, säkerhetsrådgivare för transport av farligt gods
type: Concept
in scheme: JobTech Taxonomy - Färdighet
definition: Intyg för säkerhetsrådgivare för transport av farligt gods utfärdas av MSB.
broader: s48H Sft DTn
related: 957L kZK rHZ

GNOME Office
type: Concept
in scheme: JobTech Taxonomy - Färdighet
definition: GNOME Office
broader: Allmänna datakunskaper
related: eQ4M CNm ozj
related: Y6yY SuR hVh
related: Uw4n UB2 RCW
related: fdLf oPp wVw
related: vPP6 rsw dck
related: iWcY mko rq2
related: ZQTR hVC QhJ
related: br6a VVS V3y
related: 1CX5 mZw Vcq
related: L7eh ihX vM5
related: MGk3 LvL AU2
related: jJF3 qaQ Zsh
related: oEmP NC1 sXE
related: bjqk F3A 5Hk
related: H2Zj eL9 x28
related: dJXy Rpq a2u
related: pwRH MT1 8nR
related: cRmd 536 pT1
related: zKvJ GnC Szx
related: n6iX f2z XfE
related: DZVN v5g Fco
related: ij8k EwC zyB
related: JfYV ZGg 6rm
related: vCAb uuo ek5
related: 4Jty HpK a3Q
related: p16X 44f rwZ
related: pok1 ipJ yzD

Oral protetik, specialistkompetens för tandläkare
type: Concept
in scheme: JobTech Taxonomy - Färdighet
definition: Oral protetik, specialistkompetens för tandläkare
broader: Specialistkompetens för tandläkare
related: HPxT fQJ zwT

Friluftsfrågor
type: Concept
in scheme: JobTech Taxonomy - Färdighet
definition: Friluftsfrågor
broader: zmYu aAM TuF
related: vPP6 rsw dck

Festarrangemang
type: Concept
in scheme: JobTech Taxonomy - Färdighet
definition: Festarrangemang
broader: zmYu aAM TuF
related: 48KE fDE ryL
related: dUuh wwa FGj

Miljöjournalistik
type: Concept
in scheme: JobTech Taxonomy - Färdighet
definition: Miljöjournalistik
broader: zmYu aAM TuF
related: SgNH hag n9D

Ändringssömnad
type: Concept
in scheme: JobTech Taxonomy - Färdighet
definition: Ändringssömnad avser anpassning av klädesplagg för att förbättra passform eller utföra reparationer. Kompetensen omfattar tekniker för att justera, omforma eller laga plagg i olika material, inklusive tyg och skinn, för att möta kundens specifika önskemål.
broader: zmYu aAM TuF
related: UZBj yDX Ctp
related: mwVN oEH g9k

Svarvning, CNC
type: Concept
in scheme: JobTech Taxonomy - Färdighet
definition: Svarvning, CNC avser en maskinbearbetningsteknik där datorstyrda svarvar används för att skära och forma arbetsstycken av metall eller liknande material. Denna kompetens omfattar programmering och inställning av svarvar samt övervakning av bearbetningsprocessen för att säkerställa precision och kvalitet i de tillverkade delarna.
broader: zmYu aAM TuF
related: VKKg e4t t46
related: vaEp iBS c5h
related: 4Jty HpK a3Q

Progress, databashanterare
type: Concept
in scheme: JobTech Taxonomy - Färdighet
definition: Progress, databashanterare
alternative label: Progress
broader: Databaser
related: BAeH eg8 T2d
related: cBBa ngH fCx
related: Fv7d YhP YmS
related: D9SL mtn vGM
related: DJh5 yyF hEM
related: 4Jty HpK a3Q
related: MYAz x9m 2LJ

Flöjt
type: Concept
in scheme: JobTech Taxonomy - Färdighet
definition: Flöjt
broader: wLYs CKS wK8
related: AWJF wqZ va9

Verktygsuppsättning
type: Concept
in scheme: JobTech Taxonomy - Färdighet
definition: Verktygsuppsättning
broader: zmYu aAM TuF
related: yJk6 azD ywF
related: ENV6 BNa brP
related: rxmK wwM 1NA
related: Vfum e6B 7Bw
related: yPQ4 EaN Dtj
related: kF59 fge kts
related: iZLB KpD LLo
related: 4DET dLf iB9
related: skLS kpa Ui1
related: icae Y69 H8E
related: gJtZ EBc n2z

CryEngine, spelmotor
type: Concept
in scheme: JobTech Taxonomy - Färdighet
definition: CryEngine
broader: Spelmotorer
related: Q5DF juj 8do
related: 4Jty HpK a3Q
related: Mbt6 3ko DiD

Allmänkonstruktion-Bentley MicroStation
type: Concept
in scheme: JobTech Taxonomy - Färdighet
definition: Allmänkonstruktion-Bentley MicroStation
broader: mTLu uo2 gq2
related: 3jEy yuT aVo
related: rwpH 6RA XTT
related: thZP oR7 WrY
related: MSnK 3Z8 4qA
related: K8yg U4C gkY
related: nDaB vdy eAy
related: Pd51 xnr KCY
related: ketV G9W GeR
related: SPYW 7Z1 ShT
related: XeBP nMe pXx
related: PRQn 9yw NJA
related: ETAR ggZ Wuw
related: 41KB bfk 5jR
related: 4Jty HpK a3Q

Miljöutbildning
type: Concept
in scheme: JobTech Taxonomy - Färdighet
definition: Miljöutbildning
broader: Yrkesbevis/examen
related: rE1E m3d cx1
related: yXbD NTH ijE

Flygelhorn, undervisning musikskola
type: Concept
in scheme: JobTech Taxonomy - Färdighet
definition: Flygelhorn, undervisning musikskola
broader: zmYu aAM TuF
related: mcRJ kq2 jFr

Vegetarisk kost
type: Concept
in scheme: JobTech Taxonomy - Färdighet
definition: Vegetarisk kost
broader: zmYu aAM TuF
related: BStc SJh DKG

Maskinbefäl klass VIII, behörighet
type: Concept
in scheme: JobTech Taxonomy - Färdighet
definition: Maskinbefäl klass VIII, behörighet
broader: Behörigheter, sjöfart
related: Rsoy sS6 6c4

Informationsstrategi
type: Concept
in scheme: JobTech Taxonomy - Färdighet
definition: Informationsstrategi avser en planerad och strukturerad metod för att hantera, distribuera och använda information inom en organisation för att nå specifika mål och stärka kommunikationen. Kompetensen innefattar analys av informationsbehov, utveckling av strategier för informationsspridning och upprättande av riktlinjer för hantering av information.
broader: zmYu aAM TuF
related: SgNH hag n9D
related: k1Nx auG sNh
related: 4Jty HpK a3Q
related: UXKZ 3zZ ipB

Lua, programmeringsspråk
type: Concept
in scheme: JobTech Taxonomy - Färdighet
definition: Lua, programmeringsspråk
broader: Datorspråk
related: DJh5 yyF hEM
related: 4Jty HpK a3Q

Värdetransportutbildning
type: Concept
in scheme: JobTech Taxonomy - Färdighet
definition: Utbildning i värdetransport är en särskild utbildning för väktare som ska transportera och skydda sedlar, mynt eller egendom.
broader: Yrkesbevis/examen
related: iqZh 3yX i8n

Yrkesutbildning, grafik och trycksaksproduktion
type: Concept
in scheme: JobTech Taxonomy - Färdighet
definition: Yrkesutbildning, grafik och trycksaksproduktion är en yrkeshögskoleutbildning eller eftergymnasial utbildning med inriktning mot grafisk produktion och tryckteknik.
broader: Yrkesutbildning
related: XeJB bkn mRn
related: LeQV umf wUS

Kandidatexamen med inriktning ljusdesign
type: Concept
in scheme: JobTech Taxonomy - Färdighet
definition: Kandidatexamen med inriktning ljusdesign
broader: Yrkesbevis/examen
related: 4BsK q2C sCL

Afasi, omsorgserfarenhet
type: Concept
in scheme: JobTech Taxonomy - Färdighet
definition: Afasi, omsorgserfarenhet
broader: zmYu aAM TuF
related: sq3e WVv Fjd
related: jY19 knH MJp
related: 7pz9 eY9 D2s
related: tAJS JNb hDH

Övriga språk, undervisning
type: Concept
in scheme: JobTech Taxonomy - Färdighet
definition: Övriga språk, undervisning
broader: Inriktning på lärarkompetens
related: 4KhP FxL uZ5

Processanalys
type: Concept
in scheme: JobTech Taxonomy - Färdighet
definition: Processanalys
broader: zmYu aAM TuF
related: Qo7p wjf gtv
related: vPP6 rsw dck
related: 4Jty HpK a3Q

Bolagsbildningar
type: Concept
in scheme: JobTech Taxonomy - Färdighet
definition: Bolagsbildningar
broader: zmYu aAM TuF
related: Uw4n UB2 RCW
related: q81z 3oD 1qu
related: mZsb A1K Gec
related: cRmd 536 pT1
related: FfMN Bw1 qYR

Dokumenthantering
type: Concept
in scheme: JobTech Taxonomy - Färdighet
definition: Dokumenthantering avser planering, organisering och lagring av dokument och information inom olika verksamheter. Kompetensen innebär systematisering av information, vilket inkluderar bedömning av vilken information som är relevant att spara, samt att säkerställa att dokument är lättillgängliga och korrekt klassificerade.
broader: zmYu aAM TuF
related: eQ4M CNm ozj
related: wVfo Njx 1rB
related: vPP6 rsw dck
related: ByrL ANp UwV

Teckenspråk inom scenkonst
type: Concept
in scheme: JobTech Taxonomy - Färdighet
definition: Teckenspråk inom scenkonst
broader: zmYu aAM TuF
related: iBUL s38 izZ

Basetthorn
type: Concept
in scheme: JobTech Taxonomy - Färdighet
definition: Basetthorn
broader: wLYs CKS wK8
related: AWJF wqZ va9

Köksinredning, tillverkning och montering
type: Concept
in scheme: JobTech Taxonomy - Färdighet
definition: Köksinredning, tillverkning och montering avser processen att designa, tillverka och installera köksinredningar, inklusive skåp, bänkskivor och andra komponenter som används i kök. Kompetensen innefattar kunskaper om material, konstruktionstekniker och designprinciper som krävs för att skapa funktionella och estetiska kökslösningar.
broader: zmYu aAM TuF
related: 1Nwn GYH wkH

Dansband
type: Concept
in scheme: JobTech Taxonomy - Färdighet
definition: Dansband
broader: p1WM wCw LTd
related: AWJF wqZ va9

Legitimation som sjuksköterska
type: Concept
in scheme: JobTech Taxonomy - Färdighet
definition: Legitimation som krävs för att kunna arbeta som sjuksköterska i Sverige. Utfärdas av Socialstyrelsen.
broader: Yrkesbevis/examen
related: NFUg y9y 1TY
related: bEDv SL7 VrL
related: 6eAB cbY i9T
related: TPH4 2AM isT
related: PHJN fva yxs
related: 7XXd 4St nit
related: 4P8B LtK JgE
related: r1Gk 3EN bpw
related: nrVt xUL KdQ
related: cuaN Rj5 YCc
related: dyWo sDb MLQ
related: Bywn Doc 3VF
related: 6Fu3 qQA 9DK
related: 6zAR EHM Kwj
related: Z8ci bBE tmx
related: oj4c P4b cja

Repslagning
type: Concept
in scheme: JobTech Taxonomy - Färdighet
definition: Repslagning
broader: zmYu aAM TuF
related: skLS kpa Ui1

Flyttpackningsvana
type: Concept
in scheme: JobTech Taxonomy - Färdighet
definition: Flyttpackningsvana avser färdighet i att noggrant packa och organisera föremål inför en flyttprocess. Kompetensen omfattar både packindustriella tekniker och metoder för att säkerställa att gods och möbler transporteras på ett säkert och effektivt sätt.
broader: zmYu aAM TuF
related: bwnk nv2 1cR

Elektromedicin, medicintekniskt område ingenjör
type: Concept
in scheme: JobTech Taxonomy - Färdighet
definition: Elektromedicin, medicintekniskt område ingenjör
broader: zmYu aAM TuF
related: GC7L Yw7 Mfo

Markismontering
type: Concept
in scheme: JobTech Taxonomy - Färdighet
definition: Markismontering avser installation av olika typer av markiser. Kompetensen omfattar kunskap om material, verktyg och tekniker som är nödvändiga för att genomföra monteringsarbeten med precision och kvalitet.
broader: zmYu aAM TuF
related: Kxm9 N3V shF

IP-telefoniteknik
type: Concept
in scheme: JobTech Taxonomy - Färdighet
definition: IP-telefoniteknik
broader: Kommunikationsprotokoll
related: BAeH eg8 T2d
related: cBBa ngH fCx
related: nDaB vdy eAy
related: D9SL mtn vGM
related: DJh5 yyF hEM
related: SPYW 7Z1 ShT
related: 4Jty HpK a3Q
related: 13md uyV BNG
related: UXKZ 3zZ ipB
related: MYAz x9m 2LJ

Kostinformation och kostutbildning
type: Concept
in scheme: JobTech Taxonomy - Färdighet
definition: Kostinformation och kostutbildning
broader: zmYu aAM TuF
related: Z2MZ eYc Lfv
related: Pq5C SPC bRA

Fjärrmätning av virke
type: Concept
in scheme: JobTech Taxonomy - Färdighet
definition: Massaved mäts genom kameramätning av timmerbilarnas last. Virkesmätare utför mätning av volym, med mera
broader: zmYu aAM TuF
related: qouP wtb 93q

Enklare matlagningskunskaper
type: Concept
in scheme: JobTech Taxonomy - Färdighet
definition: Enklare matlagningskunskaper avser grundläggande färdigheter i att förbereda och laga mat. Kompetensen kan tillämpas inom olika yrken, såsom restaurang- och köksbiträden, där det ingår att delta i matlagning och förberedelse av måltider, samt övrig hemservicepersonal som utför hushållsnära arbeten.
broader: zmYu aAM TuF
related: o1gn FoS fB7
related: bYde Frc xcB
related: CbQK 7th Tyf
related: Fp7x Yqt bx9
related: a8gg ktU w8V
related: tPox ie4 X9X

Dekormålning, TV
type: Concept
in scheme: JobTech Taxonomy - Färdighet
definition: Dekormålning, TV
broader: zmYu aAM TuF
related: CSUf ZVM a7Z

Althorn, undervisning musikskola
type: Concept
in scheme: JobTech Taxonomy - Färdighet
definition: Althorn, undervisning musikskola
broader: zmYu aAM TuF
related: mcRJ kq2 jFr

JIRA, systemutvecklingsverktyg
type: Concept
in scheme: JobTech Taxonomy - Färdighet
definition: JIRA, systemutvecklingsverktyg
alternative label: JIRA
broader: Programmerings- och systemutvecklingsverktyg
related: D9SL mtn vGM
related: UxT1 tPF Kbg
related: 4Jty HpK a3Q

Customer Relationship Management/CRM
type: Concept
in scheme: JobTech Taxonomy - Färdighet
definition: Customer Relationship Management/CRM avser strategier och teknologier som företag använder för att hantera interaktioner med nuvarande och potentiella kunder. Kompetensen omfattar insamling och analys av kundinformation, vilket syftar till att förbättra affärsrelationer och optimera försäljningsmetoder.
alternative label: CRM
alternative label: Customer Relationship Management
alternative label: Kundvård
broader: zmYu aAM TuF
related: oXSW fbY XrY
related: WX67 Pfb WMN
related: k1Nx auG sNh
related: 4Jty HpK a3Q
related: p16X 44f rwZ

Försäljningsvana, uppsökande försäljning företag
type: Concept
in scheme: JobTech Taxonomy - Färdighet
definition: Försäljningsvana, uppsökande försäljning företag, avser kompetens att aktivt söka och skapa kontakt med potentiella kunder för att sälja produkter och tjänster. Denna kompetens inkluderar förmåga att identifiera och utvärdera affärsmöjligheter samt att förstå kunders behov och bygga långsiktiga relationer.
broader: zmYu aAM TuF
related: oXSW fbY XrY
related: dUuh wwa FGj
related: p16X 44f rwZ

Konsumentekonomi
type: Concept
in scheme: JobTech Taxonomy - Färdighet
definition: Konsumentekonomi
broader: zmYu aAM TuF
related: WZCM nfS eAk

Uppläggning av redovisningssystem
type: Concept
in scheme: JobTech Taxonomy - Färdighet
definition: Uppläggning av redovisningssystem
broader: zmYu aAM TuF
related: Y6yY SuR hVh
related: Uw4n UB2 RCW
related: cRmd 536 pT1
related: 4Jty HpK a3Q

Grafisk design
type: Concept
in scheme: JobTech Taxonomy - Färdighet
definition: Grafisk design avser processen att skapa visuella kommunikationslösningar genom användning av text, bilder och grafik för att förmedla specifika budskap eller idéer. Denna kompetens omfattar kunskaper inom färgteori, typografi och layout, samt förmågan att använda digitala designverktyg och programvaror för att producera visuellt effektiva och estetiskt tilltalande material.
broader: zmYu aAM TuF
related: 8Bmh vtM zts
related: DqLe pH6 jyj
related: XeJB bkn mRn
related: SgNH hag n9D
related: PF4H kQD zpL
related: k1Nx auG sNh
related: UxT1 tPF Kbg
related: 4Jty HpK a3Q
related: LeQV umf wUS
related: Mbt6 3ko DiD
related: p16X 44f rwZ

Presentatörsvana, TV
type: Concept
in scheme: JobTech Taxonomy - Färdighet
definition: Presentatörsvana, TV
broader: zmYu aAM TuF
related: xuSE mtB Mir

Mästarbrev, skräddare
type: Concept
in scheme: JobTech Taxonomy - Färdighet
definition: Mästarbrev, skräddare
broader: Yrkesbevis/examen
related: mwVN oEH g9k

Ändringsarbeten, skrädderi
type: Concept
in scheme: JobTech Taxonomy - Färdighet
definition: Ändringsarbeten, skrädderi avser kompetensen att utföra modifieringar och reparationer av klädesplagg, vilket inkluderar justeringar som neddragning, uppdragning och ändring av passform. Kompetensen innebär också kunskap om olika material och tekniker för att säkerställa att kläderna passar och håller hög kvalitet efter utförda ändringar.
broader: zmYu aAM TuF
related: mwVN oEH g9k

Mode, accessoarer/Design, accessoarer
type: Concept
in scheme: JobTech Taxonomy - Färdighet
definition: Mode, accessoarer/Design, accessoarer
alternative label: Design, accessoarer
alternative label: Mode, accessoarer
broader: zmYu aAM TuF
related: PF4H kQD zpL

Batterikunskap
type: Concept
in scheme: JobTech Taxonomy - Färdighet
definition: Batterikunskap avser förståelse för batteriers funktion, konstruktion och typologier, vilket är viktigt inom flera områden som elektrisk och elektronisk utrustning. Kompetensen innefattar även kunskap om hur batterier underhålls, används och hanteras säkert i olika sammanhang.
broader: zmYu aAM TuF
related: Lzpv ofL 3H5
related: Vfum e6B 7Bw
related: SgAJ DW2 FN5
related: a75S eLg JWH

Kvalitetskontroll, industriell tillverkning
type: Concept
in scheme: JobTech Taxonomy - Färdighet
definition: Kvalitetskontroll, industriell tillverkning, avser metodik och processer för att säkerställa att produkter uppfyller specificerade kvalitetsstandarder innan de når marknaden. Denna kompetens inkluderar bland annat inspektion, mätning och testning av produkter i olika tillverkningsfaser för att identifiera avvikelser och säkerställa att kvalitetskrav efterlevs.
broader: zmYu aAM TuF
related: yJk6 azD ywF
related: Lzpv ofL 3H5
related: YiQw N87 zLU
related: sX9n CWa KVC
related: dKUb KBP mw3
related: HXzD qvt HV6
related: ENV6 BNa brP
related: 4obu LL6 RqJ
related: hxm6 xkr dHm
related: LEvM 7Hs w8i
related: rxmK wwM 1NA
related: Vfum e6B 7Bw
related: VKKg e4t t46
related: MSnK 3Z8 4qA
related: UdrS qzV P7i
related: XeJB bkn mRn
related: 1G6H AuG qyy
related: vaEp iBS c5h
related: 8ddv P8e iYz
related: yPQ4 EaN Dtj
related: kF59 fge kts
related: SgAJ DW2 FN5
related: yXbD NTH ijE
related: iZLB KpD LLo
related: Kxm9 N3V shF
related: mPzg 93F QEv
related: shkw ojo UL2
related: o31g CX1 qhQ
related: 4DET dLf iB9
related: skLS kpa Ui1
related: dMVD VYy kgg
related: J9Vz JxJ Bji
related: aU9p ekE Fqf
related: E87t egE pjA
related: TrwQ RXT W8a
related: UcNa inr snV
related: icae Y69 H8E
related: LeQV umf wUS
related: gJtZ EBc n2z
related: AUs8 M5f dLt
related: L4hA SJP SFi

Applikation, textil
type: Concept
in scheme: JobTech Taxonomy - Färdighet
definition: Applikation, textil
broader: zmYu aAM TuF
related: 34Tn BQQ tfo

Handskar, utformning
type: Concept
in scheme: JobTech Taxonomy - Färdighet
definition: Handskar, utformning
broader: zmYu aAM TuF
related: 39yB xPQ ozd

Layout-Adobe FrameMaker
type: Concept
in scheme: JobTech Taxonomy - Färdighet
definition: Layout-Adobe FrameMaker
broader: Programvara för digitalt skapande
related: 8Bmh vtM zts
related: SgNH hag n9D
related: zfve s6G tpc
related: k1Nx auG sNh
related: 4Jty HpK a3Q
related: LeQV umf wUS
related: Mbt6 3ko DiD

Google Docs
type: Concept
in scheme: JobTech Taxonomy - Färdighet
definition: Google Docs
broader: Allmänna datakunskaper
related: eQ4M CNm ozj
related: Y6yY SuR hVh
related: Uw4n UB2 RCW
related: fdLf oPp wVw
related: vPP6 rsw dck
related: iWcY mko rq2
related: ZQTR hVC QhJ
related: br6a VVS V3y
related: 1CX5 mZw Vcq
related: L7eh ihX vM5
related: MGk3 LvL AU2
related: jJF3 qaQ Zsh
related: oEmP NC1 sXE
related: bjqk F3A 5Hk
related: H2Zj eL9 x28
related: dJXy Rpq a2u
related: pwRH MT1 8nR
related: cRmd 536 pT1
related: zKvJ GnC Szx
related: n6iX f2z XfE
related: DZVN v5g Fco
related: ij8k EwC zyB
related: JfYV ZGg 6rm
related: vCAb uuo ek5
related: 4Jty HpK a3Q
related: p16X 44f rwZ
related: pok1 ipJ yzD

Auktoriserad nagelterapeut
type: Concept
in scheme: JobTech Taxonomy - Färdighet
definition: Auktoriserad nagelterapeut enligt Svenska Estetikers yrkesförbunds riktlinjer.
broader: s48H Sft DTn
related: ezKk kss CiQ

Budgetkonstruktion
type: Concept
in scheme: JobTech Taxonomy - Färdighet
definition: Budgetkonstruktion
broader: zmYu aAM TuF
related: eQ4M CNm ozj
related: Y6yY SuR hVh
related: Uw4n UB2 RCW
related: q81z 3oD 1qu
related: cRmd 536 pT1

Papperskonst
type: Concept
in scheme: JobTech Taxonomy - Färdighet
definition: Papperskonst
broader: zmYu aAM TuF
related: 34Tn BQQ tfo
related: mPzg 93F QEv

Friformssmide
type: Concept
in scheme: JobTech Taxonomy - Färdighet
definition: Friformssmide avser en metod för metallbearbetning där metallmaterial formas genom att utsättas för kompression och deformation. Kompetensen innefattar förståelse för materialens egenskaper och processerna för att uppnå önskade former och dimensioner i de metallprodukter som tillverkas.
broader: zmYu aAM TuF
related: vaEp iBS c5h

Forensiskt område droger
type: Concept
in scheme: JobTech Taxonomy - Färdighet
definition: Kompetensen avser kunskaper om och tillämpning av metoder för analys av droger inom brottsutredning. Det innefattar forensiska undersökningar av beslagtagna material för att identifiera illegala substanser, jämförelser av narkotika, svar på kemi-relaterade frågeställningar samt kemiska instrumentanalyser, från registrering och hantering av material till sammanställning och redovisning av resultat.
broader: zmYu aAM TuF
related: vPP6 rsw dck
related: rNcE Zno pD8
related: bExu 8gk azk

Barkmaskinskötsel, skogsbruk
type: Concept
in scheme: JobTech Taxonomy - Färdighet
definition: Barkmaskinskötsel, skogsbruk
broader: zmYu aAM TuF
related: KwVo sQu G2e

Naturbruk, undervisning högskolenivå
type: Concept
in scheme: JobTech Taxonomy - Färdighet
definition: Naturbruk, undervisning högskolenivå
broader: Inriktning på högskolelärarkompetens
related: Gm5j S2Y aTB
related: NNK9 F1o pK5
related: cYCo PxY zQd
related: RPBE x5M cXX
related: P7eS nP8 3dy

Gesällbrev, skomakare (reparation)
type: Concept
in scheme: JobTech Taxonomy - Färdighet
definition: Gesällbrev, skomakare (reparation) är ett bevis på att en hantverkare har genomgått utbildning och avlagt de delprov som krävs inom det specifika hantverksyrket, och därigenom uppnått ett erkännande av färdigheter och kompetens inom yrket. Utfärdas av Sveriges hantverksråd i samråd med aktuell branschorganisation.
broader: Yrkesbevis/examen
related: vJQk YvC XB7

Kommunal förvaltning
type: Concept
in scheme: JobTech Taxonomy - Färdighet
definition: Kommunal förvaltning avser organisation och administration av offentliga verksamheter inom kommunen, där beslutsfattande och resursfördelning sker för att tillgodose medborgarnas behov. Denna kompetens innefattar kunskap om lagar och förordningar som styr den kommunala verksamheten samt förståelse för hur kommunala tjänster kan planeras och genomföras effektivt.
broader: zmYu aAM TuF
related: qVHD Hj5 PXh
related: wCx8 rY3 XUT
related: ajwx FvL YuY
related: coyZ Cyv Srw
related: NxXz fBh w7j
related: br6a VVS V3y
related: oEmP NC1 sXE
related: z8di AqX GBr
related: ddGt fEH 432
related: 4GAs rKs 2Ne
related: wby2 mwq fWV
related: X1Ac Y9P PJo
related: sWzF 6pd Y6L
related: JfYV ZGg 6rm
related: 1uau t1u rDL
related: vCAb uuo ek5

Testledning, datasystem
type: Concept
in scheme: JobTech Taxonomy - Färdighet
definition: Testledning, datasystem
broader: zmYu aAM TuF
related: D9SL mtn vGM
related: DJh5 yyF hEM
related: 4Jty HpK a3Q

Tandreglering
type: Concept
in scheme: JobTech Taxonomy - Färdighet
definition: Tandreglering
broader: zmYu aAM TuF
related: 5dxv nVQ N8o

Statistisk övervakning
type: Concept
in scheme: JobTech Taxonomy - Färdighet
definition: Statistisk övervakning
broader: zmYu aAM TuF
related: jv1x tpK 32p
related: 4Jty HpK a3Q

Drömgrupp
type: Concept
in scheme: JobTech Taxonomy - Färdighet
definition: Drömgrupp
broader: zmYu aAM TuF
related: VYeq GDF a2g

Forensiskt område spår
type: Concept
in scheme: JobTech Taxonomy - Färdighet
definition: Kompetensen avser kunskaper om och tillämpning av metoder för analys av spår inom brottsutredning. Det innefattar undersökningar av skoavtryck, verktygsspår, tejper, påsar och spår på textilier från brottsplatser, inklusive registrering, hantering och förberedelse av material som laborant samt jämförande undersökningar, värdering, sannolikhetsberäkning och rapportering.
broader: zmYu aAM TuF
related: vPP6 rsw dck
related: rNcE Zno pD8
related: bExu 8gk azk

Elmotorrenovering
type: Concept
in scheme: JobTech Taxonomy - Färdighet
definition: Elmotorrenovering
broader: zmYu aAM TuF
related: yXbD NTH ijE
related: KttZ Skc bMR
related: a75S eLg JWH

Stålprodukter/Verkstadsprodukter
type: Concept
in scheme: JobTech Taxonomy - Färdighet
definition: Stålprodukter/Verkstadsprodukter
alternative label: Stålprodukter
alternative label: Verkstadsprodukter
broader: zmYu aAM TuF
related: oXSW fbY XrY
related: 85cq 6uK 4cK

Ångkraftanläggning, underhåll
type: Concept
in scheme: JobTech Taxonomy - Färdighet
definition: Ångkraftanläggning, underhåll
broader: zmYu aAM TuF
related: Cppd 9P7 HeR

Konstsmide
type: Concept
in scheme: JobTech Taxonomy - Färdighet
definition: Konstsmide avser den hantverksmässiga färdigheten att forma och bearbeta metall, främst järn och stål, för att skapa konstverk, inredningsdetaljer och utsmyckningar.
broader: zmYu aAM TuF
related: q8Ho 3Xw sHq

Engelska, undervisning gymnasienivå
type: Concept
in scheme: JobTech Taxonomy - Färdighet
definition: Engelska, undervisning gymnasienivå
broader: Inriktning på lärarkompetens
related: 4KhP FxL uZ5

Inbrottsbesiktning, privat
type: Concept
in scheme: JobTech Taxonomy - Färdighet
definition: Inbrottsbesiktning, privat
broader: zmYu aAM TuF
related: Ru4W zn2 LEz

Advanced fire fighting
type: Concept
in scheme: JobTech Taxonomy - Färdighet
definition: Advanced fire fighting
broader: s48H Sft DTn
related: Rsoy sS6 6c4
related: kZwz D8K bKs
related: CbQK 7th Tyf
related: KttZ Skc bMR
related: kDnq Q98 sD3

Reguljärreseförsäljning
type: Concept
in scheme: JobTech Taxonomy - Färdighet
definition: Reguljärreseförsäljning avser försäljning av resor som följer fasta tidtabeller och rutter, ofta relaterat till kollektivtrafik som flyg, bussar och färjor. Denna kompetens innebär att förmedla och sälja biljetter samt informera om avgångar och resor till kunder.
broader: oLM7 u3d yJ5
related: fdLf oPp wVw

Berglastning
type: Concept
in scheme: JobTech Taxonomy - Färdighet
definition: Berglastning
broader: zmYu aAM TuF
related: f71c gjL RDq

Gatukök
type: Concept
in scheme: JobTech Taxonomy - Färdighet
definition: Gatukök avser en typ av serveringsverksamhet som erbjuder snabba måltider, oftast i form av enklare rätter som hamburgare, korv och pizza, och är vanligtvis belägna på platser med hög trafik. Denna typ av verksamhet kan involvera arbete som pizzabagare och restaurang- och köksbiträden, som ansvarar för tillagning av mat, servering, samt hantering av betalningar och disk.
broader: zmYu aAM TuF
related: a8gg ktU w8V
related: tPox ie4 X9X

Geoteknik
type: Concept
in scheme: JobTech Taxonomy - Färdighet
definition: Geoteknik
broader: zmYu aAM TuF
related: 3jEy yuT aVo
related: rwpH 6RA XTT
related: GMDo DVo Yzh
related: 7zKm 4NW eey
related: XeBP nMe pXx
related: 4Jty HpK a3Q

Tandhygienistexamen
type: Concept
in scheme: JobTech Taxonomy - Färdighet
definition: Tandhygienistexamen är en yrkesexamen på högskolenivå kopplad till utbildning med inriktning mot tandhygienist. Källa: UHR (Universitets- och högskolerådet)
broader: Yrkesbevis/examen
related: 4F9o Jzv Pwz

CNC-programmering, Yasnac
type: Concept
in scheme: JobTech Taxonomy - Färdighet
definition: CNC-programmering, Yasnac
broader: Programmering, CNC-styrsystem
related: vaEp iBS c5h
related: 4Jty HpK a3Q

Teckning, cirkelledning
type: Concept
in scheme: JobTech Taxonomy - Färdighet
definition: Teckning, cirkelledning
broader: zmYu aAM TuF
related: 1CX5 mZw Vcq

Energibesiktning
type: Concept
in scheme: JobTech Taxonomy - Färdighet
definition: Energibesiktning avser systematisk granskning och analys av en byggnads energianvändning för att identifiera förbättringsmöjligheter. Denna kompetens innefattar att bedöma byggnadens tekniska system och föreslå åtgärder för att effektivisera energiförbrukningen och minska kostnader.
alternative label: Energideklaration
broader: zmYu aAM TuF
related: wCx8 rY3 XUT
related: df9D e6y 61z
related: thZP oR7 WrY
related: yXbD NTH ijE

Biomedicinsk vetenskap
type: Concept
in scheme: JobTech Taxonomy - Färdighet
definition: De principer av naturvetenskap som tillämpas på medicin. Medicinska vetenskaper såsom mikrobiologi och klinisk virologi tillämpar biologins principer för medicinska kunskaper och uppfinningsverksamhet.
broader: zmYu aAM TuF
related: wNrt Ysj WuT
related: qn2U dB9 Cmh
related: SPYW 7Z1 ShT

Cosmos 2000, telefonväxel
type: Concept
in scheme: JobTech Taxonomy - Färdighet
definition: Cosmos 2000, telefonväxel
broader: Telefonväxlar
related: 4aPu 2nd 8X6
related: ByrL ANp UwV
related: 4Jty HpK a3Q

Kandidatexamen med inriktning produktionsdesign
type: Concept
in scheme: JobTech Taxonomy - Färdighet
definition: Kandidatexamen med inriktning produktionsdesign
broader: Yrkesbevis/examen
related: CSUf ZVM a7Z

Kommunikationsinfrastruktur, installation och underhåll
type: Concept
in scheme: JobTech Taxonomy - Färdighet
definition: Kommunikationsinfrastruktur, installation och underhåll avser kompetens att installera och underhålla system för data- och telenät samt relaterade larm- och signalsystem. Detta inkluderar tekniska kunskaper som är nödvändiga för att säkerställa funktionalitet och pålitlighet i kommunikationslösningar.
broader: zmYu aAM TuF
related: fWrt sLg koW

Arbete på väg steg 2, anpassad säkerhetskompetens
type: Concept
in scheme: JobTech Taxonomy - Färdighet
definition: Kompetenskrav med certifiering för personal som utför säkerhetsprioriterade arbeten. Steg 2 innehåller 3 delar beroende på ansvar vid vägprojekt. Certifiering utförs av Trafikverket.
broader: s48H Sft DTn
related: mis4 feV uex
related: 3ZtN hhA SM7
related: bZ4J riZ zK6
related: thZP oR7 WrY
related: 7zKm 4NW eey
related: ayQ4 G3W A2w
related: 3MBw pDA P2F
related: ketV G9W GeR

TMA-fordon, certifikat vinterväghållning
type: Concept
in scheme: JobTech Taxonomy - Färdighet
definition: TMA-fordon, certifikat vinterväghållning
broader: s48H Sft DTn
related: 3MBw pDA P2F

Rekrytering och utbildning av övervakare
type: Concept
in scheme: JobTech Taxonomy - Färdighet
definition: Rekrytering och utbildning av övervakare
broader: zmYu aAM TuF
related: n6iX f2z XfE

Medicinsk bilddiagnostik
type: Concept
in scheme: JobTech Taxonomy - Färdighet
definition: Medicinsk bilddiagnostik
broader: zmYu aAM TuF
related: nu7c QuB KVQ
related: ek9W qqp XpF
related: 39yB xPQ ozd
related: seu9 VoQ VNo
related: GC7L Yw7 Mfo
related: 4Jty HpK a3Q
related: gXqW s5Q ZjN

Fartygsbefäl klass VIII, examen
type: Concept
in scheme: JobTech Taxonomy - Färdighet
definition: Fartygsbefäl klass VIII, examen
broader: s48H Sft DTn
related: CbQK 7th Tyf
related: Lm3Z gek GYc
related: kDnq Q98 sD3

Bergkartering
type: Concept
in scheme: JobTech Taxonomy - Färdighet
definition: Bergkartering
broader: zmYu aAM TuF
related: 3jEy yuT aVo
related: w6ud quG dgh

Strängsprutning-rör
type: Concept
in scheme: JobTech Taxonomy - Färdighet
definition: Strängsprutning-rör
broader: zmYu aAM TuF
related: yPQ4 EaN Dtj

Rörreparationer
type: Concept
in scheme: JobTech Taxonomy - Färdighet
definition: Rörreparationer
broader: zmYu aAM TuF
related: KttZ Skc bMR

Kontorsmaskiner
type: Concept
in scheme: JobTech Taxonomy - Färdighet
definition: Kontorsmaskiner
broader: zmYu aAM TuF
related: oXSW fbY XrY
related: 85cq 6uK 4cK

Animering
type: Concept
in scheme: JobTech Taxonomy - Färdighet
definition: Animering
broader: zmYu aAM TuF
related: 8Bmh vtM zts
related: SgNH hag n9D
related: 4Jty HpK a3Q
related: Mbt6 3ko DiD

Områdesansvar, bostads- och byggnadsfrågor
type: Concept
in scheme: JobTech Taxonomy - Färdighet
definition: Områdesansvar, bostads- och byggnadsfrågor
broader: zmYu aAM TuF
related: 8SPu K1k 5qR
related: X1Ac Y9P PJo

Frisörsalong
type: Concept
in scheme: JobTech Taxonomy - Färdighet
definition: Frisörsalong avser en etablering där frisörer erbjuder klippning, hårbehandling och stylingtjänster till kunder. I en frisörsalong kan olika hårbehandlingar utföras, inklusive kemiska behandlingar som färgning och permanenter, samt utprovning av peruker.
broader: zmYu aAM TuF
related: mwVN oEH g9k
related: LyBp bY6 bZK

RIP, routingprotokoll
type: Concept
in scheme: JobTech Taxonomy - Färdighet
definition: RIP, routingprotokoll
broader: Routingprotokoll
related: nDaB vdy eAy
related: VCpu 5EN bBt
related: fWrt sLg koW
related: 4Jty HpK a3Q

Stordatorer, drift och övervakning
type: Concept
in scheme: JobTech Taxonomy - Färdighet
definition: Stordatorer, drift och övervakning
broader: zmYu aAM TuF
related: 4Jty HpK a3Q
related: 13md uyV BNG

Fotboll, professionell utövning
type: Concept
in scheme: JobTech Taxonomy - Färdighet
definition: Fotboll, professionell utövning
broader: Idrott/aktivitet
related: AwXA EM4 71n

Internationellt certifierad passivhusexpert
type: Concept
in scheme: JobTech Taxonomy - Färdighet
definition: Internationellt certifierad passivhusexpert
broader: s48H Sft DTn
related: thZP oR7 WrY
related: w6ud quG dgh
related: K8yg U4C gkY
related: nDaB vdy eAy
related: yXbD NTH ijE
related: XeBP nMe pXx
related: 41KB bfk 5jR

Aktuariekompetens
type: Concept
in scheme: JobTech Taxonomy - Färdighet
definition: Aktuariekompetens
broader: zmYu aAM TuF
related: ZA1N Z2B nFQ

Tradjazz
type: Concept
in scheme: JobTech Taxonomy - Färdighet
definition: Tradjazz
broader: p1WM wCw LTd
related: AWJF wqZ va9

Microsoft Navision, affärssystem
type: Concept
in scheme: JobTech Taxonomy - Färdighet
definition: Microsoft Navision, affärssystem
alternative label: Microsoft Navision
alternative label: Microsoft navision
broader: xSJR 1Kq pxB
related: eQ4M CNm ozj
related: Y6yY SuR hVh
related: Uw4n UB2 RCW
related: iWcY mko rq2
related: q81z 3oD 1qu
related: cRmd 536 pT1
related: ij8k EwC zyB
related: 4Jty HpK a3Q

Engelska, undervisning grundskolenivå
type: Concept
in scheme: JobTech Taxonomy - Färdighet
definition: Engelska, undervisning grundskolenivå
broader: Inriktning på lärarkompetens
related: oQUQ D11 HPx

PHP, programmeringsspråk
type: Concept
in scheme: JobTech Taxonomy - Färdighet
definition: PHP, programmeringsspråk
alternative label: PHP
broader: Datorspråk
related: BAeH eg8 T2d
related: Fv7d YhP YmS
related: 8Bmh vtM zts
related: D9SL mtn vGM
related: DJh5 yyF hEM
related: 4Jty HpK a3Q
related: Mbt6 3ko DiD

Base Maintenance
type: Concept
in scheme: JobTech Taxonomy - Färdighet
definition: Base Maintenance
broader: zmYu aAM TuF
related: iGTu bYL 2T7
related: eRkT cTv H9v

Grekiskt kök
type: Concept
in scheme: JobTech Taxonomy - Färdighet
definition: Grekiskt kök
broader: zmYu aAM TuF
related: BStc SJh DKG

Lingvistik
type: Concept
in scheme: JobTech Taxonomy - Färdighet
definition: Lingvistik
broader: zmYu aAM TuF
related: PQDm Z63 zst

Oracle Service Bus, integrationsplattform
type: Concept
in scheme: JobTech Taxonomy - Färdighet
definition: Oracle Service Bus, integrationsplattform
alternative label: Oracle Service Bus
alternative label: Oracle-kunskaper
alternative label: Oraclekunskap
alternative label: Oracleutveckling
broader: Integrationsplattformar
related: BAeH eg8 T2d
related: cBBa ngH fCx
related: D9SL mtn vGM
related: DJh5 yyF hEM
related: 4Jty HpK a3Q
related: UXKZ 3zZ ipB
related: MYAz x9m 2LJ

Optisk kommunikation
type: Concept
in scheme: JobTech Taxonomy - Färdighet
definition: Optisk kommunikation
broader: zmYu aAM TuF
related: nDaB vdy eAy
related: SPYW 7Z1 ShT

Automatskötsel
type: Concept
in scheme: JobTech Taxonomy - Färdighet
definition: Automatskötsel
broader: zmYu aAM TuF
related: ieVp d5L rS9

Provsömnad
type: Concept
in scheme: JobTech Taxonomy - Färdighet
definition: Provsömnad
broader: zmYu aAM TuF
related: skLS kpa Ui1

Kostdatasystem
type: Concept
in scheme: JobTech Taxonomy - Färdighet
definition: Kompetensen avser kunskap och färdighet att använda digitala system för att hantera data kring måltider i storkök och andra större måltidsverksamheter. Det inkluderar användning av programvara för meny- och receptplanering, näringsberäkning, kostprisberäkning, hantering av specialkost och uppföljning av matsvinn.
broader: zmYu aAM TuF
related: X1Ac Y9P PJo
related: h324 DPT 7Tw

Återvinningsteknik, papper
type: Concept
in scheme: JobTech Taxonomy - Färdighet
definition: Återvinningsteknik, papper
broader: zmYu aAM TuF
related: qn2U dB9 Cmh
related: yXbD NTH ijE

Arbetsterapeutexamen
type: Concept
in scheme: JobTech Taxonomy - Färdighet
definition: Arbetsterapeutexamenär en yrkesexamen på högskolenivå kopplad till utbildning med inriktning mot arbetsterapeut. Källa: UHR (Universitets- och högskolerådet)
broader: Yrkesbevis/examen
related: TPH4 2AM isT

Hårdlödning
type: Concept
in scheme: JobTech Taxonomy - Färdighet
definition: Hårdlödning
broader: on11 B1f LEw
related: wQ1E Bzk ZyA
related: bXfo 4hb SXx

Reservdelsrådgivning, bilverkstad
type: Concept
in scheme: JobTech Taxonomy - Färdighet
definition: Reservdelsrådgivning, bilverkstad, avser kompetens inom rådgivning och försäljning av reservdelar för motorfordon. Denna kompetens innebär att ha kunskap om olika typer av reservdelar, deras funktion och användning, samt förmåga att ge korrekt information och råd till kunder för att möta deras behov.
broader: zmYu aAM TuF
related: Lzpv ofL 3H5
related: dUuh wwa FGj

Elinriktning-energiteknik, undervisning
type: Concept
in scheme: JobTech Taxonomy - Färdighet
definition: Elinriktning-energiteknik, undervisning
broader: Inriktning på lärarkompetens
related: 2x2V UeL 6ke

Spelutvecklingsverktyg
type: Concept
in scheme: JobTech Taxonomy - Färdighet
definition: Spelutvecklingsverktyg
broader: zmYu aAM TuF
related: Q5DF juj 8do
related: 4Jty HpK a3Q
related: Mbt6 3ko DiD

Yrkesutbildning, medicinsk fotvård
type: Concept
in scheme: JobTech Taxonomy - Färdighet
definition: Yrkesutbildning inom medicinsk fotvård omfattar kunskaper och praktiska färdigheter i att förebygga, behandla och lindra olika fotrelaterade besvär. Utbildningen inkluderar moment som fotens anatomi, hygienrutiner, instrumenthantering, behandling av förhårdnader, liktornar, nageltrång och hudsprickor samt rådgivning om egenvård och fotstatusbedömning. Undervisningen kombinerar teori och klinisk praktik och ger förutsättningar för arbete inom både vård och egen verksamhet.
broader: Yrkesutbildning
related: HATH AfN RRz

Klinisk genetik, specialistkompetens för läkare
type: Concept
in scheme: JobTech Taxonomy - Färdighet
definition: Klinisk genetik, specialistkompetens för läkare
broader: Specialistbevis för läkare
related: nu7c QuB KVQ

Tramp/Foley
type: Concept
in scheme: JobTech Taxonomy - Färdighet
definition: Tramp/Foley
alternative label: Foley
alternative label: Tramp
broader: zmYu aAM TuF
related: 4BsK q2C sCL
related: 3J38 DNz YKK
related: 4Jty HpK a3Q

Klinisk neurofysiologi, specialistkompetens för läkare
type: Concept
in scheme: JobTech Taxonomy - Färdighet
definition: Klinisk neurofysiologi, specialistkompetens för läkare
broader: Specialistbevis för läkare
related: nu7c QuB KVQ

Spelmotorer
type: Concept
in scheme: JobTech Taxonomy - Färdighet
top concept of: JobTech Taxonomy - Färdighet
definition: Spelmotorer
narrower: Egen spelmotor
narrower: Havok Vision, fysikmotor
narrower: mBmm gfH wXb
narrower: Unreal Engine, spelmotor
narrower: Unity, spelmotor
narrower: x2P4 2XP SSX
narrower: CryEngine, spelmotor
narrower: on1Q YPq eww
narrower: Godot, spelmotor

Specialistkompetens för tandläkare
type: Concept
in scheme: JobTech Taxonomy - Färdighet
top concept of: JobTech Taxonomy - Färdighet
definition: Specialistkompetens för tandläkare
narrower: Bettfysiologi, specialistkompetens för tandläkare
narrower: Odontologisk radiologi/Tandröntgen, specialistkompetens för tandläkare
narrower: Pedodonti/Barntandvård, specialistkompetens för tandläkare
narrower: Parodontologi/Tandlossningssjukdomar, specialistkompetens för tandläkare
narrower: Ortodonti/Tandreglering, specialistkompetens för tandläkare
narrower: uWKc hi4 JjZ
narrower: Endodonti/Rotbehandling, specialistkompetens för tandläkare
narrower: Orofacial medicin, specialistkompetens för tandläkare
narrower: Oral protetik, specialistkompetens för tandläkare

Ålderskontroll
type: Concept
in scheme: JobTech Taxonomy - Färdighet
definition: Ålderskontroll innebär att kontrollera att besökare uppfyller ålderskrav enligt lag, exempelvis för tillträde till alkoholservering eller nattklubbar. Kompetensen innefattar att känna till aktuella lagar och riktlinjer, kunna bedöma legitimationer korrekt samt hantera situationer där åldersgränser inte uppfylls.
broader: zmYu aAM TuF
related: ieVp d5L rS9

Punk
type: Concept
in scheme: JobTech Taxonomy - Färdighet
definition: Punk
broader: p1WM wCw LTd
related: AWJF wqZ va9

Lisp, programmeringsspråk
type: Concept
in scheme: JobTech Taxonomy - Färdighet
definition: Lisp, programmeringsspråk
alternative label: Lisp
broader: Datorspråk
related: BAeH eg8 T2d
related: Fv7d YhP YmS
related: D9SL mtn vGM
related: DJh5 yyF hEM
related: 4Jty HpK a3Q

NoSQL, databashanterare
type: Concept
in scheme: JobTech Taxonomy - Färdighet
definition: NoSQL, databashanterare
alternative label: NoSQL
broader: Databaser
related: BAeH eg8 T2d
related: cBBa ngH fCx
related: Fv7d YhP YmS
related: D9SL mtn vGM
related: DJh5 yyF hEM
related: UxT1 tPF Kbg
related: 4Jty HpK a3Q
related: MYAz x9m 2LJ

Kvinnojoursarbete
type: Concept
in scheme: JobTech Taxonomy - Färdighet
definition: Kvinnojoursarbete avser aktiviteter och insatser som syftar till att stödja och hjälpa kvinnor som utsatts för våld och övergrepp. Kompetensen innefattar kunskaper om samtal, krissituationer och skyddsstrategier, samt samverkan med andra aktörer inom socialtjänst och rättsväsende.
broader: zmYu aAM TuF
related: BWwk fYX S5B

Arbetsterapi
type: Concept
in scheme: JobTech Taxonomy - Färdighet
definition: Arbetsterapi avser en rehabiliterande och stödjande aktivitet som syftar till att främja, förbättra och kompensera nedsatt aktivitetsförmåga hos individer. Detta inkluderar träning av både fysiska och psykiska förmågor samt anpassning av hjälpmedel och arbetsmetoder för att underlätta individuellt anpassade dagliga aktiviteter.
broader: zmYu aAM TuF
related: TPH4 2AM isT
related: GiNX ESA AL1

Mästarbrev, timrare
type: Concept
in scheme: JobTech Taxonomy - Färdighet
definition: Mästarbrev, timrare
broader: Yrkesbevis/examen
related: 9mJN VwW Xjg
related: 1Nwn GYH wkH

U-landskunskap
type: Concept
in scheme: JobTech Taxonomy - Färdighet
definition: U-landskunskap
broader: zmYu aAM TuF
related: XurM DVs ggn
related: 3LdB WEJ 8Ms

Radioreklam
type: Concept
in scheme: JobTech Taxonomy - Färdighet
definition: Radioreklam
broader: zmYu aAM TuF
related: SgNH hag n9D

Samordning/Granskning-Autodesk Navisworks Manage
type: Concept
in scheme: JobTech Taxonomy - Färdighet
definition: Samordning/Granskning-Autodesk Navisworks Manage
alternative label: Granskning-Autodesk Navisworks Manage
alternative label: Samordning-Autodesk Navisworks Manage
broader: mTLu uo2 gq2
related: 3jEy yuT aVo
related: thZP oR7 WrY
related: w6ud quG dgh
related: K8yg U4C gkY
related: nDaB vdy eAy
related: 33Nt DSs YYA
related: Pd51 xnr KCY
related: ketV G9W GeR
related: SPYW 7Z1 ShT
related: XeBP nMe pXx
related: PRQn 9yw NJA
related: ETAR ggZ Wuw
related: 41KB bfk 5jR
related: 4Jty HpK a3Q

Hippologexamen
type: Concept
in scheme: JobTech Taxonomy - Färdighet
definition: Hippologexamen
broader: Yrkesbevis/examen
related: EA6o N1N QtT

Penseltillverkning
type: Concept
in scheme: JobTech Taxonomy - Färdighet
definition: Penseltillverkning
broader: zmYu aAM TuF
related: HXzD qvt HV6

Hantera auktionsföremål
type: Concept
in scheme: JobTech Taxonomy - Färdighet
definition: Hantera auktionsföremål avser kompetens i att hantera föremål som ska auktioneras ut, vilket inkluderar insamling, registrering, beskrivning och bedömning av varor. Arbetet innebär även att säkerställa att föremålen presenteras på ett korrekt och tilltalande sätt för potentiella köpare.
broader: zmYu aAM TuF
related: dUuh wwa FGj
related: ieVp d5L rS9

Utbildning, väderskydd
type: Concept
in scheme: JobTech Taxonomy - Färdighet
definition: Utbildning, väderskydd
broader: s48H Sft DTn
related: Y4j1 P17 wVA

PL-900: Microsoft Power Platform Fundamentals
type: Concept
in scheme: JobTech Taxonomy - Färdighet
definition: PL-900: Microsoft Power Platform Fundamentals
broader: s48H Sft DTn
related: cBBa ngH fCx
related: VCpu 5EN bBt
related: 4Jty HpK a3Q
related: MYAz x9m 2LJ

Inköpsvana
type: Concept
in scheme: JobTech Taxonomy - Färdighet
definition: Inköpsvana avser erfarenhet och kunskap inom inköpsprocesser, vilket inkluderar att planera och hantera inköp av varor och tjänster. Kompetensen omfattar också förmåga att analysera marknaden och etablera relationer med leverantörer.
broader: zmYu aAM TuF
related: eQ4M CNm ozj
related: Fu4x 7KG YgC
related: BStc SJh DKG
related: QqHf XKZ eyy
related: Pz9M srJ Lc9
related: 33Nt DSs YYA
related: UjoW meY Zwt
related: 4Jty HpK a3Q
related: XGyi i4B ME7
related: h324 DPT 7Tw
related: 85cq 6uK 4cK
related: FtyZ Joo tB8

Ingres, databashanterare
type: Concept
in scheme: JobTech Taxonomy - Färdighet
definition: Ingres, databashanterare
alternative label: Ingres
broader: Databaser
related: BAeH eg8 T2d
related: cBBa ngH fCx
related: Fv7d YhP YmS
related: D9SL mtn vGM
related: DJh5 yyF hEM
related: 4Jty HpK a3Q
related: MYAz x9m 2LJ

Kompetensintyg, drönaroperatör, specifik kategori
type: Concept
in scheme: JobTech Taxonomy - Färdighet
definition: Kompetensintyg, drönaroperatör, specifik kategori
broader: s48H Sft DTn
related: C3153
related: 7n3y FTE qSe

Verksamhetsledning försäljning
type: Concept
in scheme: JobTech Taxonomy - Färdighet
definition: Kompetensen avser kunskaper om och tillämpning av metoder för strategisk ledning av försäljningsverksamhet inom organisationer. Det innefattar att sätta försäljningsmål, utveckla strategier och processer, leda och motivera säljteam, analysera marknadstrender och resultat, hantera kundrelationer samt säkerställa tillväxt genom budgetering och rapportering.
broader: zmYu aAM TuF
related: oXSW fbY XrY
related: Pz9M srJ Lc9

Mästarbrev, skomakare (beställning/nytillverkning)
type: Concept
in scheme: JobTech Taxonomy - Färdighet
definition: Mästarbrev, skomakare (beställning/nytillverkning)
broader: Yrkesbevis/examen
related: vJQk YvC XB7

Leveransplanering
type: Concept
in scheme: JobTech Taxonomy - Färdighet
definition: Leveransplanering
broader: zmYu aAM TuF
related: xm5G vGn iyk
related: mp2Y vyC RFV
related: AuTi FEo j3R
related: nNxJ YWy vR2

ITS (internationell spedition)
type: Concept
in scheme: JobTech Taxonomy - Färdighet
definition: ITS (internationell spedition) avser kompetens inom hantering och organisation av godstransporter över landsgränser. Denna kompetens innefattar kunskap om tullregler, fraktavtal, samt förmåga att upprätta nödvändig dokumentation och försäkringar i samband med internationella transporter.
alternative label: ITS
alternative label: Internationell spedition
broader: zmYu aAM TuF
related: AuTi FEo j3R

Folkmusik, undervisningsvana
type: Concept
in scheme: JobTech Taxonomy - Färdighet
definition: Folkmusik, undervisningsvana
broader: zmYu aAM TuF
related: mcRJ kq2 jFr

Körning av bestrykare
type: Concept
in scheme: JobTech Taxonomy - Färdighet
definition: Körning av bestrykare
broader: zmYu aAM TuF
related: 1G6H AuG qyy

C++ Certified Associate Programmer Certification
type: Concept
in scheme: JobTech Taxonomy - Färdighet
definition: C++ Certified Associate Programmer Certification
alternative label: C Certified Associate Programmer Certification
alternative label: CPA
broader: s48H Sft DTn
related: BAeH eg8 T2d
related: Fv7d YhP YmS
related: Q5DF juj 8do
related: nDaB vdy eAy
related: D9SL mtn vGM
related: DJh5 yyF hEM
related: SPYW 7Z1 ShT
related: 4Jty HpK a3Q

Miljökontroll
type: Concept
in scheme: JobTech Taxonomy - Färdighet
definition: Miljökontroll
broader: zmYu aAM TuF
related: rE1E m3d cx1
related: yXbD NTH ijE

Miljödata
type: Concept
in scheme: JobTech Taxonomy - Färdighet
definition: Miljödata
broader: zmYu aAM TuF
related: Uw64 cuc U3H
related: jv1x tpK 32p
related: puim 6PY DGj
related: rE1E m3d cx1
related: yXbD NTH ijE

Certifierad akupressör
type: Concept
in scheme: JobTech Taxonomy - Färdighet
definition: Certifierad akupunktör är en certifiering som intygar man genomgått utbildning och uppnått kompetens inom området, enligt branschstandarder.
broader: s48H Sft DTn
related: F19Z oB6 pg3

Scaled Agile Framework, SAFe
type: Concept
in scheme: JobTech Taxonomy - Färdighet
definition: Scaled Agile Framework, SAFe
broader: zmYu aAM TuF
related: BAeH eg8 T2d
related: cBBa ngH fCx
related: Qo7p wjf gtv
related: vPP6 rsw dck
related: Q5DF juj 8do
related: D9SL mtn vGM
related: DJh5 yyF hEM
related: UxT1 tPF Kbg
related: 4Jty HpK a3Q
related: UXKZ 3zZ ipB
related: MYAz x9m 2LJ

Personalplanering
type: Concept
in scheme: JobTech Taxonomy - Färdighet
definition: Personalplanering avser processen för att strategiskt hantera och organisera personalresurser inom en verksamhet. Den omfattar aspekter som rekrytering, kompetensutveckling och resursallokering för att säkerställa en effektiv arbetsstyrka som kan möta organisationens mål och behov.
broader: zmYu aAM TuF
related: oXSW fbY XrY
related: womV SEj CAH
related: NQTS fou E6u
related: Fu4x 7KG YgC
related: mNoS AN5 drn
related: XFXX Jq9 Y2a
related: NFUg y9y 1TY
related: 8SPu K1k 5qR
related: WhBn FAp ZNW
related: bEDv SL7 VrL
related: pf1K PTz frm
related: 48KE fDE ryL
related: 6eAB cbY i9T
related: bYde Frc xcB
related: 3FP7 4Eg x8P
related: coyZ Cyv Srw
related: QG4f MCh vND
related: NxXz fBh w7j
related: w6ud quG dgh
related: 7mn2 kA9 ftp
related: Pz9M srJ Lc9
related: Fp7x Yqt bx9
related: z8di AqX GBr
related: g6eC Fwu B3J
related: yct8 Pun DWd
related: bjqk F3A 5Hk
related: PHJN fva yxs
related: H2Zj eL9 x28
related: eWiB mGP MjE
related: mZsb A1K Gec
related: 7XXd 4St nit
related: UjoW meY Zwt
related: eX3C MtJ nPA
related: 4GAs rKs 2Ne
related: wby2 mwq fWV
related: nrVt xUL KdQ
related: uxst tkg zDh
related: 1tGC fXC mxX
related: dMVD VYy kgg
related: X1Ac Y9P PJo
related: FfMN Bw1 qYR
related: cuaN Rj5 YCc
related: hZLv S5f jo2
related: mpuA s56 Hsy
related: sWzF 6pd Y6L
related: 9QMD sZ3 ZjX
related: nNxJ YWy vR2
related: k3R3 UkC nK2
related: 1uau t1u rDL
related: dyWo sDb MLQ
related: 6zAR EHM Kwj
related: XGyi i4B ME7
related: h324 DPT 7Tw
related: 9Mn4 PNA 7Yz
related: 957L kZK rHZ
related: oj4c P4b cja
related: FtyZ Joo tB8

Lucitepåläggning
type: Concept
in scheme: JobTech Taxonomy - Färdighet
definition: Lucitepåläggning
broader: zmYu aAM TuF
related: hxm6 xkr dHm

Vård- och omsorgsinriktning, undervisning
type: Concept
in scheme: JobTech Taxonomy - Färdighet
definition: Vård- och omsorgsinriktning, undervisning
broader: Inriktning på lärarkompetens
related: 2x2V UeL 6ke

Microsoft Certified Database Administrator/MCDBA
type: Concept
in scheme: JobTech Taxonomy - Färdighet
definition: Microsoft Certified Database Administrator/MCDBA
alternative label: MCDBA
alternative label: Microsoft Certified Database Administrator
broader: s48H Sft DTn
related: BAeH eg8 T2d
related: UXKZ 3zZ ipB

Bildredigering
type: Concept
in scheme: JobTech Taxonomy - Färdighet
definition: Bildredigering
broader: zmYu aAM TuF
related: ezKk kss CiQ
related: 4BsK q2C sCL
related: CkRH 4Qn iX3
related: 3J38 DNz YKK
related: PH2M uV4 r72
related: 4Jty HpK a3Q
related: CSUf ZVM a7Z

Piccolaflöjt
type: Concept
in scheme: JobTech Taxonomy - Färdighet
definition: Piccolaflöjt
broader: wLYs CKS wK8
related: AWJF wqZ va9

Datorteknik, grundläggande
type: Concept
in scheme: JobTech Taxonomy - Färdighet
definition: Datorteknik, grundläggande
broader: zmYu aAM TuF
related: MW1P GNJ 4F9
related: yXbD NTH ijE
related: fWrt sLg koW
related: a75S eLg JWH
related: 4Jty HpK a3Q
related: yyF7 jsW EeP

Driftdokumentation, data
type: Concept
in scheme: JobTech Taxonomy - Färdighet
definition: Driftdokumentation, data
broader: zmYu aAM TuF
related: 13md uyV BNG

Skåplackering
type: Concept
in scheme: JobTech Taxonomy - Färdighet
definition: Skåplackering
broader: zmYu aAM TuF
related: dKUb KBP mw3

TCMS, hänvisningssystem
type: Concept
in scheme: JobTech Taxonomy - Färdighet
definition: TCMS, hänvisningssystem
broader: Hänvisningsdatorer
related: 4aPu 2nd 8X6
related: ByrL ANp UwV
related: 4Jty HpK a3Q

Trädgårdsingenjörsexamen
type: Concept
in scheme: JobTech Taxonomy - Färdighet
definition: Trädgårdsingenjörsexamen är en yrkesexamen på högskolenivå kopplad till utbildning med inriktning mot trädgårdsingenjör. Källa: UHR (Universitets- och högskolerådet)
broader: Yrkesbevis/examen
related: XBh3 Xrm C4R
related: XurM DVs ggn
related: yXbD NTH ijE
related: k3R3 UkC nK2

Fysisk planläggning
type: Concept
in scheme: JobTech Taxonomy - Färdighet
definition: Fysisk planläggning
broader: zmYu aAM TuF
related: Pd51 xnr KCY
related: sXgV QFg vpb
related: ETAR ggZ Wuw

Utprovning av peruker
type: Concept
in scheme: JobTech Taxonomy - Färdighet
definition: Utprovning av peruker
broader: zmYu aAM TuF
related: mwVN oEH g9k
related: LyBp bY6 bZK

Pistmaskin
type: Concept
in scheme: JobTech Taxonomy - Färdighet
definition: Pistmaskin
broader: zmYu aAM TuF
related: 3ZtN hhA SM7

Barn och ungdomar med synnedsättning, erfarenhet
type: Concept
in scheme: JobTech Taxonomy - Färdighet
definition: Barn och ungdomar med synnedsättning, erfarenhet
broader: zmYu aAM TuF
related: XW9L tA9 WaX

Kopparsmide
type: Concept
in scheme: JobTech Taxonomy - Färdighet
definition: Kopparsmide
broader: zmYu aAM TuF
related: nwSm phw sPo

Torvhantering (lastning, lossning, påfyllning)
type: Concept
in scheme: JobTech Taxonomy - Färdighet
definition: Torvhantering (lastning, lossning, påfyllning)
broader: zmYu aAM TuF
related: iHrC aRv fVm

Uppläggning av metallväv
type: Concept
in scheme: JobTech Taxonomy - Färdighet
definition: Uppläggning av metallväv
broader: zmYu aAM TuF
related: vaEp iBS c5h

5G-teknik
type: Concept
in scheme: JobTech Taxonomy - Färdighet
definition: 5G-teknik avser den femte generationens mobilteknologi. Denna kompetens innefattar förståelse för nätverksarkitektur, kommunikationsprotokoll och möjligheter för IoT (Internet of Things) samt utveckling och implementering av relaterade system och applikationer.
broader: Mobiltelefonsystem
related: nDaB vdy eAy
related: DJh5 yyF hEM
related: SPYW 7Z1 ShT
related: fWrt sLg koW
related: UXKZ 3zZ ipB

Spår- och banunderhåll
type: Concept
in scheme: JobTech Taxonomy - Färdighet
definition: Spår- och banunderhåll
broader: zmYu aAM TuF
related: nk6Z 5oD QoM

Områdesansvar, utbildningsfrågor
type: Concept
in scheme: JobTech Taxonomy - Färdighet
definition: Områdesansvar, utbildningsfrågor
broader: zmYu aAM TuF
related: z8di AqX GBr
related: g6eC Fwu B3J

Habiliteringspsykologi
type: Concept
in scheme: JobTech Taxonomy - Färdighet
definition: Habiliteringspsykologi
broader: zmYu aAM TuF
related: VYeq GDF a2g

Verksamhetsutveckling
type: Concept
in scheme: JobTech Taxonomy - Färdighet
definition: Verksamhetsutveckling avser den process där analyser av företags och organisationers verksamhet genomförs för att identifiera förbättringsmöjligheter och effektivisera processer. Denna kompetens innefattar strategiskt tänkande, planering av åtgärder samt implementering av förändringar för att optimera verksamhetens resultat och effektivitet.
broader: zmYu aAM TuF
related: Qo7p wjf gtv
related: vPP6 rsw dck

Leasingavtal
type: Concept
in scheme: JobTech Taxonomy - Färdighet
definition: Leasingavtal avser ett avtal där en part, leasinggivare, hyr ut egendom, såsom fordon eller maskiner, till en annan part, leasingtagare, under en bestämd tidsperiod i utbyte mot regelbundna betalningar. Denna typ av avtal reglerar villkor för användning, ansvar och eventuell option för att köpa egendomen vid avtalets slut.
broader: zmYu aAM TuF
related: YKL2 FCB 1yr
related: M47D MU2 dhS

Bågskytte, instruktör/Bågskytte, tränare
type: Concept
in scheme: JobTech Taxonomy - Färdighet
definition: Bågskytte, instruktör/Bågskytte, tränare
alternative label: Bågskytte, instruktör
alternative label: Bågskytte, tränare
broader: Idrott/aktivitet
related: EA6o N1N QtT

Hadoop, ramverk
type: Concept
in scheme: JobTech Taxonomy - Färdighet
definition: Hadoop, ramverk
broader: srsj GQb CE1
related: D9SL mtn vGM
related: DJh5 yyF hEM
related: UxT1 tPF Kbg
related: 4Jty HpK a3Q
related: UXKZ 3zZ ipB

Analys/Beräkning-VIP-Energy
type: Concept
in scheme: JobTech Taxonomy - Färdighet
definition: Analys/Beräkning-VIP-Energy
alternative label: Analys-VIP-Energy
alternative label: Beräkning-VIP-Energy
broader: mTLu uo2 gq2
related: thZP oR7 WrY
related: K8yg U4C gkY
related: Pd51 xnr KCY
related: XeBP nMe pXx
related: PRQn 9yw NJA
related: ETAR ggZ Wuw
related: 41KB bfk 5jR
related: 4Jty HpK a3Q

Koordinatmätmaskiner
type: Concept
in scheme: JobTech Taxonomy - Färdighet
definition: Koordinatmätmaskiner
broader: zmYu aAM TuF
related: e6nk AGp y28

Ambulanssjukvård, specialistområde för sjuksköterska
type: Concept
in scheme: JobTech Taxonomy - Färdighet
definition: En fördjupad specialistkompetens för sjuksköterska inom ambulanssjukvård.
broader: Specialistområde för sjuksköterska
related: PHJN fva yxs

Smådjursklinik, vårdarerfarenhet
type: Concept
in scheme: JobTech Taxonomy - Färdighet
definition: Smådjursklinik, vårdarerfarenhet
broader: zmYu aAM TuF
related: 8q1B 5AR CEM
related: yXbD NTH ijE

Yrkesbevis, väghyvel
type: Concept
in scheme: JobTech Taxonomy - Färdighet
definition: Yrkesbevis, väghyvel
broader: Yrkesbevis/examen
related: 3ZtN hhA SM7

Umgängesrätt, utredningar
type: Concept
in scheme: JobTech Taxonomy - Färdighet
definition: Umgängesrätt, utredningar
broader: zmYu aAM TuF
related: dJXy Rpq a2u
related: pok1 ipJ yzD

Rörelsepedagogik
type: Concept
in scheme: JobTech Taxonomy - Färdighet
definition: Rörelsepedagogik
broader: zmYu aAM TuF
related: s7vU FhY L5Z

Sexuell hälsa
type: Concept
in scheme: JobTech Taxonomy - Färdighet
definition: Sexuell hälsa
broader: zmYu aAM TuF
related: 7XXd 4St nit

Fysisk funktionsnedsättning, vårderfarenhet
type: Concept
in scheme: JobTech Taxonomy - Färdighet
definition: Fysisk funktionsnedsättning, vårderfarenhet
broader: zmYu aAM TuF
related: sq3e WVv Fjd
related: 7fNG sve JWU
related: 5dxv nVQ N8o
related: jY19 knH MJp
related: LP4Z ABV gRm
related: kHgb AHf vrY
related: tAJS JNb hDH

Psykologexamen
type: Concept
in scheme: JobTech Taxonomy - Färdighet
definition: Psykologexamen är en examen på högskolenivå kopplad till utbildning med inriktning mot psykolog.
broader: Yrkesbevis/examen
related: UUQi UJ5 MSb
related: VYeq GDF a2g

Psykossjukdomar, vårderfarenhet
type: Concept
in scheme: JobTech Taxonomy - Färdighet
definition: Psykossjukdomar, vårderfarenhet
broader: zmYu aAM TuF
related: 7fNG sve JWU

Verksamhetsledning, högskola
type: Concept
in scheme: JobTech Taxonomy - Färdighet
definition: Verksamhetsledning, högskola
broader: zmYu aAM TuF
related: X1Ac Y9P PJo
related: 3i4a Ufc qpp

Elkraftteknik
type: Concept
in scheme: JobTech Taxonomy - Färdighet
definition: Elkraftteknik
broader: zmYu aAM TuF
related: MW1P GNJ 4F9
related: nDaB vdy eAy
related: SPYW 7Z1 ShT
related: KM7d Z6Y LCJ
related: 7Zqy hSM Fig
related: fWrt sLg koW
related: a75S eLg JWH
related: yyF7 jsW EeP

Gruppvägledning, ledarerfarenhet
type: Concept
in scheme: JobTech Taxonomy - Färdighet
definition: Gruppvägledning, ledarerfarenhet
broader: zmYu aAM TuF
related: fsnw ZCu v2U
related: jJF3 qaQ Zsh
related: bjqk F3A 5Hk

Ekonomisk rådgivning
type: Concept
in scheme: JobTech Taxonomy - Färdighet
definition: Ekonomisk rådgivning avser kompetensen att analysera en kunds finansiella situation och ge skräddarsydda råd om bland annat sparande, lån, investeringar, pension och försäkringar.
broader: zmYu aAM TuF
related: Y6yY SuR hVh
related: XurM DVs ggn
related: Bbkh nrm 2J8
related: Uw4n UB2 RCW
related: aQpg E2T cWq
related: pTr9 RBT 9ur
related: mZsb A1K Gec
related: cRmd 536 pT1
related: FfMN Bw1 qYR
related: 3LdB WEJ 8Ms

Boutredningar
type: Concept
in scheme: JobTech Taxonomy - Färdighet
definition: Boutredningar
broader: zmYu aAM TuF
related: R8bW rsJ b2G
related: zKvJ GnC Szx

Personalredovisning
type: Concept
in scheme: JobTech Taxonomy - Färdighet
definition: Personalredovisning
broader: zmYu aAM TuF
related: eQ4M CNm ozj
related: L7eh ihX vM5
related: Fp7x Yqt bx9
related: ij8k EwC zyB

Insatsledare räddningstjänst, erfarenhet
type: Concept
in scheme: JobTech Taxonomy - Färdighet
definition: Insatsledare räddningstjänst, erfarenhet
broader: zmYu aAM TuF
related: ug5y o6z U3L

Texturering
type: Concept
in scheme: JobTech Taxonomy - Färdighet
definition: Texturering
broader: zmYu aAM TuF
related: 8Bmh vtM zts
related: 4BsK q2C sCL
related: 4Jty HpK a3Q
related: Mbt6 3ko DiD

Specialistkompetens för psykologer
type: Concept
in scheme: JobTech Taxonomy - Färdighet
top concept of: JobTech Taxonomy - Färdighet
definition: Specialistkompetens för psykologer
narrower: Specialistbehörig inom klinisk vuxenpsykologi
narrower: Specialistbehörig inom neuropsykologi
narrower: qpdp mgT 1pi
narrower: Specialistbehörig inom pedagogisk psykologi
narrower: Specialistbehörig inom beroendepsykologi
narrower: sQRG XKK M5n
narrower: v2GT AcT bcm
narrower: psMX XVq MXZ
narrower: tqC3 TwD M9P
narrower: Specialistbehörig inom arbets- och organisationspsykologi

Musiklärarexamen
type: Concept
in scheme: JobTech Taxonomy - Färdighet
definition: Musiklärarexamen
broader: Yrkesbevis/examen
related: 2x2V UeL 6ke
related: 4KhP FxL uZ5
related: oQUQ D11 HPx

Samhällsjournalistik
type: Concept
in scheme: JobTech Taxonomy - Färdighet
definition: Samhällsjournalistik
broader: zmYu aAM TuF
related: SgNH hag n9D

IT solutions
type: Concept
in scheme: JobTech Taxonomy - Färdighet
definition: IT solutions
broader: zmYu aAM TuF
related: BAeH eg8 T2d
related: 4Jty HpK a3Q

Vitvaror, installation och underhåll
type: Concept
in scheme: JobTech Taxonomy - Färdighet
definition: Vitvaror, installation och underhåll avser kompetensen att installera och utföra service på vitvaror som kylskåp, tvättmaskiner, och andra hushållsapparater samt att säkerställa deras funktionalitet och effektivitet. Detta inkluderar kunskaper om elinstallationer, vattenanslutningar och reparationstekniker för att upprätthålla och förbättra vitvarornas prestanda.
broader: zmYu aAM TuF
related: fWrt sLg koW

Persiennmontering
type: Concept
in scheme: JobTech Taxonomy - Färdighet
definition: Persiennmontering avser arbetet med att installera och fästa persienner i fönsteröppningar. Kompetensen innefattar kunskap om olika typer av persienner och monteringsmetoder samt förmågan att hantera verktyg och utrustning som krävs för korrekt installation.
broader: zmYu aAM TuF
related: Kxm9 N3V shF

Gesällbrev, glasmästare
type: Concept
in scheme: JobTech Taxonomy - Färdighet
definition: Gesällbrev, glasmästare
broader: Yrkesbevis/examen
related: J17g Q2a 2u1

Urologi, specialistkompetens för läkare
type: Concept
in scheme: JobTech Taxonomy - Färdighet
definition: Urologi, specialistkompetens för läkare
broader: Specialistbevis för läkare
related: nu7c QuB KVQ

Volleyboll, instruktör/Volleyboll, tränare
type: Concept
in scheme: JobTech Taxonomy - Färdighet
definition: Volleyboll, instruktör/Volleyboll, tränare
alternative label: Volleyboll, instruktör
alternative label: Volleyboll, tränare
broader: Idrott/aktivitet
related: EA6o N1N QtT

Behörighet Ansvarig brunnsborrare (AB)
type: Concept
in scheme: JobTech Taxonomy - Färdighet
definition: Behörighet Ansvarig brunnsborrare (AB)
broader: s48H Sft DTn
related: 7zKm 4NW eey

Maskinell spårjustering
type: Concept
in scheme: JobTech Taxonomy - Färdighet
definition: Maskinell spårjustering
broader: zmYu aAM TuF
related: bZ4J riZ zK6

CSS, stilmall
type: Concept
in scheme: JobTech Taxonomy - Färdighet
definition: CSS, stilmallar
alternative label: CSS
alternative label: Cascading stylesheets
alternative label: Kaskadmallar
broader: Datorspråk
related: BAeH eg8 T2d
related: Fv7d YhP YmS
related: 8Bmh vtM zts
related: D9SL mtn vGM
related: DJh5 yyF hEM
related: 4Jty HpK a3Q
related: Mbt6 3ko DiD

Tillskärning, råglas
type: Concept
in scheme: JobTech Taxonomy - Färdighet
definition: Tillskärning, råglas
broader: zmYu aAM TuF
related: hxm6 xkr dHm

Apple-script, programmeringsspråk
type: Concept
in scheme: JobTech Taxonomy - Färdighet
definition: Apple-script, programmeringsspråk
alternative label: Apple-script
broader: Datorspråk
related: BAeH eg8 T2d
related: Fv7d YhP YmS
related: D9SL mtn vGM
related: DJh5 yyF hEM
related: 4Jty HpK a3Q

Utbildning, armén
type: Concept
in scheme: JobTech Taxonomy - Färdighet
definition: Utbildning, armén
broader: zmYu aAM TuF
related: jXUQ rUV iBv
related: dhgR 9jk 95r
related: KiVA anS RJh

Frilandsodling
type: Concept
in scheme: JobTech Taxonomy - Färdighet
definition: Frilandsodling avser odling av växter i utomhusmiljö, utanför skyddade anläggningar som växthus. Kompetensen innefattar kunskaper inom jordbrukstekniker, växtval och skötsel för att maximera skörd och kvalitet på de odlat produkterna.
broader: zmYu aAM TuF
related: XurM DVs ggn
related: yXbD NTH ijE
related: 2xQ4 4kh kTZ
related: k3R3 UkC nK2

MD 110, telefonväxel
type: Concept
in scheme: JobTech Taxonomy - Färdighet
definition: MD 110, telefonväxel
broader: Telefonväxlar
related: 4aPu 2nd 8X6
related: ByrL ANp UwV
related: 4Jty HpK a3Q

Kassettillverkning
type: Concept
in scheme: JobTech Taxonomy - Färdighet
definition: Kassettillverkning
broader: zmYu aAM TuF
related: mPzg 93F QEv

Trådning
type: Concept
in scheme: JobTech Taxonomy - Färdighet
definition: Trådning
broader: zmYu aAM TuF
related: ezKk kss CiQ

Soloframträdande
type: Concept
in scheme: JobTech Taxonomy - Färdighet
definition: Soloframträdande
broader: zmYu aAM TuF
related: AWJF wqZ va9
related: gmRr 7tt eHj

Publicera forskningsresultat
type: Concept
in scheme: JobTech Taxonomy - Färdighet
definition: Publicera forskningsresultat
broader: zmYu aAM TuF
related: HPxT fQJ zwT
related: Z2MZ eYc Lfv
related: mp2Y vyC RFV
related: mcRJ kq2 jFr
related: cYCo PxY zQd
related: PQDm Z63 zst
related: sXgV QFg vpb
related: dsK3 hkt zGy
related: SPYW 7Z1 ShT
related: RPBE x5M cXX
related: e9FK VKh ahW
related: 4Jty HpK a3Q
related: 6zAR EHM Kwj
related: P7eS nP8 3dy

Slungblästring
type: Concept
in scheme: JobTech Taxonomy - Färdighet
definition: Slungblästring
broader: zmYu aAM TuF
related: idjo 2Wr a3E

Kontrabas
type: Concept
in scheme: JobTech Taxonomy - Färdighet
definition: Kontrabas
broader: wLYs CKS wK8
related: AWJF wqZ va9

Nordic Team, hotellbokningssystem
type: Concept
in scheme: JobTech Taxonomy - Färdighet
definition: Nordic Team, hotellbokningssystem
alternative label: Nordic Team
broader: kRoQ fPR 8oK
related: bYde Frc xcB
related: 4Jty HpK a3Q

Minkskötsel
type: Concept
in scheme: JobTech Taxonomy - Färdighet
definition: Minkskötsel
broader: zmYu aAM TuF
related: Lrsj wRZ sFV

Teckenspråk, undervisning
type: Concept
in scheme: JobTech Taxonomy - Färdighet
definition: Teckenspråk, undervisning
broader: zmYu aAM TuF
related: mcRJ kq2 jFr

Kafé
type: Concept
in scheme: JobTech Taxonomy - Färdighet
definition: Kafé
broader: zmYu aAM TuF
related: 1wqU Jhj amb
related: tPox ie4 X9X

Barnpsykologi
type: Concept
in scheme: JobTech Taxonomy - Färdighet
definition: Barnpsykologi
broader: zmYu aAM TuF
related: VYeq GDF a2g

Animering, arkitektur
type: Concept
in scheme: JobTech Taxonomy - Färdighet
definition: Animering, arkitektur
broader: zmYu aAM TuF
related: Pd51 xnr KCY
related: 41KB bfk 5jR
related: 4Jty HpK a3Q

Importkunskap
type: Concept
in scheme: JobTech Taxonomy - Färdighet
definition: Importkunskap
broader: zmYu aAM TuF
related: 33Nt DSs YYA
related: 85cq 6uK 4cK

Strömförsörjningssystem
type: Concept
in scheme: JobTech Taxonomy - Färdighet
definition: Strömförsörjningssystem
broader: zmYu aAM TuF
related: nDaB vdy eAy
related: SPYW 7Z1 ShT

Ortopediska produkter, produktkunskap
type: Concept
in scheme: JobTech Taxonomy - Färdighet
definition: Ortopediska produkter, produktkunskap, avser förståelse och insikt i de olika typerna av ortopediska hjälpmedel och produkter, deras funktioner samt hur de används för att stödja och underlätta kroppens funktionalitet. Denna kompetens innefattar även kännedom om material, tillverkningsprocesser och anpassning av produkter efter individuella behov.
broader: zmYu aAM TuF
related: 39yB xPQ ozd
related: YKL2 FCB 1yr
related: vJQk YvC XB7

Industriprojektering
type: Concept
in scheme: JobTech Taxonomy - Färdighet
definition: Industriprojektering
broader: zmYu aAM TuF
related: thZP oR7 WrY
related: XeBP nMe pXx

Besiktning av eldstäder
type: Concept
in scheme: JobTech Taxonomy - Färdighet
definition: Besiktning av eldstäder är en brandskyddskontroll för att upptäcka fel och brister i och omkring eldstäder.
broader: zmYu aAM TuF
related: SUfj 4D9 FNx

Sadelmakeri
type: Concept
in scheme: JobTech Taxonomy - Färdighet
definition: Sadelmakeri avser kompetens inom tillverkning och reparation av sadlar och relaterade läderprodukter. Denna kompetens omfattar hantering av olika lädertyper, mönstring, sömnad och anpassning av sadlar för att säkerställa funktion och komfort.
broader: zmYu aAM TuF
related: vJQk YvC XB7
related: vhUJ LyD XWc

Lantbruksteknik
type: Concept
in scheme: JobTech Taxonomy - Färdighet
definition: Lantbruksteknik
broader: zmYu aAM TuF
related: XurM DVs ggn
related: yXbD NTH ijE
related: 4Jty HpK a3Q

Säkerhetskontroll
type: Concept
in scheme: JobTech Taxonomy - Färdighet
definition: Säkerhetskontroll
broader: zmYu aAM TuF
related: iqZh 3yX i8n

Limnologi
type: Concept
in scheme: JobTech Taxonomy - Färdighet
definition: Limnologi
broader: zmYu aAM TuF
related: yXbD NTH ijE
related: e9FK VKh ahW

Oud
type: Concept
in scheme: JobTech Taxonomy - Färdighet
definition: Oud
broader: wLYs CKS wK8
related: AWJF wqZ va9

Demontering
type: Concept
in scheme: JobTech Taxonomy - Färdighet
definition: Demontering avser processen att ta bort och separera komponenter från en struktur eller anläggning, vilket kan omfatta allt från byggmaterial till tekniska installationer. Denna kompetens innefattar metoder för säker och effektiv nedmontering, samt kunskap om verktyg och tekniker som används för att hantera olika material.
broader: zmYu aAM TuF
related: bZ4J riZ zK6
related: Y4j1 P17 wVA
related: X7HR rZK 4wj
related: yXbD NTH ijE
related: AD3U cFH rbe
related: iHrC aRv fVm
related: L4hA SJP SFi
related: bXfo 4hb SXx

Custody
type: Concept
in scheme: JobTech Taxonomy - Färdighet
definition: Custody
broader: zmYu aAM TuF
related: aQpg E2T cWq

Riksdagsstenograf, aspirantutbildning
type: Concept
in scheme: JobTech Taxonomy - Färdighet
definition: Riksdagsstenograf, aspirantutbildning
broader: Yrkesbevis/examen
related: oEmP NC1 sXE

Barnkirurgi
type: Concept
in scheme: JobTech Taxonomy - Färdighet
definition: Barnkirurgi
broader: zmYu aAM TuF
related: NFUg y9y 1TY

Ändringsarbeten, pälsar
type: Concept
in scheme: JobTech Taxonomy - Färdighet
definition: Ändringsarbeten, pälsar
broader: zmYu aAM TuF
related: mwVN oEH g9k

Luftsanering
type: Concept
in scheme: JobTech Taxonomy - Färdighet
definition: Luftsanering
broader: zmYu aAM TuF
related: idjo 2Wr a3E
related: yXbD NTH ijE

Tryckkärl
type: Concept
in scheme: JobTech Taxonomy - Färdighet
definition: Tryckkärl
broader: zmYu aAM TuF
related: K8yg U4C gkY
related: PRQn 9yw NJA

Handledning av vuxna i lärande
type: Concept
in scheme: JobTech Taxonomy - Färdighet
definition: Handledning av vuxna i lärande
broader: zmYu aAM TuF
related: 3FP7 4Eg x8P

Matematiksvårigheter, specialpedagogik/Dyskalkyli, specialpedagogik
type: Concept
in scheme: JobTech Taxonomy - Färdighet
definition: Matematiksvårigheter, specialpedagogik/Dyskalkyli, specialpedagogik
alternative label: Dyskalkyli, specialpedagogik
alternative label: Matematiksvårigheter, specialpedagogik
broader: zmYu aAM TuF
related: 3FP7 4Eg x8P

Java Enterprise Edition, programmeringsspråk
type: Concept
in scheme: JobTech Taxonomy - Färdighet
definition: Java Enterprise Edition, programmeringsspråk
alternative label: Java Enterprise Edition
broader: Datorspråk
related: BAeH eg8 T2d
related: Fv7d YhP YmS
related: D9SL mtn vGM
related: DJh5 yyF hEM
related: 4Jty HpK a3Q

Kurdiskt kök
type: Concept
in scheme: JobTech Taxonomy - Färdighet
definition: Kurdiskt kök
broader: zmYu aAM TuF
related: BStc SJh DKG

Maringeologi
type: Concept
in scheme: JobTech Taxonomy - Färdighet
definition: Maringeologi
broader: zmYu aAM TuF
related: 7zKm 4NW eey
related: yXbD NTH ijE
related: V7Yz 4WV g4z

Verksamhetsledning, verkstad
type: Concept
in scheme: JobTech Taxonomy - Färdighet
definition: Verksamhetsledning, verkstad
broader: zmYu aAM TuF
related: pf1K PTz frm

Byggkonstruktion-Tekla Structures
type: Concept
in scheme: JobTech Taxonomy - Färdighet
definition: Byggkonstruktion-Tekla Structures
broader: mTLu uo2 gq2
related: thZP oR7 WrY
related: w6ud quG dgh
related: Pd51 xnr KCY
related: XeBP nMe pXx
related: ETAR ggZ Wuw
related: 41KB bfk 5jR
related: 4Jty HpK a3Q

Fysik, undervisning gymnasienivå
type: Concept
in scheme: JobTech Taxonomy - Färdighet
definition: Fysik, undervisning gymnasienivå
broader: Inriktning på lärarkompetens
related: 4KhP FxL uZ5

Diplomerad make-up artist
type: Concept
in scheme: JobTech Taxonomy - Färdighet
definition: Diplomerad make-up artist visar på avancerade kunskaper inom makeup. Diplomering utförs av olika utbildningsföretag.
broader: s48H Sft DTn
related: ezKk kss CiQ

Fastighetsunderhåll
type: Concept
in scheme: JobTech Taxonomy - Färdighet
definition: Fastighetsunderhåll avser arbete och insatser som krävs för att säkerställa en fastighets funktion och skick, inklusive reparationer, skötsel och service av inre och yttre miljö. Kompetensen omfattar bland annat övervakning av tekniska system, utförande av reparationer samt hantering av serviceärenden från hyresgäster och besökare.
broader: zmYu aAM TuF
related: df9D e6y 61z
related: U8HK Jdi GuC

Mjukslöjd, konsulenterfarenhet
type: Concept
in scheme: JobTech Taxonomy - Färdighet
definition: Mjukslöjd, konsulenterfarenhet
broader: zmYu aAM TuF
related: mcRJ kq2 jFr
related: 1CX5 mZw Vcq

Vildmarkresor, ledarerfarenhet/Äventyrsresor, ledarerfarenhet
type: Concept
in scheme: JobTech Taxonomy - Färdighet
definition: Vildmarkresor, ledarerfarenhet/Äventyrsresor, ledarerfarenhet
alternative label: Vildmarkresor, ledarerfarenhet
alternative label: Äventyrsresor, ledarerfarenhet
broader: zmYu aAM TuF
related: A6X3 efC VNy
related: yXbD NTH ijE

Gesällbrev, reception
type: Concept
in scheme: JobTech Taxonomy - Färdighet
definition: Gesällbrev, reception
broader: Yrkesbevis/examen
related: bYde Frc xcB

Bensinmotorer, reparationsvana
type: Concept
in scheme: JobTech Taxonomy - Färdighet
definition: Bensinmotorer, reparationsvana
broader: zmYu aAM TuF
related: Lzpv ofL 3H5

SRC/VHF
type: Concept
in scheme: JobTech Taxonomy - Färdighet
definition: SRC/VHF
alternative label: VHF
broader: s48H Sft DTn
related: BStc SJh DKG
related: Rsoy sS6 6c4
related: kZwz D8K bKs
related: CbQK 7th Tyf
related: UjoW meY Zwt
related: 4BsK q2C sCL
related: tPox ie4 X9X
related: CkRH 4Qn iX3
related: KttZ Skc bMR
related: kDnq Q98 sD3
related: a75S eLg JWH
related: 4Jty HpK a3Q
related: 957L kZK rHZ

Fasadblästring
type: Concept
in scheme: JobTech Taxonomy - Färdighet
definition: Fasadblästring
broader: zmYu aAM TuF
related: idjo 2Wr a3E

Datawarehouse
type: Concept
in scheme: JobTech Taxonomy - Färdighet
definition: Datawarehouse
broader: zmYu aAM TuF
related: D9SL mtn vGM
related: DJh5 yyF hEM
related: UxT1 tPF Kbg
related: 4Jty HpK a3Q
related: UXKZ 3zZ ipB

Tillverkningsindustri-Iron CAD
type: Concept
in scheme: JobTech Taxonomy - Färdighet
definition: Tillverkningsindustri-Iron CAD
broader: mTLu uo2 gq2
related: mis4 feV uex
related: xm5G vGn iyk
related: mp2Y vyC RFV
related: 3jEy yuT aVo
related: rwpH 6RA XTT
related: K8yg U4C gkY
related: PRQn 9yw NJA
related: 4Jty HpK a3Q

Hotell- och turisminriktning, undervisning
type: Concept
in scheme: JobTech Taxonomy - Färdighet
definition: Hotell- och turisminriktning, undervisning
broader: Inriktning på lärarkompetens
related: 2x2V UeL 6ke

Biologi, undervisning grundskolenivå
type: Concept
in scheme: JobTech Taxonomy - Färdighet
definition: Biologi, undervisning grundskolenivå
broader: Inriktning på lärarkompetens
related: oQUQ D11 HPx

Tornkran, monteringsvana
type: Concept
in scheme: JobTech Taxonomy - Färdighet
definition: Tornkran, monteringsvana, avser färdigheten att installera och montera tornkranar, vilket inkluderar kunskaper om tekniska specifikationer och säkerhetsåtgärder. Denna kompetens omfattar även förståelse för kranens funktion och de mekaniska system som är involverade i dess drift och installation.
broader: zmYu aAM TuF
related: XYzP 5Tn 7Ep
related: KttZ Skc bMR

Frukt och grönt, produktkunskap
type: Concept
in scheme: JobTech Taxonomy - Färdighet
definition: Frukt och grönt, produktkunskap
broader: zmYu aAM TuF
related: s1Qk o98 2o1

Fjällturism, ledarerfarenhet
type: Concept
in scheme: JobTech Taxonomy - Färdighet
definition: Fjällturism, ledarerfarenhet, avser kompetens att leda och organisera turer och aktiviteter i fjällmiljöer. Denna kompetens omfattar kunskap om fjällens natur, kultur och säkerhet, samt förmåga att engagera och informera deltagare i olika turistsituationer.
broader: zmYu aAM TuF
related: A6X3 efC VNy

Organisationspsykologi
type: Concept
in scheme: JobTech Taxonomy - Färdighet
definition: Organisationspsykologi
broader: zmYu aAM TuF
related: VYeq GDF a2g

Plåtsvetsning
type: Concept
in scheme: JobTech Taxonomy - Färdighet
definition: Plåtsvetsning avser processen som används för att sammanfoga plåtdelar genom att applicera värme, vilket gör att metallerna smälter samman och skapar en stark fästpunkt. Kompetensen innefattar kunskaper om olika svetsmetoder, säkerhetsstandarder och materialegenskaper, samt färdigheter för att utföra svetsning på plåtar av varierande tjocklek och typ.
broader: on11 B1f LEw
related: wQ1E Bzk ZyA
related: TrwQ RXT W8a
related: L4hA SJP SFi

Marinbiologi
type: Concept
in scheme: JobTech Taxonomy - Färdighet
definition: Marinbiologi
broader: zmYu aAM TuF
related: yXbD NTH ijE
related: e9FK VKh ahW

CNC-programmering, Fanuc
type: Concept
in scheme: JobTech Taxonomy - Färdighet
definition: CNC-programmering, Fanuc
broader: Programmering, CNC-styrsystem
related: vaEp iBS c5h
related: 4Jty HpK a3Q

Fastighetssäkerhet
type: Concept
in scheme: JobTech Taxonomy - Färdighet
definition: Fastighetssäkerhet avser åtgärder och rutiner för att skydda en fastighet, dess användare samt tillgångar mot olika risker som inbrott, brand och andra hot. Kompetensen innebär kunskap om säkerhetssystem, övervakningslösningar och riskhantering, samt implementering av strategier för att säkerställa en trygg och säker miljö.
broader: zmYu aAM TuF
related: df9D e6y 61z
related: U8HK Jdi GuC

2D-grafik-Autodesk SketchBook Pro
type: Concept
in scheme: JobTech Taxonomy - Färdighet
definition: 2D-grafik-Autodesk SketchBook Pro
broader: Programvara för digitalt skapande
related: 8Bmh vtM zts
related: 34Tn BQQ tfo
related: 4Jty HpK a3Q
related: LeQV umf wUS
related: Mbt6 3ko DiD

Simsport, instruktör/Simsport, tränare
type: Concept
in scheme: JobTech Taxonomy - Färdighet
definition: Simsport, instruktör eller tränare avser en kompetens som innebär att leda och utbilda simmare på olika nivåer, inklusive professionella och amatörer. Kompetensen omfattar även planering och genomförande av träningar samt arrangemang och övervakning av simtävlingar och idrottsevenemang.
alternative label: Simsport, instruktör
alternative label: Simsport, tränare
broader: Idrott/aktivitet
related: EA6o N1N QtT

Väg- och vattenbyggnadsteknik
type: Concept
in scheme: JobTech Taxonomy - Färdighet
definition: Väg- och vattenbyggnadsteknik
broader: zmYu aAM TuF
related: thZP oR7 WrY
related: w6ud quG dgh
related: yXbD NTH ijE
related: XeBP nMe pXx

Yrkesutbildning, lager- och terminalarbete
type: Concept
in scheme: JobTech Taxonomy - Färdighet
definition: Yrkesutbildning, lager- och terminalarbete är en eftergymnasial yrkesutbildning med inriktning till lagerarbetare och terminalarbetare.
broader: Yrkesutbildning
related: kLyY rwr aJr

Industriförsäljning
type: Concept
in scheme: JobTech Taxonomy - Färdighet
definition: Industriförsäljning avser försäljning av produkter och tjänster till företag, återförsäljare och grossister, med fokus på uppsökande verksamhet eller försäljning från kontor. Kompetensen inkluderar ansvar för specifika produkter eller distrikt, samt utarbetande av kundspecifika lösningar och hantering av kundrelationer och försäljningsstatistik.
broader: zmYu aAM TuF
related: oXSW fbY XrY

Klensmide
type: Concept
in scheme: JobTech Taxonomy - Färdighet
definition: Klensmide
broader: zmYu aAM TuF
related: q8Ho 3Xw sHq

Basklarinett
type: Concept
in scheme: JobTech Taxonomy - Färdighet
definition: Basklarinett
broader: wLYs CKS wK8
related: AWJF wqZ va9

Talboksproduktion
type: Concept
in scheme: JobTech Taxonomy - Färdighet
definition: Talboksproduktion
broader: zmYu aAM TuF
related: rYSG 3WJ LmC

Devis, redovisningssystem
type: Concept
in scheme: JobTech Taxonomy - Färdighet
definition: Devis, redovisningssystem
alternative label: Devis
broader: xSJR 1Kq pxB
related: eQ4M CNm ozj
related: q81z 3oD 1qu
related: ij8k EwC zyB
related: 4Jty HpK a3Q

Kronofogdeutbildning
type: Concept
in scheme: JobTech Taxonomy - Färdighet
definition: Kronofogdeutbildning
broader: Yrkesbevis/examen
related: br6a VVS V3y

Hållbarhetskompetens
type: Concept
in scheme: JobTech Taxonomy - Färdighet
definition: Hållbarhetskompetens
broader: Yrkesövergripande kompetenser
related: yXbD NTH ijE

Cybersäkerhet, kritisk IT-infrastruktur
type: Concept
in scheme: JobTech Taxonomy - Färdighet
definition: Cybersäkerhet, kritisk IT-infrastruktur
alternative label: Critical infrastructure security
alternative label: Enterprise IT infrastructure
broader: zmYu aAM TuF
related: BAeH eg8 T2d
related: 4Jty HpK a3Q

Deklarationer
type: Concept
in scheme: JobTech Taxonomy - Färdighet
definition: Deklarationer
broader: zmYu aAM TuF
related: FfMN Bw1 qYR

ERM, Engine room management
type: Concept
in scheme: JobTech Taxonomy - Färdighet
definition: ERM, Engine room management
broader: s48H Sft DTn
related: Rsoy sS6 6c4

Kromgarvning
type: Concept
in scheme: JobTech Taxonomy - Färdighet
definition: Kromgarvning avser en specifik process inom läderhantverk där krom används som garvningsmedel för att behandla hudar och skinn. Kompetensen innefattar hantering av kemiska processer för att säkerställa hållbarhet och kvalitet på det färdiga lädret, samt kunskap om säkerhetsföreskrifter relaterade till användning av kemikalier.
broader: zmYu aAM TuF
related: skLS kpa Ui1
related: vJQk YvC XB7

Städtjänster
type: Concept
in scheme: JobTech Taxonomy - Färdighet
definition: Städtjänster avser utförande av rengöring och underhåll av olika typer av lokaler, inklusive bostäder, kontor, hotell, och offentliga inrättningar. Kompetensen omfattar kunskaper om städmetoder, använda rengöringsmedel och utrustning samt effektiv tidsplanering.
broader: zmYu aAM TuF
related: oXSW fbY XrY
related: o1gn FoS fB7
related: Z6TY xDf Yup

Restaurangvana, fartygserfarenhet
type: Concept
in scheme: JobTech Taxonomy - Färdighet
definition: Restaurangvana, fartygserfarenhet
broader: Övriga specialiteter, sjöfart
related: UjoW meY Zwt

Riktningsarbete
type: Concept
in scheme: JobTech Taxonomy - Färdighet
definition: Riktningsarbete
broader: zmYu aAM TuF
related: Lzpv ofL 3H5
related: L4hA SJP SFi

Landskapsplanering
type: Concept
in scheme: JobTech Taxonomy - Färdighet
definition: Landskapsplanering
broader: zmYu aAM TuF
related: yXbD NTH ijE
related: Pd51 xnr KCY
related: ETAR ggZ Wuw

Beroendeproblematik
type: Concept
in scheme: JobTech Taxonomy - Färdighet
definition: Kompetensen innefattar att arbeta stödjande, coachande och behandlande utifrån beroendeproblematik med bred förståelse för sociala, psykologiska och beteendemässiga aspekter av beroende. Detta bekräftas av kursplaner som inkluderar bland annat motiverande samtal (MI), KBT, gruppbehandling, bedömningsinstrument, återfallsprevention samt kunskap om beroenden såsom alkohol, narkotika och spelmissbruk.
broader: zmYu aAM TuF
related: BWwk fYX S5B
related: fsnw ZCu v2U
related: VYeq GDF a2g
related: pok1 ipJ yzD

Samhällskunskap, undervisning grundskolenivå
type: Concept
in scheme: JobTech Taxonomy - Färdighet
definition: Samhällskunskap, undervisning grundskolenivå
broader: Inriktning på lärarkompetens
related: oQUQ D11 HPx

Journalistisk omvärldsanalys
type: Concept
in scheme: JobTech Taxonomy - Färdighet
definition: Journalistisk omvärldsanalys avser förmågan att systematiskt analysera och tolka händelser och trender i omvärlden för att ge en omfattande bild av samhällsutvecklingen. Kompetensen omfattar insamling av information, kritisk granskning av källor och förmåga att skapa sammanhang i rapporteringen, vilket möjliggör en djupare förståelse av aktuella frågor och fenomen.
broader: zmYu aAM TuF
related: SgNH hag n9D

IT-revision
type: Concept
in scheme: JobTech Taxonomy - Färdighet
definition: IT-revision
broader: zmYu aAM TuF
related: cRmd 536 pT1
related: 4Jty HpK a3Q

CDI, hotellbokningssystem
type: Concept
in scheme: JobTech Taxonomy - Färdighet
definition: CDI, hotellbokningssystem
alternative label: CDI
broader: kRoQ fPR 8oK
related: bYde Frc xcB
related: 4Jty HpK a3Q

Hantverksinriktning, undervisning
type: Concept
in scheme: JobTech Taxonomy - Färdighet
definition: Hantverksinriktning, undervisning
broader: Inriktning på lärarkompetens
related: 2x2V UeL 6ke

Qbasic, programmeringsspråk
type: Concept
in scheme: JobTech Taxonomy - Färdighet
definition: Qbasic, programmeringsspråk
alternative label: Qbasic
broader: Datorspråk
related: BAeH eg8 T2d
related: Fv7d YhP YmS
related: D9SL mtn vGM
related: DJh5 yyF hEM
related: 4Jty HpK a3Q

Däck, reparationsvana
type: Concept
in scheme: JobTech Taxonomy - Färdighet
definition: Däck, reparationsvana
broader: zmYu aAM TuF
related: ENV6 BNa brP
related: Kxm9 N3V shF

Certifikat BPL - Balloon Pilot Licence
type: Concept
in scheme: JobTech Taxonomy - Färdighet
definition: Ett certifikat för ballongpilot.
broader: s48H Sft DTn
related: 7n3y FTE qSe

Pälsdjursskötsel
type: Concept
in scheme: JobTech Taxonomy - Färdighet
definition: Pälsdjursskötsel
broader: zmYu aAM TuF
related: Lrsj wRZ sFV

Radioteater
type: Concept
in scheme: JobTech Taxonomy - Färdighet
definition: Radioteater
broader: zmYu aAM TuF
related: iBUL s38 izZ

Luftakrobatik
type: Concept
in scheme: JobTech Taxonomy - Färdighet
definition: Luftakrobatik
broader: zmYu aAM TuF
related: xuSE mtB Mir

CNC-programmering, Heidenhain
type: Concept
in scheme: JobTech Taxonomy - Färdighet
definition: CNC-programmering, Heidenhain
broader: Programmering, CNC-styrsystem
related: vaEp iBS c5h
related: 4Jty HpK a3Q

Certifierad brandvakt
type: Concept
in scheme: JobTech Taxonomy - Färdighet
definition: Certifierad brandvakt
broader: s48H Sft DTn
related: Lzpv ofL 3H5
related: DPPw 4wa AsH
related: sX9n CWa KVC
related: dKUb KBP mw3
related: m8TS hdk pSf
related: 3ZtN hhA SM7
related: bZ4J riZ zK6
related: LEvM 7Hs w8i
related: V79C DD2 3Gj
related: J17g Q2a 2u1
related: 3g5x Tm7 8QH
related: QKvX v7r PNL
related: 7zKm 4NW eey
related: e6nk AGp y28
related: idjo 2Wr a3E
related: kZwz D8K bKs
related: KwVo sQu G2e
related: CbQK 7th Tyf
related: Y4j1 P17 wVA
related: q2Ge zrQ zJb
related: 9mJN VwW Xjg
related: XYzP 5Tn 7Ep
related: SUfj 4D9 FNx
related: wQ1E Bzk ZyA
related: o31g CX1 qhQ
related: 1Nwn GYH wkH
related: E87t egE pjA
related: AD3U cFH rbe
related: f71c gjL RDq
related: fLKb bJ3 69p
related: TrwQ RXT W8a
related: KttZ Skc bMR
related: 3UzE P8A 9sS
related: vCBT Pnd 8UB
related: kDnq Q98 sD3
related: a75S eLg JWH
related: NnB3 eWH auo
related: iHrC aRv fVm
related: UcNa inr snV
related: cGxX R9c kW1
related: q8Ho 3Xw sHq
related: L4hA SJP SFi
related: yyF7 jsW EeP
related: bXfo 4hb SXx

Materialkunskap, bygg
type: Concept
in scheme: JobTech Taxonomy - Färdighet
definition: Materialkunskap, bygg
broader: zmYu aAM TuF
related: DPPw 4wa AsH
related: 3ZtN hhA SM7
related: bZ4J riZ zK6
related: V79C DD2 3Gj
related: 3g5x Tm7 8QH
related: QKvX v7r PNL
related: Y4j1 P17 wVA
related: q2Ge zrQ zJb
related: 9mJN VwW Xjg
related: XYzP 5Tn 7Ep
related: AD3U cFH rbe
related: f71c gjL RDq
related: fLKb bJ3 69p
related: 3UzE P8A 9sS
related: NnB3 eWH auo
related: iHrC aRv fVm
related: cGxX R9c kW1
related: bXfo 4hb SXx

Segelmakeri
type: Concept
in scheme: JobTech Taxonomy - Färdighet
definition: Segelmakeri avser processen att tillverka och reparera segel, kapell och andra textilprodukter som används inom marin verksamhet. Kompetensen innefattar kunskaper om materialegenskaper, skärning, sömnad och monteringsmetoder för att sammanställa hållbara och funktionella produkter.
broader: zmYu aAM TuF
related: UZBj yDX Ctp

Arbetsrätt
type: Concept
in scheme: JobTech Taxonomy - Färdighet
definition: Arbetsrätt
broader: zmYu aAM TuF
related: q8wL kdi WaW
related: br6a VVS V3y
related: L7eh ihX vM5
related: bjqk F3A 5Hk
related: 6aak 8eh iwT
related: DZVN v5g Fco
related: JfYV ZGg 6rm

OT-säkerhet
type: Concept
in scheme: JobTech Taxonomy - Färdighet
definition: OT-säkerhet
broader: zmYu aAM TuF
related: BAeH eg8 T2d
related: mp2Y vyC RFV
related: 3jEy yuT aVo
related: K8yg U4C gkY
related: nDaB vdy eAy
related: SPYW 7Z1 ShT
related: PRQn 9yw NJA
related: 4Jty HpK a3Q

Kylanläggning, underhåll
type: Concept
in scheme: JobTech Taxonomy - Färdighet
definition: Kylanläggning, underhåll
broader: zmYu aAM TuF
related: Lzpv ofL 3H5
related: df9D e6y 61z
related: yXbD NTH ijE
related: Cppd 9P7 HeR
related: fWrt sLg koW
related: KttZ Skc bMR
related: 3UzE P8A 9sS
related: a75S eLg JWH

Elektromekaniska system, installation och underhåll
type: Concept
in scheme: JobTech Taxonomy - Färdighet
definition: Elektromekaniska system, installation och underhåll, avser kompetens att installera, underhålla och reparera system som kombinerar elektriska och mekaniska komponenter. Detta omfattar kunskaper om och färdighet i hantering av olika typer av elektromekaniska system och deras funktioner.
broader: zmYu aAM TuF
related: MW1P GNJ 4F9
related: fWrt sLg koW
related: KttZ Skc bMR
related: a75S eLg JWH
related: 4Jty HpK a3Q
related: yyF7 jsW EeP

Sopho, telefonväxel
type: Concept
in scheme: JobTech Taxonomy - Färdighet
definition: Sopho, telefonväxel
broader: Telefonväxlar
related: 4aPu 2nd 8X6
related: ByrL ANp UwV
related: 4Jty HpK a3Q

Krisbearbetning, socialt arbete
type: Concept
in scheme: JobTech Taxonomy - Färdighet
definition: Krisbearbetning, socialt arbete
broader: zmYu aAM TuF
related: dJXy Rpq a2u
related: n6iX f2z XfE
related: wzeq No2 LF1
related: pok1 ipJ yzD

Alfresco, CMS
type: Concept
in scheme: JobTech Taxonomy - Färdighet
definition: Alfresco, CMS/innehållshanteringssystem
alternative label: Alfresco, innehållshanteringssystem
broader: jTAz uCP RNc
related: BAeH eg8 T2d
related: cBBa ngH fCx
related: Fv7d YhP YmS
related: vPP6 rsw dck
related: 4Jty HpK a3Q
related: MYAz x9m 2LJ

Privata avtal
type: Concept
in scheme: JobTech Taxonomy - Färdighet
definition: Privata avtal
broader: jv6G f2M ao5
related: mNoS AN5 drn
related: L7eh ihX vM5
related: bjqk F3A 5Hk

Techotel, hotellbokningssystem
type: Concept
in scheme: JobTech Taxonomy - Färdighet
definition: Techotel, hotellbokningssystem
alternative label: Techotel
broader: kRoQ fPR 8oK
related: bYde Frc xcB
related: 4Jty HpK a3Q

Barn- och ungdomspedagogisk examen med inriktning fritidspedagogik
type: Concept
in scheme: JobTech Taxonomy - Färdighet
definition: Barn- och ungdomspedagogisk examen med inriktning fritidspedagogik
broader: Yrkesbevis/examen
related: CFW8 eBa NaV

Reptiler, konservering
type: Concept
in scheme: JobTech Taxonomy - Färdighet
definition: Reptiler, konservering
broader: zmYu aAM TuF
related: 34Tn BQQ tfo

Mästarbrev, slöjdaryrket - trä
type: Concept
in scheme: JobTech Taxonomy - Färdighet
definition: Mästarbrev, slöjdaryrket - trä
broader: Yrkesbevis/examen
related: aKdV u7V R5j

Diplomerad logistiker
type: Concept
in scheme: JobTech Taxonomy - Färdighet
definition: Diplomerad logistiker
broader: s48H Sft DTn
related: xm5G vGn iyk
related: nNxJ YWy vR2

Reparation av pianon
type: Concept
in scheme: JobTech Taxonomy - Färdighet
definition: Reparation av pianon avser åtgärder och processer för att underhålla och återställa funktionaliteten hos pianon, inklusive justeringar av mekanik, stämning av strängar och reparation av skador. Kompetensen omfattar kunskaper om pianots konstruktion och material samt tekniska färdigheter för att identifiera och åtgärda problem som kan påverka instrumentets ljud och spelbarhet.
broader: zmYu aAM TuF
related: aKdV u7V R5j

Glasinredning, tillverknings- och monteringsvana
type: Concept
in scheme: JobTech Taxonomy - Färdighet
definition: Glasinredning, tillverknings- och monteringsvana
broader: zmYu aAM TuF
related: J17g Q2a 2u1

Allmänbildande kurser, undervisning folkhögskola
type: Concept
in scheme: JobTech Taxonomy - Färdighet
definition: Allmänbildande kurser, undervisning folkhögskola
broader: zmYu aAM TuF
related: 4KhP FxL uZ5

Dieselmotorrenovering
type: Concept
in scheme: JobTech Taxonomy - Färdighet
definition: Dieselmotorrenovering
broader: zmYu aAM TuF
related: KttZ Skc bMR

Handbroderi
type: Concept
in scheme: JobTech Taxonomy - Färdighet
definition: Handbroderi
broader: zmYu aAM TuF
related: UZBj yDX Ctp

Falsning, papper
type: Concept
in scheme: JobTech Taxonomy - Färdighet
definition: Falsning, papper
broader: zmYu aAM TuF
related: mPzg 93F QEv
related: aU9p ekE Fqf

Fiction/Spelfilm
type: Concept
in scheme: JobTech Taxonomy - Färdighet
definition: Fiction/Spelfilm
alternative label: Fiction
alternative label: Spelfilm
broader: zmYu aAM TuF
related: SgNH hag n9D
related: rYSG 3WJ LmC

Gymnastik, professionell utövning
type: Concept
in scheme: JobTech Taxonomy - Färdighet
definition: Gymnastik, professionell utövning
broader: Idrott/aktivitet
related: AwXA EM4 71n

Asfaltfräs
type: Concept
in scheme: JobTech Taxonomy - Färdighet
definition: Asfaltfräs
broader: zmYu aAM TuF
related: bZ4J riZ zK6

Vilotidsförordningen
type: Concept
in scheme: JobTech Taxonomy - Färdighet
definition: Vilotidsförordningen
broader: zmYu aAM TuF
related: nuXg Wjc JPd

Avgasrening, dieselmotorer
type: Concept
in scheme: JobTech Taxonomy - Färdighet
definition: Avgasrening, dieselmotorer
broader: zmYu aAM TuF
related: Lzpv ofL 3H5

Textilhantverk
type: Concept
in scheme: JobTech Taxonomy - Färdighet
definition: Textilhantverk avser en praktisk kompetens inom tillverkning, design och skapande av textila produkter som inkluderar tekniker som vävning, sömnad, broderi och stickning. Kompetensen omfattar både konstnärliga och tekniska aspekter av att arbeta med olika typer av textilier för att skapa funktionella och estetiska plagg och föremål.
broader: zmYu aAM TuF
related: 34Tn BQQ tfo
related: aKdV u7V R5j
related: PF4H kQD zpL

Formslipning
type: Concept
in scheme: JobTech Taxonomy - Färdighet
definition: Formslipning
broader: zmYu aAM TuF
related: 4bxV 58E P9N

Färg/Kemikalieprodukter/Tapeter
type: Concept
in scheme: JobTech Taxonomy - Färdighet
definition: Färg/Kemikalieprodukter/Tapeter
alternative label: Färg
alternative label: Kemikalieprodukter
alternative label: Tapeter
broader: zmYu aAM TuF
related: oXSW fbY XrY
related: YKL2 FCB 1yr
related: 85cq 6uK 4cK

Certifikat, maskinmekaniker
type: Concept
in scheme: JobTech Taxonomy - Färdighet
definition: Certifikat, maskinmekaniker
broader: s48H Sft DTn
related: KttZ Skc bMR

Steppdans
type: Concept
in scheme: JobTech Taxonomy - Färdighet
definition: Steppdans
broader: Dans
related: gmRr 7tt eHj

Flygtimmar, mellan 250–1500
type: Concept
in scheme: JobTech Taxonomy - Färdighet
definition: Flygtimmar, mellan 250–1500, avser det antal timmar en pilot har tillbringat i luften med att flyga ett luftfartyg. Denna kompetens relaterar till alla som har ansvar för flygning av olika typer av flygplan, helikoptrar och andra luftfartyg, och kan påverka vilken typ av certifikat och licenser som kan erhållas.
broader: zmYu aAM TuF
related: nuXg Wjc JPd
related: 7n3y FTE qSe

Rörelsenedsättning, funktionshindersfrågor
type: Concept
in scheme: JobTech Taxonomy - Färdighet
definition: Rörelsenedsättning, funktionshindersfrågor
broader: zmYu aAM TuF
related: vPP6 rsw dck

Aktiehandel
type: Concept
in scheme: JobTech Taxonomy - Färdighet
definition: Kompetens inom aktiehandel avser kunskap, utförande och rådgivning kring att köpa och sälja aktier och relaterade derivat på finansmarknader för att generera vinst genom prisrörelser eller utdelning. Det innefattar kunskap om börser, marknadstrender, riskhantering och regelverk samt förmåga att analysera företagsvärden.
broader: zmYu aAM TuF
related: Bbkh nrm 2J8
related: aQpg E2T cWq
related: pTr9 RBT 9ur
related: FfMN Bw1 qYR
related: 9Mn4 PNA 7Yz

Simlärarutbildning
type: Concept
in scheme: JobTech Taxonomy - Färdighet
definition: Simlärarutbildning är en eftergymnasial utbildning med inriktning mot simundervisning.
broader: Yrkesbevis/examen
related: EA6o N1N QtT
related: ayQ4 G3W A2w

Produktionsledning, anläggningsteknik
type: Concept
in scheme: JobTech Taxonomy - Färdighet
definition: Produktionsledning, anläggningsteknik
broader: zmYu aAM TuF
related: thZP oR7 WrY
related: 7mn2 kA9 ftp
related: XeBP nMe pXx

Skidor, instruktör
type: Concept
in scheme: JobTech Taxonomy - Färdighet
definition: Slalom, instruktör/Slalom, tränare avser kompetensen att träna och instruera individer inom slalomskidåkning, vilket inkluderar både teknik och säkerhet. Kompetensen kan även innefatta arrangemang och ledning av träningspass och tävlingar, med fokus på att stödja och utveckla deltagarnas färdigheter och prestationer.
alternative label: Skidor, tränare
alternative label: Slalom, instruktör
alternative label: Slalom, tränare
broader: Idrott/aktivitet
related: EA6o N1N QtT
related: A6X3 efC VNy

Oljeeldningsmontering
type: Concept
in scheme: JobTech Taxonomy - Färdighet
definition: Oljeeldningsmontering
broader: zmYu aAM TuF
related: fLKb bJ3 69p

Golftränarutbildning steg 1–4
type: Concept
in scheme: JobTech Taxonomy - Färdighet
definition: Golftränarutbildning steg 1–4
broader: Yrkesbevis/examen
related: EA6o N1N QtT

Elcyklar
type: Concept
in scheme: JobTech Taxonomy - Färdighet
definition: Elcyklar
broader: zmYu aAM TuF
related: YKL2 FCB 1yr
related: M47D MU2 dhS

Fritidsfordon, service
type: Concept
in scheme: JobTech Taxonomy - Färdighet
definition: Fritidsfordon, service avser service av husvagnar och husbilar.
broader: zmYu aAM TuF
related: Lzpv ofL 3H5

Sminkning, Teater
type: Concept
in scheme: JobTech Taxonomy - Färdighet
definition: Sminka/göra make-up på skådespelare inom teater, opera eller liknande.
broader: zmYu aAM TuF
related: ezKk kss CiQ

Trafikundervisning, moped klass 1
type: Concept
in scheme: JobTech Taxonomy - Färdighet
definition: Trafikundervisning, moped klass 1
broader: zmYu aAM TuF
related: yVZH zHh 6fG

Högtemperaturfysik/Plasmafysik
type: Concept
in scheme: JobTech Taxonomy - Färdighet
definition: Högtemperaturfysik/Plasmafysik
alternative label: Högtemperaturfysik
alternative label: Plasmafysik
broader: zmYu aAM TuF
related: KM7d Z6Y LCJ

Växellådsreparationer
type: Concept
in scheme: JobTech Taxonomy - Färdighet
definition: Växellådsreparationer
broader: zmYu aAM TuF
related: Lzpv ofL 3H5

ISTQB certificate
type: Concept
in scheme: JobTech Taxonomy - Färdighet
definition: ISTQB certificate
broader: s48H Sft DTn
related: D9SL mtn vGM
related: 4Jty HpK a3Q

Passagerarservice
type: Concept
in scheme: JobTech Taxonomy - Färdighet
definition: Passagerarservice avser åtgärder och rutiner för att säkerställa en trygg och bekväm upplevelse för resande i olika transportsystem. Kompetensen omfattar bland annat kontroll av biljetter och färdbevis, assisterande service samt information om resor, avgångstider och säkerhetsföreskrifter.
broader: zmYu aAM TuF
related: fdLf oPp wVw
related: ffz2 2n3 R7g
related: FiDm 2S8 gx7
related: A6X3 efC VNy
related: s78G Zp2 dkq
related: 957L kZK rHZ
related: 1Tso 4TB RkE

Arkitekt-SketchUp 3D
type: Concept
in scheme: JobTech Taxonomy - Färdighet
definition: Arkitekt-SketchUp 3D
broader: mTLu uo2 gq2
related: thZP oR7 WrY
related: w6ud quG dgh
related: Pd51 xnr KCY
related: XeBP nMe pXx
related: ETAR ggZ Wuw
related: 41KB bfk 5jR
related: 4Jty HpK a3Q

Mikroprocessorsystem
type: Concept
in scheme: JobTech Taxonomy - Färdighet
definition: Mikroprocessorsystem
broader: zmYu aAM TuF
related: nDaB vdy eAy
related: SPYW 7Z1 ShT
related: 4Jty HpK a3Q

Båtinredning, tillverknings- och monteringsvana
type: Concept
in scheme: JobTech Taxonomy - Färdighet
definition: Båtinredning, tillverknings- och monteringsvana avser kompetens inom tillverkning och installation av interiörer i båtar. Denna kompetens innefattar färdigheter att arbeta med olika material och tekniker för att skapa funktionella och estetiskt tilltalande lösningar för båtars inredning.
broader: zmYu aAM TuF
related: 1Nwn GYH wkH

Sun Certified Enterprise Architect
type: Concept
in scheme: JobTech Taxonomy - Färdighet
definition: Sun Certified Enterprise Architect
broader: s48H Sft DTn
related: BAeH eg8 T2d

Programmering av metallduksvävstol
type: Concept
in scheme: JobTech Taxonomy - Färdighet
definition: Programmering av metallduksvävstol
broader: zmYu aAM TuF
related: vaEp iBS c5h

Hogia, redovisningssystem
type: Concept
in scheme: JobTech Taxonomy - Färdighet
definition: Hogia, redovisningssystem
alternative label: Hogia
broader: xSJR 1Kq pxB
related: eQ4M CNm ozj
related: q81z 3oD 1qu
related: ij8k EwC zyB
related: 4Jty HpK a3Q

Verksamhetsledning marknad
type: Concept
in scheme: JobTech Taxonomy - Färdighet
definition: Kompetensen avser kunskaper om och tillämpning av metoder för strategisk ledning av marknadsföringsverksamhet inom organisationer. Det innefattar bland annat utveckling och implementering av marknadsstrategier samt samordning med sälj- och produktutveckling.
broader: zmYu aAM TuF
related: Pz9M srJ Lc9
related: mpuA s56 Hsy

Programledning
type: Concept
in scheme: JobTech Taxonomy - Färdighet
definition: Programledning
broader: zmYu aAM TuF
related: xuSE mtB Mir

Klassisk balett
type: Concept
in scheme: JobTech Taxonomy - Färdighet
definition: Klassisk balett
broader: zmYu aAM TuF
related: AWJF wqZ va9
related: gmRr 7tt eHj

Mönsterläggning
type: Concept
in scheme: JobTech Taxonomy - Färdighet
definition: Mönsterläggning
broader: zmYu aAM TuF
related: bZ4J riZ zK6
related: V79C DD2 3Gj

Kvalitetsverktyg
type: Concept
in scheme: JobTech Taxonomy - Färdighet
top concept of: JobTech Taxonomy - Färdighet
definition: Kvalitetsverktyg
narrower: Life Cycle Cost/LCC
narrower: Statistisk Processtyrning/SPS
narrower: Total Quality Management/TQM
narrower: Quality Function Deployment/QFD
narrower: Total Productive Maintenance/TPM
narrower: The Seven Quality Management Tools/7QM
narrower: Fail Mode, Eff Analys or Critical Analys/FMEA
narrower: Total Quality Control/TQC
narrower: The Seven Quality Control Tools/7QC

Emballagetillverkning
type: Concept
in scheme: JobTech Taxonomy - Färdighet
definition: Emballagetillverkning
broader: zmYu aAM TuF
related: 8ddv P8e iYz
related: yPQ4 EaN Dtj
related: iZLB KpD LLo

Grundläggande tjänstgöring IGF-koden
type: Concept
in scheme: JobTech Taxonomy - Färdighet
definition: Grundläggande tjänstgöring IGF-koden
broader: s48H Sft DTn
related: Rsoy sS6 6c4
related: kDnq Q98 sD3

Digital skadedjurskontroll
type: Concept
in scheme: JobTech Taxonomy - Färdighet
definition: Digital skadedjurskontroll avser användning av digitala verktyg och teknologier för att övervaka, identifiera och hantera skadedjursproblem. Kompetensen innefattar insamling och analys av data samt tillämpning av digitala lösningar för att optimera skadedjursbekämpning och förebygga återkommande angrepp.
broader: zmYu aAM TuF
related: idjo 2Wr a3E
related: 4Jty HpK a3Q

BAAN, affärssystem
type: Concept
in scheme: JobTech Taxonomy - Färdighet
definition: BAAN, affärssystem
alternative label: BAAN
broader: xSJR 1Kq pxB
related: eQ4M CNm ozj
related: Y6yY SuR hVh
related: Uw4n UB2 RCW
related: iWcY mko rq2
related: q81z 3oD 1qu
related: cRmd 536 pT1
related: ij8k EwC zyB
related: 4Jty HpK a3Q

Kriminalvårdsfrågor
type: Concept
in scheme: JobTech Taxonomy - Färdighet
definition: Kriminalvårdsfrågor
broader: zmYu aAM TuF
related: vPP6 rsw dck

Hälso- och sjukvård, områdeskunskap
type: Concept
in scheme: JobTech Taxonomy - Färdighet
definition: Hälso- och sjukvård, områdeskunskap
broader: zmYu aAM TuF
related: vPP6 rsw dck
related: coyZ Cyv Srw

Textilfärgning
type: Concept
in scheme: JobTech Taxonomy - Färdighet
definition: Textilfärgning
broader: zmYu aAM TuF
related: 4DET dLf iB9

E-handel, utveckling/Elektronisk handel, utveckling
type: Concept
in scheme: JobTech Taxonomy - Färdighet
definition: E-handel, utveckling/Elektronisk handel, utveckling
broader: zmYu aAM TuF
related: Pz9M srJ Lc9
related: 4Jty HpK a3Q

Engelskt horn
type: Concept
in scheme: JobTech Taxonomy - Färdighet
definition: Engelskt horn
broader: wLYs CKS wK8
related: AWJF wqZ va9

Gitarr, undervisning musikskola
type: Concept
in scheme: JobTech Taxonomy - Färdighet
definition: Gitarr, undervisning musikskola
broader: zmYu aAM TuF
related: mcRJ kq2 jFr

Arkoffsettryckning
type: Concept
in scheme: JobTech Taxonomy - Färdighet
definition: Arkoffsettryckning
broader: zmYu aAM TuF
related: XeJB bkn mRn

Geografiska fältstudier
type: Concept
in scheme: JobTech Taxonomy - Färdighet
definition: Geografiska fältstudier
broader: zmYu aAM TuF
related: cYCo PxY zQd
related: 4KhP FxL uZ5
related: oQUQ D11 HPx

Avsnitt/Dramaserier
type: Concept
in scheme: JobTech Taxonomy - Färdighet
definition: Avsnitt/Dramaserier
alternative label: Avsnitt
alternative label: Dramaserier
broader: zmYu aAM TuF
related: zfve s6G tpc
related: rYSG 3WJ LmC

Förkromning
type: Concept
in scheme: JobTech Taxonomy - Färdighet
definition: Förkromning
broader: zmYu aAM TuF
related: YiQw N87 zLU

Aktieadministration
type: Concept
in scheme: JobTech Taxonomy - Färdighet
definition: Aktieadministration
broader: zmYu aAM TuF
related: Bbkh nrm 2J8
related: aQpg E2T cWq
related: pTr9 RBT 9ur

Satellitteknik
type: Concept
in scheme: JobTech Taxonomy - Färdighet
definition: Satellitteknik
broader: zmYu aAM TuF
related: SPYW 7Z1 ShT
related: 4Jty HpK a3Q

Hantverkspedagogik
type: Concept
in scheme: JobTech Taxonomy - Färdighet
definition: Hantverkspedagogik avser metoder och strategier för undervisning och lärande inom hantverksyrken och praktiska färdigheter. Kompetensen omfattar planering och genomförande av pedagogiska aktiviteter som främjar kreativitet och praktisk kunskap hos elever inom hantverk.
broader: zmYu aAM TuF
related: BWwk fYX S5B
related: aA2Z 9XX R1v

Kodlåsteknik
type: Concept
in scheme: JobTech Taxonomy - Färdighet
definition: Kodlåsteknik avser kompetens inom installation, justering och reparation av kodlås och relaterande låssystem. Kompetensen innefattar även förståelse för säkerhetssystem och deras funktionalitet, samt förmåga att arbeta med precision för att säkerställa effektiv och säker användning av kodlåstekniken.
broader: zmYu aAM TuF
related: e6nk AGp y28
related: 4Jty HpK a3Q

Säkerhetsglas, monteringsvana
type: Concept
in scheme: JobTech Taxonomy - Färdighet
definition: Säkerhetsglas, monteringsvana
broader: zmYu aAM TuF
related: J17g Q2a 2u1

Förmyndarrätt
type: Concept
in scheme: JobTech Taxonomy - Färdighet
definition: Förmyndarrätt
broader: zmYu aAM TuF
related: zKvJ GnC Szx

Kranutrustning, underhåll
type: Concept
in scheme: JobTech Taxonomy - Färdighet
definition: Kranutrustning, underhåll avser kompetens inom inspektion, underhåll och reparation av kran- och lyftsystem för att säkerställa deras funktion och säkerhet. Denna kompetens omfattar kunskap om olika typer av kranutrustning, deras mekaniska och elektriska komponenter samt procedurer för säkerhetskontroller och förebyggande underhåll.
broader: zmYu aAM TuF
related: XYzP 5Tn 7Ep
related: KttZ Skc bMR

ESL-metodik
type: Concept
in scheme: JobTech Taxonomy - Färdighet
definition: ESL-metodik
broader: zmYu aAM TuF
related: 7fNG sve JWU

Industrilokalsmålning (järnkonstruktioner)
type: Concept
in scheme: JobTech Taxonomy - Färdighet
definition: Industrilokalsmålning (järnkonstruktioner)
broader: zmYu aAM TuF
related: QKvX v7r PNL

Inslagsproduktion
type: Concept
in scheme: JobTech Taxonomy - Färdighet
definition: Inslagsproduktion
broader: zmYu aAM TuF
related: rYSG 3WJ LmC

Asiens arkeologi
type: Concept
in scheme: JobTech Taxonomy - Färdighet
definition: Asiens arkeologi
broader: zmYu aAM TuF
related: sXgV QFg vpb

Tortyrskadebehandling
type: Concept
in scheme: JobTech Taxonomy - Färdighet
definition: Tortyrskadebehandling
broader: zmYu aAM TuF
related: VYeq GDF a2g

IATA-certifikat
type: Concept
in scheme: JobTech Taxonomy - Färdighet
definition: IATA-certifikat
broader: s48H Sft DTn
related: fdLf oPp wVw
related: AuTi FEo j3R

Koagulations- och blödningsrubbningar, specialistkompetens för läkare
type: Concept
in scheme: JobTech Taxonomy - Färdighet
definition: Koagulations- och blödningsrubbningar, specialistkompetens för läkare
broader: Specialistbevis för läkare
related: nu7c QuB KVQ

Mätarmontering
type: Concept
in scheme: JobTech Taxonomy - Färdighet
definition: Mätarmontering
broader: zmYu aAM TuF
related: df9D e6y 61z

Landskapsingenjörsexamen
type: Concept
in scheme: JobTech Taxonomy - Färdighet
definition: Landskapsingenjörsexamen
broader: Yrkesbevis/examen
related: XBh3 Xrm C4R
related: yXbD NTH ijE

Skadesanering
type: Concept
in scheme: JobTech Taxonomy - Färdighet
definition: Skadesanering avser kompetensen att röja upp, rengöra och återställa platser och lokaler efter olyckor, utsläpp eller skadeangrepp. Denna kompetens inkluderar åtgärder för att sanera fastigheter från exempelvis asbest eller mögel samt rengöring av ventilationsaggregat.
broader: zmYu aAM TuF
related: idjo 2Wr a3E
related: yXbD NTH ijE

Galvanoteknik
type: Concept
in scheme: JobTech Taxonomy - Färdighet
definition: Galvanoteknik
broader: zmYu aAM TuF
related: e6nk AGp y28

MS-101 Microsoft 365 Mobility and Security
type: Concept
in scheme: JobTech Taxonomy - Färdighet
definition: MS-101 Microsoft 365 Mobility and Security
broader: s48H Sft DTn
related: BAeH eg8 T2d
related: cBBa ngH fCx
related: 4Jty HpK a3Q
related: MYAz x9m 2LJ

Reparation av segel
type: Concept
in scheme: JobTech Taxonomy - Färdighet
definition: Reparation av segel
broader: zmYu aAM TuF
related: UZBj yDX Ctp

Arkitektexamen
type: Concept
in scheme: JobTech Taxonomy - Färdighet
definition: Arkitektexamen är en examen på högskolenivå kopplad till utbildning med inriktning mot arkitekt.
broader: Yrkesbevis/examen
related: wCx8 rY3 XUT
related: Pd51 xnr KCY
related: 41KB bfk 5jR

Visual Page, HTML-editor
type: Concept
in scheme: JobTech Taxonomy - Färdighet
definition: Visual Page, HTML-editor
alternative label: Visual Page
broader: Programmerings- och systemutvecklingsverktyg
related: 8Bmh vtM zts
related: D9SL mtn vGM
related: 4Jty HpK a3Q
related: Mbt6 3ko DiD
related: MYAz x9m 2LJ

VVS-tjänster, produktkunskap
type: Concept
in scheme: JobTech Taxonomy - Färdighet
definition: VVS-tjänster, produktkunskap
broader: zmYu aAM TuF
related: oXSW fbY XrY

Ridande polis-utbildning
type: Concept
in scheme: JobTech Taxonomy - Färdighet
definition: Ridande polis-utbildning
broader: Yrkesbevis/examen
related: rNcE Zno pD8

Automatisk mätaravläsning
type: Concept
in scheme: JobTech Taxonomy - Färdighet
definition: Automatisk mätaravläsning
broader: zmYu aAM TuF
related: df9D e6y 61z
related: Cppd 9P7 HeR
related: 4Jty HpK a3Q

Litteraturvetenskap
type: Concept
in scheme: JobTech Taxonomy - Färdighet
definition: Litteraturvetenskap
broader: zmYu aAM TuF
related: sXgV QFg vpb

Passagerartransporter
type: Concept
in scheme: JobTech Taxonomy - Färdighet
definition: Passagerartransporter avser åtgärder och aktiviteter som syftar till att transportera passagerare med olika fordon, såsom personbilar, minibussar och motorcyklar. Denna kompetens omfattar kunskaper om säker körning, kundservice och hantering av passagerare under transporten.
broader: zmYu aAM TuF
related: ffz2 2n3 R7g
related: P7Ay ooF pri

Mekanisk konstruktion
type: Concept
in scheme: JobTech Taxonomy - Färdighet
definition: Mekanisk konstruktion
broader: zmYu aAM TuF
related: K8yg U4C gkY
related: PRQn 9yw NJA

Behörighet för inspektioner
type: Concept
in scheme: JobTech Taxonomy - Färdighet
definition: Behörighet för inspektioner
broader: Yrkesbevis/examen
related: DPPw 4wa AsH

ISAC, styr- och utvecklingsmodell
type: Concept
in scheme: JobTech Taxonomy - Färdighet
definition: ISAC, styr- och utvecklingsmodell
alternative label: ISAC
broader: Styr- och utvecklingsmodeller
related: cBBa ngH fCx
related: D9SL mtn vGM
related: DJh5 yyF hEM
related: UxT1 tPF Kbg
related: 4Jty HpK a3Q
related: UXKZ 3zZ ipB

Bärtekniker för servering
type: Concept
in scheme: JobTech Taxonomy - Färdighet
definition: Bärtekniker för servering
broader: zmYu aAM TuF
related: UjoW meY Zwt

Utsättning
type: Concept
in scheme: JobTech Taxonomy - Färdighet
definition: Utsättning
broader: zmYu aAM TuF
related: bZ4J riZ zK6
related: thZP oR7 WrY
related: w6ud quG dgh
related: 9mJN VwW Xjg
related: XeBP nMe pXx
related: iHrC aRv fVm

Lilla röret (mindre än eller lika med 25 mm.)
type: Concept
in scheme: JobTech Taxonomy - Färdighet
definition: Lilla röret (mindre än eller lika med 25 mm.)
broader: zmYu aAM TuF
related: wQ1E Bzk ZyA

Afrikansk dans
type: Concept
in scheme: JobTech Taxonomy - Färdighet
definition: Afrikansk dans
broader: Dans
related: gmRr 7tt eHj

Steppdans, undervisning
type: Concept
in scheme: JobTech Taxonomy - Färdighet
definition: Steppdans, undervisning
broader: zmYu aAM TuF
related: mcRJ kq2 jFr

Verksamhetsledning, byggföretag
type: Concept
in scheme: JobTech Taxonomy - Färdighet
definition: Verksamhetsledning, byggföretag
broader: zmYu aAM TuF
related: 7mn2 kA9 ftp

Certifierad Arkoffsettryckare
type: Concept
in scheme: JobTech Taxonomy - Färdighet
definition: Certifierad Arkoffsettryckare
broader: s48H Sft DTn
related: XeJB bkn mRn

Bröllopsmusik
type: Concept
in scheme: JobTech Taxonomy - Färdighet
definition: Bröllopsmusik
broader: p1WM wCw LTd
related: AWJF wqZ va9

Plastskulptur
type: Concept
in scheme: JobTech Taxonomy - Färdighet
definition: Plastskulptur
broader: zmYu aAM TuF
related: 34Tn BQQ tfo

CNC-programmering, Num
type: Concept
in scheme: JobTech Taxonomy - Färdighet
definition: CNC-programmering, Num
broader: Programmering, CNC-styrsystem
related: vaEp iBS c5h
related: 4Jty HpK a3Q

Hovslageri
type: Concept
in scheme: JobTech Taxonomy - Färdighet
definition: Hovslageri avser kompetens att utföra arbete med hästars hovar, som inkluderar skoning och medicinsk behandling av hovar vid behov. Kompetensen omfattar kunskap om hovens anatomi, olika skotyper och material, samt tekniker för att säkerställa hästens välmående och rörlighet.
broader: zmYu aAM TuF
related: KYmy iqC xiQ

Grundutbildning för tullaspiranter
type: Concept
in scheme: JobTech Taxonomy - Färdighet
definition: Grundutbildning för tullaspiranter är en eftergymnasial yrkesinriktad utbildning med inriktning till Tulltjänsteman.
broader: Yrkesbevis/examen
related: FKCE Anf zGH

Samordning/Granskning-Autodesk Navisworks Freedom
type: Concept
in scheme: JobTech Taxonomy - Färdighet
definition: Samordning/Granskning-Autodesk Navisworks Freedom
alternative label: Granskning-Autodesk Navisworks Freedom
alternative label: Samordning-Autodesk Navisworks Freedom
broader: mTLu uo2 gq2
related: 3jEy yuT aVo
related: thZP oR7 WrY
related: w6ud quG dgh
related: K8yg U4C gkY
related: nDaB vdy eAy
related: 33Nt DSs YYA
related: Pd51 xnr KCY
related: ketV G9W GeR
related: SPYW 7Z1 ShT
related: XeBP nMe pXx
related: PRQn 9yw NJA
related: ETAR ggZ Wuw
related: 41KB bfk 5jR
related: 4Jty HpK a3Q

SAP R/3, affärssystem
type: Concept
in scheme: JobTech Taxonomy - Färdighet
definition: SAP R/3, affärssystem
alternative label: SAP R/3
broader: xSJR 1Kq pxB
related: eQ4M CNm ozj
related: Y6yY SuR hVh
related: Uw4n UB2 RCW
related: iWcY mko rq2
related: q81z 3oD 1qu
related: cRmd 536 pT1
related: ij8k EwC zyB
related: 4Jty HpK a3Q

Trädgårdsdesign
type: Concept
in scheme: JobTech Taxonomy - Färdighet
definition: Trädgårdsdesign
broader: zmYu aAM TuF
related: XBh3 Xrm C4R
related: 2xQ4 4kh kTZ
related: ETAR ggZ Wuw

Analog konstruktion
type: Concept
in scheme: JobTech Taxonomy - Färdighet
definition: Analog konstruktion
broader: zmYu aAM TuF
related: nDaB vdy eAy
related: SPYW 7Z1 ShT

Valvmurning
type: Concept
in scheme: JobTech Taxonomy - Färdighet
definition: Valvmurning
broader: zmYu aAM TuF
related: NnB3 eWH auo

Skärpning, verktyg
type: Concept
in scheme: JobTech Taxonomy - Färdighet
definition: Skärpning, verktyg avser processen att bearbeta och underhålla verktyg för att säkerställa deras funktionalitet och effektivitet genom att åtgärda slitage och återställa skärpa. Kompetensen omfattar användning av olika tekniker och utrustning för att slipa och justera verktygens egenskaper, vilket är centralt för yrken inom områden som slipning och verktygsmakning.
broader: zmYu aAM TuF
related: MSnK 3Z8 4qA
related: 4bxV 58E P9N

Strålskyddsteknikerutbildning
type: Concept
in scheme: JobTech Taxonomy - Färdighet
definition: Utbildning inom strålskydd för arbete vid anläggningar med joniserande strålning. Utbildning ges ofta internt på företag.
broader: Yrkesbevis/examen
related: puim 6PY DGj
related: rE1E m3d cx1
related: nuXg Wjc JPd

Verktygskonstruktion
type: Concept
in scheme: JobTech Taxonomy - Färdighet
definition: Verktygskonstruktion
broader: zmYu aAM TuF
related: K8yg U4C gkY
related: PRQn 9yw NJA

Tvärflöjt
type: Concept
in scheme: JobTech Taxonomy - Färdighet
definition: Tvärflöjt
broader: wLYs CKS wK8
related: AWJF wqZ va9

Vattenborrning
type: Concept
in scheme: JobTech Taxonomy - Färdighet
definition: Vattenborrning
broader: zmYu aAM TuF
related: 7zKm 4NW eey

Ombordservicepersonal, sjöfart
type: Concept
in scheme: JobTech Taxonomy - Färdighet
definition: Ombordservicepersonal, sjöfart
broader: Övriga specialiteter, sjöfart
related: UjoW meY Zwt
related: tPox ie4 X9X

Rollsättning/Casting
type: Concept
in scheme: JobTech Taxonomy - Färdighet
definition: Rollsättning/Casting
alternative label: Casting
alternative label: Rollsättning
broader: zmYu aAM TuF
related: rYSG 3WJ LmC
related: PH2M uV4 r72

Manusprogram-Celtx
type: Concept
in scheme: JobTech Taxonomy - Färdighet
definition: Manusprogram-Celtx
broader: Programvara för digitalt skapande
related: zfve s6G tpc
related: 4Jty HpK a3Q

Kvalitetsutveckling, omsorg
type: Concept
in scheme: JobTech Taxonomy - Färdighet
definition: Kvalitetsutveckling, omsorg
broader: zmYu aAM TuF
related: BWwk fYX S5B
related: 5uP5 Ugw aVE

Special effects
type: Concept
in scheme: JobTech Taxonomy - Färdighet
definition: Special effects
broader: zmYu aAM TuF
related: ezKk kss CiQ

IR-teknik
type: Concept
in scheme: JobTech Taxonomy - Färdighet
definition: IR-teknik
broader: Kommunikationsprotokoll
related: BAeH eg8 T2d
related: cBBa ngH fCx
related: Q5DF juj 8do
related: nDaB vdy eAy
related: D9SL mtn vGM
related: DJh5 yyF hEM
related: SPYW 7Z1 ShT
related: 4Jty HpK a3Q
related: 13md uyV BNG
related: UXKZ 3zZ ipB
related: MYAz x9m 2LJ

Baseboll, instruktör/Baseboll, tränare
type: Concept
in scheme: JobTech Taxonomy - Färdighet
definition: Baseboll, instruktör/Baseboll, tränare
alternative label: Baseboll, instruktör
alternative label: Baseboll, tränare
broader: Idrott/aktivitet
related: EA6o N1N QtT

Cisco Certified Network Associate/CCNA
type: Concept
in scheme: JobTech Taxonomy - Färdighet
definition: Cisco Certified Network Associate/CCNA
alternative label: CCNA
alternative label: Cisco Certified Network Associate
broader: s48H Sft DTn
related: BAeH eg8 T2d
related: VCpu 5EN bBt
related: fWrt sLg koW
related: 4Jty HpK a3Q
related: 13md uyV BNG

CAK-certifikat för ambulans
type: Concept
in scheme: JobTech Taxonomy - Färdighet
definition: CAK-certifikat för ambulans
broader: s48H Sft DTn
related: ug5y o6z U3L

Fjärrbilslotsning
type: Concept
in scheme: JobTech Taxonomy - Färdighet
definition: Fjärrbilslotsning avser den specifika kompetensen att styra och navigera fjärrstyrda lastbilar i olika trafik- och trafiksystem, vilket kan omfatta att manövrera fordonet på distans och säkerställa korrekt lastning och lossning. Denna kompetens kräver kunskap om trafikregler, säkerhet och tekniska system för fjärrstyrning.
broader: zmYu aAM TuF
related: 3MBw pDA P2F

Viltinventering
type: Concept
in scheme: JobTech Taxonomy - Färdighet
definition: Viltinventering
broader: zmYu aAM TuF
related: yXbD NTH ijE
related: 3LdB WEJ 8Ms

Yrkesutbildning, dekorationsmålare/förgyllare
type: Concept
in scheme: JobTech Taxonomy - Färdighet
definition: Yrkesutbildning, dekorationsmålare/förgyllare är en yrkeshögskoleutbildning med inriktning till dekorationsmålare/förgyllare.
broader: Yrkesutbildning
related: aKdV u7V R5j

Flygtjänst, specialisering för officer
type: Concept
in scheme: JobTech Taxonomy - Färdighet
definition: Flygtjänst, specialisering för officer
broader: zmYu aAM TuF
related: dhgR 9jk 95r
related: KiVA anS RJh

Arbetsmarknadsfrågor
type: Concept
in scheme: JobTech Taxonomy - Färdighet
definition: Arbetsmarknadsfrågor
broader: zmYu aAM TuF
related: vPP6 rsw dck
related: SgNH hag n9D
related: fsnw ZCu v2U

Yrkesbevis, glastekniker
type: Concept
in scheme: JobTech Taxonomy - Färdighet
definition: Yrkesbevis, glastekniker
broader: Yrkesbevis/examen
related: J17g Q2a 2u1

Matbröd
type: Concept
in scheme: JobTech Taxonomy - Färdighet
definition: Matbröd
broader: zmYu aAM TuF
related: BStc SJh DKG
related: 5qT8 z9d 8rw

Skogstaxering
type: Concept
in scheme: JobTech Taxonomy - Färdighet
definition: Skogstaxering är kompetensen att inventera och uppskatta skogens egenskaper, som virkesvolym, bonitet, trädslagsfördelning och ståndort genom fältmätningar och stickprovsmetoder. Det kan vara okulär eller avancerad, som i Riksskogstaxeringen, och används för planering av skötsel och avverkning. Metoderna inkluderar klavning av träd, arealavgränsning och volymskattning för att ge underlag till skogsbruksplaner.
broader: zmYu aAM TuF
related: 3LdB WEJ 8Ms

Valvdörrar, låsteknik
type: Concept
in scheme: JobTech Taxonomy - Färdighet
definition: Valvdörrar, låsteknik
broader: zmYu aAM TuF
related: e6nk AGp y28

Produktionsledning, olja och gas
type: Concept
in scheme: JobTech Taxonomy - Färdighet
definition: Produktionsledning, olja och gas
broader: zmYu aAM TuF
related: rwpH 6RA XTT

Kulturantropologi
type: Concept
in scheme: JobTech Taxonomy - Färdighet
definition: Kulturantropologi
broader: zmYu aAM TuF
related: sXgV QFg vpb

Trafikverkets föreskriftsregler
type: Concept
in scheme: JobTech Taxonomy - Färdighet
definition: Trafikverkets föreskriftsregler
broader: zmYu aAM TuF
related: nuXg Wjc JPd

Optikerexamen
type: Concept
in scheme: JobTech Taxonomy - Färdighet
definition: Optikerexamen är en yrkesexamen på högskolenivå kopplad till utbildning med inriktning mot optiker. Källa: UHR (Universitets- och högskolerådet)
broader: Yrkesbevis/examen
related: PUhV DVQ MM6

Högtrycksrengöring
type: Concept
in scheme: JobTech Taxonomy - Färdighet
definition: Högtrycksrengöring avser användning av reningsmetod där vatten under högt tryck används för att avlägsna smuts och skräp från olika ytor. Kompetensen innefattar kunskaper om utrustning, säkerhet och teknik för att effektivt genomföra rengöring på olika material och i olika miljöer.
broader: zmYu aAM TuF
related: dKUb KBP mw3
related: df9D e6y 61z
related: idjo 2Wr a3E
related: Z6TY xDf Yup
related: FjdF H2e tAG

Civilekonomexamen
type: Concept
in scheme: JobTech Taxonomy - Färdighet
definition: Civilekonomexamen
broader: Yrkesbevis/examen
related: Y6yY SuR hVh
related: Qo7p wjf gtv
related: Bbkh nrm 2J8
related: Uw4n UB2 RCW
related: vPP6 rsw dck
related: pTr9 RBT 9ur
related: mZsb A1K Gec
related: WX67 Pfb WMN
related: cRmd 536 pT1

Oorganisk kemi
type: Concept
in scheme: JobTech Taxonomy - Färdighet
definition: Oorganisk kemi
broader: zmYu aAM TuF
related: v9nU 6Fw 4Qg
related: qn2U dB9 Cmh
related: eofS oZs RZi
related: bExu 8gk azk

EU-regler
type: Concept
in scheme: JobTech Taxonomy - Färdighet
definition: EU-regler
broader: zmYu aAM TuF
related: qVHD Hj5 PXh
related: vPP6 rsw dck
related: oEmP NC1 sXE
related: vCAb uuo ek5

Sekreterarfunktion i politiska organ
type: Concept
in scheme: JobTech Taxonomy - Färdighet
definition: Sekreterarfunktion i politiska organ
broader: zmYu aAM TuF
related: vPP6 rsw dck

Fartygsbefäl klass VIII (behörighet)
type: Concept
in scheme: JobTech Taxonomy - Färdighet
definition: Fartygsbefäl klass VIII (behörighet)
broader: Behörigheter, sjöfart
related: kDnq Q98 sD3

XOR Compact, redovisningssystem
type: Concept
in scheme: JobTech Taxonomy - Färdighet
definition: XOR Compact, redovisningssystem
alternative label: XOR Compact
broader: xSJR 1Kq pxB
related: eQ4M CNm ozj
related: Y6yY SuR hVh
related: Uw4n UB2 RCW
related: iWcY mko rq2
related: q81z 3oD 1qu
related: cRmd 536 pT1
related: ij8k EwC zyB
related: 4Jty HpK a3Q

Multimediaproduktion
type: Concept
in scheme: JobTech Taxonomy - Färdighet
definition: Multimediaproduktion
broader: zmYu aAM TuF
related: 4BsK q2C sCL
related: CkRH 4Qn iX3
related: 3J38 DNz YKK
related: 4Jty HpK a3Q

Avgasrening, bensinmotorer
type: Concept
in scheme: JobTech Taxonomy - Färdighet
definition: Avgasrening, bensinmotorer
broader: zmYu aAM TuF
related: Lzpv ofL 3H5

Legitimation som barnmorska
type: Concept
in scheme: JobTech Taxonomy - Färdighet
definition: Legitimation som krävs för att kunna arbeta som barnmorska i Sverige. Utfärdas av Socialstyrelsen.
broader: Yrkesbevis/examen
related: 7XXd 4St nit
related: 4P8B LtK JgE
related: r1Gk 3EN bpw
related: Z8ci bBE tmx

Yrkesfiske
type: Concept
in scheme: JobTech Taxonomy - Färdighet
definition: Yrkesfiske avser det organiserade fiskandet som bedrivs för kommersiella syften, vilket inkluderar havs-, kust- och insjöfiske. Kompetensen omfattar också underhåll av båtar och redskap som används i fisket.
broader: zmYu aAM TuF
related: Lm3Z gek GYc

Artificiella naglar
type: Concept
in scheme: JobTech Taxonomy - Färdighet
definition: Artificiella naglar
broader: zmYu aAM TuF
related: ezKk kss CiQ

Gassäkerhetsansvarig
type: Concept
in scheme: JobTech Taxonomy - Färdighet
definition: Gassäkerhetsansvarig
broader: s48H Sft DTn
related: KttZ Skc bMR

Gesällbrev, kock
type: Concept
in scheme: JobTech Taxonomy - Färdighet
definition: Gesällbrev, kock
broader: Yrkesbevis/examen
related: BStc SJh DKG

Arbetsledning, sjöfart
type: Concept
in scheme: JobTech Taxonomy - Färdighet
definition: Arbetsledning, sjöfart
broader: Övriga specialiteter, sjöfart
related: Rsoy sS6 6c4
related: kDnq Q98 sD3

Radioterapi/Strålbehandling
type: Concept
in scheme: JobTech Taxonomy - Färdighet
definition: Radioterapi/Strålbehandling
alternative label: Radioterapi
alternative label: Strålbehandling
broader: zmYu aAM TuF
related: 4Jty HpK a3Q
related: 6zAR EHM Kwj

Polisens flygutbildning
type: Concept
in scheme: JobTech Taxonomy - Färdighet
definition: Polisens flygutbildning
broader: Yrkesbevis/examen
related: rNcE Zno pD8

Riskbaserad kundanalys
type: Concept
in scheme: JobTech Taxonomy - Färdighet
definition: Riskbaserad kundanalys
broader: zmYu aAM TuF
related: Uw4n UB2 RCW

Studiebrevsgranskning
type: Concept
in scheme: JobTech Taxonomy - Färdighet
definition: Studiebrevsgranskning
broader: zmYu aAM TuF
related: Gm5j S2Y aTB
related: cYCo PxY zQd
related: RPBE x5M cXX

Geografi
type: Concept
in scheme: JobTech Taxonomy - Färdighet
definition: Geografi
broader: zmYu aAM TuF
related: sXgV QFg vpb

Arbete på väg steg 1, grundkompetens
type: Concept
in scheme: JobTech Taxonomy - Färdighet
definition: Utbildningen framför lagar och regler för personer som utför vägarbete och hur regler skall tillämpas vid olika arbeten. Denna kurs sker online och ger kursdeltagaren ett certifikat/kursintyg efter godkänt resultat. Källa: Trafikverket
broader: s48H Sft DTn
related: mis4 feV uex
related: XBh3 Xrm C4R
related: 3ZtN hhA SM7
related: bZ4J riZ zK6
related: thZP oR7 WrY
related: 7zKm 4NW eey
related: ayQ4 G3W A2w
related: 3MBw pDA P2F
related: ketV G9W GeR

Orgelpipmakeri
type: Concept
in scheme: JobTech Taxonomy - Färdighet
definition: Orgelpipmakeri avser hantverk och teknik för att tillverka pipor för orglar, vilket innefattar noggrant val av material och precision i konstruktionen för att uppnå önskad ton och klang. Kompetensen omfattar både traditionella och moderna metoder samt en djup förståelse för akustik och instrumentbyggande.
broader: zmYu aAM TuF
related: aKdV u7V R5j

CICS, programmeringsverktyg
type: Concept
in scheme: JobTech Taxonomy - Färdighet
definition: CICS, programmeringsverktyg
alternative label: CICS
broader: Programmerings- och systemutvecklingsverktyg
related: D9SL mtn vGM
related: DJh5 yyF hEM
related: 4Jty HpK a3Q
related: MYAz x9m 2LJ

Jägarexamen
type: Concept
in scheme: JobTech Taxonomy - Färdighet
definition: Jägarexamen
broader: Yrkesbevis/examen
related: 3LdB WEJ 8Ms

Data, cirkelledning
type: Concept
in scheme: JobTech Taxonomy - Färdighet
definition: Data, cirkelledning
broader: zmYu aAM TuF
related: 1CX5 mZw Vcq
related: 4Jty HpK a3Q

Bas-P/Byggarbetsmiljösamordnare för planering och projektering
type: Concept
in scheme: JobTech Taxonomy - Färdighet
definition: Byggarbetsmiljösamordnaren för planering och projektering (Bas-P) ska samordna de olika projektörerna, det vill säga arkitekter, konstruktörer och andra som medverkar vid planeringen och projekteringen. Källa: Arbetsmiljöverket
alternative label: Bas-P, Byggarbetsmiljösamordnare för planering och projektering
broader: s48H Sft DTn
related: thZP oR7 WrY
related: w6ud quG dgh
related: XeBP nMe pXx

Grundläggande polartjänstgöring
type: Concept
in scheme: JobTech Taxonomy - Färdighet
definition: Grundläggande polartjänstgöring
broader: s48H Sft DTn
related: Rsoy sS6 6c4
related: kZwz D8K bKs
related: kDnq Q98 sD3

Blekingska
type: Concept
in scheme: JobTech Taxonomy - Färdighet
definition: Blekingska
broader: Dialekt
related: iBUL s38 izZ

Egenföretagare, erfarenhet
type: Concept
in scheme: JobTech Taxonomy - Färdighet
definition: Egenföretagare, erfarenhet
broader: Yrkesövergripande kompetenser

Montering av betongelement
type: Concept
in scheme: JobTech Taxonomy - Färdighet
definition: Montering av betongelement
broader: zmYu aAM TuF
related: AD3U cFH rbe

Porslinsmålning
type: Concept
in scheme: JobTech Taxonomy - Färdighet
definition: Porslinsmålning avser den konstnärliga färdigheten att måla och dekorera porslin för att förbättra dess estetiska och kulturella värde. Kompetensen omfattar kunskaper i färgteknik, design och appliceringstekniker som är specifika för keramiskt material.
broader: zmYu aAM TuF
related: aKdV u7V R5j

Certified JavaScript Developer
type: Concept
in scheme: JobTech Taxonomy - Färdighet
definition: Certified JavaScript Developer
broader: s48H Sft DTn
related: cBBa ngH fCx
related: Q5DF juj 8do
related: D9SL mtn vGM
related: DJh5 yyF hEM
related: 4Jty HpK a3Q
related: UXKZ 3zZ ipB
related: MYAz x9m 2LJ

Rosenterapi
type: Concept
in scheme: JobTech Taxonomy - Färdighet
definition: Kompetensen avser kunskaper om och erfarenhet av behandlingsformen rosenterapi. Behandling innebär beröring med avsikt att att lösa upp muskelspänningar i kroppen.
broader: zmYu aAM TuF
related: F19Z oB6 pg3

Resejournalistik
type: Concept
in scheme: JobTech Taxonomy - Färdighet
definition: Resejournalistik
broader: zmYu aAM TuF
related: SgNH hag n9D

Laminatgolv
type: Concept
in scheme: JobTech Taxonomy - Färdighet
definition: Laminatgolv
broader: zmYu aAM TuF
related: V79C DD2 3Gj

Fritidsgård
type: Concept
in scheme: JobTech Taxonomy - Färdighet
definition: Fritidsgård avser en verksamhet som erbjuder fritidsaktiviteter för barn och ungdomar, inklusive möjligheter till social samvaro och utveckling. Kompetensen relaterar till planering, organisering och ledning av olika typer av aktiviteter för att skapa en positiv och trygg miljö för deltagarna.
broader: zmYu aAM TuF
related: aA2Z 9XX R1v

Energifrågor
type: Concept
in scheme: JobTech Taxonomy - Färdighet
definition: Energifrågor
broader: zmYu aAM TuF
related: qVHD Hj5 PXh
related: wCx8 rY3 XUT
related: thZP oR7 WrY
related: yXbD NTH ijE

Enklare bakningskunskaper
type: Concept
in scheme: JobTech Taxonomy - Färdighet
definition: Enklare bakningskunskaper
broader: zmYu aAM TuF
related: tPox ie4 X9X

Pälsdjursavel
type: Concept
in scheme: JobTech Taxonomy - Färdighet
definition: Pälsdjursavel
broader: zmYu aAM TuF
related: Lrsj wRZ sFV

Topografi
type: Concept
in scheme: JobTech Taxonomy - Färdighet
definition: Topografi
broader: zmYu aAM TuF
related: ketV G9W GeR

Intensivvård, specialistkompetens för fysioterapeuter
type: Concept
in scheme: JobTech Taxonomy - Färdighet
definition: Intensivvård, specialistkompetens för fysioterapeuter
broader: Specialistinriktning inom fysioterapi
related: s7vU FhY L5Z

Textilteknik
type: Concept
in scheme: JobTech Taxonomy - Färdighet
definition: Textilteknik avser kunskaper och färdigheter relaterade till design, tillverkning och behandling av textila material och produkter. Kompetensen omfattar olika aspekter av textilproduktionen, inklusive förståelse för materialens egenskaper och tillverkningsprocesser, samt förmåga att tillämpa tekniska lösningar inom textilindustri.
broader: zmYu aAM TuF
related: mis4 feV uex
related: skLS kpa Ui1
related: PF4H kQD zpL

Rational Functional Tester, systemutvecklingsverktyg
type: Concept
in scheme: JobTech Taxonomy - Färdighet
definition: Rational Functional Tester, systemutvecklingsverktyg
alternative label: Rational Functional Tester
broader: Programmerings- och systemutvecklingsverktyg
related: D9SL mtn vGM
related: DJh5 yyF hEM
related: 4Jty HpK a3Q
related: MYAz x9m 2LJ

Naturvårdsplanering
type: Concept
in scheme: JobTech Taxonomy - Färdighet
definition: Naturvårdsplanering
broader: zmYu aAM TuF
related: XurM DVs ggn
related: yXbD NTH ijE
related: e9FK VKh ahW

Eldslukning
type: Concept
in scheme: JobTech Taxonomy - Färdighet
definition: Eldslukning
broader: zmYu aAM TuF
related: xuSE mtB Mir

Microsoft Dynamics AX, affärssystem
type: Concept
in scheme: JobTech Taxonomy - Färdighet
definition: Microsoft Dynamics AX, affärssystem
alternative label: Microsoft Dynamics AX
broader: xSJR 1Kq pxB
related: eQ4M CNm ozj
related: Y6yY SuR hVh
related: Uw4n UB2 RCW
related: iWcY mko rq2
related: q81z 3oD 1qu
related: cRmd 536 pT1
related: ij8k EwC zyB
related: 4Jty HpK a3Q

Stålämneshantering
type: Concept
in scheme: JobTech Taxonomy - Färdighet
definition: Stålämneshantering
broader: zmYu aAM TuF
related: E87t egE pjA
related: UcNa inr snV

XQuery, frågespråk
type: Concept
in scheme: JobTech Taxonomy - Färdighet
definition: XQuery, frågespråk
broader: Datorspråk
related: D9SL mtn vGM
related: DJh5 yyF hEM
related: UxT1 tPF Kbg
related: 4Jty HpK a3Q
related: UXKZ 3zZ ipB

Foto, cirkelledning
type: Concept
in scheme: JobTech Taxonomy - Färdighet
definition: Foto, cirkelledning
broader: zmYu aAM TuF
related: 1CX5 mZw Vcq

Revision
type: Concept
in scheme: JobTech Taxonomy - Färdighet
definition: Revision är en oberoende granskning av företags årsredovisning, bokföring och förvaltning för att säkerställa att de ger en rättvisande bild och följer lagar samt god revisionssed. Kompetensen omfattar riskbedömningar, stickprovskontroller, avstämningar, analys av interna rutiner och upprättande av revisionsberättelse med eventuella anmärkningar. Arbetet utförs av revisorer och assistenter på revisionsbyråer.
broader: zmYu aAM TuF
related: Y6yY SuR hVh
related: 4W6S 1kA nrv
related: Uw4n UB2 RCW
related: q81z 3oD 1qu
related: cRmd 536 pT1
related: 4Jty HpK a3Q

MSA
type: Concept
in scheme: JobTech Taxonomy - Färdighet
definition: MSA
broader: zmYu aAM TuF
related: Pd51 xnr KCY
related: ETAR ggZ Wuw
related: 41KB bfk 5jR

Vaktmästeri, sjukhus
type: Concept
in scheme: JobTech Taxonomy - Färdighet
definition: Vaktmästeri, sjukhus avser ett arbete som innefattar ett flertal praktiska uppgifter för att stödja den dagliga driften av sjukhusmiljöer. Kompetensen inkluderar ansvar för underhåll och reparationer av lokaler och utrustning samt hantering av post och leveranser inom sjukhuset.
broader: zmYu aAM TuF
related: 9DdK AZY ZNK

Rullpolering
type: Concept
in scheme: JobTech Taxonomy - Färdighet
definition: Rullpolering
broader: zmYu aAM TuF
related: 4bxV 58E P9N

Augmented reality/AR
type: Concept
in scheme: JobTech Taxonomy - Färdighet
definition: Augmented reality/AR
alternative label: AR
alternative label: Augmented reality
alternative label: Förstärkt verklighet
broader: zmYu aAM TuF
related: 4BsK q2C sCL
related: UxT1 tPF Kbg
related: 4Jty HpK a3Q
related: Mbt6 3ko DiD

Pälsning
type: Concept
in scheme: JobTech Taxonomy - Färdighet
definition: Pälsning
broader: zmYu aAM TuF
related: Lrsj wRZ sFV

Kassavana
type: Concept
in scheme: JobTech Taxonomy - Färdighet
definition: Kassavana avser erfarenhet och färdighet i att hantera betalningar och genomföra kassatransaktioner i olika försäljningsmiljöer. Kompetensen involverar kunskaper om kassaapparater, betalningssystem och rutiner för att säkerställa korrekt betalning och redovisning av transaktioner.
broader: zmYu aAM TuF
related: XFXX Jq9 Y2a
related: fdLf oPp wVw
related: YHwG fk2 MDL
related: JnTF wXr 6Eh
related: bYde Frc xcB
related: PxXc 16t oZo
related: mwVN oEH g9k
related: Fp7x Yqt bx9
related: YKL2 FCB 1yr
related: UjoW meY Zwt
related: s1Qk o98 2o1
related: a8gg ktU w8V
related: 41Az ioZ rmH
related: 5qT8 z9d 8rw
related: 9DdK AZY ZNK
related: FfMN Bw1 qYR
related: s78G Zp2 dkq
related: 1wqU Jhj amb
related: tPox ie4 X9X
related: M47D MU2 dhS
related: ieVp d5L rS9
related: xyW2 toA Skh
related: LyBp bY6 bZK
related: AQrL tTu Wbg
related: 1Tso 4TB RkE
related: WNVp RYe zLX

Apache Kafka, streaming-plattform
type: Concept
in scheme: JobTech Taxonomy - Färdighet
definition: Apache Kafka, streaming-plattform
alternative label: Apache Kafka
broader: Applikationsplattformar
related: D9SL mtn vGM
related: DJh5 yyF hEM
related: UxT1 tPF Kbg
related: 4Jty HpK a3Q
related: UXKZ 3zZ ipB

Animalieproduktion
type: Concept
in scheme: JobTech Taxonomy - Färdighet
definition: Animalieproduktion avser processen för uppfödning och skötsel av lantbrukets husdjur för produktion av livsmedel såsom mjölk, kött och ägg. Denna kompetens omfattar aspekter av djurhållning, avel och hantering.
broader: zmYu aAM TuF
related: XurM DVs ggn
related: KYmy iqC xiQ
related: RYCQ ogb uUY

Gnistning, CNC
type: Concept
in scheme: JobTech Taxonomy - Färdighet
definition: Gnistning, CNC
broader: zmYu aAM TuF
related: vaEp iBS c5h
related: 4Jty HpK a3Q

Vapen, arkeologisk kunskap
type: Concept
in scheme: JobTech Taxonomy - Färdighet
definition: Vapen, arkeologisk kunskap
broader: zmYu aAM TuF
related: sXgV QFg vpb

Biosäkerhet
type: Concept
in scheme: JobTech Taxonomy - Färdighet
definition: Biosäkerhet handlar om att förhindra oavsiktlig exponering för smittämnen eller oavsiktlig spridning till omgivning och miljö. Källa: www.folkhalsomyndigheten.se
alternative label: Biosafety
broader: zmYu aAM TuF
related: c8r8 e4L gwj
related: wNrt Ysj WuT
related: XurM DVs ggn
related: Z2MZ eYc Lfv
related: KYmy iqC xiQ
related: puim 6PY DGj
related: rE1E m3d cx1
related: yXbD NTH ijE
related: k3R3 UkC nK2

Kontrabas, undervisning musikskola
type: Concept
in scheme: JobTech Taxonomy - Färdighet
definition: Kontrabas, undervisning musikskola
broader: zmYu aAM TuF
related: mcRJ kq2 jFr

Mönsterkonstruktion
type: Concept
in scheme: JobTech Taxonomy - Färdighet
definition: Mönsterkonstruktion avser processen att skapa fysiska eller digitala mallar och mönster som används för tillverkning av kläder, accessoarer och andra produkter i textil och läder. Denna kompetens omfattar teknisk färdighet i design och utensilier för att säkerställa att de färdiga produkterna uppfyller designkrav och specifikationer.
broader: zmYu aAM TuF
related: 34Tn BQQ tfo
related: DqLe pH6 jyj
related: mwVN oEH g9k
related: vJQk YvC XB7
related: PF4H kQD zpL
related: 4Jty HpK a3Q

Cisco Certified Design Professional/CCDP
type: Concept
in scheme: JobTech Taxonomy - Färdighet
definition: Cisco Certified Design Professional/CCDP
alternative label: CCDP
alternative label: Cisco Certified Design Professional
broader: s48H Sft DTn
related: BAeH eg8 T2d
related: Fv7d YhP YmS
related: VCpu 5EN bBt
related: fWrt sLg koW
related: 4Jty HpK a3Q
related: 13md uyV BNG

Kalkylering
type: Concept
in scheme: JobTech Taxonomy - Färdighet
definition: Kalkylering
broader: zmYu aAM TuF
related: 8A1f sxQ adT
related: 48KE fDE ryL
related: thZP oR7 WrY
related: 33Nt DSs YYA
related: dUuh wwa FGj
related: 85cq 6uK 4cK

Sminkning, Film/TV
type: Concept
in scheme: JobTech Taxonomy - Färdighet
definition: Sminka/göra make-up på skådespelare inom film- eller Tv-produktioner.
alternative label: Sminkning, Film
alternative label: Sminkning, TV
broader: zmYu aAM TuF
related: ezKk kss CiQ

Fastighetsjour
type: Concept
in scheme: JobTech Taxonomy - Färdighet
definition: Fastighetsjour
broader: zmYu aAM TuF
related: iqZh 3yX i8n

AV-teknik
type: Concept
in scheme: JobTech Taxonomy - Färdighet
definition: AV-teknik
broader: zmYu aAM TuF
related: 4BsK q2C sCL
related: CkRH 4Qn iX3
related: 4Jty HpK a3Q

Radon
type: Concept
in scheme: JobTech Taxonomy - Färdighet
definition: Radon
broader: zmYu aAM TuF
related: puim 6PY DGj
related: rE1E m3d cx1
related: nuXg Wjc JPd

Ledarskapsutveckling
type: Concept
in scheme: JobTech Taxonomy - Färdighet
definition: Ledarskapsutveckling
broader: zmYu aAM TuF
related: Qo7p wjf gtv
related: mNoS AN5 drn
related: vPP6 rsw dck
related: bjqk F3A 5Hk

Certifierad innovationsledare
type: Concept
in scheme: JobTech Taxonomy - Färdighet
definition: Certifierad innovationsledare
broader: s48H Sft DTn
related: Qo7p wjf gtv

Konsthistoria
type: Concept
in scheme: JobTech Taxonomy - Färdighet
definition: Konsthistoria
broader: zmYu aAM TuF
related: wVfo Njx 1rB
related: Qbvf 6nd Esn

Cyklar
type: Concept
in scheme: JobTech Taxonomy - Färdighet
definition: Cyklar avser fordon som drivs genom mänsklig kraft och används för transport och motion. Denna kompetens kan omfatta kunskaper om cykeltyp, användning och underhåll samt insikt i tillgängliga produkter och tjänster relaterade till cyklar.
broader: zmYu aAM TuF
related: Lzpv ofL 3H5
related: YKL2 FCB 1yr
related: M47D MU2 dhS

Komposition, jazz
type: Concept
in scheme: JobTech Taxonomy - Färdighet
definition: Komposition, jazz
broader: zmYu aAM TuF
related: AWJF wqZ va9

A+, hårdvarucertifikat
type: Concept
in scheme: JobTech Taxonomy - Färdighet
definition: A+, hårdvarucertifikat
broader: s48H Sft DTn
related: Fv7d YhP YmS
related: hmaC cfi UKg
related: 1CX5 mZw Vcq
related: VCpu 5EN bBt
related: fWrt sLg koW
related: 13md uyV BNG
related: UXKZ 3zZ ipB

Projektering av vindkraft
type: Concept
in scheme: JobTech Taxonomy - Färdighet
definition: Projektering av vindkraft
broader: zmYu aAM TuF
related: rE1E m3d cx1
related: yXbD NTH ijE
related: PRQn 9yw NJA

Grovstyckningsvana
type: Concept
in scheme: JobTech Taxonomy - Färdighet
definition: Grovstyckningsvana
broader: zmYu aAM TuF
related: QqHf XKZ eyy

Förvaltningsekonomi
type: Concept
in scheme: JobTech Taxonomy - Färdighet
definition: Förvaltningsekonomi
broader: zmYu aAM TuF
related: WZCM nfS eAk

Fasadglasning
type: Concept
in scheme: JobTech Taxonomy - Färdighet
definition: Fasadglasning
broader: zmYu aAM TuF
related: J17g Q2a 2u1

Yrkesutbildning, klövvårdare
type: Concept
in scheme: JobTech Taxonomy - Färdighet
definition: Yrkesutbildning, klövvårdare är en yrkeshögskoleutbildning med inriktning till klövvårdare.
broader: Yrkesutbildning
related: KYmy iqC xiQ

Aktivitet och hälsa för barn och unga personer, specialistområde för arbetsterapeut
type: Concept
in scheme: JobTech Taxonomy - Färdighet
definition: Ett specialistområde och en fördjupad specialistkompetens för arbetsterapeut inom aktivitet och hälsa för barn och unga personer.
broader: Specialistområde för arbetsterapeut
related: TPH4 2AM isT

Sitevision, CMS
type: Concept
in scheme: JobTech Taxonomy - Färdighet
definition: Sitevision, CMS/innehållshanteringssystem
alternative label: Sitevision, innehållshanteringssystem
broader: jTAz uCP RNc
related: BAeH eg8 T2d
related: cBBa ngH fCx
related: Fv7d YhP YmS
related: vPP6 rsw dck
related: oEmP NC1 sXE
related: 4Jty HpK a3Q
related: MYAz x9m 2LJ

Kärnkraftanläggning, underhåll
type: Concept
in scheme: JobTech Taxonomy - Färdighet
definition: Kärnkraftanläggning, underhåll
broader: zmYu aAM TuF
related: Cppd 9P7 HeR

Batteriladdning
type: Concept
in scheme: JobTech Taxonomy - Färdighet
definition: Batteriladdning
broader: zmYu aAM TuF
related: DxiF hTo b3X

Ventilationsteknik
type: Concept
in scheme: JobTech Taxonomy - Färdighet
definition: Ventilationsteknik
broader: zmYu aAM TuF
related: K8yg U4C gkY
related: yXbD NTH ijE
related: Cppd 9P7 HeR
related: PRQn 9yw NJA
related: 4Jty HpK a3Q

Lönesystem
type: Concept
in scheme: JobTech Taxonomy - Färdighet
definition: Lönesystem
broader: zmYu aAM TuF
related: L7eh ihX vM5
related: oEmP NC1 sXE
related: ij8k EwC zyB
related: 4Jty HpK a3Q

Direktmarknadsföring, design
type: Concept
in scheme: JobTech Taxonomy - Färdighet
definition: Direktmarknadsföring, design
broader: zmYu aAM TuF
related: 8Bmh vtM zts

Varuvärdering
type: Concept
in scheme: JobTech Taxonomy - Färdighet
definition: Varvuärdering avser kompetens att bedöma och dokumentera marknadsvärde på föremål inför försäljning, så som vid auktion. Kompetensen omfattar kunskap om olika objektkategorier (till exempel konst, antikviteter, samlarföremål, möbler eller fordon), förståelse för hur efterfrågan och trender påverkar priset samt förmåga att tolka tidigare försäljningsstatistik och prisjämförelser.
broader: zmYu aAM TuF
related: Ru4W zn2 LEz
related: dUuh wwa FGj
related: JAFv ZaP tDG

Skötsel av fordonstvätt
type: Concept
in scheme: JobTech Taxonomy - Färdighet
definition: Skötsel av fordonstvätt avser de åtgärder och rutiner som används för att säkerställa renlighet och underhåll av fordonstvättsanläggningar. Denna kompetens innefattar kunskaper om olika tvättsystem och kemikalier samt hantering av avfall och säkerhet vid rengöringsprocesser.
broader: zmYu aAM TuF
related: JnTF wXr 6Eh
related: FjdF H2e tAG

CANT-Auktorisation (auktorisation för kabel-TV)
type: Concept
in scheme: JobTech Taxonomy - Färdighet
definition: CANT-Auktorisation (auktorisation för kabel-TV)
broader: Yrkesbevis/examen
related: fWrt sLg koW

Dödsbon med fastighetsbestånd
type: Concept
in scheme: JobTech Taxonomy - Färdighet
definition: Dödsbon med fastighetsbestånd
broader: zmYu aAM TuF
related: zKvJ GnC Szx

Illusionsnummer/Trolleri
type: Concept
in scheme: JobTech Taxonomy - Färdighet
definition: Illusionsnummer/Trolleri
alternative label: Illusionsnummer
alternative label: Trolleri
broader: zmYu aAM TuF
related: iBUL s38 izZ
related: xuSE mtB Mir

Hästskötsel
type: Concept
in scheme: JobTech Taxonomy - Färdighet
definition: Hästskötsel avser den kompetens som omfattar vård, fodring, träning och hantering av hästar för att säkerställa deras hälsa och välbefinnande. Kompetensen inkluderar också kunskaper i uppfödning och avel samt underhåll av utrustning och anläggningar relaterade till hästaffärer.
broader: zmYu aAM TuF
related: KYmy iqC xiQ
related: yXbD NTH ijE

Fartygsbefäl klass IV (behörighet)
type: Concept
in scheme: JobTech Taxonomy - Färdighet
definition: Fartygsbefäl klass IV (behörighet)
broader: Behörigheter, sjöfart
related: kZwz D8K bKs
related: kDnq Q98 sD3

Yrkesbevis, teleskoptruck
type: Concept
in scheme: JobTech Taxonomy - Färdighet
definition: Yrkesbevis, teleskoptruck
broader: Yrkesbevis/examen
related: 3ZtN hhA SM7
related: MrcX RDn N53

Djurbestånd, inventering
type: Concept
in scheme: JobTech Taxonomy - Färdighet
definition: Djurbestånd, inventering
broader: zmYu aAM TuF
related: yXbD NTH ijE
related: e9FK VKh ahW

Postkassörsutbildning
type: Concept
in scheme: JobTech Taxonomy - Färdighet
definition: Postkassörsutbildning
broader: Yrkesbevis/examen
related: FfMN Bw1 qYR
related: WNVp RYe zLX

Turkiskt kök
type: Concept
in scheme: JobTech Taxonomy - Färdighet
definition: Turkiskt kök
broader: zmYu aAM TuF
related: BStc SJh DKG

Pilates, instruktör/Pilates, tränare
type: Concept
in scheme: JobTech Taxonomy - Färdighet
definition: Pilates, instruktör/Pilates, tränare
alternative label: Pilates, instruktör
alternative label: Pilates, tränare
broader: Idrott/aktivitet
related: EA6o N1N QtT

Suzukimetodik, undervisning
type: Concept
in scheme: JobTech Taxonomy - Färdighet
definition: Suzukimetodik, undervisning
broader: zmYu aAM TuF
related: mcRJ kq2 jFr
related: 1CX5 mZw Vcq

Symfonirock
type: Concept
in scheme: JobTech Taxonomy - Färdighet
definition: Symfonirock
broader: p1WM wCw LTd
related: AWJF wqZ va9

Tulldeklaration
type: Concept
in scheme: JobTech Taxonomy - Färdighet
definition: Tulldeklaration
broader: zmYu aAM TuF
related: FKCE Anf zGH

Internationell skatterätt
type: Concept
in scheme: JobTech Taxonomy - Färdighet
definition: Internationell skatterätt
broader: zmYu aAM TuF
related: br6a VVS V3y
related: DZVN v5g Fco
related: JfYV ZGg 6rm

Demensvård
type: Concept
in scheme: JobTech Taxonomy - Färdighet
definition: Demensvård
broader: zmYu aAM TuF
related: BWwk fYX S5B
related: sq3e WVv Fjd
related: 7fNG sve JWU
related: jY19 knH MJp
related: tAJS JNb hDH
related: 5uP5 Ugw aVE

Betongbil, körvana
type: Concept
in scheme: JobTech Taxonomy - Färdighet
definition: Betongbil, körvana avser färdigheten att köra en betongbil för transport av färskbetong till byggarbetsplatser. Kompetensen innefattar förståelse för fordonets egenskaper samt säker hantering av lasten under transport.
broader: zmYu aAM TuF
related: 3MBw pDA P2F

VVS, el, tele Autodesk Revit MEP
type: Concept
in scheme: JobTech Taxonomy - Färdighet
definition: VVS, el, tele Autodesk Revit MEP
broader: mTLu uo2 gq2
related: K8yg U4C gkY
related: nDaB vdy eAy
related: SPYW 7Z1 ShT
related: PRQn 9yw NJA
related: 4Jty HpK a3Q

Kostymer, film/Kostymer, TV
type: Concept
in scheme: JobTech Taxonomy - Färdighet
definition: Kostymer, film/Kostymer, TV
alternative label: Kostymer, TV
alternative label: Kostymer, film
broader: zmYu aAM TuF
related: PH2M uV4 r72

Dokumentärfilm
type: Concept
in scheme: JobTech Taxonomy - Färdighet
definition: Dokumentärfilm
broader: zmYu aAM TuF
related: SgNH hag n9D
related: rYSG 3WJ LmC

Trav, instruktör/Trav, tränare
type: Concept
in scheme: JobTech Taxonomy - Färdighet
definition: Trav, instruktör/Trav, tränare
alternative label: Trav, instruktör
alternative label: Trav, tränare
broader: Idrott/aktivitet
related: EA6o N1N QtT
related: KYmy iqC xiQ

Cisternarbete
type: Concept
in scheme: JobTech Taxonomy - Färdighet
definition: Cisternarbete avser arbete relaterat till installation, underhåll och reparation av cisterner, vilka används för att lagra vätskor. Kompetensen omfattar kunskap om säkerhetsstandarder och procedurer för att hantera och kontrollera cisterner, samt förmåga att utföra inspektioner och reparationer för att säkerställa deras funktion och säkerhet.
broader: zmYu aAM TuF
related: L4hA SJP SFi

Utställningsdesign
type: Concept
in scheme: JobTech Taxonomy - Färdighet
definition: Utställningsdesign
broader: zmYu aAM TuF
related: PF4H kQD zpL

Byggnadsplåtslagning
type: Concept
in scheme: JobTech Taxonomy - Färdighet
definition: Byggnadsplåtslagning
broader: zmYu aAM TuF
related: L4hA SJP SFi
related: bXfo 4hb SXx

Fysisk funktionsnedsättning, omsorgserfarenhet
type: Concept
in scheme: JobTech Taxonomy - Färdighet
definition: Fysisk funktionsnedsättning, omsorgserfarenhet avser insikter och erfarenheter som krävs för att ge adekvat stöd och omsorg till personer med fysiska funktionsnedsättningar. Kompetensen inkluderar förståelse för individuella behov och förmåga att anpassa hjälp och stöd i vardagen.
broader: zmYu aAM TuF
related: BWwk fYX S5B
related: sq3e WVv Fjd
related: jY19 knH MJp
related: 7pz9 eY9 D2s
related: tAJS JNb hDH

Längdskidåkning, instruktör/Längdskidåkning, tränare
type: Concept
in scheme: JobTech Taxonomy - Färdighet
definition: Längdskidåkning, instruktör/Längdskidåkning, tränare
alternative label: Längdskidåkning, instruktör
alternative label: Längdskidåkning, tränare
broader: Idrott/aktivitet
related: EA6o N1N QtT

Kikarmontage
type: Concept
in scheme: JobTech Taxonomy - Färdighet
definition: Kikarmontage
broader: zmYu aAM TuF
related: e6nk AGp y28

Blockflöjt, undervisning musikskola
type: Concept
in scheme: JobTech Taxonomy - Färdighet
definition: Blockflöjt, undervisning musikskola
broader: zmYu aAM TuF
related: mcRJ kq2 jFr

Arborrning, CNC
type: Concept
in scheme: JobTech Taxonomy - Färdighet
definition: Arborrning, CNC
broader: zmYu aAM TuF
related: vaEp iBS c5h
related: 4Jty HpK a3Q

Direktmarknadsföring
type: Concept
in scheme: JobTech Taxonomy - Färdighet
definition: Direktmarknadsföring
broader: zmYu aAM TuF
related: WX67 Pfb WMN

2-års montör
type: Concept
in scheme: JobTech Taxonomy - Färdighet
definition: 2-års montör
broader: Yrkesbevis/examen
related: a75S eLg JWH
related: yyF7 jsW EeP

Ammoniakkylning
type: Concept
in scheme: JobTech Taxonomy - Färdighet
definition: Ammoniakkylning
broader: zmYu aAM TuF
related: fLKb bJ3 69p

Långhårsteknik
type: Concept
in scheme: JobTech Taxonomy - Färdighet
definition: Långhårsteknik
broader: zmYu aAM TuF
related: mwVN oEH g9k
related: LyBp bY6 bZK

Folkbokföring
type: Concept
in scheme: JobTech Taxonomy - Färdighet
definition: Folkbokföring avser registrering av personer i befolkningsregister och dokumentation av deras personuppgifter, inklusive namn, adresser och civilstånd. Kompetensen innebär att hantera och upprätthålla korrekt information för att säkerställa att myndigheter har tillgång till aktuella uppgifter.
broader: zmYu aAM TuF
related: 4W6S 1kA nrv

Svets-/lödarmetoder med verifierad kunskap
type: Concept
in scheme: JobTech Taxonomy - Färdighet
top concept of: JobTech Taxonomy - Färdighet
definition: Svets-/lödarmetoder med verifierad kunskap
alternative label: Svets-/lödarmetoder med verifierad
narrower: EPW, Europeisk plastsvetsare, certifikat
narrower: ELW, Europeisk lasersvetsspecialist, yrkesdiplom
narrower: IWSD, Internationell svetskonstruktör, yrkesdiplom
narrower: EN 13133, Hårdlödning/ISO 13585
narrower: Svets Svart, certifikat
narrower: IWI, Internationell svetsinspektör, yrkesdiplom
narrower: xsv5 dqk LQp
narrower: sM6P 7yB 1sw
narrower: qqjD EVW ohZ
narrower: IWT, Internationell svetstekniker, yrkesdiplom
narrower: Svets Grön, certifikat
narrower: z98j kcf JyA
narrower: IW, Internationell svetsare, yrkesdiplom
narrower: m4uF yGD 3mf

Rullställning
type: Concept
in scheme: JobTech Taxonomy - Färdighet
definition: Rullställning
broader: zmYu aAM TuF
related: 9mJN VwW Xjg
related: AD3U cFH rbe

Kyrkogård, skötselvana
type: Concept
in scheme: JobTech Taxonomy - Färdighet
definition: Kyrkogård, skötselvana avser kunskap och färdighet att underhålla och vårda kyrkogårdar, vilket inkluderar aktiviteter som gräsklippning, plantering av blommor och skötsel av träd och buskar. Kompetensen omfattar även förståelse för kulturhistoriska värden och estetik relaterad till kyrkogårdsanläggningar.
broader: zmYu aAM TuF
related: XBh3 Xrm C4R
related: XurM DVs ggn
related: df9D e6y 61z

Regi, Scen
type: Concept
in scheme: JobTech Taxonomy - Färdighet
definition: Regissera olika scenproduktioner.
broader: zmYu aAM TuF
related: rYSG 3WJ LmC

Lotus-script, programmeringsspråk
type: Concept
in scheme: JobTech Taxonomy - Färdighet
definition: Lotus-script, programmeringsspråk
alternative label: Lotus-script
broader: Datorspråk
related: BAeH eg8 T2d
related: Fv7d YhP YmS
related: D9SL mtn vGM
related: DJh5 yyF hEM
related: 4Jty HpK a3Q

SPARQL, frågespråk
type: Concept
in scheme: JobTech Taxonomy - Färdighet
definition: SPARQL, frågespråk
broader: Datorspråk
related: D9SL mtn vGM
related: DJh5 yyF hEM
related: UxT1 tPF Kbg
related: 4Jty HpK a3Q
related: UXKZ 3zZ ipB

Ovanjordssprängning, anläggningsarbete
type: Concept
in scheme: JobTech Taxonomy - Färdighet
definition: Ovanjordssprängning, anläggningsarbete
broader: xKbn JBn EPE
related: sX9n CWa KVC
related: f71c gjL RDq

Grundlärarexamen årskurs 4–6
type: Concept
in scheme: JobTech Taxonomy - Färdighet
definition: Grundlärarexamen årskurs 4–6
broader: Yrkesbevis/examen
related: oQUQ D11 HPx

Råkostberedning
type: Concept
in scheme: JobTech Taxonomy - Färdighet
definition: Råkostberedning
broader: zmYu aAM TuF
related: BStc SJh DKG
related: tPox ie4 X9X

Maskinskötsel, livsmedelsindustri
type: Concept
in scheme: JobTech Taxonomy - Färdighet
definition: Maskinskötsel, livsmedelsindustri avser kompetens som omfattar driften och övervakningen av maskiner och utrustning som används inom livsmedelssektorn. Detta inkluderar hantering av maskiner för produktion och bearbetning av olika livsmedelsprodukter, vilket kräver kunskap om maskinens funktioner och säkerhet samt grundläggande underhåll.
broader: zmYu aAM TuF
related: yJk6 azD ywF
related: kF59 fge kts
related: icae Y69 H8E
related: gJtZ EBc n2z

Affärssystem, erfarenhet
type: Concept
in scheme: JobTech Taxonomy - Färdighet
definition: Affärssystem, erfarenhet, avser kunskap och praktisk förmåga att använda och implementera affärssystem inom en organisation. Kompetensen omfattar förståelse för systemens funktionalitet och integration i affärsprocesser, vilket kan bidra till att effektivisera och optimera verksamheten.
broader: zmYu aAM TuF
related: q81z 3oD 1qu

Datorspel
type: Concept
in scheme: JobTech Taxonomy - Färdighet
definition: Produktkunskaper om datorspel och tevespel.
alternative label: Dataspel, videospel, tv-spel, gaming
broader: zmYu aAM TuF
related: YKL2 FCB 1yr
related: 4Jty HpK a3Q

Medlemsadministration
type: Concept
in scheme: JobTech Taxonomy - Färdighet
definition: Medlemsadministration
broader: zmYu aAM TuF
related: eQ4M CNm ozj
related: 4Jty HpK a3Q

Metallvävning
type: Concept
in scheme: JobTech Taxonomy - Färdighet
definition: Metallvävning
broader: zmYu aAM TuF
related: vaEp iBS c5h

Selenium, systemutvecklingsverktyg
type: Concept
in scheme: JobTech Taxonomy - Färdighet
definition: Selenium, systemutvecklingsverktyg
alternative label: Selenium
broader: Programmerings- och systemutvecklingsverktyg
related: D9SL mtn vGM
related: 4Jty HpK a3Q

3D-grafik-caligari trueSpace
type: Concept
in scheme: JobTech Taxonomy - Färdighet
definition: 3D-grafik-caligari trueSpace
broader: Programvara för digitalt skapande
related: 8Bmh vtM zts
related: 34Tn BQQ tfo
related: Q5DF juj 8do
related: 4Jty HpK a3Q
related: LeQV umf wUS
related: Mbt6 3ko DiD

Mästarbrev, gravör (blankstick/silver/skylt-stans och stämpelgravör)
type: Concept
in scheme: JobTech Taxonomy - Färdighet
definition: Mästarbrev, gravör (blankstick/silver/skylt-stans och stämpelgravör)
broader: Yrkesbevis/examen
related: nwSm phw sPo
related: aKdV u7V R5j

Kyltak
type: Concept
in scheme: JobTech Taxonomy - Färdighet
definition: Kyltak
broader: zmYu aAM TuF
related: 3g5x Tm7 8QH

Registerhantering
type: Concept
in scheme: JobTech Taxonomy - Färdighet
definition: Registerhantering
broader: zmYu aAM TuF
related: eQ4M CNm ozj
related: 8A1f sxQ adT
related: dUuh wwa FGj
related: NCeZ rSk B4D
related: FfMN Bw1 qYR

Torvupptagning (maskinkörning)
type: Concept
in scheme: JobTech Taxonomy - Färdighet
definition: Torvupptagning (maskinkörning)
broader: zmYu aAM TuF
related: iHrC aRv fVm

Länsveterinärverksamhet
type: Concept
in scheme: JobTech Taxonomy - Färdighet
definition: Länsveterinärverksamhet
broader: zmYu aAM TuF
related: WL4E r4b ek4

Dekormålning
type: Concept
in scheme: JobTech Taxonomy - Färdighet
definition: Dekormålning
broader: zmYu aAM TuF
related: aKdV u7V R5j
related: CSUf ZVM a7Z

Hörhjälpmedel, utprovning och träning
type: Concept
in scheme: JobTech Taxonomy - Färdighet
definition: Hörhjälpmedel, utprovning och träning
broader: zmYu aAM TuF
related: pzch NRY 9ZF
related: e6nk AGp y28
related: 4Jty HpK a3Q

Födoämnesallergi, kunskap om
type: Concept
in scheme: JobTech Taxonomy - Färdighet
definition: Födoämnesallergi, kunskap om
broader: zmYu aAM TuF
related: BStc SJh DKG
related: o1gn FoS fB7
related: Hi9c iTe gHH
related: UjoW meY Zwt

Trappform
type: Concept
in scheme: JobTech Taxonomy - Färdighet
definition: Trappform
broader: zmYu aAM TuF
related: bZ4J riZ zK6
related: 9mJN VwW Xjg

Skyddsombudsutbildning
type: Concept
in scheme: JobTech Taxonomy - Färdighet
definition: Skyddsombudsutbildning
broader: Yrkesbevis/examen
related: Uw64 cuc U3H
related: puim 6PY DGj
related: nuXg Wjc JPd

Licens, SwedSec
type: Concept
in scheme: JobTech Taxonomy - Färdighet
definition: Licens, SwedSec
broader: s48H Sft DTn
related: Bbkh nrm 2J8
related: aQpg E2T cWq
related: pTr9 RBT 9ur
related: FfMN Bw1 qYR

Rock
type: Concept
in scheme: JobTech Taxonomy - Färdighet
definition: Rock
broader: p1WM wCw LTd
related: AWJF wqZ va9

Kirurgi, specialistkompetens för läkare
type: Concept
in scheme: JobTech Taxonomy - Färdighet
definition: Kirurgi, specialistkompetens för läkare
broader: Specialistbevis för läkare
related: nu7c QuB KVQ

Metallkonstruktionsmontage
type: Concept
in scheme: JobTech Taxonomy - Färdighet
definition: Metallkonstruktionsmontage
broader: zmYu aAM TuF
related: TrwQ RXT W8a

Teoretisk filosofi
type: Concept
in scheme: JobTech Taxonomy - Färdighet
definition: Teoretisk filosofi
broader: zmYu aAM TuF
related: sXgV QFg vpb

Biogasteknik
type: Concept
in scheme: JobTech Taxonomy - Färdighet
definition: Biogasteknik
broader: zmYu aAM TuF
related: rwpH 6RA XTT
related: yXbD NTH ijE
related: PRQn 9yw NJA

Lättmatros (behörighet)
type: Concept
in scheme: JobTech Taxonomy - Färdighet
definition: Lättmatros (behörighet)
broader: Behörigheter, sjöfart
related: CbQK 7th Tyf

SAP, applikationsplattform
type: Concept
in scheme: JobTech Taxonomy - Färdighet
definition: SAP, applikationsplattform
alternative label: SAP
broader: Applikationsplattformar
related: BAeH eg8 T2d
related: cBBa ngH fCx
related: D9SL mtn vGM
related: DJh5 yyF hEM
related: UxT1 tPF Kbg
related: 4Jty HpK a3Q
related: UXKZ 3zZ ipB
related: MYAz x9m 2LJ

Godkänd revisor
type: Concept
in scheme: JobTech Taxonomy - Färdighet
definition: Godkänd revisor
broader: Yrkesbevis/examen
related: cRmd 536 pT1

Skoputsning
type: Concept
in scheme: JobTech Taxonomy - Färdighet
definition: Skoputsning
broader: zmYu aAM TuF
related: 4DET dLf iB9

Kyl- och frys- och värmetransporter, körvana
type: Concept
in scheme: JobTech Taxonomy - Färdighet
definition: Kyl- och frys- och värmetransporter, körvana
broader: zmYu aAM TuF
related: 3MBw pDA P2F

Fastighetsbesiktning
type: Concept
in scheme: JobTech Taxonomy - Färdighet
definition: Fastighetsbesiktning är kompetensen att utföra inspektioner och bedömningar av byggnaders tekniska skick, funktion och efterlevnad av regler, oavsett byggnadstyp eller skede. Den innefattar att systematiskt granska strukturer, installationer och ytor för att identifiera brister, risker eller avvikelser, samt dokumentera observationer i opartiska rapporter som underlag för beslut om köp, försäljning, renovering eller underhåll.
broader: zmYu aAM TuF
related: Ru4W zn2 LEz
related: U8HK Jdi GuC

Fastbränsleanläggning, underhåll
type: Concept
in scheme: JobTech Taxonomy - Färdighet
definition: Fastbränsleanläggning, underhåll
broader: zmYu aAM TuF
related: Cppd 9P7 HeR

ATM, teletransmission
type: Concept
in scheme: JobTech Taxonomy - Färdighet
definition: ATM, teletransmission
broader: Transportnätsystem
related: nDaB vdy eAy
related: SPYW 7Z1 ShT
related: 4Jty HpK a3Q

Marktjänst, specialisering för officer
type: Concept
in scheme: JobTech Taxonomy - Färdighet
definition: Marktjänst, specialisering för officer
broader: zmYu aAM TuF
related: dhgR 9jk 95r
related: KiVA anS RJh

Programvara, produktkunskap
type: Concept
in scheme: JobTech Taxonomy - Färdighet
definition: Programvara, produktkunskap
broader: zmYu aAM TuF
related: oXSW fbY XrY
related: YKL2 FCB 1yr
related: 4Jty HpK a3Q

Spel, ATG terminal, lottredovisning
type: Concept
in scheme: JobTech Taxonomy - Färdighet
definition: Spel, ATG terminal, lottredovisning
broader: zmYu aAM TuF
related: JnTF wXr 6Eh
related: YKL2 FCB 1yr
related: s1Qk o98 2o1

Koppar, formgivning
type: Concept
in scheme: JobTech Taxonomy - Färdighet
definition: Koppar, formgivning
broader: zmYu aAM TuF
related: nwSm phw sPo

Trappstädning
type: Concept
in scheme: JobTech Taxonomy - Färdighet
definition: Trappstädning
broader: zmYu aAM TuF
related: Z6TY xDf Yup

Marknadsrätt
type: Concept
in scheme: JobTech Taxonomy - Färdighet
definition: Marknadsrätt
broader: zmYu aAM TuF
related: mp2Y vyC RFV
related: br6a VVS V3y
related: DZVN v5g Fco
related: JfYV ZGg 6rm

MS Team Foundation Server, systemutvecklingsverktyg
type: Concept
in scheme: JobTech Taxonomy - Färdighet
definition: MS Team Foundation Server, systemutvecklingsverktyg
alternative label: MS Team Foundation Server
broader: Programmerings- och systemutvecklingsverktyg
related: D9SL mtn vGM
related: DJh5 yyF hEM
related: 4Jty HpK a3Q
related: MYAz x9m 2LJ

Hjälp på väg (Trafikverkets kravkurs)
type: Concept
in scheme: JobTech Taxonomy - Färdighet
definition: Hjälp på väg (Trafikverkets kravkurs)
broader: Yrkesbevis/examen
related: 3ZtN hhA SM7
related: bZ4J riZ zK6
related: 3MBw pDA P2F

Yoga, instruktör/Yoga, tränare
type: Concept
in scheme: JobTech Taxonomy - Färdighet
definition: Yoga, instruktör/Yoga, tränare innebär att leda och instruera yogaövningar och klasser, samt anpassa träningsprogram för olika nivåer av utövare. Kompetensen omfattar kunskap om olika yogastilar, kroppens anatomi och fysiologi samt metoder för att vägleda deltagare i en trygg och effektiv praktik.
alternative label: Yoga, instruktör
alternative label: Yoga, tränare
broader: Idrott/aktivitet
related: EA6o N1N QtT

Film/effekter-Motion
type: Concept
in scheme: JobTech Taxonomy - Färdighet
definition: Film/effekter-Motion
alternative label: Film-Motion
alternative label: effekter-Motion
broader: Programvara för digitalt skapande
related: 8Bmh vtM zts
related: 4BsK q2C sCL
related: CkRH 4Qn iX3
related: 3J38 DNz YKK
related: PH2M uV4 r72
related: 4Jty HpK a3Q

Lantbruksfrågor
type: Concept
in scheme: JobTech Taxonomy - Färdighet
definition: Lantbruksfrågor
broader: zmYu aAM TuF
related: vPP6 rsw dck
related: rE1E m3d cx1
related: yXbD NTH ijE

Direkttextning
type: Concept
in scheme: JobTech Taxonomy - Färdighet
definition: Direkttextning
broader: zmYu aAM TuF
related: PQDm Z63 zst
related: 4Jty HpK a3Q

Geropsykologi
type: Concept
in scheme: JobTech Taxonomy - Färdighet
definition: Geropsykologi
broader: zmYu aAM TuF
related: VYeq GDF a2g

Koppar, materialkunskap
type: Concept
in scheme: JobTech Taxonomy - Färdighet
definition: Koppar, materialkunskap
broader: Materialkunskap
related: wQ1E Bzk ZyA
related: L4hA SJP SFi
related: bXfo 4hb SXx

Flamenco
type: Concept
in scheme: JobTech Taxonomy - Färdighet
definition: Flamenco
broader: p1WM wCw LTd
related: AWJF wqZ va9

Litteraturhistorisk guidning
type: Concept
in scheme: JobTech Taxonomy - Färdighet
definition: Litteraturhistorisk guidning
broader: zmYu aAM TuF
related: A6X3 efC VNy

Fastighetsinventering
type: Concept
in scheme: JobTech Taxonomy - Färdighet
definition: Fastighetsinventering
broader: zmYu aAM TuF
related: Fghp zje WA8
related: U8HK Jdi GuC

Serieteckning
type: Concept
in scheme: JobTech Taxonomy - Färdighet
definition: Serieteckning
broader: zmYu aAM TuF
related: 34Tn BQQ tfo

Läkemedelsindustri
type: Concept
in scheme: JobTech Taxonomy - Färdighet
definition: Läkemedelsindustri avser den sektor som innefattar forskning, utveckling, tillverkning och distribution av läkemedel och relaterade produkter. Denna kompetens omfattar kunskap om läkemedelsformulering, kvalitetssäkring samt regulatoriska krav.
broader: zmYu aAM TuF
related: rxmK wwM 1NA
related: TMsM oNw j6z
related: QEBd qHu vGr
related: XjcN 5LT bWx
related: WL4E r4b ek4

Mineralogi
type: Concept
in scheme: JobTech Taxonomy - Färdighet
definition: Mineralogi
broader: zmYu aAM TuF
related: yXbD NTH ijE
related: V7Yz 4WV g4z

Nätverksdesign
type: Concept
in scheme: JobTech Taxonomy - Färdighet
definition: Nätverksdesign avser processen att planera och skapa strukturer för nätverkskommunikation inom olika miljöer, inklusive både hårdvaru- och mjukvarukomponenter. Denna kompetens inkluderar praktisk och teoretisk kunskap om nätverksprotokoll, arkitektur och säkerhetslösningar för att bygga effektiva och säkra nätverksstrukturer.
broader: nHDU dpj R9H
related: 1CX5 mZw Vcq
related: VCpu 5EN bBt
related: 4Jty HpK a3Q
related: UXKZ 3zZ ipB

Könsbestämning, kycklingar
type: Concept
in scheme: JobTech Taxonomy - Färdighet
definition: Könsbestämning, kycklingar
broader: zmYu aAM TuF
related: KYmy iqC xiQ

Skyddssystem i fordon
type: Concept
in scheme: JobTech Taxonomy - Färdighet
definition: Skyddssystem i fordon
broader: zmYu aAM TuF
related: Lzpv ofL 3H5
related: a75S eLg JWH

Mästarbrev, handvävare
type: Concept
in scheme: JobTech Taxonomy - Färdighet
definition: Mästarbrev, handvävare
broader: Yrkesbevis/examen
related: aKdV u7V R5j

Programmering
type: Concept
in scheme: JobTech Taxonomy - Färdighet
definition: Programmering avser processen att skriva och utveckla kod för att skapa programvara och applikationer som utför specifika uppgifter eller löser problem. Kompetensen inkluderar förståelse för olika programmeringsspråk, algoritmer, datastrukturer och mjukvaruutvecklingsmetoder.
broader: zmYu aAM TuF
related: nDaB vdy eAy
related: D9SL mtn vGM
related: DJh5 yyF hEM
related: SPYW 7Z1 ShT
related: UxT1 tPF Kbg
related: 4Jty HpK a3Q

Badbevakareutbildning
type: Concept
in scheme: JobTech Taxonomy - Färdighet
definition: Badbevakareutbildning
broader: Yrkesbevis/examen
related: ayQ4 G3W A2w

Lekterapi
type: Concept
in scheme: JobTech Taxonomy - Färdighet
definition: Lekterapi
broader: zmYu aAM TuF
related: Hi9c iTe gHH
related: 5ek3 Cgq WeZ

Flödesekonomi/Supply chain management/SCM
type: Concept
in scheme: JobTech Taxonomy - Färdighet
definition: Flödesekonomi/Supply chain management/SCM
alternative label: Flödesekonomi
alternative label: SCM
alternative label: Supply chain management
broader: zmYu aAM TuF
related: xm5G vGn iyk
related: 4Jty HpK a3Q

Avfallsteknik
type: Concept
in scheme: JobTech Taxonomy - Färdighet
definition: Avfallsteknik
broader: zmYu aAM TuF
related: K8yg U4C gkY
related: yXbD NTH ijE
related: PRQn 9yw NJA

Maskdesign/Perukdesign, Teater
type: Concept
in scheme: JobTech Taxonomy - Färdighet
definition: Skapa/designa masker och peruker för teater-produktioner.
alternative label: Maskdesign Teater
alternative label: Perukdesign Teater
broader: zmYu aAM TuF
related: ezKk kss CiQ

Verksamhetsledning, hår- och skönhetsvård
type: Concept
in scheme: JobTech Taxonomy - Färdighet
definition: Verksamhetsledning, hår- och skönhetsvård
broader: zmYu aAM TuF
related: NQTS fou E6u

Områdesansvar, arbetsmarknadsfrågor
type: Concept
in scheme: JobTech Taxonomy - Färdighet
definition: Områdesansvar, arbetsmarknadsfrågor
broader: zmYu aAM TuF
related: qVHD Hj5 PXh
related: ajwx FvL YuY
related: X1Ac Y9P PJo

ITIL
type: Concept
in scheme: JobTech Taxonomy - Färdighet
definition: Kompetensen avser kunskaper om och tillämpning av ITIL-ramverket för IT-tjänstehantering (ITSM). Det innefattar principer, processer och metoder för att designa, leverera, driva och förbättra IT-tjänster med fokus på kundvärde, kontinuerlig förbättring och samverkan mellan organisation, teknik och leverantörer.
broader: zmYu aAM TuF
related: BAeH eg8 T2d
related: cBBa ngH fCx

Brandväggar
type: Concept
in scheme: JobTech Taxonomy - Färdighet
definition: Brandväggar
broader: zmYu aAM TuF
related: BAeH eg8 T2d
related: 4Jty HpK a3Q

Hem- och konsumentkunskap, undervisning
type: Concept
in scheme: JobTech Taxonomy - Färdighet
definition: Hem- och konsumentkunskap, undervisning
broader: Inriktning på lärarkompetens
related: oQUQ D11 HPx

Yrkesdiplom, försäkringsförmedlare
type: Concept
in scheme: JobTech Taxonomy - Färdighet
definition: Yrkesdiplom, försäkringsförmedlare
broader: Yrkesbevis/examen
related: 9dLz BCK oDA

BBedit, HTML-editor
type: Concept
in scheme: JobTech Taxonomy - Färdighet
definition: BBedit, HTML-editor
alternative label: BBedit
broader: Programmerings- och systemutvecklingsverktyg
related: 8Bmh vtM zts
related: D9SL mtn vGM
related: 4Jty HpK a3Q
related: Mbt6 3ko DiD
related: MYAz x9m 2LJ

Character modelling
type: Concept
in scheme: JobTech Taxonomy - Färdighet
definition: Character modelling
broader: zmYu aAM TuF
related: Q5DF juj 8do
related: 4BsK q2C sCL
related: 4Jty HpK a3Q
related: Mbt6 3ko DiD

Foajéservice/Garderobservice
type: Concept
in scheme: JobTech Taxonomy - Färdighet
definition: Foajéservice/Garderobservice avser den kompetens som innefattar att ta emot och hantera ytterkläder och personliga tillhörigheter från gäster vid evenemang samt att ge service i foajén genom att assistera besökare. Kompetensen kräver kunskaper om kundservice och hantering av klädesplagg samt ansvar för att säkerställa att gästerna upplever en trygg och bekväm atmosfär före och efter deras besök.
alternative label: Foajéservice, Garderobservice
broader: zmYu aAM TuF
related: 9DdK AZY ZNK
related: WNVp RYe zLX

Akutsjukvård, specialistkompetens för läkare
type: Concept
in scheme: JobTech Taxonomy - Färdighet
definition: Akutsjukvård, specialistkompetens för läkare
broader: Specialistbevis för läkare
related: nu7c QuB KVQ

Golv, produktkunskap
type: Concept
in scheme: JobTech Taxonomy - Färdighet
definition: Golv, produktkunskap
broader: zmYu aAM TuF
related: oXSW fbY XrY

Flygtimmar, färre än 250
type: Concept
in scheme: JobTech Taxonomy - Färdighet
definition: Flygtimmar, färre än 250, avser en kompetens där en person har mindre än 250 timmar i flygningstid med luftfartyg. Denna nivå av erfarenhet kan vara relevant för dem som strävar efter att uppnå certifieringar inom pilotyrket eller som har nyss påbörjat sin karriär inom luftfart.
broader: zmYu aAM TuF
related: nuXg Wjc JPd
related: 7n3y FTE qSe

REXX, programmeringsspråk
type: Concept
in scheme: JobTech Taxonomy - Färdighet
definition: REXX, programmeringsspråk
alternative label: REXX
broader: Datorspråk
related: BAeH eg8 T2d
related: Fv7d YhP YmS
related: D9SL mtn vGM
related: DJh5 yyF hEM
related: 4Jty HpK a3Q

Smörgåsar
type: Concept
in scheme: JobTech Taxonomy - Färdighet
definition: Smörgåsar avser en typ av beredning av livsmedel som innefattar olika ingredienser lagda på bröd, övriga ytor eller mellan brödskivor. Kompetensen omfattar kunskap om sammansättning, presentation och variation av smörgåsar.
broader: zmYu aAM TuF
related: BStc SJh DKG
related: YKL2 FCB 1yr
related: 1wqU Jhj amb

Katalogiseringsvana, arkeologiska föremål
type: Concept
in scheme: JobTech Taxonomy - Färdighet
definition: Katalogiseringsvana, arkeologiska föremål
broader: zmYu aAM TuF
related: sXgV QFg vpb

Fiddla
type: Concept
in scheme: JobTech Taxonomy - Färdighet
definition: Fiddla
broader: wLYs CKS wK8
related: AWJF wqZ va9

CROM, redovisningssystem
type: Concept
in scheme: JobTech Taxonomy - Färdighet
definition: CROM, redovisningssystem
alternative label: CROM
broader: xSJR 1Kq pxB
related: eQ4M CNm ozj
related: Y6yY SuR hVh
related: Uw4n UB2 RCW
related: iWcY mko rq2
related: q81z 3oD 1qu
related: cRmd 536 pT1
related: ij8k EwC zyB
related: 4Jty HpK a3Q

Politiskt styrd verksamhet, ledarerfarenhet
type: Concept
in scheme: JobTech Taxonomy - Färdighet
definition: Politiskt styrd verksamhet, ledarerfarenhet
broader: zmYu aAM TuF
related: qVHD Hj5 PXh
related: womV SEj CAH
related: 8SPu K1k 5qR
related: ajwx FvL YuY
related: NxXz fBh w7j
related: ddGt fEH 432
related: wby2 mwq fWV
related: X1Ac Y9P PJo
related: 3i4a Ufc qpp
related: sWzF 6pd Y6L

Kulturjournalistik
type: Concept
in scheme: JobTech Taxonomy - Färdighet
definition: Kulturjournalistik
broader: zmYu aAM TuF
related: SgNH hag n9D

Motormontering
type: Concept
in scheme: JobTech Taxonomy - Färdighet
definition: Motormontering avser processen att montera motorer i olika fordon eller maskiner, vilket inkluderar installation av motorer och relaterade komponenter genom metoder som skruvning, svetsning, lödning, nitning eller limning.
broader: zmYu aAM TuF
related: shkw ojo UL2

Corba, distribuerad objektteknik
type: Concept
in scheme: JobTech Taxonomy - Färdighet
definition: Corba, distribuerad objektteknik
broader: zmYu aAM TuF
related: DJh5 yyF hEM
related: 4Jty HpK a3Q
related: UXKZ 3zZ ipB

Software Virtualization Solution/SVS
type: Concept
in scheme: JobTech Taxonomy - Färdighet
definition: Software Virtualization Solution/SVS
alternative label: SVS
alternative label: Software Virtualization Solution
broader: Programmerings- och systemutvecklingsverktyg
related: D9SL mtn vGM
related: DJh5 yyF hEM
related: 4Jty HpK a3Q
related: MYAz x9m 2LJ

Djurfoder, beredning
type: Concept
in scheme: JobTech Taxonomy - Färdighet
definition: Djurfoder, beredning avser processen för att förbereda och bearbeta foder för djur, vilket innefattar olika metoder och tekniker för att säkerställa att fodret är av hög kvalitet och näringsrikt. Processen involverar hantering av diverse råvaror och maskiner som används för att producera foderprodukter anpassade för olika djurarter.
broader: zmYu aAM TuF
related: yXbD NTH ijE
related: gJtZ EBc n2z

Allmänna datakunskaper
type: Concept
in scheme: JobTech Taxonomy - Färdighet
top concept of: JobTech Taxonomy - Färdighet
definition: Allmänna datakunskaper
narrower: xSLo P6B 2AF
narrower: MS Project
narrower: q6QD 6et rcJ
narrower: Corel WordPerfect Office
narrower: AbiWord
narrower: MS Works
narrower: Think Free
narrower: IBM Lotus Notes
narrower: Kravhantering, systemutveckling
narrower: Movie Magic
narrower: FileMaker Pro
narrower: GNOME Office
narrower: Google Docs
narrower: MS Excel
narrower: XyWrite
narrower: qtHa AsU Cfo
narrower: Apple iWork MAC
narrower: Electronic Data Capture/EDC
narrower: European Computer Driving Licence/ECDL
narrower: MS Access
narrower: jcpA Zfs nSz
narrower: Adobe Acrobat
narrower: Computer Aided Translation/CAT-verktyg
narrower: Zoho Office Suite
narrower: MS Publisher
narrower: w8bU wHe omF
narrower: OpenOffice
narrower: MS Power Point
narrower: MS Word

OCaml, programmeringsspråk
type: Concept
in scheme: JobTech Taxonomy - Färdighet
definition: OCaml, programmeringsspråk
broader: Datorspråk
related: BAeH eg8 T2d
related: cBBa ngH fCx
related: Q5DF juj 8do
related: D9SL mtn vGM
related: DJh5 yyF hEM
related: UxT1 tPF Kbg
related: UXKZ 3zZ ipB

Inflationsanalys
type: Concept
in scheme: JobTech Taxonomy - Färdighet
definition: Inflationsanalys
broader: zmYu aAM TuF
related: WZCM nfS eAk

pSOS, operativsystem
type: Concept
in scheme: JobTech Taxonomy - Färdighet
definition: pSOS, operativsystem
alternative label: pSOS
broader: xAWr WYq JPP
related: BAeH eg8 T2d
related: cBBa ngH fCx
related: D9SL mtn vGM
related: VCpu 5EN bBt
related: DJh5 yyF hEM
related: 4Jty HpK a3Q
related: 13md uyV BNG
related: UXKZ 3zZ ipB
related: MYAz x9m 2LJ

Restaurering, arkitektur
type: Concept
in scheme: JobTech Taxonomy - Färdighet
definition: Restaurering, arkitektur
broader: zmYu aAM TuF
related: XeBP nMe pXx
related: 41KB bfk 5jR

Fordonsinriktning-karosseri och lackering, undervisning
type: Concept
in scheme: JobTech Taxonomy - Färdighet
definition: Fordonsinriktning-karosseri och lackering, undervisning
broader: Inriktning på lärarkompetens
related: 2x2V UeL 6ke

Dataspelsdesign/Game design
type: Concept
in scheme: JobTech Taxonomy - Färdighet
definition: Dataspelsdesign/Game design
broader: zmYu aAM TuF
related: Q5DF juj 8do
related: 4Jty HpK a3Q
related: Mbt6 3ko DiD

Mästarbrev, riggare
type: Concept
in scheme: JobTech Taxonomy - Färdighet
definition: Mästarbrev, riggare
broader: Yrkesbevis/examen
related: vaEp iBS c5h

Behörigheter, sjöfart
type: Concept
in scheme: JobTech Taxonomy - Färdighet
top concept of: JobTech Taxonomy - Färdighet
definition: Behörigheter, sjöfart
narrower: Fartygsbefäl klass VII (behörighet)
narrower: Maskinbefäl klass IV (behörighet)
narrower: Farligt gods, behörighet
narrower: Maskinbefäl klass VI (behörighet)
narrower: Matros, inre fart (behörighet)
narrower: Maskinbefäl klass II (behörighet)
narrower: Basic-SAR
narrower: Lättmatros (behörighet)
narrower: Maskinbefäl klass III (behörighet)
narrower: Begränsat fartygsbefäl klass VIII, inre fart
narrower: Oljelasthantering, behörighet
narrower: Fartygsbefäl klass II (behörighet)
narrower: Fartygsbefäl klass VI (behörighet)
narrower: q4p6 d9U 7D4
narrower: Fartygsbefäl klass III (behörighet)
narrower: Fartygselektriker (behörighet)
narrower: xUT3 aF5 i59
narrower: rYGi DpZ kWM
narrower: Behörighet för Befaren maskinpersonal
narrower: Fartygsbefäl klass VI, inre fart (behörighet)
narrower: Fartygsbefäl klass VII, inre fart (behörighet)
narrower: sYfy ekc ifq
narrower: pYDp S3J AxM
narrower: GOC-behörighet
narrower: Certifikat för fartygskock
narrower: ROC-behörighet
narrower: Maskinbefäl klass VII (behörighet)
narrower: Sjökapten (behörighet)
narrower: Fartygseltekniker, ETO (behörighet)
narrower: Maskinbefäl klass VIII, behörighet
narrower: Gaslasthantering, behörighet
narrower: Matros (behörighet)
narrower: Motorman (behörighet)
narrower: Fartygsbefäl klass VIII (behörighet)
narrower: Sjöingenjör (behörighet)
narrower: pvoJ tqz rnN
narrower: Fartygsbefäl klass IV (behörighet)
narrower: kwir 9Jv apf

Tandställningar, specialisering tandteknik
type: Concept
in scheme: JobTech Taxonomy - Färdighet
definition: Tandställningar, specialisering tandteknik
broader: zmYu aAM TuF
related: 39yB xPQ ozd

Terminal- och lagerarbete
type: Concept
in scheme: JobTech Taxonomy - Färdighet
definition: Terminal- och lagerarbete avser aktiviteter som utförs för att hantera, lagra och distribuera varor på terminaler och lager. Kompetensen omfattar registrering, kontroll och styrning av material- och varuflöden, samt planering och genomförande av leveranser och lagerhållning.
broader: zmYu aAM TuF
related: WhBn FAp ZNW
related: iWcY mko rq2
related: kLyY rwr aJr
related: MrcX RDn N53
related: 4Jty HpK a3Q

Friktionssvetsning
type: Concept
in scheme: JobTech Taxonomy - Färdighet
definition: Friktionssvetsning ger ingen fullständig uppsmältning av fogytorna. De delar som ska sammanfogas roteras/gnids mot varandra under högt tryck. Källa: Svetskommissionen
broader: on11 B1f LEw
related: vaEp iBS c5h

Clowneri
type: Concept
in scheme: JobTech Taxonomy - Färdighet
definition: Clowneri
broader: zmYu aAM TuF
related: xuSE mtB Mir

ADRS (diesel i skogen)
type: Concept
in scheme: JobTech Taxonomy - Färdighet
definition: ADRS (diesel i skogen)
broader: s48H Sft DTn
related: Lzpv ofL 3H5
related: KwVo sQu G2e

Webbdesign-Wordpress
type: Concept
in scheme: JobTech Taxonomy - Färdighet
definition: Webbdesign-Wordpress
broader: Programvara för digitalt skapande
related: 8Bmh vtM zts
related: 4Jty HpK a3Q
related: Mbt6 3ko DiD

Flamencodans
type: Concept
in scheme: JobTech Taxonomy - Färdighet
definition: Flamencodans
broader: Dans
related: gmRr 7tt eHj

Kostrådgivning
type: Concept
in scheme: JobTech Taxonomy - Färdighet
definition: Kostrådgivning avser kompetens inom att ge råd och vägledning om kost och näring för att stödja individers hälsa och välbefinnande. Denna kompetens innebär att kunna analysera kostvanor, rekommendera lämpliga kosthållningar och bidra till en förbättrad livsstil baserat på individens behov och mål.
broader: zmYu aAM TuF
related: FpPP jqK xzT
related: Z2MZ eYc Lfv
related: EA6o N1N QtT
related: Pq5C SPC bRA
related: aA2Z 9XX R1v

Yrkeskompetensbevis för förare (YKB)
type: Concept
in scheme: JobTech Taxonomy - Färdighet
definition: Lagen om yrkeskompetensbevis omfattar förare som utför gods- eller persontransporter med C- eller D-behörighet. Lagen innebär bland annat krav på godkänd grundutbildning. Därefter krävs att föraren går en återkommande fortbildning vart 5:e år för att förnya beviset.
broader: Yrkesbevis/examen
related: FiDm 2S8 gx7
related: ayQ4 G3W A2w
related: 3MBw pDA P2F

Ljud-Sony Creative Software ACID Pro
type: Concept
in scheme: JobTech Taxonomy - Färdighet
definition: Ljud-Sony Creative Software ACID Pro
broader: Programvara för digitalt skapande
related: SgNH hag n9D
related: 4BsK q2C sCL
related: CkRH 4Qn iX3
related: 3J38 DNz YKK
related: PH2M uV4 r72
related: 4Jty HpK a3Q

Lyftplattformar
type: Concept
in scheme: JobTech Taxonomy - Färdighet
definition: Lyftplattformar
broader: zmYu aAM TuF
related: Lzpv ofL 3H5
related: iGTu bYL 2T7
related: KttZ Skc bMR

Barn- och fritidskunskap, undervisning
type: Concept
in scheme: JobTech Taxonomy - Färdighet
definition: Barn- och fritidskunskap, undervisning
broader: Inriktning på lärarkompetens
related: 2x2V UeL 6ke

Vägassistans
type: Concept
in scheme: JobTech Taxonomy - Färdighet
definition: Vägassistans avser tjänster och stöd som ges till fordonsförare vid driftstopp eller olyckor på vägar. Detta innebär ofta insatser för att bärga fordon, reparera mindre fel på plats samt ge vägledning och säkerhet till förarna.
broader: zmYu aAM TuF
related: 3MBw pDA P2F

Varumärkesrätt
type: Concept
in scheme: JobTech Taxonomy - Färdighet
definition: Varumärkesrätt
broader: zmYu aAM TuF
related: q8wL kdi WaW
related: mp2Y vyC RFV
related: br6a VVS V3y
related: 6aak 8eh iwT
related: DZVN v5g Fco

Produktplanering
type: Concept
in scheme: JobTech Taxonomy - Färdighet
definition: Produktplanering
broader: zmYu aAM TuF
related: mis4 feV uex
related: xm5G vGn iyk
related: 8A1f sxQ adT
related: v9nU 6Fw 4Qg
related: qn2U dB9 Cmh
related: mp2Y vyC RFV
related: K8yg U4C gkY
related: nDaB vdy eAy
related: 33Nt DSs YYA
related: AuTi FEo j3R
related: SPYW 7Z1 ShT
related: PRQn 9yw NJA

Rörvalsning
type: Concept
in scheme: JobTech Taxonomy - Färdighet
definition: Rörvalsning avser processen att forma metallrör genom valsningsteknik, där metallen bearbetas och formas till önskad dimension och geometri. Denna kompetens involverar kunskap om och skicklighet i att ställa in och optimera valsverk för att producera rör med specifika egenskaper och kvaliteter.
broader: zmYu aAM TuF
related: m8TS hdk pSf

Hjärt- och lungräddning
type: Concept
in scheme: JobTech Taxonomy - Färdighet
definition: Hjärt- och lungräddning
broader: zmYu aAM TuF
related: FpPP jqK xzT
related: EA6o N1N QtT
related: idjo 2Wr a3E
related: ayQ4 G3W A2w
related: 9DdK AZY ZNK
related: aA2Z 9XX R1v
related: ieVp d5L rS9

Säkerhetsprövning enligt Säkerhetsskyddslag (2018:585)
type: Concept
in scheme: JobTech Taxonomy - Färdighet
definition: Säkerhetsprövning ska göras innan en person deltar i verksamhet som har betydelse för Sveriges säkerhet. Prövningen ska klarlägga om personen kan antas vara lojal mot de intressen som skyddas i lagen och i övrigt är pålitlig ur säkerhetssynpunkt. Källa: Arbetsgivarverket
broader: zmYu aAM TuF
related: bjqk F3A 5Hk
related: nuXg Wjc JPd

Riskbedömningar, försäkring
type: Concept
in scheme: JobTech Taxonomy - Färdighet
definition: Riskbedömningar, försäkring
broader: zmYu aAM TuF
related: Ru4W zn2 LEz
related: ZA1N Z2B nFQ
related: 9dLz BCK oDA

Maskinformning
type: Concept
in scheme: JobTech Taxonomy - Färdighet
definition: Maskinformning
broader: zmYu aAM TuF
related: aKdV u7V R5j
related: J9Vz JxJ Bji

Dockmakeri
type: Concept
in scheme: JobTech Taxonomy - Färdighet
definition: Dockmakeri avser tillverkning och reparation av dockor, vilket kan inkludera både konstnärliga och funktionella aspekter. Kompetensen omfattar kunskap om materialval, formgivning och tekniker för skapande av dockor i olika storlekar och stilar.
broader: zmYu aAM TuF
related: iBUL s38 izZ
related: aKdV u7V R5j

Statsvetenskap
type: Concept
in scheme: JobTech Taxonomy - Färdighet
definition: Statsvetenskap
broader: zmYu aAM TuF
related: sXgV QFg vpb
related: ZQiZ 6Kd D3a
related: WZCM nfS eAk

Städmaterial
type: Concept
in scheme: JobTech Taxonomy - Färdighet
definition: Städmaterial
broader: zmYu aAM TuF
related: oXSW fbY XrY
related: o1gn FoS fB7
related: Z6TY xDf Yup

Säkerhetsdörrar, monteringsvana
type: Concept
in scheme: JobTech Taxonomy - Färdighet
definition: Säkerhetsdörrar, monteringsvana
broader: zmYu aAM TuF
related: Kxm9 N3V shF

Tak- och fasadisolering
type: Concept
in scheme: JobTech Taxonomy - Färdighet
definition: Tak- och fasadisolering
broader: zmYu aAM TuF
related: yXbD NTH ijE
related: cGxX R9c kW1

CMAS One Star Instructor
type: Concept
in scheme: JobTech Taxonomy - Färdighet
definition: CMAS One Star Instructor är grundläggande instruktörsutbildning inom dykning. I begreppet ingår kunskapen att lära ut grundläggande dykteknik och säkerhetsrutiner.
broader: s48H Sft DTn
related: EA6o N1N QtT

Emacs, texteditor
type: Concept
in scheme: JobTech Taxonomy - Färdighet
definition: Emacs, texteditor
alternative label: Emacs
broader: Programmerings- och systemutvecklingsverktyg
related: 8Bmh vtM zts
related: D9SL mtn vGM
related: DJh5 yyF hEM
related: 4Jty HpK a3Q
related: Mbt6 3ko DiD
related: MYAz x9m 2LJ

Tackjärnshantering
type: Concept
in scheme: JobTech Taxonomy - Färdighet
definition: Tackjärnshantering
broader: zmYu aAM TuF
related: E87t egE pjA
related: UcNa inr snV

Kontroll av rese- och identitetshandlingar
type: Concept
in scheme: JobTech Taxonomy - Färdighet
definition: Kontroll av rese- och identitetshandlingar innebär förmågan att granska och verifiera pass, ID-kort, visum och andra resehandlingars äkthet och giltighet. Detta innefattar kunskap om säkerhetsdetaljer, vattenstämplar, hologram och andra skyddsmekanismer som används för att förhindra förfalskning.
broader: zmYu aAM TuF
related: vPP6 rsw dck
related: FKCE Anf zGH
related: rNcE Zno pD8
related: iqZh 3yX i8n

Socioterapi, metodkunskap
type: Concept
in scheme: JobTech Taxonomy - Färdighet
definition: Socioterapi, metodkunskap
broader: zmYu aAM TuF
related: 7fNG sve JWU

Mästarbrev, krukmakare
type: Concept
in scheme: JobTech Taxonomy - Färdighet
definition: Mästarbrev, krukmakare
broader: Yrkesbevis/examen
related: aKdV u7V R5j

Ada, programmeringsspråk
type: Concept
in scheme: JobTech Taxonomy - Färdighet
definition: Ada, programmeringsspråk
alternative label: Ada
alternative label: Adautveckling
broader: Datorspråk
related: BAeH eg8 T2d
related: Fv7d YhP YmS
related: D9SL mtn vGM
related: DJh5 yyF hEM
related: 4Jty HpK a3Q

Agresso, redovisningssystem
type: Concept
in scheme: JobTech Taxonomy - Färdighet
definition: Agresso, redovisningssystem
alternative label: Agresso
alternative label: Agressokompetens
broader: xSJR 1Kq pxB
related: eQ4M CNm ozj
related: Uw4n UB2 RCW
related: iWcY mko rq2
related: cRmd 536 pT1
related: ij8k EwC zyB
related: 4Jty HpK a3Q

Bildprojektor, installation och underhåll
type: Concept
in scheme: JobTech Taxonomy - Färdighet
definition: Bildprojektor, installation och underhåll
broader: Hårdvara
related: VCpu 5EN bBt
related: 4BsK q2C sCL
related: 4Jty HpK a3Q

Rundslipning
type: Concept
in scheme: JobTech Taxonomy - Färdighet
definition: Rundslipning
broader: zmYu aAM TuF
related: 4bxV 58E P9N

Informationssökning
type: Concept
in scheme: JobTech Taxonomy - Färdighet
definition: Informationssökning avser processen att aktivt söka, hitta och samla in information från olika källor för att uppnå ett specifikt syfte eller besvara en fråga. Kompetensen omfattar förmåga att använda olika informationskällor och söktekniker effektivt för att erhålla relevant och tillförlitlig information.
broader: Yrkesövergripande kompetenser
related: 4Jty HpK a3Q

Arbetsledarerfarenhet
type: Concept
in scheme: JobTech Taxonomy - Färdighet
definition: Arbetsledarerfarenhet avser den erfarenhet och de färdigheter som krävs för att leda och övervaka arbete i en grupp eller organisation. Kompetensen omfattar förmåga att planera, organisera och styra uppgifter samt att motivera och stödja medarbetare för att uppnå gemensamma mål.
broader: Yrkesövergripande kompetenser
related: WhBn FAp ZNW
related: UjoW meY Zwt
related: 1Tso 4TB RkE

35 mm film
type: Concept
in scheme: JobTech Taxonomy - Färdighet
definition: 35 mm film
broader: zmYu aAM TuF
related: 4BsK q2C sCL
related: CkRH 4Qn iX3
related: 3J38 DNz YKK

Kriminalvårdens grundutbildning
type: Concept
in scheme: JobTech Taxonomy - Färdighet
definition: Utbildningen ger kunskaper om Kriminalvårdens organisation, vad det innebär att arbeta som Kriminalvårdare, reglerna som styr verksamheten och arbetsmetoder.
broader: Yrkesbevis/examen
related: hgAg gLr YGg

Matjournalistik
type: Concept
in scheme: JobTech Taxonomy - Färdighet
definition: Matjournalistik
broader: zmYu aAM TuF
related: SgNH hag n9D

Vätgasteknik
type: Concept
in scheme: JobTech Taxonomy - Färdighet
definition: Vätgasteknik
broader: zmYu aAM TuF
related: v9nU 6Fw 4Qg
related: K8yg U4C gkY
related: yXbD NTH ijE
related: Cppd 9P7 HeR
related: PRQn 9yw NJA

IANA/ICANN, bestämmelser och rekommendationer
type: Concept
in scheme: JobTech Taxonomy - Färdighet
definition: IANA/ICANN, bestämmelser och rekommendationer
broader: zmYu aAM TuF
related: cBBa ngH fCx
related: D9SL mtn vGM
related: VCpu 5EN bBt
related: DJh5 yyF hEM
related: 4Jty HpK a3Q
related: UXKZ 3zZ ipB
related: MYAz x9m 2LJ

Vattenbruksteknik
type: Concept
in scheme: JobTech Taxonomy - Färdighet
definition: Vattenbruksteknik avser tillämpning av teknologier och metoder för att producera, odla och sköta vattenlevande organismer, såsom fisk och skaldjur, på ett hållbart sätt. Kompetensen fokuserar på att optimera produktionsprocesser samt minimera negativa miljöpåverkan genom användning av effektiva och miljövänliga metoder inom vattenbruk.
broader: zmYu aAM TuF
related: c8r8 e4L gwj
related: puim 6PY DGj
related: rE1E m3d cx1
related: yXbD NTH ijE
related: e9FK VKh ahW

Behörighet Ansvarig brunnsborrare med svetsintyg (ABS)
type: Concept
in scheme: JobTech Taxonomy - Färdighet
definition: Behörighet Ansvarig brunnsborrare med svetsintyg (ABS)
broader: s48H Sft DTn
related: 7zKm 4NW eey

Virkeskontraktering
type: Concept
in scheme: JobTech Taxonomy - Färdighet
definition: Virkeskontraktering
broader: zmYu aAM TuF
related: 3LdB WEJ 8Ms

Sprutisolering
type: Concept
in scheme: JobTech Taxonomy - Färdighet
definition: Sprutisolering
broader: zmYu aAM TuF
related: yXbD NTH ijE
related: cGxX R9c kW1

C#, programmeringsspråk
type: Concept
in scheme: JobTech Taxonomy - Färdighet
definition: C#, programmeringsspråk
alternative label: C #
alternative label: C#
alternative label: C-sharp
alternative label: Csharp
broader: Datorspråk
related: BAeH eg8 T2d
related: Fv7d YhP YmS
related: Q5DF juj 8do
related: D9SL mtn vGM
related: DJh5 yyF hEM
related: 4Jty HpK a3Q

Turbinkonstruktion
type: Concept
in scheme: JobTech Taxonomy - Färdighet
definition: Turbinkonstruktion
broader: zmYu aAM TuF
related: K8yg U4C gkY
related: PRQn 9yw NJA

Pälsreparationer
type: Concept
in scheme: JobTech Taxonomy - Färdighet
definition: Pälsreparationer avser kompetensen att laga och underhålla plagg tillverkade av päls, vilket kan inkludera reparation av skador, justeringar och omdesign av pälskläder. Kompetensen innebär även kunskap om olika typer av pälsmaterial och tekniker för att återskapa plaggets ursprungliga utseende och funktion.
broader: zmYu aAM TuF
related: mwVN oEH g9k

Brandskadebesiktning, privat
type: Concept
in scheme: JobTech Taxonomy - Färdighet
definition: Brandskadebesiktning, privat
broader: zmYu aAM TuF
related: Ru4W zn2 LEz

F
type: Concept
in scheme: JobTech Taxonomy - Färdighet
definition: F#.NET, programmeringsspråk
alternative label: F #
alternative label: F sharp
alternative label: F#
alternative label: F#.NET
alternative label: F-sharp
broader: Datorspråk
related: BAeH eg8 T2d
related: Fv7d YhP YmS
related: D9SL mtn vGM
related: DJh5 yyF hEM
related: 4Jty HpK a3Q

Java, programmeringsspråk
type: Concept
in scheme: JobTech Taxonomy - Färdighet
definition: Java, programmeringsspråk
alternative label: Java
alternative label: Java-programmering
alternative label: Java-utveckling
alternative label: Javakompetens
alternative label: Javakunskap
alternative label: Javaprogrammering
alternative label: Javautveckling
broader: Datorspråk
related: BAeH eg8 T2d
related: Fv7d YhP YmS
related: D9SL mtn vGM
related: DJh5 yyF hEM
related: 4Jty HpK a3Q

Radiojournalistik
type: Concept
in scheme: JobTech Taxonomy - Färdighet
definition: Radiojournalistik
broader: zmYu aAM TuF
related: SgNH hag n9D

Gesällbrev, möbelrenoverare
type: Concept
in scheme: JobTech Taxonomy - Färdighet
definition: Gesällbrev, möbelrenoverare
broader: Yrkesbevis/examen
related: 34Tn BQQ tfo
related: 1Nwn GYH wkH

Sprängning, jord- och skogsbruk
type: Concept
in scheme: JobTech Taxonomy - Färdighet
definition: Sprängning, jord- och skogsbruk
broader: xKbn JBn EPE
related: f71c gjL RDq

Design/Visualisering-Rhinoceros
type: Concept
in scheme: JobTech Taxonomy - Färdighet
definition: Design/Visualisering-Rhinoceros
alternative label: Design-Rhinoceros
alternative label: Visualisering-Rhinoceros
broader: mTLu uo2 gq2
related: DqLe pH6 jyj
related: K8yg U4C gkY
related: SgNH hag n9D
related: Pd51 xnr KCY
related: PRQn 9yw NJA
related: zfve s6G tpc
related: ETAR ggZ Wuw
related: 41KB bfk 5jR
related: PF4H kQD zpL
related: 4Jty HpK a3Q

Foliering
type: Concept
in scheme: JobTech Taxonomy - Färdighet
definition: Foliering
broader: zmYu aAM TuF
related: FjdF H2e tAG

Certifierad kostrådgivare
type: Concept
in scheme: JobTech Taxonomy - Färdighet
definition: Certifierad kostrådgivare uppfyller Branschrådet för hälsas kompetenskrav för att bli certifierad.
broader: s48H Sft DTn
related: FpPP jqK xzT

Underjordsbrytning
type: Concept
in scheme: JobTech Taxonomy - Färdighet
definition: Underjordsbrytning
broader: zmYu aAM TuF
related: sX9n CWa KVC
related: f71c gjL RDq

Industri, undervisning
type: Concept
in scheme: JobTech Taxonomy - Färdighet
definition: Industri, undervisning
broader: Inriktning på lärarkompetens
related: 2x2V UeL 6ke

Idrottslärarexamen
type: Concept
in scheme: JobTech Taxonomy - Färdighet
definition: Idrottslärarexamen
broader: Yrkesbevis/examen
related: 2x2V UeL 6ke
related: 4KhP FxL uZ5
related: oQUQ D11 HPx

Porträttfotografering
type: Concept
in scheme: JobTech Taxonomy - Färdighet
definition: Porträttfotografering
broader: zmYu aAM TuF
related: 3J38 DNz YKK

Level design
type: Concept
in scheme: JobTech Taxonomy - Färdighet
definition: Level design
broader: zmYu aAM TuF
related: 4Jty HpK a3Q
related: Mbt6 3ko DiD