Taxiförare
type: Concept
in scheme: JobTech Taxonomy - Yrkesbarometeryrken
top concept of: JobTech Taxonomy - Yrkesbarometeryrken
definition: Barometeryrke för Taxiförare.
related: 7FqZ 2r8 CEN

Grovarbetare inom bygg och anläggning
type: Concept
in scheme: JobTech Taxonomy - Yrkesbarometeryrken
top concept of: JobTech Taxonomy - Yrkesbarometeryrken
definition: Barometeryrke för Grovarbetare inom bygg och anläggning.
related: 3uEE 35U U6j
related: qot1 qJ1 kec

Djursjukskötare
type: Concept
in scheme: JobTech Taxonomy - Yrkesbarometeryrken
top concept of: JobTech Taxonomy - Yrkesbarometeryrken
definition: Barometeryrke för Djursjukskötare.
related: 8Vew BX8 97h

Kallskänkor
type: Concept
in scheme: JobTech Taxonomy - Yrkesbarometeryrken
top concept of: JobTech Taxonomy - Yrkesbarometeryrken
definition: Barometeryrke för Kallskänkor.
related: iLgH g2C 2KH
related: JECy 3w6 gah

Fastighetstekniker
type: Concept
in scheme: JobTech Taxonomy - Yrkesbarometeryrken
top concept of: JobTech Taxonomy - Yrkesbarometeryrken
definition: Barometeryrke för Fastighetstekniker.
related: mbDn h6o Tuy

Hamnarbetare
type: Concept
in scheme: JobTech Taxonomy - Yrkesbarometeryrken
top concept of: JobTech Taxonomy - Yrkesbarometeryrken
definition: Barometeryrke för Hamnarbetare.
related: dUfE XG7 TGZ

Ställningsbyggare (med yrkesbevis/certifikat)
type: Concept
in scheme: JobTech Taxonomy - Yrkesbarometeryrken
top concept of: JobTech Taxonomy - Yrkesbarometeryrken
definition: Barometeryrke för Ställningsbyggare (med yrkesbevis/certifikat).
related: cQd3 2n5 cpN

Svetsare och gasskärare
type: Concept
in scheme: JobTech Taxonomy - Yrkesbarometeryrken
top concept of: JobTech Taxonomy - Yrkesbarometeryrken
definition: Barometeryrke för Svetsare och gasskärare.
related: 7m9j eBh GeH
related: 1vrZ JJL fLC
related: rxrQ Nyy k6y
related: 9KrJ 9W8 KtX

Speciallärare och specialpedagoger
type: Concept
in scheme: JobTech Taxonomy - Yrkesbarometeryrken
top concept of: JobTech Taxonomy - Yrkesbarometeryrken
definition: Barometeryrke för Speciallärare och specialpedagoger.
related: Curv dHm 3dZ
related: cztk vjQ Jyo
related: Tyia uZN ZSc
related: yhF2 vDD WB9
related: hhzp fKU NQ2
related: f1zq tpA QtN
related: dhXy 7Te Tzb
related: zgdJ VBy xLX
related: ViNH ews HsT
related: guie fEy nt1
related: wgpx nrT Wd7
related: Q4cY dFt 9ou
related: BgiX vEt 6Ko

Montörer av metall-, gummi- och plastprodukter
type: Concept
in scheme: JobTech Taxonomy - Yrkesbarometeryrken
top concept of: JobTech Taxonomy - Yrkesbarometeryrken
definition: Barometeryrke för Montörer av metall-, gummi- och plastprodukter.
related: XHXj WBN 21D
related: T1g1 9J5 SxG
related: efyx 6es 7jQ
related: rAjz 1xP f1a
related: t4YB gM1 yzn

Industrielektriker (med certifikat)
type: Concept
in scheme: JobTech Taxonomy - Yrkesbarometeryrken
top concept of: JobTech Taxonomy - Yrkesbarometeryrken
definition: Barometeryrke för Industrielektriker (med certifikat).
related: VXjE yRK 6o3
related: MZAa r7q ofj
related: afDJ LWv ESt
related: uZU6 oxo Dpd
related: dxDS JeM SdE

Transportledare och transportsamordnare
type: Concept
in scheme: JobTech Taxonomy - Yrkesbarometeryrken
top concept of: JobTech Taxonomy - Yrkesbarometeryrken
definition: Barometeryrke för Transportledare och transportsamordnare.
related: sSsf D7Q JyQ
related: WYkE arW 7Z1
related: i9VX mum dFB
related: Ce5J e8j 7oh
related: HZs8 1T5 LwW
related: uzca L4S 34f

Specialistläkare
type: Concept
in scheme: JobTech Taxonomy - Yrkesbarometeryrken
top concept of: JobTech Taxonomy - Yrkesbarometeryrken
definition: Barometeryrke för Specialistläkare.

Marknadsanalytiker och marknadsförare
type: Concept
in scheme: JobTech Taxonomy - Yrkesbarometeryrken
top concept of: JobTech Taxonomy - Yrkesbarometeryrken
definition: Barometeryrke för Marknadsanalytiker och marknadsförare.
related: 3abF Jyu WtS
related: jtGy ZBL NEP
related: MqZd qqV ZUM
related: 1z8u QoC C56
related: mUa7 6EA jUn
related: Eh2z fA6 4Ls
related: WCma 2oa gyZ
related: 2DRV Z7N 2Gk
related: eTVL hfE Lyh
related: Tr7k cwB 2T4
related: ooRg ZrL uVU
related: s1An KJo G5i
related: g2XL xyr wS7

Miljö- och hälsoskyddsinspektörer
type: Concept
in scheme: JobTech Taxonomy - Yrkesbarometeryrken
top concept of: JobTech Taxonomy - Yrkesbarometeryrken
definition: Barometeryrke för Miljö- och hälsoskyddsinspektörer.
related: h87Z 5Fc wzR
related: WxGP KAX zh4
related: wHan NPd h9H
related: RGgm n1E LBx
related: Ff3e S5X gQr
related: Asp6 ez8 aQt
related: KvsU QLE dXW

Specialister inom miljöskydd och miljöteknik
type: Concept
in scheme: JobTech Taxonomy - Yrkesbarometeryrken
top concept of: JobTech Taxonomy - Yrkesbarometeryrken
definition: Barometeryrke för Specialister inom miljöskydd och miljöteknik.
related: 2gtP DKV nfQ
related: viXg 7h3 zzB
related: tQue 1d4 APA
related: 3bJd 7LS t8i
related: VwH7 tvk ief
related: BnmA vvT aod
related: xoTd uUm g8g
related: Z8r5 oWv dNy
related: 4gH3 huQ czg
related: P3mE DHj fw3
related: SLfL nQ3 MnE
related: Z22C Lax BJF

Städare
type: Concept
in scheme: JobTech Taxonomy - Yrkesbarometeryrken
top concept of: JobTech Taxonomy - Yrkesbarometeryrken
definition: Barometeryrke för Städare.
related: 9YZg 5x3 REV
related: gBcF mUm Ruc
related: 8MFH Ud4 ysM
related: 2qmv BHZ kuo
related: KF64 AvU S4N

Uppfödare och skötare av lantbruksdjur
type: Concept
in scheme: JobTech Taxonomy - Yrkesbarometeryrken
top concept of: JobTech Taxonomy - Yrkesbarometeryrken
definition: Barometeryrke för Uppfödare och skötare av lantbruksdjur.
related: Tufb JbW wS6
related: 7MTK RiL Vde
related: hqts 17R Uaj
related: RvHV ckc cbT
related: bVXj j6g vzn

Målare (med yrkesbevis)
type: Concept
in scheme: JobTech Taxonomy - Yrkesbarometeryrken
top concept of: JobTech Taxonomy - Yrkesbarometeryrken
definition: Barometeryrke för Målare (med yrkesbevis).
related: rv19 K1B Fuo

Nätverks- och systemtekniker
type: Concept
in scheme: JobTech Taxonomy - Yrkesbarometeryrken
top concept of: JobTech Taxonomy - Yrkesbarometeryrken
definition: Barometeryrke för Nätverks- och systemtekniker.
related: 7jMK KQk M9L
related: Nkbd wa9 TZF

Psykiatrisjuksköterskor
type: Concept
in scheme: JobTech Taxonomy - Yrkesbarometeryrken
top concept of: JobTech Taxonomy - Yrkesbarometeryrken
definition: Barometeryrke för Psykiatrisjuksköterskor.
related: UVrW krj vk8

Trafiklärare
type: Concept
in scheme: JobTech Taxonomy - Yrkesbarometeryrken
top concept of: JobTech Taxonomy - Yrkesbarometeryrken
definition: Barometeryrke för Trafiklärare.
related: hERw LKk uJK
related: AAfT AzF d2e

Takmontörer (med yrkesbevis)
type: Concept
in scheme: JobTech Taxonomy - Yrkesbarometeryrken
top concept of: JobTech Taxonomy - Yrkesbarometeryrken
definition: Barometeryrke för Takmontörer (med yrkesbevis).
related: pSke JBu 461
related: QM63 e85 CUC

Ingenjörer och tekniker inom kemi och kemiteknik
type: Concept
in scheme: JobTech Taxonomy - Yrkesbarometeryrken
top concept of: JobTech Taxonomy - Yrkesbarometeryrken
definition: Barometeryrke för Ingenjörer och tekniker inom kemi och kemiteknik.
related: KyUN dkM sDB
related: jK73 q3a fcZ
related: ZEak n3Q WjS
related: 8X6p EBT DZK
related: GYd6 A2J kFK
related: 4ZyQ 56y MwM
related: 9Vqi fu8 Nat
related: f4qH cL4 piJ
related: XHMe b6A dxf
related: 87Wn cyF MUV
related: E7Rb uFW vog
related: tsdt MEd bUS

Skötare
type: Concept
in scheme: JobTech Taxonomy - Yrkesbarometeryrken
top concept of: JobTech Taxonomy - Yrkesbarometeryrken
definition: Barometeryrke för Skötare.
related: ELLq sK6 wqk

Drifttekniker inom IT
type: Concept
in scheme: JobTech Taxonomy - Yrkesbarometeryrken
top concept of: JobTech Taxonomy - Yrkesbarometeryrken
definition: Barometeryrke för Drifttekniker inom IT.
related: AF1L wVt xmK

Specialister och rådgivare inom lantbruk
type: Concept
in scheme: JobTech Taxonomy - Yrkesbarometeryrken
top concept of: JobTech Taxonomy - Yrkesbarometeryrken
definition: Barometeryrke för Specialister och rådgivare inom lantbruk.
related: KmXs JvR Ns2
related: 3kbp yfk LgT
related: dksu Shs BKd
related: Co7T yKa Zb1
related: oXqv 9m5 6Dn
related: hfBR H6L vbv
related: pHNj F3k Dmd
related: t5Aa WvJ Rfi
related: FAo1 Ftu Jwc
related: aeJj czs 5Tq
related: WEAR T5W Bxa
related: dn3p YMa E8p
related: BLeD 2gg F6H
related: oRBx v9Q vH2
related: icuk htc ti4
related: 6vCW mkV T5F
related: egDr i9z xoT
related: 6FK9 Dya PEL
related: 8hp2 MAG 9Vn
related: xrCc 5SZ VcF
related: JCUJ yye maC

Kriminalvårdare
type: Concept
in scheme: JobTech Taxonomy - Yrkesbarometeryrken
top concept of: JobTech Taxonomy - Yrkesbarometeryrken
definition: Barometeryrke för Kriminalvårdare.
related: UY47 7BK rfi
related: NoHX doS a8J

Diakoner
type: Concept
in scheme: JobTech Taxonomy - Yrkesbarometeryrken
top concept of: JobTech Taxonomy - Yrkesbarometeryrken
definition: Barometeryrke för Diakoner.
related: 9HFY TcS 6qs

Redovisningsekonomer
type: Concept
in scheme: JobTech Taxonomy - Yrkesbarometeryrken
top concept of: JobTech Taxonomy - Yrkesbarometeryrken
definition: Barometeryrke för Redovisningsekonomer.
related: Bbpr AMz nzt
related: 8N18 sGB X4M

Arkivarier
type: Concept
in scheme: JobTech Taxonomy - Yrkesbarometeryrken
top concept of: JobTech Taxonomy - Yrkesbarometeryrken
definition: Barometeryrke för Arkivarier.
related: woHv Nnf tCs
related: E7nX ux2 hF9
related: GshP 4E5 XSN
related: q9PK qMB caU
related: hbt8 56y SMg

Kundtjänstpersonal
type: Concept
in scheme: JobTech Taxonomy - Yrkesbarometeryrken
top concept of: JobTech Taxonomy - Yrkesbarometeryrken
definition: Barometeryrke för Kundtjänstpersonal.
related: rDKi QTj qxa
related: mYcf TH2 zPj
related: 8Uhp XYo z5f
related: w8eg Ufq B5X

Servitörer
type: Concept
in scheme: JobTech Taxonomy - Yrkesbarometeryrken
top concept of: JobTech Taxonomy - Yrkesbarometeryrken
definition: Barometeryrke för Servitörer.
related: rGGf KLs To7
related: RnSZ Ub1 DiV
related: HuYB gtA 7jL
related: 6Spw ptw fgR

IT-strateger
type: Concept
in scheme: JobTech Taxonomy - Yrkesbarometeryrken
top concept of: JobTech Taxonomy - Yrkesbarometeryrken
definition: Barometeryrke för IT-strateger.
related: mBMU HvW LMY

Köksmästare och souschefer
type: Concept
in scheme: JobTech Taxonomy - Yrkesbarometeryrken
top concept of: JobTech Taxonomy - Yrkesbarometeryrken
definition: Barometeryrke för Köksmästare och souschefer.
related: DY59 t7s rsh
related: iugg Qq9 QHH
related: 73vz UAk B8d

Ingenjörer och tekniker inom maskinteknik
type: Concept
in scheme: JobTech Taxonomy - Yrkesbarometeryrken
top concept of: JobTech Taxonomy - Yrkesbarometeryrken
definition: Barometeryrke för Ingenjörer och tekniker inom maskinteknik.
related: CC4H YCh 77T
related: qCeG oQA cxB
related: ciWH LHa Wf1
related: EBur MWp Xkz
related: RU3Y Gqt h3c
related: Gnrd Brt 15j
related: 44U4 7Fz GCy
related: zmTy qPb e9e
related: 2NdT qer nQk
related: GCza QNs oUe
related: 6hYL n56 7v8
related: 8wPx j4J ZTh
related: ms98 iAJ Cym
related: WWXN Y22 6fy
related: 4eYC a1M xtL
related: cBns bSk db4
related: daqX L4S U6H
related: uuA6 a4j BGg
related: XHyR e9A sqQ
related: v7RH VyX qbC
related: 51vT RSZ sK1
related: Fa62 Ypt bsw
related: y2J4 Kxs TVQ
related: iJwC kdU cu7

Snabbmatskockar och grillbiträden
type: Concept
in scheme: JobTech Taxonomy - Yrkesbarometeryrken
top concept of: JobTech Taxonomy - Yrkesbarometeryrken
definition: Barometeryrke för Snabbmatskockar och grillbiträden.
related: nZc4 PaT ZTx
related: FntA 2Z4 8zD

Operationssjuksköterskor
type: Concept
in scheme: JobTech Taxonomy - Yrkesbarometeryrken
top concept of: JobTech Taxonomy - Yrkesbarometeryrken
definition: Barometeryrke för Operationssjuksköterskor.
related: YJKc yXU DUH

Grundskollärare
type: Concept
in scheme: JobTech Taxonomy - Yrkesbarometeryrken
top concept of: JobTech Taxonomy - Yrkesbarometeryrken
definition: Barometeryrke för Grundskollärare.
related: VZoJ 4oe xyR
related: rgsj poi koz
related: S9LC 4m4 yza
related: PecC mHt 1Cj
related: wypk 7S7 snv

Personliga assistenter
type: Concept
in scheme: JobTech Taxonomy - Yrkesbarometeryrken
top concept of: JobTech Taxonomy - Yrkesbarometeryrken
definition: Barometeryrke för Personliga assistenter.
related: SF73 TBz fhR
related: eU1q zvL 9Rf

Civilingenjörer inom gruvteknik och metallurgi
type: Concept
in scheme: JobTech Taxonomy - Yrkesbarometeryrken
top concept of: JobTech Taxonomy - Yrkesbarometeryrken
definition: Barometeryrke för Civilingenjörer inom gruvteknik och metallurgi.
related: 66nJ dqL YGj
related: QU7D U7E G66
related: S75J j1p EEp
related: 64vk 6Lh WDK
related: ECsc vUd JMx
related: 6Jyi QHU LKn
related: qb9c qLP ThK
related: uu19 iuB Zb2
related: Suia ytk oL2
related: ouQJ 4hT WKV

Massörer och massageterapeuter
type: Concept
in scheme: JobTech Taxonomy - Yrkesbarometeryrken
top concept of: JobTech Taxonomy - Yrkesbarometeryrken
definition: Barometeryrke för Massörer och massageterapeuter.

Vårdare och stödassistenter
type: Concept
in scheme: JobTech Taxonomy - Yrkesbarometeryrken
top concept of: JobTech Taxonomy - Yrkesbarometeryrken
definition: Barometeryrke för Vårdare och stödassistenter.
related: tT85 Pdp 4Uq
related: LxhG of8 eMi

Installations- och serviceelektriker (med certifikat)
type: Concept
in scheme: JobTech Taxonomy - Yrkesbarometeryrken
top concept of: JobTech Taxonomy - Yrkesbarometeryrken
definition: Barometeryrke för Installations- och serviceelektriker (med certifikat).
related: K3iK iEb 41Y
related: 84Uc bhA s47
related: cUfj 4io mFf

Producenter och projektledare inom film och teater
type: Concept
in scheme: JobTech Taxonomy - Yrkesbarometeryrken
top concept of: JobTech Taxonomy - Yrkesbarometeryrken
definition: Barometeryrke för Producenter och projektledare inom film och teater.
related: SV22 7W1 pFT
related: U7a3 JF5 fAJ
related: tHsR 3HM Ab5
related: HFRz KDw 1U1
related: HA6M LrT 4xS
related: C8MA QWG A3m
related: mSf9 4xq vXR

Bartendrar
type: Concept
in scheme: JobTech Taxonomy - Yrkesbarometeryrken
top concept of: JobTech Taxonomy - Yrkesbarometeryrken
definition: Barometeryrke för Bartendrar.
related: Pppw ySf 9m7
related: h6oZ 9aZ 27G
related: dPjw 76j Eo5
related: fLps qRU 1CC

Bibliotekarier
type: Concept
in scheme: JobTech Taxonomy - Yrkesbarometeryrken
top concept of: JobTech Taxonomy - Yrkesbarometeryrken
definition: Barometeryrke för Bibliotekarier.
related: wQA4 aaU D3W
related: N1NW zL4 2LA
related: XJNz k5q CGS
related: n9RX nnz ZYF
related: q23Y yfC 6RM
related: N5U8 grE HFR
related: GujS MtW PRH
related: 5tRi kgo ZAJ

Träarbetare och snickare (med yrkesbevis)
type: Concept
in scheme: JobTech Taxonomy - Yrkesbarometeryrken
top concept of: JobTech Taxonomy - Yrkesbarometeryrken
definition: Barometeryrke för Träarbetare och snickare (med yrkesbevis).
related: 4Z7F oBG vMG
related: NLEL 3vn mTB

Företagssäljare
type: Concept
in scheme: JobTech Taxonomy - Yrkesbarometeryrken
top concept of: JobTech Taxonomy - Yrkesbarometeryrken
definition: Barometeryrke för Företagssäljare.
related: p17k znk osi
related: jsUx ngg Kz2
related: QLwS aMP Jcu
related: TTDZ Neo 9GJ
related: kron xtp zCz
related: qSbh gsL gJS
related: 8jrL 5RZ 9Kt
related: iwAf kus wxF
related: 38iE Jad mu6
related: g5fd Eyr bjS
related: z2ti meu Pzf

Saneringsarbetare
type: Concept
in scheme: JobTech Taxonomy - Yrkesbarometeryrken
top concept of: JobTech Taxonomy - Yrkesbarometeryrken
definition: Barometeryrke för Saneringsarbetare.
related: 2eTw 69k MEy
related: K7KE FG6 Sqt
related: 89uF Vvx qcD
related: wUVt uYQ 4Ld

Socialsekreterare
type: Concept
in scheme: JobTech Taxonomy - Yrkesbarometeryrken
top concept of: JobTech Taxonomy - Yrkesbarometeryrken
definition: Barometeryrke för Socialsekreterare.
related: FwM7 WYB qgc
related: aEF1 qeh 5Qe
related: jEX9 VcQ u2N
related: Qopb b1K cm3
related: UmP3 4RG XnW
related: dBVw 5Cw upG

Elevassistenter
type: Concept
in scheme: JobTech Taxonomy - Yrkesbarometeryrken
top concept of: JobTech Taxonomy - Yrkesbarometeryrken
definition: Barometeryrke för Elevassistenter.
related: rN8K yrD VDk
related: Zfgc BYU HM2
related: Sbzf iBA MAS
related: 17FS XzU AQ4

Budförare
type: Concept
in scheme: JobTech Taxonomy - Yrkesbarometeryrken
top concept of: JobTech Taxonomy - Yrkesbarometeryrken
definition: Barometeryrke för Budförare.
related: HdJy NMc Ey8
related: PtiU 6mm yyL
related: JjFi LiK yR1

Laboratorieingenjörer
type: Concept
in scheme: JobTech Taxonomy - Yrkesbarometeryrken
top concept of: JobTech Taxonomy - Yrkesbarometeryrken
definition: Barometeryrke för Laboratorieingenjörer.

Renhållnings- och återvinningsarbetare
type: Concept
in scheme: JobTech Taxonomy - Yrkesbarometeryrken
top concept of: JobTech Taxonomy - Yrkesbarometeryrken
definition: Barometeryrke för Renhållnings- och återvinningsarbetare.
related: DixA mfm THe
related: snWH Lp8 JfA
related: qn4x gMp dsJ
related: gaiS XtL PH7

Inköpare och upphandlare
type: Concept
in scheme: JobTech Taxonomy - Yrkesbarometeryrken
top concept of: JobTech Taxonomy - Yrkesbarometeryrken
definition: Barometeryrke för Inköpare och upphandlare.
related: KVVN sqH Wpz
related: ryH6 MAv QWb

CNC- och maskinoperatörer inom metall
type: Concept
in scheme: JobTech Taxonomy - Yrkesbarometeryrken
top concept of: JobTech Taxonomy - Yrkesbarometeryrken
definition: Barometeryrke för CNC- och maskinoperatörer inom metall.
related: gVdm kTY c7h
related: AsUQ NKv XeC
related: chjQ sAN hJC
related: LJmP CR7 Pym
related: 9haD NB6 ULH

Kantorer och organister
type: Concept
in scheme: JobTech Taxonomy - Yrkesbarometeryrken
top concept of: JobTech Taxonomy - Yrkesbarometeryrken
definition: Barometeryrke för Kantorer och organister.
related: JCzk 4xw LrF

Servicehandläggare med flera
type: Concept
in scheme: JobTech Taxonomy - Yrkesbarometeryrken
top concept of: JobTech Taxonomy - Yrkesbarometeryrken
definition: Barometeryrke för Servicehandläggare med flera.
related: NqN3 Mur sGB
related: whBX Ndk opm
related: r47H 2uB RDF
related: X7oZ fbn TgG

Fordonsmontörer
type: Concept
in scheme: JobTech Taxonomy - Yrkesbarometeryrken
top concept of: JobTech Taxonomy - Yrkesbarometeryrken
definition: Barometeryrke för Fordonsmontörer.
related: 6wcp 7D7 GU7
related: L67L 8eL ug5
related: fHs2 j2K p7B

Systemadministratörer
type: Concept
in scheme: JobTech Taxonomy - Yrkesbarometeryrken
top concept of: JobTech Taxonomy - Yrkesbarometeryrken
definition: Barometeryrke för Systemadministratörer.
related: Lxas 8K9 W1o
related: y763 SQh 71J

Musei- och konstintendenter
type: Concept
in scheme: JobTech Taxonomy - Yrkesbarometeryrken
top concept of: JobTech Taxonomy - Yrkesbarometeryrken
definition: Barometeryrke för Musei- och konstintendenter.
related: kJtR sGs BP1
related: HWxz PRg S9f
related: DVVd BqV umM
related: trQQ nL6 TRm
related: ijoc xYk hmR
related: 6DdY jkA MMn
related: 6kiy vo2 kc6

Slaktare
type: Concept
in scheme: JobTech Taxonomy - Yrkesbarometeryrken
top concept of: JobTech Taxonomy - Yrkesbarometeryrken
definition: Barometeryrke för Slaktare.
related: Jx41 ADW h5R

Trädgårdsarbetare, skötsel utemiljö
type: Concept
in scheme: JobTech Taxonomy - Yrkesbarometeryrken
top concept of: JobTech Taxonomy - Yrkesbarometeryrken
definition: Barometeryrke för Trädgårdsarbetare, skötsel utemiljö.
related: 4Y6u JPp jas
related: hcoE duS bdQ
related: aQeS LkP v3G
related: tArV EVU cFQ

Mjukvaru- och systemutvecklare
type: Concept
in scheme: JobTech Taxonomy - Yrkesbarometeryrken
top concept of: JobTech Taxonomy - Yrkesbarometeryrken
definition: Barometeryrke för Mjukvaru- och systemutvecklare.
related: n2kJ qFK x2K
related: e5sX ceH kV7
related: CZkP hCz KM8
related: 9jYT DS5 6JE
related: QQjZ NAN bDR
related: CQse CRd snw
related: fg7B yov smw
related: YpXF Mob zM8
related: rz2m 96d vyF
related: z5AM ayf WcL
related: GDHs eoz uKx
related: 7wdX 4rv 33z
related: rQds YGd quU
related: WoBk fWz nrt
related: 71Ji irM rSJ
related: vpAN viS cFV

Barnskötare
type: Concept
in scheme: JobTech Taxonomy - Yrkesbarometeryrken
top concept of: JobTech Taxonomy - Yrkesbarometeryrken
definition: Barometeryrke för Barnskötare.
related: ujBX nic wuH
related: rM7G ge7 XhP

Brandmän
type: Concept
in scheme: JobTech Taxonomy - Yrkesbarometeryrken
top concept of: JobTech Taxonomy - Yrkesbarometeryrken
definition: Barometeryrke för Brandmän.
related: sgib x6a wnW

Apotekare
type: Concept
in scheme: JobTech Taxonomy - Yrkesbarometeryrken
top concept of: JobTech Taxonomy - Yrkesbarometeryrken
definition: Barometeryrke för Apotekare.
related: YHfo Sbx vzK

Chefssekreterare och VD-assistenter
type: Concept
in scheme: JobTech Taxonomy - Yrkesbarometeryrken
top concept of: JobTech Taxonomy - Yrkesbarometeryrken
definition: Barometeryrke för Chefssekreterare och VD-assistenter.
related: sBhb Rma Cq5
related: PeNQ qpR wTS

Fjärrbilsförare
type: Concept
in scheme: JobTech Taxonomy - Yrkesbarometeryrken
top concept of: JobTech Taxonomy - Yrkesbarometeryrken
definition: Barometeryrke för Fjärrbilsförare.
related: BNz8 F9J y2L

Lärare i yrkesämnen
type: Concept
in scheme: JobTech Taxonomy - Yrkesbarometeryrken
top concept of: JobTech Taxonomy - Yrkesbarometeryrken
definition: Barometeryrke för Lärare i yrkesämnen.
related: g7NJ ZHN MPB
related: sETD 6ca PbW

Butikssäljare inom dagligvaruhandel
type: Concept
in scheme: JobTech Taxonomy - Yrkesbarometeryrken
top concept of: JobTech Taxonomy - Yrkesbarometeryrken
definition: Barometeryrke för Butikssäljare inom dagligvaruhandel.
related: RGNc B6x 1A8
related: pBhS 6fg 727

Anläggningsmaskinförare (med yrkesbevis)
type: Concept
in scheme: JobTech Taxonomy - Yrkesbarometeryrken
top concept of: JobTech Taxonomy - Yrkesbarometeryrken
definition: Barometeryrke för Anläggningsmaskinförare (med yrkesbevis).
related: yays pQS czh
related: 84h8 6JS XQR
related: 3XPa uKH Dwp
related: 79h8 5t6 p8d
related: qKE5 dUi zg9
related: 9wDu THq WZQ
related: 2F9v VeB 3AQ
related: bour RRe n9Y
related: bf92 EVy 5NP
related: acEj tD8 hKX
related: EGix gMZ 3r9
related: otRF t2h Sja
related: hwpD iJX CGi
related: kL6N 6kS hBu

Lokförare
type: Concept
in scheme: JobTech Taxonomy - Yrkesbarometeryrken
top concept of: JobTech Taxonomy - Yrkesbarometeryrken
definition: Barometeryrke för Lokförare.
related: WU2H o2e rrm
related: Eh9j 7Ud Diu

Administrativa assistenter
type: Concept
in scheme: JobTech Taxonomy - Yrkesbarometeryrken
top concept of: JobTech Taxonomy - Yrkesbarometeryrken
definition: Barometeryrke för Administrativa assistenter.
related: WL4K 4RF NEJ
related: xf1u Fjo du4

Gruv- och stenbrottsarbetare (med yrkesbevis)
type: Concept
in scheme: JobTech Taxonomy - Yrkesbarometeryrken
top concept of: JobTech Taxonomy - Yrkesbarometeryrken
definition: Barometeryrke för Gruv- och stenbrottsarbetare (med yrkesbevis).
related: 31Uw P9P AgC
related: pNfC oCh RPi
related: Ls8r yKQ MQ4

Sjuksköterskor inom vård av äldre
type: Concept
in scheme: JobTech Taxonomy - Yrkesbarometeryrken
top concept of: JobTech Taxonomy - Yrkesbarometeryrken
definition: Barometeryrke för Sjuksköterskor inom vård av äldre.
related: 6dCj L43 LpC

Vårdbiträden
type: Concept
in scheme: JobTech Taxonomy - Yrkesbarometeryrken
top concept of: JobTech Taxonomy - Yrkesbarometeryrken
definition: Barometeryrke för Vårdbiträden.
related: Edjj 2Q7 P8X
related: 4zLr jP5 peZ
related: enMi XgH GQc

Barnmorskor
type: Concept
in scheme: JobTech Taxonomy - Yrkesbarometeryrken
top concept of: JobTech Taxonomy - Yrkesbarometeryrken
definition: Barometeryrke för Barnmorskor.
related: DEDi wap ntF

Larmoperatörer
type: Concept
in scheme: JobTech Taxonomy - Yrkesbarometeryrken
top concept of: JobTech Taxonomy - Yrkesbarometeryrken
definition: Barometeryrke för Larmoperatörer.
related: 1WsA bfK QUd
related: 4GHe kgB cAk

Montörer av elektrisk och elektronisk utrustning
type: Concept
in scheme: JobTech Taxonomy - Yrkesbarometeryrken
top concept of: JobTech Taxonomy - Yrkesbarometeryrken
definition: Barometeryrke för Montörer av elektrisk och elektronisk utrustning.
related: chze 8HV Ujk
related: GaiH Bzd mU5
related: 8qCg sxp 6fq
related: AJDU fpb ADF

Trädgårdsanläggare
type: Concept
in scheme: JobTech Taxonomy - Yrkesbarometeryrken
top concept of: JobTech Taxonomy - Yrkesbarometeryrken
definition: Barometeryrke för Trädgårdsanläggare.
related: JZur dmf EPY
related: jhj8 puk Eht

CNC- och maskinoperatörer inom trä
type: Concept
in scheme: JobTech Taxonomy - Yrkesbarometeryrken
top concept of: JobTech Taxonomy - Yrkesbarometeryrken
definition: Barometeryrke för CNC- och maskinoperatörer inom trä.
related: 8wmm Wto 9iG
related: 1puM DYY yEy

Matroser och jungmän
type: Concept
in scheme: JobTech Taxonomy - Yrkesbarometeryrken
top concept of: JobTech Taxonomy - Yrkesbarometeryrken
definition: Barometeryrke för Matroser och jungmän.
related: R2un HhG 7oY
related: 2p8h gqm 4LG
related: vL9M 7hk 1X9
related: 68DU 3eK 84a
related: auBo DeP r69

Restaurang- och köksbiträden
type: Concept
in scheme: JobTech Taxonomy - Yrkesbarometeryrken
top concept of: JobTech Taxonomy - Yrkesbarometeryrken
definition: Barometeryrke för Restaurang- och köksbiträden.
related: EaDK DwG ujx
related: JQ1x uHt jnP
related: yXRQ Ad9 E8V
related: pKTY Kwu sUw
related: oRB5 b7i Qzv

Planeringsarkitekter
type: Concept
in scheme: JobTech Taxonomy - Yrkesbarometeryrken
top concept of: JobTech Taxonomy - Yrkesbarometeryrken
definition: Barometeryrke för Planeringsarkitekter.
related: fCPi bZh PBa
related: dVwu SVA Yoz
related: 6sVS uwh x15

Finansanalytiker och finansmäklare
type: Concept
in scheme: JobTech Taxonomy - Yrkesbarometeryrken
top concept of: JobTech Taxonomy - Yrkesbarometeryrken
definition: Barometeryrke för Finansanalytiker och finansmäklare.
related: ZaFc F2b Yuo
related: ZwtT u1t CsN
related: 5W5Z b4L upx
related: roHu JVn w1y
related: V2MS 5F4 WAq
related: u2iH Myz 45U
related: 2Di8 skD voL
related: edHP yoz SJM

Distributionselektriker
type: Concept
in scheme: JobTech Taxonomy - Yrkesbarometeryrken
top concept of: JobTech Taxonomy - Yrkesbarometeryrken
definition: Barometeryrke för Distributionselektriker.
related: TCGb VdF NSm
related: bgTi SxA pLX
related: E6hM rR1 nye

Drifttekniker vid värme- och vattenverk
type: Concept
in scheme: JobTech Taxonomy - Yrkesbarometeryrken
top concept of: JobTech Taxonomy - Yrkesbarometeryrken
definition: Barometeryrke för Drifttekniker vid värme- och vattenverk.
related: swZK y6d 5Wb
related: FCZt EXF Pag

Fritidsledare
type: Concept
in scheme: JobTech Taxonomy - Yrkesbarometeryrken
top concept of: JobTech Taxonomy - Yrkesbarometeryrken
definition: Barometeryrke för Fritidsledare.
related: aWHP Fv2 1US
related: r2Gv ft9 p51
related: BY1K mZ4 oKj
related: ZnNn D2K pTi

Truckförare
type: Concept
in scheme: JobTech Taxonomy - Yrkesbarometeryrken
top concept of: JobTech Taxonomy - Yrkesbarometeryrken
definition: Barometeryrke för Truckförare.
related: GQSf fnq kjF
related: kT6D nm2 KP8
related: wjGn DCt 3Br

Civilingenjörer inom maskinteknik
type: Concept
in scheme: JobTech Taxonomy - Yrkesbarometeryrken
top concept of: JobTech Taxonomy - Yrkesbarometeryrken
definition: Barometeryrke för Civilingenjörer inom maskinteknik.
related: Rd3G bFa zvR
related: cAJj uJb s9C
related: TRVV bXp BG9
related: ApfX 5Ak gpe
related: Fxue CC5 2Fy
related: HEq1 4eB EE1
related: rncq GAq KMx
related: hgwv NVk dmq
related: 8r8B 8bP usp
related: KWFX juL yMb
related: VUEH TU9 KqG
related: QrW9 R6M QRK
related: k111 vB5 1Tf

Ingenjörer och tekniker inom elektroteknik
type: Concept
in scheme: JobTech Taxonomy - Yrkesbarometeryrken
top concept of: JobTech Taxonomy - Yrkesbarometeryrken
definition: Barometeryrke för Ingenjörer och tekniker inom elektroteknik.
related: 1jm3 XFQ TdJ
related: a46P 3cL 149
related: gzCS pYs foY
related: T55e efV Eqh
related: LrrC U7A Xus
related: p65e YPU LoH
related: Sbff eeY jch
related: 9U5Y 9Ji uJq
related: b5Re ALr 2Nq
related: JWb8 x89 Smp
related: 51jM crG YQH

IT-säkerhetsspecialister
type: Concept
in scheme: JobTech Taxonomy - Yrkesbarometeryrken
top concept of: JobTech Taxonomy - Yrkesbarometeryrken
definition: Barometeryrke för IT-säkerhetsspecialister.
related: MGCL TYX EUA
related: fZoS si8 SFg
related: 9yMK 8ep D1K
related: wPEL cpR WA2
related: JPBx Vxc zWM
related: YLgW 3fm CmS
related: FHwx yXu FAd

Cell- och molekylärbiologer
type: Concept
in scheme: JobTech Taxonomy - Yrkesbarometeryrken
top concept of: JobTech Taxonomy - Yrkesbarometeryrken
definition: Barometeryrke för Cell- och molekylärbiologer.
related: 5LS7 Cbz 1Yt
related: xaQL Wbc 6su
related: PiQ3 Wzy U1X
related: SrQv qDW cLW
related: mUD2 7si XaE
related: jRge ki1 8cd
related: gmx1 BCX EEe
related: 96TD UsQ X4S
related: Uc39 yCn Vka
related: 41dT obG dFc
related: KanX 2ou 7gD
related: ms96 qce p79
related: GhGu qim 5oB
related: RYu4 YEr tYJ
related: UADD eJ1 SNQ
related: Pt1j hPW CZb
related: ZNyx 1tG w4E
related: Nihf tgV ueT
related: keVJ c38 DLa
related: uygD Smj a7w
related: 5RkB Zeq aH6

Grundutbildade sjuksköterskor
type: Concept
in scheme: JobTech Taxonomy - Yrkesbarometeryrken
top concept of: JobTech Taxonomy - Yrkesbarometeryrken
definition: Barometeryrke för Grundutbildade sjuksköterskor.
related: dASq 9GH jbS
related: bXNH MNX dUR
related: t3qY aWP PJB

Planerare och utredare
type: Concept
in scheme: JobTech Taxonomy - Yrkesbarometeryrken
top concept of: JobTech Taxonomy - Yrkesbarometeryrken
definition: Barometeryrke för Planerare och utredare.
related: EgyF T9E tg6
related: 7YVF kE4 aPm
related: XWyW 4YA kjf
related: 9ENZ 5kK FrP
related: aY7W GJ6 o62
related: UrNc Tx6 vGs
related: k7GJ Ysw GbY
related: 1DSQ YqU AMs
related: g41i MsZ 2Ga
related: d7s6 CJT vmu
related: kDDZ ekG oQU
related: L5t3 Vf6 qZq
related: mokP vny RLh
related: wfAA fWK aym
related: T6tY uW8 Rw4
related: q1k8 CXz 7Nd
related: Gas4 5AR GZC
related: nNEJ aMM bWW
related: bXik Ys8 w9s
related: Zme8 ZCs itg
related: SFZw QVx MU7
related: 1Cjx ooE HT9
related: dbJy 8L3 Nkb
related: CKJ9 ZCh SQ6
related: 1naX kwP nzG
related: j6a1 gE6 uYW
related: B5ME WoV 6ZB
related: u9g1 LAk 2PX
related: hN4f 6jN eZQ
related: JvRi WQd NP3
related: 1awg QKB bkw
related: FVGD Qb5 oxT
related: Dt25 NxU ASi
related: S46w C6B hxh
related: brrG pJ8 Gc3
related: 1mBD 3PT t2h
related: uYjC s5u tKu
related: wSsP RuF tcG
related: mqMb FSG ahg
related: YG1s tUg jWJ
related: vyab VDH LLt
related: Y89z jPJ jFv
related: oPcU Dcj 6cq
related: BPnn Wh1 PZH
related: Gs8E rxg vLX

Kuratorer
type: Concept
in scheme: JobTech Taxonomy - Yrkesbarometeryrken
top concept of: JobTech Taxonomy - Yrkesbarometeryrken
definition: Barometeryrke för Kuratorer.
related: Wnx2 nLc JWY
related: YpRs ybt 47a
related: UVvg XmH CA4
related: tzHp Aw9 qQQ

Fritidspedagoger
type: Concept
in scheme: JobTech Taxonomy - Yrkesbarometeryrken
top concept of: JobTech Taxonomy - Yrkesbarometeryrken
definition: Barometeryrke för Fritidspedagoger.

Förskollärare
type: Concept
in scheme: JobTech Taxonomy - Yrkesbarometeryrken
top concept of: JobTech Taxonomy - Yrkesbarometeryrken
definition: Barometeryrke för Förskollärare.
related: rUcW z9R Qsv
related: kbCX 1s6 vqh
related: 4mUk ow8 wji
related: JUu4 wcP kQG

Maskinoperatörer inom plast
type: Concept
in scheme: JobTech Taxonomy - Yrkesbarometeryrken
top concept of: JobTech Taxonomy - Yrkesbarometeryrken
definition: Barometeryrke för Maskinoperatörer inom plast.
related: 8Kvc Fxt Jei
related: Abi5 CxG 9mK
related: D9nf Uo8 zJ4

Butikssäljare (båt och motorfordon)
type: Concept
in scheme: JobTech Taxonomy - Yrkesbarometeryrken
top concept of: JobTech Taxonomy - Yrkesbarometeryrken
definition: Barometeryrke för Butikssäljare (båt och motorfordon).
related: Qbmc 5Yr Lca
related: Jd8e 1UD 8Vo
related: vugJ jNY XLH
related: ywWg 2t1 JSW
related: CNHD RxB thm

Florister
type: Concept
in scheme: JobTech Taxonomy - Yrkesbarometeryrken
top concept of: JobTech Taxonomy - Yrkesbarometeryrken
definition: Barometeryrke för Florister.
related: EuTa edS Add

Bilrekonditionerare
type: Concept
in scheme: JobTech Taxonomy - Yrkesbarometeryrken
top concept of: JobTech Taxonomy - Yrkesbarometeryrken
definition: Barometeryrke för Bilrekonditionerare.
related: gP3r Q2H ht9
related: KJ3U fNr b8K

Ekonomiassistenter
type: Concept
in scheme: JobTech Taxonomy - Yrkesbarometeryrken
top concept of: JobTech Taxonomy - Yrkesbarometeryrken
definition: Barometeryrke för Ekonomiassistenter.
related: MZ9T JuJ FxU
related: BK8D hZe dtk

Tandhygienister
type: Concept
in scheme: JobTech Taxonomy - Yrkesbarometeryrken
top concept of: JobTech Taxonomy - Yrkesbarometeryrken
definition: Barometeryrke för Tandhygienister.
related: TPRY Wze q6x

Civilingenjörer inom elkraft
type: Concept
in scheme: JobTech Taxonomy - Yrkesbarometeryrken
top concept of: JobTech Taxonomy - Yrkesbarometeryrken
definition: Barometeryrke för Civilingenjörer inom elkraft.
related: FuJx cGT 5im
related: fYBk dfW DJc
related: U7De k7U G3d

Kranbilsförare
type: Concept
in scheme: JobTech Taxonomy - Yrkesbarometeryrken
top concept of: JobTech Taxonomy - Yrkesbarometeryrken
definition: Barometeryrke för Kranbilsförare.
related: J5Hz isE mb1

Fastighetsförvaltare
type: Concept
in scheme: JobTech Taxonomy - Yrkesbarometeryrken
top concept of: JobTech Taxonomy - Yrkesbarometeryrken
definition: Barometeryrke för Fastighetsförvaltare.
related: EPe8 EQu YCL

Specialister och rådgivare inom skogsbruk
type: Concept
in scheme: JobTech Taxonomy - Yrkesbarometeryrken
top concept of: JobTech Taxonomy - Yrkesbarometeryrken
definition: Barometeryrke för Specialister och rådgivare inom skogsbruk.
related: 77Gm wws Dqp
related: 8e4C 3b3 qAW
related: oM6Y bP4 41Z
related: x42Z 9vG pPF
related: Tnkm dQ2 UXu
related: Jocy apM 4v4
related: dGC5 1ze AHS
related: B84w zFQ 8Ug
related: sGNc sUZ 7NR
related: a1E3 mkT gPe
related: EUwj KEo dNz
related: v2G8 CnQ mPU

Grafiska formgivare
type: Concept
in scheme: JobTech Taxonomy - Yrkesbarometeryrken
top concept of: JobTech Taxonomy - Yrkesbarometeryrken
definition: Barometeryrke för Grafiska formgivare.
related: E4KE 68y 6ag
related: VpYo k5f N9R
related: qSoX VSS SpZ
related: p6Y5 8hP oFD

Lednings- och organisationsutvecklare
type: Concept
in scheme: JobTech Taxonomy - Yrkesbarometeryrken
top concept of: JobTech Taxonomy - Yrkesbarometeryrken
definition: Barometeryrke för Lednings- och organisationsutvecklare.
related: 9LoK Hba 2NG
related: x6oS 7T1 8Rh
related: 9MD2 MYv ukk
related: Zx9p x3C ohu
related: XJGx 3CT HxX
related: 3Zo3 ez5 Kdx
related: Zwhm 5tT Zms
related: 3vry gaE yfQ
related: yc4h BH7 yq6
related: Fb9B 93K hHP
related: fUJp V4d ueo
related: Wui8 Q9N NVc
related: X1FS ZXE DT2

Sjuksköterskor inom akutsjukvård
type: Concept
in scheme: JobTech Taxonomy - Yrkesbarometeryrken
top concept of: JobTech Taxonomy - Yrkesbarometeryrken
definition: Barometeryrke för Sjuksköterskor inom akutsjukvård.
related: dAmo ydH Fko
related: Pi5N 5NB 7BY
related: Uh7q DpM rm3

Buss- och lastbilsmekaniker
type: Concept
in scheme: JobTech Taxonomy - Yrkesbarometeryrken
top concept of: JobTech Taxonomy - Yrkesbarometeryrken
definition: Barometeryrke för Buss- och lastbilsmekaniker.
related: J63w XYr isZ
related: o7LP duC u9Z
related: EbyD yr3 wmJ
related: Qq5v QZ3 EE9

GIS- och kartingenjörer
type: Concept
in scheme: JobTech Taxonomy - Yrkesbarometeryrken
top concept of: JobTech Taxonomy - Yrkesbarometeryrken
definition: Barometeryrke för GIS- och kartingenjörer.
related: HdqU oqU fr7
related: uXRf emU Fou
related: R2hT 88E wx6
related: 54qK bhx bc5
related: GCnM ryR 1ie

Ramp- och flyttpersonal
type: Concept
in scheme: JobTech Taxonomy - Yrkesbarometeryrken
top concept of: JobTech Taxonomy - Yrkesbarometeryrken
definition: Barometeryrke för Ramp- och flyttpersonal.
related: s8L4 bRy BqF
related: nDGY Jbi cRM
related: QfuC LxN w4T
related: ifxC 6uZ pE5
related: rzVf pA7 qGY

Bilmekaniker
type: Concept
in scheme: JobTech Taxonomy - Yrkesbarometeryrken
top concept of: JobTech Taxonomy - Yrkesbarometeryrken
definition: Barometeryrke för Bilmekaniker.
related: paDm hYD LFG
related: ponJ a1z dkd
related: ZQWe EYX cqa

Tandläkare
type: Concept
in scheme: JobTech Taxonomy - Yrkesbarometeryrken
top concept of: JobTech Taxonomy - Yrkesbarometeryrken
definition: Barometeryrke för Tandläkare.
related: TdvW S8R CFH
related: 59gf eKP pEW
related: rAUa sJT 33X

Systemförvaltare
type: Concept
in scheme: JobTech Taxonomy - Yrkesbarometeryrken
top concept of: JobTech Taxonomy - Yrkesbarometeryrken
definition: Barometeryrke för Systemförvaltare.
related: nFJR WkF ir7
related: AQ8y 9XL Jvv
related: wNG8 Rsg RQc
related: oSg4 2uU wpN

Kemister
type: Concept
in scheme: JobTech Taxonomy - Yrkesbarometeryrken
top concept of: JobTech Taxonomy - Yrkesbarometeryrken
definition: Barometeryrke för Kemister.
related: 1n3p xeZ Zhy
related: SMii y8Z VmX
related: KZsj HrG iKS
related: HtLv 4EJ o5r

Biståndsbedömare
type: Concept
in scheme: JobTech Taxonomy - Yrkesbarometeryrken
top concept of: JobTech Taxonomy - Yrkesbarometeryrken
definition: Barometeryrke för Biståndsbedömare.
related: 6gF2 LeK d34
related: pYiF Z6V ULQ

Tandsköterskor
type: Concept
in scheme: JobTech Taxonomy - Yrkesbarometeryrken
top concept of: JobTech Taxonomy - Yrkesbarometeryrken
definition: Barometeryrke för Tandsköterskor.
related: xq4p 8Y5 SYR
related: ckkD JhH Sc6

Bagare och konditorer
type: Concept
in scheme: JobTech Taxonomy - Yrkesbarometeryrken
top concept of: JobTech Taxonomy - Yrkesbarometeryrken
definition: Barometeryrke för Bagare och konditorer.
related: XugJ 6hw wVV

Buss- och spårvagnsförare
type: Concept
in scheme: JobTech Taxonomy - Yrkesbarometeryrken
top concept of: JobTech Taxonomy - Yrkesbarometeryrken
definition: Barometeryrke för Buss- och spårvagnsförare.
related: GkMH KEV QKX
related: 6zL8 YYP 1eR

Ingenjörer och tekniker inom bygg och anläggning
type: Concept
in scheme: JobTech Taxonomy - Yrkesbarometeryrken
top concept of: JobTech Taxonomy - Yrkesbarometeryrken
definition: Barometeryrke för Ingenjörer och tekniker inom bygg och anläggning.
related: cAYP wEe u3D
related: B4x6 Ed3 14i
related: namT cva UiK
related: Dr4w ovQ dkj
related: qzp5 Kmf JL1
related: fSLM a7G ZfA
related: wV1P Ms5 HB2
related: Ys2U uQv V4n
related: HAQu 4kR S5h
related: QyBB mhx iKS
related: JERf eXM Dyz
related: K68t jNi FqQ
related: UMkU jge 4mH

Murare och plattsättare (med yrkesbevis)
type: Concept
in scheme: JobTech Taxonomy - Yrkesbarometeryrken
top concept of: JobTech Taxonomy - Yrkesbarometeryrken
definition: Barometeryrke för Murare och plattsättare (med yrkesbevis).
related: mY9m WER ZCf
related: vcGg bkm g4E
related: gbuQ nGX vDz
related: Qv4e brq Ca5
related: 5DcA EVV BHZ
related: FZrG W9Q fE7

Bärplockare och plantörer
type: Concept
in scheme: JobTech Taxonomy - Yrkesbarometeryrken
top concept of: JobTech Taxonomy - Yrkesbarometeryrken
definition: Barometeryrke för Bärplockare och plantörer.
related: g6hq ENJ Yno
related: V1QR VzZ vbj
related: StaK vgD 1pR
related: HTC6 96A dwB
related: iJHN s3P 2Ge

Supporttekniker inom IT
type: Concept
in scheme: JobTech Taxonomy - Yrkesbarometeryrken
top concept of: JobTech Taxonomy - Yrkesbarometeryrken
definition: Barometeryrke för Supporttekniker inom IT.
related: nTwt VnS Z2x

Civilingenjörer inom bygg och anläggning
type: Concept
in scheme: JobTech Taxonomy - Yrkesbarometeryrken
top concept of: JobTech Taxonomy - Yrkesbarometeryrken
definition: Barometeryrke för Civilingenjörer inom bygg och anläggning.
related: kgyb GN3 qR1
related: pTTz 5DC itW
related: n9AC sTq NAH
related: g7ym Uf1 kjx
related: r4G8 gBH Pug
related: bDCc dTJ qcd
related: EXiu jov tYu
related: cfJA uhP dD3
related: EYJm PM2 S4P
related: mcAc Xvo Jp8

VVS-montörer (med certifikat)
type: Concept
in scheme: JobTech Taxonomy - Yrkesbarometeryrken
top concept of: JobTech Taxonomy - Yrkesbarometeryrken
definition: Barometeryrke för VVS-montörer (med certifikat).
related: mvnD QKo UPh
related: ZZTi v6g 4cZ
related: TEWT q89 rcn
related: BUeN T5B 77E
related: Euqs sFt uAP
related: oAHt G4F Bya

Optiker
type: Concept
in scheme: JobTech Taxonomy - Yrkesbarometeryrken
top concept of: JobTech Taxonomy - Yrkesbarometeryrken
definition: Barometeryrke för Optiker.
related: HWPy 9jT TX2

Banktjänstemän
type: Concept
in scheme: JobTech Taxonomy - Yrkesbarometeryrken
top concept of: JobTech Taxonomy - Yrkesbarometeryrken
definition: Barometeryrke för Banktjänstemän.
related: pp2y Kru xG6
related: mQAj VmK aU4
related: 6Lx9 ukW WSn

Isoleringsmontörer (med yrkesbevis)
type: Concept
in scheme: JobTech Taxonomy - Yrkesbarometeryrken
top concept of: JobTech Taxonomy - Yrkesbarometeryrken
definition: Barometeryrke för Isoleringsmontörer (med yrkesbevis).
related: Dz54 J8f tgi
related: rAgy tQu JC1
related: NU3d HjX pSd

Trädgårdsodlare
type: Concept
in scheme: JobTech Taxonomy - Yrkesbarometeryrken
top concept of: JobTech Taxonomy - Yrkesbarometeryrken
definition: Barometeryrke för Trädgårdsodlare.
related: 43oy qgN eds

Veterinärer
type: Concept
in scheme: JobTech Taxonomy - Yrkesbarometeryrken
top concept of: JobTech Taxonomy - Yrkesbarometeryrken
definition: Barometeryrke för Veterinärer.
related: GgmE SvH mtm

Ljus-, ljud- och bildtekniker
type: Concept
in scheme: JobTech Taxonomy - Yrkesbarometeryrken
top concept of: JobTech Taxonomy - Yrkesbarometeryrken
definition: Barometeryrke för Ljus-, ljud- och bildtekniker.
related: YTjK wVy YNM
related: bqrn 3Hf Wtv
related: 82bk gCY NS2
related: f4mp tWX wa9
related: YBxu 4hV dNB
related: imJC PfJ RHt
related: aQDK H6n bwK
related: 7Rih wMN qpR
related: ugmL 11t RvD
related: qMJk 3Zy Mue
related: Fc5F 3Wu B8K
related: Y5A4 9s7 HtL
related: xJpQ KS5 L8c
related: bQws 2wE x2Z
related: kpw6 7cd 9X6
related: 2hTu y9K CxY
related: m8ED BbT twk
related: 6Um7 yX6 J7z
related: 5BLi wBL fM1
related: NapE zvy guo
related: XDgH ApE nBH
related: ubgh Tgi RgH
related: vaq4 wCT Pu9
related: mM8D fX8 czT
related: 2KG5 YmC TRA
related: r32c vMU Zot
related: BM2p vGv Npg
related: 2Cjr 5Bn GVb
related: PY3M 7bz cbC
related: XHRR 4kg Upi
related: yEKs 7aD 9nD
related: Q7YP jJ8 qsk
related: 3ZFj Cbb uPL
related: j9yt DeA YBJ
related: 44wU Cyh yqp
related: 8CJr LQ7 MBG
related: DjWo rw6 r9z

Hotellreceptionister
type: Concept
in scheme: JobTech Taxonomy - Yrkesbarometeryrken
top concept of: JobTech Taxonomy - Yrkesbarometeryrken
definition: Barometeryrke för Hotellreceptionister.
related: 1r5s qHw 84e
related: 5E9J 4Ka UPK
related: 4uw5 ysb 1Ky
related: 3kFW XLk v9H
related: of8z oz7 gBp
related: p299 kkg 67z

Väktare och ordningsvakter
type: Concept
in scheme: JobTech Taxonomy - Yrkesbarometeryrken
top concept of: JobTech Taxonomy - Yrkesbarometeryrken
definition: Barometeryrke för Väktare och ordningsvakter.
related: mobn aTk jS6
related: pCtL mkz HVe
related: PX1A 3JR jUL
related: Jpr5 Qf8 e5d
related: L7dr edw VWG
related: Dk1g 6Du mNF
related: TH8w hsR AMf
related: Geiy N5y GLi

Undersköterskor inom vård- och specialavdelningar och mottagningar
type: Concept
in scheme: JobTech Taxonomy - Yrkesbarometeryrken
top concept of: JobTech Taxonomy - Yrkesbarometeryrken
definition: Barometeryrke för Undersköterskor inom vård- och specialavdelningar och mottagningar.
related: Z5L9 7Eb cCd
related: PQkQ Dmk ZF8

Controllrar
type: Concept
in scheme: JobTech Taxonomy - Yrkesbarometeryrken
top concept of: JobTech Taxonomy - Yrkesbarometeryrken
definition: Barometeryrke för Controllrar.
related: QQ23 iVQ Kzw
related: TMQA DYj srP
related: SgGz 7JC dtw
related: 6N4Q KwA SS1
related: 8tSq t1z MRT
related: GrZU ofe QAx
related: Aqbg XW3 UGb
related: eirM Tfo qRu

Handpaketerare
type: Concept
in scheme: JobTech Taxonomy - Yrkesbarometeryrken
top concept of: JobTech Taxonomy - Yrkesbarometeryrken
definition: Barometeryrke för Handpaketerare.
related: YDvo JCY pDR

Processoperatörer inom papper och pappersmassa
type: Concept
in scheme: JobTech Taxonomy - Yrkesbarometeryrken
top concept of: JobTech Taxonomy - Yrkesbarometeryrken
definition: Barometeryrke för Processoperatörer inom papper och pappersmassa.
related: h4wH 7kG UTN
related: a6Hu zpi ALp

Bil- och tunnplåtslagare
type: Concept
in scheme: JobTech Taxonomy - Yrkesbarometeryrken
top concept of: JobTech Taxonomy - Yrkesbarometeryrken
definition: Barometeryrke för Bil- och tunnplåtslagare.
related: 17Xf MuM vg2
related: P8M1 XTH Ryt
related: 73zz 8gq D9Z

Farmakologer och biomedicinare
type: Concept
in scheme: JobTech Taxonomy - Yrkesbarometeryrken
top concept of: JobTech Taxonomy - Yrkesbarometeryrken
definition: Barometeryrke för Farmakologer och biomedicinare.
related: 8xAv A7E Gix
related: RtCz v7Z Lm6
related: ULqj eRx kVd
related: yMd7 87H qf2
related: WdKG DQU 4y7
related: aeZy 4k3 bCr
related: vGyq S18 JKE
related: mQAY wtA 7G2
related: g1U8 c99 Zry
related: MqSM PXs d8P

Hudterapeuter
type: Concept
in scheme: JobTech Taxonomy - Yrkesbarometeryrken
top concept of: JobTech Taxonomy - Yrkesbarometeryrken
definition: Barometeryrke för Hudterapeuter.
related: VDPL pKt otU
related: zqBJ sRm m5Z

Marknads- och försäljningsassistenter
type: Concept
in scheme: JobTech Taxonomy - Yrkesbarometeryrken
top concept of: JobTech Taxonomy - Yrkesbarometeryrken
definition: Barometeryrke för Marknads- och försäljningsassistenter.
related: uWwq jF2 nhq
related: Py1W JCz LNX
related: qggA Smr PbQ
related: HFuj YCt Ymn

Ordersamordnare
type: Concept
in scheme: JobTech Taxonomy - Yrkesbarometeryrken
top concept of: JobTech Taxonomy - Yrkesbarometeryrken
definition: Barometeryrke för Ordersamordnare.
related: 8NWY SC6 LVA
related: uJM6 kRc rCb
related: gLtU eR9 ZcW

Systemtestare och testledare
type: Concept
in scheme: JobTech Taxonomy - Yrkesbarometeryrken
top concept of: JobTech Taxonomy - Yrkesbarometeryrken
definition: Barometeryrke för Systemtestare och testledare.
related: TU7g mwa VzB
related: 843H Mp1 EVL
related: sUih DqP zQP
related: CTqd fc6 MG5
related: KXaA 48Y gKe

Fartygsbefäl
type: Concept
in scheme: JobTech Taxonomy - Yrkesbarometeryrken
top concept of: JobTech Taxonomy - Yrkesbarometeryrken
definition: Barometeryrke för Fartygsbefäl.
related: F1CJ eRU TBg
related: 8UPT SpB Zqh
related: jDJN Q3V 3ot
related: sxew RLg hyK
related: o8aU Geg vRm
related: xhjJ p62 8Gs
related: 4itw Zm3 2YB
related: NfYe q89 pY2

Vaktmästare
type: Concept
in scheme: JobTech Taxonomy - Yrkesbarometeryrken
top concept of: JobTech Taxonomy - Yrkesbarometeryrken
definition: Barometeryrke för Vaktmästare.
related: 5XnU 5ZJ LQN
related: BK7A kh5 xWc
related: oH9v baf a3d
related: cRmS zdM NEA
related: 6ybD FpX WDW

Läkare (exklusive AT-, ST- och specialistläkare)
type: Concept
in scheme: JobTech Taxonomy - Yrkesbarometeryrken
top concept of: JobTech Taxonomy - Yrkesbarometeryrken
definition: Barometeryrke för Läkare (exklusive AT-, ST- och specialistläkare).
related: 9K3i XD4 Kyy

Studieadministratörer och utbildningshandläggare
type: Concept
in scheme: JobTech Taxonomy - Yrkesbarometeryrken
top concept of: JobTech Taxonomy - Yrkesbarometeryrken
definition: Barometeryrke för Studieadministratörer och utbildningshandläggare.
related: JQ3q X9q aTC
related: o8W6 jkq JoX
related: eUw9 e75 NBz
related: U4dr Qkp 7XM

ST-läkare
type: Concept
in scheme: JobTech Taxonomy - Yrkesbarometeryrken
top concept of: JobTech Taxonomy - Yrkesbarometeryrken
definition: Barometeryrke för ST-läkare.
related: cvFw Ay2 ynn

Fin-, inrednings- och möbelsnickare
type: Concept
in scheme: JobTech Taxonomy - Yrkesbarometeryrken
top concept of: JobTech Taxonomy - Yrkesbarometeryrken
definition: Barometeryrke för Fin-, inrednings- och möbelsnickare.
related: EVMd 5ES dRT
related: 7P58 BVX 1sE
related: Xoxs REs gmK
related: YJMS XMf fAA
related: kBdt K9U vgC
related: cyCt LLE qDy

Kockar
type: Concept
in scheme: JobTech Taxonomy - Yrkesbarometeryrken
top concept of: JobTech Taxonomy - Yrkesbarometeryrken
definition: Barometeryrke för Kockar.
related: Vg3d Azf p5Y
related: JbJw as4 S93
related: KarC Tsk u1m
related: Ki3J DNi 7Hi

Distriktssköterskor
type: Concept
in scheme: JobTech Taxonomy - Yrkesbarometeryrken
top concept of: JobTech Taxonomy - Yrkesbarometeryrken
definition: Barometeryrke för Distriktssköterskor.
related: n2Tp B8E gED

Maskinbefäl
type: Concept
in scheme: JobTech Taxonomy - Yrkesbarometeryrken
top concept of: JobTech Taxonomy - Yrkesbarometeryrken
definition: Barometeryrke för Maskinbefäl.
related: YEm9 pLR XoT
related: RoCf 4ac hBg
related: 4h8W 71M HXk
related: VGMT upD kaQ
related: Nf55 bBW JXz

Butikssäljare inom fackhandel
type: Concept
in scheme: JobTech Taxonomy - Yrkesbarometeryrken
top concept of: JobTech Taxonomy - Yrkesbarometeryrken
definition: Barometeryrke för Butikssäljare inom fackhandel.
related: ek9W CmD y2M

Civilingenjörer inom logistik och produktionsplanering
type: Concept
in scheme: JobTech Taxonomy - Yrkesbarometeryrken
top concept of: JobTech Taxonomy - Yrkesbarometeryrken
definition: Barometeryrke för Civilingenjörer inom logistik och produktionsplanering.
related: 7oRE Ejt YWQ
related: Gj5E c7b YHD
related: NzLu oTf S7f
related: dxAK mLr bAa

Gymnasielärare
type: Concept
in scheme: JobTech Taxonomy - Yrkesbarometeryrken
top concept of: JobTech Taxonomy - Yrkesbarometeryrken
definition: Barometeryrke för Gymnasielärare.
related: 86sy hBf exW
related: P9Et 5en uwo
related: kJEw Qzp bkK

Odlare av jordbruksväxter, frukt och bär
type: Concept
in scheme: JobTech Taxonomy - Yrkesbarometeryrken
top concept of: JobTech Taxonomy - Yrkesbarometeryrken
definition: Barometeryrke för Odlare av jordbruksväxter, frukt och bär.
related: tYNQ WZ6 8ic
related: M72y eD6 3HN
related: WZ1a Pbw Qb9

Larm- och servicetekniker inom elektronik
type: Concept
in scheme: JobTech Taxonomy - Yrkesbarometeryrken
top concept of: JobTech Taxonomy - Yrkesbarometeryrken
definition: Barometeryrke för Larm- och servicetekniker inom elektronik.
related: pahf 9Ek WVz
related: NsCV eWr uwV
related: yfhW 7ko iVM
related: VYBp MJp drc
related: xAjj Dx7 LvV
related: opk4 E3a 8Pt
related: pL3Q f1c RfT

Fysioterapeuter och sjukgymnaster
type: Concept
in scheme: JobTech Taxonomy - Yrkesbarometeryrken
top concept of: JobTech Taxonomy - Yrkesbarometeryrken
definition: Barometeryrke för Fysioterapeuter och sjukgymnaster.
related: ES2Z D87 uLq

Säkerhetsrådgivare och inspektörer
type: Concept
in scheme: JobTech Taxonomy - Yrkesbarometeryrken
top concept of: JobTech Taxonomy - Yrkesbarometeryrken
definition: Barometeryrke för Säkerhetsrådgivare och inspektörer.
related: xdLw h9E dNV
related: 77wX fg5 rMa
related: XEUg tcM vjF
related: SRCS uYJ MUP
related: wRxU Co2 FgS
related: PrPH J1d qua
related: NCaY h1f Eni
related: 9UWD XwF 4nX
related: uuGY vBh H4w

Civilingenjörer inom elektroteknik
type: Concept
in scheme: JobTech Taxonomy - Yrkesbarometeryrken
top concept of: JobTech Taxonomy - Yrkesbarometeryrken
definition: Barometeryrke för Civilingenjörer inom elektroteknik.
related: NbhD gbP tHm
related: eQpn LHp c2a
related: 37Yu WtR fRM
related: bVd9 PdQ nxv
related: YqiW QLd qHo
related: 7ZhX MM3 RvF
related: 4bkL eTC tAq

Skräddare och ateljésömmerskor
type: Concept
in scheme: JobTech Taxonomy - Yrkesbarometeryrken
top concept of: JobTech Taxonomy - Yrkesbarometeryrken
definition: Barometeryrke för Skräddare och ateljésömmerskor.
related: evtB Zc1 S4L
related: gJBf GLN b7x
related: tn2F 2Aw NWq
related: ras1 rJP 9UX
related: z9Cu vJh B55
related: M7XY rbq hwD
related: bS4M dZq 39m

Fastighetsskötare
type: Concept
in scheme: JobTech Taxonomy - Yrkesbarometeryrken
top concept of: JobTech Taxonomy - Yrkesbarometeryrken
definition: Barometeryrke för Fastighetsskötare.
related: gD5N mCM ea5

Frisörer
type: Concept
in scheme: JobTech Taxonomy - Yrkesbarometeryrken
top concept of: JobTech Taxonomy - Yrkesbarometeryrken
definition: Barometeryrke för Frisörer.
related: r4Ax 25F QjZ
related: 2mPd wgX 1zA
related: tuoE 9Nj fAS
related: hDzC BF5 Wz2

Lantmätare
type: Concept
in scheme: JobTech Taxonomy - Yrkesbarometeryrken
top concept of: JobTech Taxonomy - Yrkesbarometeryrken
definition: Barometeryrke för Lantmätare.
related: bmgy Rsq 4DA
related: 5mme U1P px4
related: 8rtq NCB wQA
related: aBY4 qDb bRP

Golvläggare (med yrkesbevis)
type: Concept
in scheme: JobTech Taxonomy - Yrkesbarometeryrken
top concept of: JobTech Taxonomy - Yrkesbarometeryrken
definition: Barometeryrke för Golvläggare (med yrkesbevis).
related: UUQD UFi 9hX
related: Mgiv Xs7 u2r

Biomedicinska analytiker
type: Concept
in scheme: JobTech Taxonomy - Yrkesbarometeryrken
top concept of: JobTech Taxonomy - Yrkesbarometeryrken
definition: Barometeryrke för Biomedicinska analytiker.
related: Pj8T bST f7D

Revisorer
type: Concept
in scheme: JobTech Taxonomy - Yrkesbarometeryrken
top concept of: JobTech Taxonomy - Yrkesbarometeryrken
definition: Barometeryrke för Revisorer.
related: jwgi jYc iE9
related: 6UAM i1i RYb

Skolsköterskor
type: Concept
in scheme: JobTech Taxonomy - Yrkesbarometeryrken
top concept of: JobTech Taxonomy - Yrkesbarometeryrken
definition: Barometeryrke för Skolsköterskor.
related: szfD hPZ y7M

Hovmästare
type: Concept
in scheme: JobTech Taxonomy - Yrkesbarometeryrken
top concept of: JobTech Taxonomy - Yrkesbarometeryrken
definition: Barometeryrke för Hovmästare.
related: 4ZeS 9Z9 wmL

Maskinoperatörer inom livsmedel
type: Concept
in scheme: JobTech Taxonomy - Yrkesbarometeryrken
top concept of: JobTech Taxonomy - Yrkesbarometeryrken
definition: Barometeryrke för Maskinoperatörer inom livsmedel.
related: qRP9 1dB UXM
related: PTXV RiA Cd4

Processoperatörer inom metall
type: Concept
in scheme: JobTech Taxonomy - Yrkesbarometeryrken
top concept of: JobTech Taxonomy - Yrkesbarometeryrken
definition: Barometeryrke för Processoperatörer inom metall.
related: bQpS SPS L9u

Tvätteriarbetare
type: Concept
in scheme: JobTech Taxonomy - Yrkesbarometeryrken
top concept of: JobTech Taxonomy - Yrkesbarometeryrken
definition: Barometeryrke för Tvätteriarbetare.
related: 8xk8 SZa cyW

Lager- och terminalpersonal
type: Concept
in scheme: JobTech Taxonomy - Yrkesbarometeryrken
top concept of: JobTech Taxonomy - Yrkesbarometeryrken
definition: Barometeryrke för Lager- och terminalpersonal.
related: GLp9 DyP gHJ
related: wQLK eDg pD4
related: Dj3u riG xsr
related: B41N Qiz vhj
related: zXv9 zv2 VUs
related: DLEi bTh oLA

Designers inom spel och digitala medier
type: Concept
in scheme: JobTech Taxonomy - Yrkesbarometeryrken
top concept of: JobTech Taxonomy - Yrkesbarometeryrken
definition: Barometeryrke för Designers inom spel och digitala medier.
related: 1qgf mXF 5Xp
related: Qrbr LWo Pqt
related: jg79 1KF Hvq
related: TQKD b9Y 57Z
related: NmF5 vMj Mjj
related: PTs4 wYQ zDP
related: 3GKG 7xX AcT
related: ytrP JCv bwH
related: pnt9 PEs zZy
related: 64tE EQA 3g4
related: StMY YV6 HYo
related: pxgV uM9 SaZ

Pedagoger inom kultur
type: Concept
in scheme: JobTech Taxonomy - Yrkesbarometeryrken
top concept of: JobTech Taxonomy - Yrkesbarometeryrken
definition: Barometeryrke för Pedagoger inom kultur.
related: QhS4 HKc T2v
related: TFdz Dvb vwc
related: qaj9 brh EM1
related: xrVh 3uf kWi
related: SA7K jqY K81
related: r8Cv UQf sS9
related: PC9e 5Fn 5Vx
related: zrQ9 1z2 kT3
related: f5ea EuN EfJ
related: 3XMs GiA szk
related: 1yBB G2R LGr
related: 6U5J pNt h6t
related: jUbF gem LC8
related: pUgn qWq yog
related: D8xk 1Sz Dqo
related: LQDq hXy t7W
related: KAF2 Th5 aiq

Journalister
type: Concept
in scheme: JobTech Taxonomy - Yrkesbarometeryrken
top concept of: JobTech Taxonomy - Yrkesbarometeryrken
definition: Barometeryrke för Journalister.
related: 4SdN cwv Tfo
related: KZSb ze9 LCc
related: 5x47 XP7 zyN
related: kHze MW7 PkZ
related: o5mU krL 1KT
related: GFu2 s4q 9sr
related: 7EQu 8Xg 9SD
related: b3Jk Gfs oo9
related: WYdq yJR JnE

SFI-lärare
type: Concept
in scheme: JobTech Taxonomy - Yrkesbarometeryrken
top concept of: JobTech Taxonomy - Yrkesbarometeryrken
definition: Barometeryrke för SFI-lärare.
related: 15e8 KDZ 31Z

Friskvårdskonsulter och hälsopedagoger
type: Concept
in scheme: JobTech Taxonomy - Yrkesbarometeryrken
top concept of: JobTech Taxonomy - Yrkesbarometeryrken
definition: Barometeryrke för Friskvårdskonsulter och hälsopedagoger.
related: qSsm wXn Z6i
related: VRVR RgP 6jV

Behandlingsassistenter och socialpedagoger
type: Concept
in scheme: JobTech Taxonomy - Yrkesbarometeryrken
top concept of: JobTech Taxonomy - Yrkesbarometeryrken
definition: Barometeryrke för Behandlingsassistenter och socialpedagoger.
related: jJNX nBj SN9
related: NSEG DmQ waj
related: MMTE fiP 1Ng
related: j57s wsS ecL
related: ddSf Ytu Kw1
related: GLCR pYe cxx

Personal- och HR-specialister
type: Concept
in scheme: JobTech Taxonomy - Yrkesbarometeryrken
top concept of: JobTech Taxonomy - Yrkesbarometeryrken
definition: Barometeryrke för Personal- och HR-specialister.
related: ds7X mdp bPc
related: s28Q sya S2b
related: 23nR PXa 9br
related: DHo9 qpj owx
related: 1aZz LY7 QYN
related: 1d3z y59 2Hm
related: Ygok j9c uke
related: uiqh Drm XGr
related: QaQC ozP Bme

Arbetsterapeuter
type: Concept
in scheme: JobTech Taxonomy - Yrkesbarometeryrken
top concept of: JobTech Taxonomy - Yrkesbarometeryrken
definition: Barometeryrke för Arbetsterapeuter.
related: xaaV c7e mk7
related: pTLB 6Zr fGi
related: heGV uHh o8W

Systemanalytiker och IT-arkitekter
type: Concept
in scheme: JobTech Taxonomy - Yrkesbarometeryrken
top concept of: JobTech Taxonomy - Yrkesbarometeryrken
definition: Barometeryrke för Systemanalytiker och IT-arkitekter.
related: Bk9y Nbk FYQ
related: i1F4 cZZ PJu
related: 6CfM iwp hDJ
related: XZaM BRb 3mM
related: Gjz2 EJT HGL
related: J7aL Ugk bkU
related: eSph tp4 T7Z
related: 7YaM bPu c1T
related: ziUj 67V Yk4
related: h643 FdG 96d
related: r66d XpS 6bt
related: TT8h qKk 1iu
related: QsNj UkQ Hg5

AT-läkare
type: Concept
in scheme: JobTech Taxonomy - Yrkesbarometeryrken
top concept of: JobTech Taxonomy - Yrkesbarometeryrken
definition: Barometeryrke för AT-läkare.
related: mtf5 vYH PCv

Studie- och yrkesvägledare
type: Concept
in scheme: JobTech Taxonomy - Yrkesbarometeryrken
top concept of: JobTech Taxonomy - Yrkesbarometeryrken
definition: Barometeryrke för Studie- och yrkesvägledare.
related: au7G ooX gGy
related: KYPa Jv8 ZbU

Kyl- och värmepumpstekniker
type: Concept
in scheme: JobTech Taxonomy - Yrkesbarometeryrken
top concept of: JobTech Taxonomy - Yrkesbarometeryrken
definition: Barometeryrke för Kyl- och värmepumpstekniker.
related: 6LYA Sgu hsR
related: 1ixi 57J KFF

Undersköterskor inom hemtjänst, hemsjukvård, äldreboende och habilitering
type: Concept
in scheme: JobTech Taxonomy - Yrkesbarometeryrken
top concept of: JobTech Taxonomy - Yrkesbarometeryrken
definition: Barometeryrke för Undersköterskor inom hemtjänst, hemsjukvård, äldreboende och habilitering.
related: bSEB VKd Ub3
related: wvmE VKa dzo

Kontorsreceptionister
type: Concept
in scheme: JobTech Taxonomy - Yrkesbarometeryrken
top concept of: JobTech Taxonomy - Yrkesbarometeryrken
definition: Barometeryrke för Kontorsreceptionister.
related: srEz jK8 dQ5
related: Bkm3 rLa uYG

Telefonförsäljare
type: Concept
in scheme: JobTech Taxonomy - Yrkesbarometeryrken
top concept of: JobTech Taxonomy - Yrkesbarometeryrken
definition: Barometeryrke för Telefonförsäljare.
related: WZ2C vH9 8ek
related: 6FAe TXj 2vw

Receptarier
type: Concept
in scheme: JobTech Taxonomy - Yrkesbarometeryrken
top concept of: JobTech Taxonomy - Yrkesbarometeryrken
definition: Barometeryrke för Receptarier.
related: abS5 M7h pMr

Bensinstationspersonal
type: Concept
in scheme: JobTech Taxonomy - Yrkesbarometeryrken
top concept of: JobTech Taxonomy - Yrkesbarometeryrken
definition: Barometeryrke för Bensinstationspersonal.
related: gZ4R TcH ir2

Lackerare och industrimålare
type: Concept
in scheme: JobTech Taxonomy - Yrkesbarometeryrken
top concept of: JobTech Taxonomy - Yrkesbarometeryrken
definition: Barometeryrke för Lackerare och industrimålare.
related: XGS1 7V1 8EN
related: v2HV VNh D7s
related: JG8k mXR Hat
related: tpQm zqJ xPr
related: cA1v Y45 FS4
related: u5rf SQW YE1
related: wyXB eSG eyX

Frivårds- och integrationshandläggare
type: Concept
in scheme: JobTech Taxonomy - Yrkesbarometeryrken
top concept of: JobTech Taxonomy - Yrkesbarometeryrken
definition: Barometeryrke för Frivårds- och integrationshandläggare.
related: wVNJ 2v4 NKo
related: KJoL 2hp Sa5
related: Vq8N Qvz i4u
related: KCzs vBp vXD

Betongarbetare (med yrkesbevis)
type: Concept
in scheme: JobTech Taxonomy - Yrkesbarometeryrken
top concept of: JobTech Taxonomy - Yrkesbarometeryrken
definition: Barometeryrke för Betongarbetare (med yrkesbevis).
related: s4uc rN5 Lje
related: 57z2 b5A hAT

Medicinska sekreterare/vårdadministratörer
type: Concept
in scheme: JobTech Taxonomy - Yrkesbarometeryrken
top concept of: JobTech Taxonomy - Yrkesbarometeryrken
definition: Barometeryrke för Medicinska sekreterare/vårdadministratörer.
related: EAao VsW pQb

Ingenjörer och tekniker inom elkraft
type: Concept
in scheme: JobTech Taxonomy - Yrkesbarometeryrken
top concept of: JobTech Taxonomy - Yrkesbarometeryrken
definition: Barometeryrke för Ingenjörer och tekniker inom elkraft.
related: 7Yn2 NLJ oa2
related: JaTP TuX 3wA
related: SHaU rbc XzE
related: VyPZ Aeo ka9
related: EGeL Yk2 ZWE
related: 6XM4 Hb5 CrT
related: kx3b 92W PuD
related: DE7c vm2 LTA

Kafé- och konditoribiträden
type: Concept
in scheme: JobTech Taxonomy - Yrkesbarometeryrken
top concept of: JobTech Taxonomy - Yrkesbarometeryrken
definition: Barometeryrke för Kafé- och konditoribiträden.
related: uWvx kdX rL5

Förare av jordbruks- och skogsmaskiner
type: Concept
in scheme: JobTech Taxonomy - Yrkesbarometeryrken
top concept of: JobTech Taxonomy - Yrkesbarometeryrken
definition: Barometeryrke för Förare av jordbruks- och skogsmaskiner.
related: hVUG 5nN gBh
related: j5hb nHr 8Q5

Anläggningsarbetare (med yrkesbevis)
type: Concept
in scheme: JobTech Taxonomy - Yrkesbarometeryrken
top concept of: JobTech Taxonomy - Yrkesbarometeryrken
definition: Barometeryrke för Anläggningsarbetare (med yrkesbevis).
related: y5XM 3yd YN6
related: K7QL Xmt nut
related: MQHi q9J x2d
related: Gbx4 8HD tme
related: Xkw4 BSP dad
related: fUgD M9L fen

Bygg- och anläggningsförare
type: Concept
in scheme: JobTech Taxonomy - Yrkesbarometeryrken
top concept of: JobTech Taxonomy - Yrkesbarometeryrken
definition: Barometeryrke för Bygg- och anläggningsförare.
related: xGr7 SGS U3F

Kassapersonal
type: Concept
in scheme: JobTech Taxonomy - Yrkesbarometeryrken
top concept of: JobTech Taxonomy - Yrkesbarometeryrken
definition: Barometeryrke för Kassapersonal.
related: 9e9K NST qHe
related: SuKt UNt RuE
related: j8X2 KhG 6ty

Psykologer
type: Concept
in scheme: JobTech Taxonomy - Yrkesbarometeryrken
top concept of: JobTech Taxonomy - Yrkesbarometeryrken
definition: Barometeryrke för Psykologer.
related: SEhy kME xFW
related: zRLw Aid zDh
related: te5X YVU JaR
related: xBo9 V9m bfg

Pizzabagare
type: Concept
in scheme: JobTech Taxonomy - Yrkesbarometeryrken
top concept of: JobTech Taxonomy - Yrkesbarometeryrken
definition: Barometeryrke för Pizzabagare.
related: 9YaE Syg 5ZB

Informatörer och kommunikatörer
type: Concept
in scheme: JobTech Taxonomy - Yrkesbarometeryrken
top concept of: JobTech Taxonomy - Yrkesbarometeryrken
definition: Barometeryrke för Informatörer och kommunikatörer.
related: aRp4 qjZ tPV
related: om9i fYm RSu
related: TGjW 5aJ 3jH
related: YmhJ 5rb V4W
related: ssMq a6Q Sd4
related: Cya6 5QD RTL
related: XiJJ yXL TC7
related: 64i5 ex4 BP9
related: JEfK mkY bp1
related: qrqz uUw so5
related: Mhxx 6q2 tY7
related: TxpA wa5 FBf
related: 2MWk Cnz tTJ
related: 7mFy ghh iL6
related: Sow7 TEq S9T

Löne- och personaladministratörer
type: Concept
in scheme: JobTech Taxonomy - Yrkesbarometeryrken
top concept of: JobTech Taxonomy - Yrkesbarometeryrken
definition: Barometeryrke för Löne- och personaladministratörer.
related: ofiS 5F2 YmV
related: ojEj nt6 PCa

Skolassistenter
type: Concept
in scheme: JobTech Taxonomy - Yrkesbarometeryrken
top concept of: JobTech Taxonomy - Yrkesbarometeryrken
definition: Barometeryrke för Skolassistenter.
related: BbP9 J9m o9L

Jurister
type: Concept
in scheme: JobTech Taxonomy - Yrkesbarometeryrken
top concept of: JobTech Taxonomy - Yrkesbarometeryrken
definition: Barometeryrke för Jurister.
related: vZwa QWZ tYo
related: 3yNP r6U JEp
related: EsXb 35r rTR
related: Ge1J Xyz cAL
related: zzs5 u1V MWZ
related: c9xX 2pP 87h
related: iiJF QdU neU
related: Jus5 Fsv LTi
related: pfiK oXH eYR
related: R1KJ g9V Hd1
related: ho3v 5nB pK4
related: CNqp v1H VoC
related: R96Q iZz EEN
related: CAJM dnc ki1
related: a1ej vRW F5w
related: Hoev CZJ Uej
related: NecX bp4 yu8
related: Mwfw wJn 8h1
related: B7rt Gcd YEP
related: 1gxo A2w 5A3
related: Y2fL gQi EVU
related: SxuD j5S Xmr
related: iXGB w9y 33h
related: xbZT DjD aWc
related: NRKi FKY H8E
related: xrNb bgJ bdD
related: J7Xj Srg vHe
related: 3RzT cHB vVp
related: gRYp hGs Ytg
related: tQFo jhD UXT
related: JsZC cXR Aop
related: e38N yjU sZq
related: Uarb tsK J19
related: UJuc Hqm GQg
related: i1oo e5Q bgL
related: U9AU Rre pbM
related: THPG 73G E5r
related: FVym vuE zrk
related: pryF 3WJ nLL
related: yxdq tQs wWo
related: rnBV XXP Uv2
related: uFNT 1EH Cgq
related: k81E qaH h78
related: BSxs sUz Urb

Skogsarbetare
type: Concept
in scheme: JobTech Taxonomy - Yrkesbarometeryrken
top concept of: JobTech Taxonomy - Yrkesbarometeryrken
definition: Barometeryrke för Skogsarbetare.
related: 1WpJ Ho8 Ley
related: mzyt mwS Lhr
related: 4fuh Uf7 NAA

Byggnads- och ventilationsplåtslagare (med yrkesbevis)
type: Concept
in scheme: JobTech Taxonomy - Yrkesbarometeryrken
top concept of: JobTech Taxonomy - Yrkesbarometeryrken
definition: Barometeryrke för Byggnads- och ventilationsplåtslagare (med yrkesbevis).
related: 4EZJ 3HN fUK
related: gwt3 c6R h8Y

Operatörer inom sågverk
type: Concept
in scheme: JobTech Taxonomy - Yrkesbarometeryrken
top concept of: JobTech Taxonomy - Yrkesbarometeryrken
definition: Barometeryrke för Operatörer inom sågverk.
related: eXSQ Gwt hZN
related: o8dP hY4 p8p
related: fGU9 3VM B6g

Montörer av träprodukter
type: Concept
in scheme: JobTech Taxonomy - Yrkesbarometeryrken
top concept of: JobTech Taxonomy - Yrkesbarometeryrken
definition: Barometeryrke för Montörer av träprodukter.
related: ZS6E gwQ wDF
related: dxsZ fG8 hvR

Arbetsförmedlare
type: Concept
in scheme: JobTech Taxonomy - Yrkesbarometeryrken
top concept of: JobTech Taxonomy - Yrkesbarometeryrken
definition: Barometeryrke för Arbetsförmedlare.
related: gPCx T6e 6P8
related: XSDj JZ2 ugu
related: Luo9 kCz Z8D
related: tFfE tZV 9u5

Underhållsmekaniker och maskinreparatörer
type: Concept
in scheme: JobTech Taxonomy - Yrkesbarometeryrken
top concept of: JobTech Taxonomy - Yrkesbarometeryrken
definition: Barometeryrke för Underhållsmekaniker och maskinreparatörer.
related: mszs EcM DgP
related: UEsj tfo nGD
related: ci6b Nc2 FmS
related: 9uVb cNz M1q
related: aNrh uSe mok
related: Gic7 SUy mGj
related: 9XKh kC3 A29
related: tgdx Nhu Cky
related: q7SB sGS x72

Lastbilsförare
type: Concept
in scheme: JobTech Taxonomy - Yrkesbarometeryrken
top concept of: JobTech Taxonomy - Yrkesbarometeryrken
definition: Barometeryrke för Lastbilsförare.
related: JiE6 FnP qXP
related: zxMH Zgf tsS
related: JEhg Dmh mzv
related: bhk6 aNU xRe
related: CMSX P2L ZYx
related: Bqc9 t1Y 7LZ
related: qx4W T5v KWs
related: S8DM Z9a 3W6
related: gobw eRi v1F
related: DjPb jLn 55T
related: 6nKy pXY CRv

Röntgensjuksköterskor
type: Concept
in scheme: JobTech Taxonomy - Yrkesbarometeryrken
top concept of: JobTech Taxonomy - Yrkesbarometeryrken
definition: Barometeryrke för Röntgensjuksköterskor.
related: ztEq Vts 77r

JobTech Taxonomy - Yrkesbarometeryrken
type: ConceptScheme
description: Terminologi för begrepp av typerna 'barometer-occupation'
publisher: https://jobtechdev.se/en

JobTech Taxonomy - Yrkesbarometeryrken
type: Collection
description: Begrepp av typen 'Yrkesbarometeryrken' (kod 'barometer-occupation')
member: Kundtjänstpersonal
member: Personal- och HR-specialister
member: Arbetsförmedlare
member: Maskinbefäl
member: Sjuksköterskor inom vård av äldre
member: Administrativa assistenter
member: Fartygsbefäl
member: Golvläggare (med yrkesbevis)
member: Ingenjörer och tekniker inom maskinteknik
member: Målare (med yrkesbevis)
member: Kallskänkor
member: Montörer av metall-, gummi- och plastprodukter
member: Laboratorieingenjörer
member: Brandmän
member: Takmontörer (med yrkesbevis)
member: Matroser och jungmän
member: CNC- och maskinoperatörer inom metall
member: Kuratorer
member: Arbetsterapeuter
member: Byggnads- och ventilationsplåtslagare (med yrkesbevis)
member: Städare
member: Fin-, inrednings- och möbelsnickare
member: Installations- och serviceelektriker (med certifikat)
member: Lantmätare
member: Bygg- och anläggningsförare
member: Barnmorskor
member: Anläggningsarbetare (med yrkesbevis)
member: Bagare och konditorer
member: Odlare av jordbruksväxter, frukt och bär
member: Träarbetare och snickare (med yrkesbevis)
member: Undersköterskor inom vård- och specialavdelningar och mottagningar
member: Butikssäljare (båt och motorfordon)
member: Speciallärare och specialpedagoger
member: Kafé- och konditoribiträden
member: Specialistläkare
member: Sjuksköterskor inom akutsjukvård
member: Bensinstationspersonal
member: Djursjukskötare
member: Kassapersonal
member: Bärplockare och plantörer
member: Tvätteriarbetare
member: Köksmästare och souschefer
member: Taxiförare
member: Civilingenjörer inom bygg och anläggning
member: Banktjänstemän
member: Lokförare
member: Kriminalvårdare
member: Restaurang- och köksbiträden
member: Läkare (exklusive AT-, ST- och specialistläkare)
member: SFI-lärare
member: Fritidspedagoger
member: Underhållsmekaniker och maskinreparatörer
member: Bilrekonditionerare
member: Optiker
member: Butikssäljare inom dagligvaruhandel
member: Lackerare och industrimålare
member: Maskinoperatörer inom livsmedel
member: Väktare och ordningsvakter
member: Maskinoperatörer inom plast
member: Servitörer
member: ST-läkare
member: Skolsköterskor
member: Undersköterskor inom hemtjänst, hemsjukvård, äldreboende och habilitering
member: Grovarbetare inom bygg och anläggning
member: Lärare i yrkesämnen
member: Montörer av elektrisk och elektronisk utrustning
member: Fastighetstekniker
member: Hudterapeuter
member: Budförare
member: Studieadministratörer och utbildningshandläggare
member: Personliga assistenter
member: Trädgårdsarbetare, skötsel utemiljö
member: Psykiatrisjuksköterskor
member: Trafiklärare
member: Förare av jordbruks- och skogsmaskiner
member: Systemförvaltare
member: Hamnarbetare