JobTech Taxonomy - SUN utbildningsområde
type: ConceptScheme
description: Terminologi för begrepp av typerna 'sun-education-field-1', 'sun-education-field-2', 'sun-education-field-3', 'sun-education-field-4'
publisher: https://jobtechdev.se/en

JobTech Taxonomy - SUN utbildningsinriktning nivå 1
type: Collection
description: Begrepp av typen 'SUN utbildningsinriktning nivå 1' (kod 'sun-education-field-1')
member: Hälso- och sjukvård samt social omsorg
member: Allmän utbildning
member: Naturvetenskap, matematik och informations- och kommunikationsteknik (IKT)
member: Tjänster
member: Teknik och tillverkning
member: Lant- och skogsbruk samt djursjukvård
member: Pedagogik och lärarutbildning
member: Samhällsvetenskap, juridik, handel, administration
member: Humaniora och konst
member: Okänd

JobTech Taxonomy - SUN utbildningsinriktning nivå 2
type: Collection
description: Begrepp av typen 'SUN utbildningsinriktning nivå 2' (kod 'sun-education-field-2')
member: Hälso- och sjukvård
member: Samhällsbyggnad och byggnadsteknik
member: Journalistik och information
member: Konst och media
member: Matematik och övrig naturvetenskap
member: Teknik och teknisk industri
member: Bred, generell utbildning
member: Okänd
member: Biologi och miljövetenskap
member: Lantbruk, trädgård, skog och fiske
member: Humaniora
member: Fysik, kemi och geovetenskap
member: Arbetsmiljö och renhållning
member: Pedagogik och lärarutbildning
member: Juridik och rättsvetenskap
member: Läs- och skrivinlärning för vuxna
member: Socialt arbete och omsorg
member: Säkerhetstjänster
member: Personlig utveckling
member: Informations- och kommunikationsteknik (IKT)
member: Företagsekonomi, handel och administration
member: Transporttjänster
member: Material och tillverkning
member: Samhälls- och beteendevetenskap
member: Personliga tjänster
member: Djursjukvård

JobTech Taxonomy - SUN utbildningsinriktning nivå 3
type: Collection
description: Begrepp av typen 'SUN utbildningsinriktning nivå 3' (kod 'sun-education-field-3')
member: Barn och ungdom
member: Samhälls- och beteendevetenskap, övrig och ospecificerad utbildning
member: Konsthantverk
member: Socialt arbete
member: Omvårdnad
member: Samhällsbyggnad och byggnadsteknik, övrig och ospecificerad utbildning
member: Geovetenskap och naturgeografi
member: Kemi- och bioteknik
member: Filosofi och logik
member: Inköp, försäljning och distribution
member: Humaniora, övrig och ospecificerad utbildning
member: Elektronik, datateknik och automation
member: Lärarutbildning för förskola och fritidsverksamhet
member: Skog
member: Biologi och miljövetenskap, övrig och ospecificerad utbildning
member: Lärarutbildning för grundskolans tidiga åldrar
member: Personlig utveckling
member: Journalistik och information, allmän utbildning
member: Medicin
member: Transporttjänster
member: Tillverkning och hantering av livsmedel
member: Samhällsbyggnad och byggnadsteknik, allmän utbildning
member: Berg- och mineralteknik
member: Arbetsmiljö och renhållning, allmän utbildning
member: Juridik och rättsvetenskap
member: Företagsekonomi, handel och administration, allmän utbildning
member: Idrott och friskvård
member: Säkerhetstjänster, allmän utbildning
member: Sociologi, etnologi och kulturgeografi
member: Lantbruk, trädgård, skog och fiske, allmän utbildning
member: Ledning och administration
member: Personliga tjänster, övrig och ospecificerad utbildning
member: Djursjukvård
member: Arbetsmiljö och arbetarskydd
member: Nationalekonomi och ekonomisk historia
member: Medieproduktion
member: Pedagogik
member: Konst och media, allmän utbildning
member: Teknik och teknisk industri, allmän utbildning
member: Datavetenskap och systemvetenskap
member: Turism, resor och fritid
member: Tekniskt inriktad vårdutbildning
member: Humaniora, allmän utbildning
member: Lantbruk
member: Fiske och vattenbruk
member: Arbetsmiljö och renhållning, övrig och ospecificerad utbildning
member: Byggnadsteknik och anläggningsteknik
member: Säkerhetstjänster, övrig och ospecificerad utbildning
member: Konst och media, övrig och ospecificerad utbildning
member: Terapi, rehabilitering och kostbehandling
member: Matematik
member: Material och tillverkning, allmän utbildning
member: Farmaci
member: Journalistik och medievetenskap
member: Säkerhet i samhället
member: Statistik
member: Hälso- och sjukvård, allmän utbildning
member: Läs- och skrivinlärning för vuxna
member: Tillverkning av produkter av trä, papper, glas, porslin och plast
member: Naturvård och djurskydd
member: Bank, försäkring och finansiering
member: Journalistik och information, övrig och ospecificerad utbildning
member: Musik, dans och dramatik
member: Hårvård, skönhetsvård och massage
member: Personliga tjänster, allmän utbildning
member: Kemi
member: Marknadsföring
member: Hotell, restaurang och storhushåll
member: Industriell ekonomi och organisation
member: Socialt arbete och socialt omsorgsarbete, övrig och ospecificerad utbildning
member: Informations- och kommunikationsteknik (IKT), allmän utbildning
member: Redovisning och beskattning
member: Biologi och biokemi
member: Religion
member: Lantbruk, trädgård, skog och fiske, övrig och ospecificerad utbildning
member: Matematik och naturvetenskap, övrig och ospecificerad utbildning
member: Tillverkning av textilier, konfektion och lädervaror

JobTech Taxonomy - SUN utbildningsinriktning nivå 4
type: Collection
description: Begrepp av typen 'SUN utbildningsinriktning nivå 4' (kod 'sun-education-field-4')
member: Litteraturvetenskap och litteraturhistoria
member: Säkerhetstjänster, allmän utbildning
member: Allmän språkkunskap och allmänt språkliga utbildningar
member: Dokumentations- och informationsvetenskap
member: Musik
member: Läkarutbildning, enskilda basspecialiteter, exklusive allmänmedicin
member: Officersutbildning
member: Bred, generell utbildning, annan inriktning
member: Civilingenjörsutbildning, fordons- och farkostteknik
member: Polisutbildning
member: Renhållning och avfallshantering
member: Ingenjörsutbildning, energi- och elektroteknik
member: Svenska minoritetsspråk
member: Civilingenjörsutbildning, övrig och ospecificerad utbildning
member: Översättning och tolkning
member: Studie- och yrkesvägledarutbildning
member: Personlig utveckling
member: Företagsekonomi, handel och administration, övrig och ospecificerad utbildning
member: Annan utbildning inom lantbruk
member: Ingenjörsutbildning, trä, papper, glas, porslin och plast
member: Lärarutbildning, hotell och restaurang
member: Sjukhusfysikerutbildning
member: Bank, försäkring och finansiering
member: Specialistsjuksköterskeutbildning, onkologisk vård
member: Annan utbildning i nationalekonomi och ekonomisk historia
member: Speciallärarutbildning
member: Annan utbildning i fordons- och farkostteknik
member: Tandläkarutbildning
member: Modersmålslärarutbildning
member: Miljövetenskap
member: Företagsekonomi, organisation och management
member: Redovisning och beskattning
member: Civilingenjörsutbildning, byggnadsteknik
member: Annan omvårdnadsutbildning, psykiskt funktionsnedsatta
member: Läkarutbildning, bild- och funktionsmedicinska specialiteter
member: Byggnadssnickeri
member: Dietistutbildning
member: Film-, radio- och tv-produktion
member: Lärarutbildning, förskola
member: Statistik
member: Journalistik
member: Ingenjörsutbildning, bred inriktning mot byggande
member: Audionomutbildning
member: Barnmorskeutbildning
member: Transporttjänster, allmän utbildning
member: Tandsköterskeutbildning
member: Annan utbildning inom medicin
member: Energi, drift och underhåll
member: Lärarutbildning, vård och omsorg
member: Annan utbildning i svenska och litteraturvetenskap
member: Dans, teater och dramatik
member: Annan utbildning i psykologi
member: Filosofi och logik
member: Annan omvårdnadsutbildning, övriga inriktningar
member: Civilingenjörsutbildning, maskinteknik
member: Civilingenjörsutbildning, trä, papper, glas, porslin och plast
member: Annan lärarutbildning för grundskolans tidiga åldrar
member: Massageutbildning
member: Svenska och nordiska språk
member: Jägmästar- och skogsvetarutbildning
member: Lärarutbildning, naturbruk
member: Annan utbildning inom formgivning
member: Ämneslärarutbildning, matematik, data, naturvetenskap och teknik i kombination med historia, samhällsvetenskap och företagsekonomi
member: Ingenjörsutbildning, textilteknologi
member: Ämneslärarutbildning, matematik, data, naturvetenskap och teknik i kombination med praktisk-estetiska ämnen
member: Fysioterapeututbildning
member: Utbildning i djurvård
member: Idrott och friskvård
member: Företagsekonomi, marknadsföring
member: Hortonomutbildning
member: Annan utbildning i elektronik, datateknik och automation
member: Kiropraktorutbildning
member: Specialistsjuksköterskeutbildning, intensivvård
member: Annan utbildning i främmande språk
member: Naprapatutbildning
member: Annan utbildning inom textilier, konfektion och läder
member: Annan utbildning inom transporttjänster

Tekniskt inriktad vårdutbildning
type: Concept
in scheme: JobTech Taxonomy - SUN utbildningsområde
definition: Här ingår utbildningar inriktade mot en rad olika tekniker/teknologier som används för att diagnostisera och behandla sjukdomar och handikapp.
broader: Hälso- och sjukvård
narrower: Sjukhusfysikerutbildning
narrower: Biomedicinsk analytikerutbildning
narrower: Annan tekniskt inriktad vårdutbildning
narrower: Röntgensjuksköterskeutbildning
narrower: Optikerutbildning
narrower: Audionomutbildning
narrower: Ortopedingenjörsutbildning

Glas- och porslinstillverkning
type: Concept
in scheme: JobTech Taxonomy - SUN utbildningsområde
definition: Glas- och porslinstillverkning
broader: Tillverkning av produkter av trä, papper, glas, porslin och plast
related: oJSp tHC DuR
related: Atc1 Q8Z 2mc
related: 5VdM GPZ ftL
related: jLPA Myg vqa

Säkerhetstjänster
type: Concept
in scheme: JobTech Taxonomy - SUN utbildningsområde
definition: Säkerhetstjänster
broader: Tjänster
narrower: Säkerhet i samhället
narrower: Säkerhetstjänster, allmän utbildning
narrower: Säkerhetstjänster, övrig och ospecificerad utbildning
narrower: Militär utbildning

Läkarutbildning, kirurgiska specialiteter
type: Concept
in scheme: JobTech Taxonomy - SUN utbildningsområde
definition: Omfattar: · Anestesi och intensivvård · Barn- och ungdomskirurgi · Övriga kirurgiska specialiteter
broader: Medicin
related: SEGc ZcL bGL
related: GWjU MW8 sYo
related: YkuM k11 66G
related: 94gy sCc riA
related: gzxT J1q Q1G
related: odSB WvP V2m
related: syj1 KrL qf2
related: Gu7M dRY sad
related: GGKa SCn rPr
related: 1gc3 qP3 oHJ
related: RZrr jKx SiQ
related: fnaH ri3 dUa
related: Ax5A 5h8 hvK
related: evqV cPs HXe
related: C8ij inY 383
related: eG7i LdW 64m
related: BmR3 PRp ZDe
related: 82Ah QrV Ydy
related: AfAA pdi 1Ba
related: zWF8 yFt mzh
related: 7w1Q Uy6 7z6

Civilingenjörsutbildning, berg- och mineralteknik
type: Concept
in scheme: JobTech Taxonomy - SUN utbildningsområde
definition: Omfattar också: · Civilingenjörsutbildningar inom naturresursteknik
broader: Berg- och mineralteknik
related: sW3S wSa HZx
related: 27fY Dfg CWS

Lantmästarutbildning
type: Concept
in scheme: JobTech Taxonomy - SUN utbildningsområde
definition: Lantmästarutbildning
broader: Lantbruk
related: RCtg 4FA NVo

Utbildning för postservice
type: Concept
in scheme: JobTech Taxonomy - SUN utbildningsområde
definition: Utbildning för postservice
broader: Transporttjänster
related: JXfL 54x TNu

Socialt arbete och socialt omsorgsarbete, övrig och ospecificerad utbildning
type: Concept
in scheme: JobTech Taxonomy - SUN utbildningsområde
definition: Socialt arbete och socialt omsorgsarbete, övrig och ospecificerad utbildning
broader: Socialt arbete och socialt omsorgsarbete, övrig och ospecificerad utbildning

Företagsekonomi, annan inriktning
type: Concept
in scheme: JobTech Taxonomy - SUN utbildningsområde
definition: Omfattar: · Utbildning inom företagsekonomi, inriktning affärssystem · Utbildning inom företagsekonomi, inriktning distribution och logistik · Utbildning inom företagsekonomi, inriktning ekonomistyrning · Utbildning inom företagsekonomi, inriktning entreprenörskap · Utbildning inom företagsekonomi, inriktning IT-ekonomi · Övriga utbildningar i företagsekonomi, annan inriktning Omfattar inte: · Utbildning i affärslogistik, jfr 345a · Utbildning i företagsekonomi, internationell inriktning, jfr 340a
broader: Företagsekonomi, handel och administration, allmän utbildning
related: HYEF BNM w2M
related: F8aA i2f SXp
related: LxTP ht6 nCJ
related: hjgC mET uzP
related: o35Y SRG SPj
related: vM7K q9e ibJ

Arbetsmiljö och renhållning
type: Concept
in scheme: JobTech Taxonomy - SUN utbildningsområde
definition: Arbetsmiljö och renhållning
broader: Tjänster
narrower: Arbetsmiljö och renhållning, övrig och ospecificerad utbildning
narrower: Renhållning och avfallshantering
narrower: Arbetsmiljö och renhållning, allmän utbildning
narrower: Arbetsmiljö och arbetarskydd

Företagsekonomi, handel och administration
type: Concept
in scheme: JobTech Taxonomy - SUN utbildningsområde
definition: Företagsekonomi, handel och administration
broader: Samhällsvetenskap, juridik, handel, administration
narrower: Redovisning och beskattning
narrower: Företagsekonomi, handel och administration, övrig och ospecificerad utbildning
narrower: Kontorsservice och sekreterartjänster
narrower: Ledning och administration
narrower: Marknadsföring
narrower: Företagsekonomi, handel och administration, allmän utbildning
narrower: Bank, försäkring och finansiering
narrower: Arbetsplatsrelaterad utbildning
narrower: Inköp, försäljning och distribution

Lärarutbildning i yrkesämne och praktisk-estetiska ämnen
type: Concept
in scheme: JobTech Taxonomy - SUN utbildningsområde
definition: Här ingår utbildningar inriktade mot att undervisa i yrkesämnen och i praktisk-estetiska ämnen.
broader: Pedagogik och lärarutbildning
narrower: Lärarutbildning, trä- och metallslöjd samt textilslöjd
narrower: Lärarutbildning, hem- och konsumentkunskap
narrower: Lärarutbildning, dans och teater
narrower: Lärarutbildning, handel och administration
narrower: Lärarutbildning i annat yrkesämne och praktisk-estetiska ämnen
narrower: Lärarutbildning, naturbruk
narrower: Lärarutbildning, vård och omsorg
narrower: Lärarutbildning, hotell och restaurang
narrower: Lärarutbildning, medieproduktion
narrower: Lärarutbildning, idrott och hälsa
narrower: Lärarutbildning, musik
narrower: Lärarutbildning, bild och formkonst
narrower: Lärarutbildning, industri och hantverk

VVS-utbildning
type: Concept
in scheme: JobTech Taxonomy - SUN utbildningsområde
definition: VVS-utbildning
broader: Byggnadsteknik och anläggningsteknik
related: P6R9 ysV yTm
related: vrH4 zGX 7e9

Annan utbildning inom omvårdnad
type: Concept
in scheme: JobTech Taxonomy - SUN utbildningsområde
definition: Omfattar: · Utbildning som leder till generell examen inom omvårdnad · Utbildning som leder till generell examen inom vårdvetenskap
broader: Omvårdnad
related: J8vC U48 goT
related: VwPu PqZ aTv

Samhällsbyggnad och byggnadsteknik, övrig och ospecificerad utbildning
type: Concept
in scheme: JobTech Taxonomy - SUN utbildningsområde
definition: Samhällsbyggnad och byggnadsteknik, övrig och ospecificerad utbildning
broader: Samhällsbyggnad och byggnadsteknik, övrig och ospecificerad utbildning

Biologi och miljövetenskap, allmän utbildning
type: Concept
in scheme: JobTech Taxonomy - SUN utbildningsområde
definition: Biologi och miljövetenskap, allmän utbildning
broader: Biologi och miljövetenskap, allmän utbildning

Kemi- och bioteknik
type: Concept
in scheme: JobTech Taxonomy - SUN utbildningsområde
definition: Här ingår tekniska utbildningar inriktade mot kemiska och biologiska processer. Det inkluderar utbildningar med teknisk inriktning som har fokus på kemisk industri och processindustri.
broader: Teknik och teknisk industri
narrower: Processindustriteknik
narrower: Ingenjörsutbildning, kemi- och bioteknik
narrower: Laboratorieteknik
narrower: Annan utbildning i kemi- och bioteknik
narrower: Civilingenjörsutbildning, kemi- och bioteknik

Psykologi
type: Concept
in scheme: JobTech Taxonomy - SUN utbildningsområde
definition: Här ingår utbildningar inriktade mot människors sätt att känna, tänka och handla utifrån individernas olikheter, erfarenheter och miljö.
broader: Samhälls- och beteendevetenskap
narrower: Annan utbildning i psykologi
narrower: Psykoterapeututbildning
narrower: Psykologutbildning
narrower: Psykologutbildning, inklusive fullgjord praktiktjänstgöring (PTP)

Barnmorskeutbildning
type: Concept
in scheme: JobTech Taxonomy - SUN utbildningsområde
definition: Barnmorskeutbildning
broader: Omvårdnad
related: Ym8P FaF mNd

Systemutveckling och programmering
type: Concept
in scheme: JobTech Taxonomy - SUN utbildningsområde
definition: Omfattar: · Applikationsutveckling · Utbildningar i data- och systemvetenskap · Utbildningar i informatik · Utbildningar i informationsarkitektur · Utbildningar i informationssystem · Utbildningar i medicinsk informatik · Utbildningar i medieteknik · Utbildningar i systemhantering och programmering · Utbildningar i systemvetenskap · Utbildningar till databasutvecklare · Utbildningar till mjukvarutestare · Utbildningar till programmerare, mobil · Utbildningar till programmerare, spel · Utbildningar till webbutvecklare · Övriga utbildningar i systemutveckling och programmering Omfattar inte: · Civilingenjörs- och ingenjörsutbildningar i datateknik, informationsteknologi, eller medieteknik, jfr 523 · Tekniska utbildningar som ger kunskap om konstruktion av datorer (maskinvara), jfr 523 · Utbildning i speldesign med tonvikt på grafisk design, jfr 213d
broader: Datavetenskap och systemvetenskap
related: qd4t Uom HpT
related: c7Fz 2cA 7ZC
related: k2nm 7ss NnX
related: vxnU XUS Qgy
related: uo6r Mvw H9z
related: 4GYo UUA LR3
related: po8N jhA UZB
related: kgqB 5hC yDS
related: FwNn 9cy 9DZ
related: q2nQ 7zx PGg
related: WqZp DeL 43R
related: 76z6 NZb xHQ
related: t4sa rKY zru
related: nJrP YTh 7rx
related: T6hF tCj cZ4
related: jfgc TbF 1pt

Läkarutbildning, tilläggsspecialiteter
type: Concept
in scheme: JobTech Taxonomy - SUN utbildningsområde
definition: Omfattar: · Allergologi · Arbetsmedicin · Beroendemedicin · Gynekologisk onkologi · Nuklearmedicin · Palliativ medicin · Skolhälsovård · Smärtlindring · Vårdhygien · Äldrepsykiatri · Övriga tilläggsspecialiteter
broader: Medicin
related: uY2h t6x Cn9
related: J2pY Vij YXq
related: m8k7 JES s9B
related: oHcT vjL 8cq
related: EJ12 c54 gYz
related: pDUp SCH 5Gw
related: 1dq7 P2Y L4T
related: L8hJ UEA khe
related: 7buz wrB AJr
related: Y8Hw Dj7 mzj
related: h6TM CiK 2fm
related: PPJ5 c1P KcF
related: YaR5 k5y Spn

Specialistsjuksköterskeutbildning, öppen och annan inriktning
type: Concept
in scheme: JobTech Taxonomy - SUN utbildningsområde
definition: Omfattar: · Akutsjukvårdutbildning · Diabetesvårdutbildning · Diagnostisk radiologiutbildning · Företagshälsovårdutbildning · Gastroenterologisk vårdutbildning · Hjärtsjukvårdutbildning · Infektionssjukvårdutbildning · Skolsköterskeutbildning · Ögonsjukvårdutbildning · Övrig specialistsjuksköterskeutbildning, öppen och annan inriktning Omfattar också: · Sjuksköterskeutbildning, (äldre) vidareutbildning med inriktning allmän hälso- och sjukvård
broader: Omvårdnad
related: z5v5 j6T 175
related: gCUP 4ZA Sz8
related: 1dUg Jaj yvZ
related: 4bba F4N ur8
related: Cq2f jKn ooe
related: vSdm Wd9 rTh
related: Q63n PuD TZW
related: dTMp 6dP Xu3
related: zkNk Hrj 6Td
related: YL9y cMD X9B
related: gfYZ sLm QmA
related: pokZ 3Rs qmC

Konst och media, allmän utbildning
type: Concept
in scheme: JobTech Taxonomy - SUN utbildningsområde
definition: Här ingår breda utbildningar inriktade mot konst och media utan tydlig tyngdpunkt på någon av de övriga inriktningarna under 21.
broader: Konst och media
narrower: Konst och media, allmän utbildning

Biologi och miljövetenskap, allmän utbildning
type: Concept
in scheme: JobTech Taxonomy - SUN utbildningsområde
definition: Här ingår breda utbildningar inriktade mot biologi, miljövetenskap, miljö- och naturvård utan klar tyngdpunkt mot någon av de övriga inriktningarna inom 42.
broader: Biologi och miljövetenskap
narrower: Biologi och miljövetenskap, allmän utbildning

Trädgårdsingenjörs- och trädgårdsteknikerutbildning
type: Concept
in scheme: JobTech Taxonomy - SUN utbildningsområde
definition: Trädgårdsingenjörs- och trädgårdsteknikerutbildning
broader: Trädgård
related: o3na szd RoS
related: E77x jEB JAP

Annan utbildning i elektronik, datateknik och automation
type: Concept
in scheme: JobTech Taxonomy - SUN utbildningsområde
definition: Omfattar också: · Gymnasieskolans teknikprogram, inriktning informations- och medieteknik · Utbildning i kommunikationsteknik · Utbildning som leder till generell examen inom automatiseringsteknik · Utbildning som leder till generell examen inom datateknik · Utbildning som leder till generell examen inom elektronik · Utbildning som leder till generell examen inom informationsteknologi, med tyngdpunkt inom teknik · Utbildning som leder till generell examen inom medieteknik, med tyngdpunkt inom teknik · Övrig utbildning i elektronik, datateknik och automation Omfattar inte: · Utbildningar i medieteknik, ej teknisk tyngdpunkt, jfr 481a · Utbildningar inriktade mot datavetenskap, jfr 481b · Utbildningar inriktade mot systemering och programvaruteknik, jfr 481a
broader: Elektronik, datateknik och automation
related: jgm1 KJY 7h5
related: J8fM Ga5 UU1
related: iZch hBN guP
related: VM9z qp3 eNg
related: 52fk zAk bQh
related: An1v tUU 58t
related: TmLX azH raJ
related: 43DM iZV tYN
related: Z55j wVq N99
related: wdJ7 ABw cwD
related: VwcV VgS nUM
related: bCbk 6xt qij
related: sc9m C7q 5Fw
related: BuNG Cqs 8v2
related: h3rX dXX rL9
related: RuV2 X6U 2PA
related: suQc mTA z63
related: EHdJ JGo v7t
related: Vacq uRd 1tF
related: yCg6 R1s Dcy

Franska
type: Concept
in scheme: JobTech Taxonomy - SUN utbildningsområde
definition: Franska
broader: Främmande språk och språkvetenskap
related: VGJS PiK Fz1

Konst och media
type: Concept
in scheme: JobTech Taxonomy - SUN utbildningsområde
definition: Konst och media
broader: Humaniora och konst
narrower: Medieproduktion
narrower: Bild- och formkonst
narrower: Musik, dans och dramatik
narrower: Konst och media, övrig och ospecificerad utbildning
narrower: Formgivning
narrower: Konst och media, allmän utbildning
narrower: Konsthantverk

Journalistik och information
type: Concept
in scheme: JobTech Taxonomy - SUN utbildningsområde
definition: Journalistik och information
broader: Samhällsvetenskap, juridik, handel, administration
narrower: Journalistik och medievetenskap
narrower: Journalistik och information, allmän utbildning
narrower: Biblioteks- och dokumentationsvetenskap
narrower: Journalistik och information, övrig och ospecificerad utbildning

Läkarutbildning, bild- och funktionsmedicinska specialiteter
type: Concept
in scheme: JobTech Taxonomy - SUN utbildningsområde
definition: Omfattar också: · Barn- och ungdomsradiologi
broader: Medicin
related: 4XE8 tKG Ezx
related: DcA5 jwb o1j
related: h9MA nW7 jSE
related: GvWo 9Wo jWs
related: WFvi vcM evT
related: GhrC x13 AgQ
related: oRRv SHb cmX

Konst och media, övrig och ospecificerad utbildning
type: Concept
in scheme: JobTech Taxonomy - SUN utbildningsområde
definition: Här redovisas utbildningar inom konst och media som inte kan föras till någon av de övriga inriktningarna inom 21, Konst och media. Breda utbildningar inom området ingår inte.
broader: Konst och media
narrower: Konst och media, övrig och ospecificerad utbildning

Pappersmassa- och papperstillverkning
type: Concept
in scheme: JobTech Taxonomy - SUN utbildningsområde
definition: Pappersmassa- och papperstillverkning
broader: Tillverkning av produkter av trä, papper, glas, porslin och plast
related: ZzMz m43 8D2

Fordons- och farkostteknik
type: Concept
in scheme: JobTech Taxonomy - SUN utbildningsområde
definition: Här ingår tekniska utbildningar inriktade mot konstruktion, produktion, utveckling, underhåll och reparation av motorfordon, fartyg och flygplan.
broader: Teknik och teknisk industri
narrower: Annan utbildning i fordons- och farkostteknik
narrower: Fartygs- och flygteknik
narrower: Ingenjörsutbildning, fordons- och farkostteknik
narrower: Civilingenjörsutbildning, fordons- och farkostteknik
narrower: Fordonsteknik

Civilingenjörsutbildning, livsmedel
type: Concept
in scheme: JobTech Taxonomy - SUN utbildningsområde
definition: Civilingenjörsutbildning, livsmedel
broader: Tillverkning och hantering av livsmedel
related: 99nd kNy rqG

Journalistik
type: Concept
in scheme: JobTech Taxonomy - SUN utbildningsområde
definition: Omfattar också: · Utbildningar inom bildjournalistik · Utbildning till webbredaktör, tyngdpunkt redaktionellt innehåll
broader: Journalistik och medievetenskap
related: E9iZ rqz VcR
related: g4uT VRd 5WC
related: pRW4 z1W u6e

Civilingenjörsutbildning, trä, papper, glas, porslin och plast
type: Concept
in scheme: JobTech Taxonomy - SUN utbildningsområde
definition: Omfattar inte: · Civilingenjörsutbildningar i materialteknik om tyngdpunkten ligger på metallurgi, jfr 544a
broader: Tillverkning av produkter av trä, papper, glas, porslin och plast
related: 7DTL cfj JEt

Främmande språk och språkvetenskap
type: Concept
in scheme: JobTech Taxonomy - SUN utbildningsområde
definition: Här omfattas utbildningar inriktade mot uppbyggnad och komposition av främmande språk. Det inkluderar till språket relaterade kulturer, litteratur och språkvetenskap. Allmänt språkvetenskapliga utbildningar ingår också. Utbildning i de svenska minoritetsspråken finska, jiddisch, meänkieli, romani, och samiska redovisas under svenska minoritetsspråk (223b).
broader: Humaniora
narrower: Annan utbildning i främmande språk
narrower: Ryska
narrower: Arabiska
narrower: Svenska som främmande språk
narrower: Allmän språkkunskap och allmänt språkliga utbildningar
narrower: Tyska
narrower: Franska
narrower: Spanska
narrower: Översättning och tolkning
narrower: Engelska
narrower: Japanska
narrower: Kinesiska

Industri- och produktdesign
type: Concept
in scheme: JobTech Taxonomy - SUN utbildningsområde
definition: Omfattar också: · Utbildningar inom förpackningsdesign
broader: Formgivning
related: DQbU KUB 9Eh
related: JqNo tGD DGk
related: xSTG 4am gVh

Biologi och miljövetenskap
type: Concept
in scheme: JobTech Taxonomy - SUN utbildningsområde
definition: Biologi och miljövetenskap
broader: Naturvetenskap, matematik och informations- och kommunikationsteknik (IKT)
narrower: Miljövård och miljöskydd
narrower: Biologi och miljövetenskap, allmän utbildning
narrower: Biologi och biokemi
narrower: Naturvård och djurskydd
narrower: Miljövetenskap
narrower: Biologi och miljövetenskap, övrig och ospecificerad utbildning

Fysik, kemi och geovetenskap
type: Concept
in scheme: JobTech Taxonomy - SUN utbildningsområde
definition: Fysik, kemi och geovetenskap
broader: Naturvetenskap, matematik och informations- och kommunikationsteknik (IKT)
narrower: Fysik, kemi och geovetenskap, allmän utbildning
narrower: Geovetenskap och naturgeografi
narrower: Fysik
narrower: Fysik, kemi och geovetenskap, övrig och ospecificerad utbildning
narrower: Kemi

Ingenjörsutbildning, livsmedel
type: Concept
in scheme: JobTech Taxonomy - SUN utbildningsområde
definition: Ingenjörsutbildning, livsmedel
broader: Tillverkning och hantering av livsmedel
related: 7x7B DU3 uZW

Annan utbildning i miljöteknik och miljökontroll
type: Concept
in scheme: JobTech Taxonomy - SUN utbildningsområde
definition: Omfattar: · Miljöteknisk yrkesutbildning · Utbildning i återvinning, med tyngdpunkt på miljöteknik · Utbildning som leder till generell examen inom ekoteknik · Utbildning som leder till generell examen inom miljöteknik · Utbildning som leder till generell examen inom vattenteknik · Övrig utbildning i miljöteknik och miljökontroll Omfattar inte: · Utbildningar i miljövetenskap, jfr 422z · Utbildningar i samhällsbyggnad, jfr 581
broader: Miljöteknik och miljökontroll
related: gPCs TL4 BQx
related: rhcm RvQ xQw
related: z5sb QZi E8V
related: USy6 b5x UyD
related: rJgz Q8j umn

Svenska och nordiska språk
type: Concept
in scheme: JobTech Taxonomy - SUN utbildningsområde
definition: Omfattar inte: · Modersmålsutbildning, jfr 223c · Svenska minoritetsspråk, jfr 223b · Svenska som andraspråk, jfr 222g
broader: Svenska och litteraturvetenskap
related: gfhX bqH U4K
related: uZmn 3kj LEE
related: BiGm 58D SSn

Bageri och konditori
type: Concept
in scheme: JobTech Taxonomy - SUN utbildningsområde
definition: Bageri och konditori
broader: Tillverkning och hantering av livsmedel
related: 4t2m 4Dj ksJ
related: 7nop FpW VKt

Handel och administration
type: Concept
in scheme: JobTech Taxonomy - SUN utbildningsområde
definition: Omfattar: · Gymnasieskolans handels- och administrationsprogram Omfattar också: · Breda yrkesinriktade utbildningar inom handel och administration
broader: Företagsekonomi, handel och administration, allmän utbildning
related: HGDY Mss U4y
related: PkFD erP 1gY
related: 3T7X hXw 7rj

Annan utbildning inom djursjukvård
type: Concept
in scheme: JobTech Taxonomy - SUN utbildningsområde
definition: Omfattar: · Utbildning som leder till generell examen inom djuromvårdnad · Utbildning som leder till generell examen inom veterinärmedicin · Utbildning till djurvårdare · Övriga utbildningar inom djursjukvård Omfattar inte: · Utbildning till hovslagare, jfr 621f · Utbildning till klövvårdare, jfr 621g · Utbildningar i djurhållning och hästhållning, jfr 621e och 621f · Utbildningar i vård av friska djur, jfr 621g
broader: Djursjukvård
related: QuFR q4Z Sup
related: NPxJ jcg a9g
related: yvRV Qv1 gA6
related: QndJ qiu SVo
related: 2dMs uGE Ve8

Samhällsbyggnad och arkitektur
type: Concept
in scheme: JobTech Taxonomy - SUN utbildningsområde
definition: Här ingår utbildningar inriktade mot planering och utformning av byggnader, samhällen och miljöer, både ur en naturvetenskaplig, en samhällsvetenskaplig och ur en konstnärlig synvinkel.
broader: Samhällsbyggnad och byggnadsteknik
narrower: Landskapsarkitektutbildning
narrower: Arkitektutbildning
narrower: Landskapsingenjörsutbildning
narrower: Annan utbildning inom samhällsbyggnad och arkitektur
narrower: Ingenjörsutbildning, samhällsbyggnad och samhällsmiljö
narrower: Civilingenjörsutbildning, samhällsbyggnad och samhällsmiljö

Biologi
type: Concept
in scheme: JobTech Taxonomy - SUN utbildningsområde
definition: Omfattar: · Utbildningar i humanbiologi · Utbildningar i limnologi · Utbildningar i livsvetenskap (life science) · Utbildningar i medicinsk biologi · Utbildningar i mikrobiologi · Utbildningar i molekylärbiologi · Övriga utbildningar i biologi
broader: Biologi och biokemi
related: o6US 5HP iDM
related: 2yRC 9ub yAt
related: PpWP rSs vky
related: uGpQ ihW 7dP
related: eD1A sx6 r1V
related: hgnc Zyj VyQ
related: 4uyB i5y sS5
related: HA9H xqq gZY
related: HhNP o9h zNQ
related: AN5Z WMA ktH
related: T5mu JHL EJA

Lärarutbildning, idrott och hälsa
type: Concept
in scheme: JobTech Taxonomy - SUN utbildningsområde
definition: Lärarutbildning, idrott och hälsa
broader: Lärarutbildning i yrkesämne och praktisk-estetiska ämnen
related: rDXv G87 Mbc

Ämneslärarutbildning, språk, i kombination med praktisk-estetiska ämnen
type: Concept
in scheme: JobTech Taxonomy - SUN utbildningsområde
definition: Ämneslärarutbildning, språk, i kombination med praktisk-estetiska ämnen
broader: Ämneslärarutbildning
related: kWFX BTs yKM

Energi, drift och underhåll
type: Concept
in scheme: JobTech Taxonomy - SUN utbildningsområde
definition: Omfattar: · Gymnasieskolans el- och energiprogram, inriktning energiteknik · Gymnasieskolans industritekniska program, inriktning driftsäkerhet och underhåll · Gymnasieskolans VVS- och fastighetsprogram, inriktning kyl- och värmepumpsteknik · Gymnasieskolans VVS- och fastighetsprogram, inriktning ventilationsteknik · Utbildningar i inneklimat, inklusive utbildningar inriktade mot värme, ventilation och kylanläggningar · Utbildningar till drifttekniker · Utbildningar till vattenkraftstekniker · Utbildningar till vindkrafttekniker · Övriga utbildningar i energi, drift och underhåll Omfattar inte: · VVS-utbildningar med tyngdpunkt på vatten och avlopp, jfr 582f
broader: Energi- och elektroteknik
related: kupJ nbq Bnv
related: kGUL rxu HWa
related: Tt87 pLZ Qad
related: 47CK p4C 5u7
related: LMJr hgi K2X
related: Xqjd 4jo 3AD
related: ot3R oRt 9ws
related: 6fod Vd5 Lot
related: pREv DLX xPt
related: m6R3 7BM M4V
related: kXWG wZe X1t
related: 4h1p EpB 2bL
related: j2j1 9tr mGW
related: etcQ jc2 EfF
related: sBci e3q QZk
related: gvf5 n79 ram
related: h51D HXv ehi
related: DxZb pFy rrJ
related: JVbw TJN bfc
related: Ttpx rth 7Nt

Annan lärarutbildning för förskola och fritidsverksamhet
type: Concept
in scheme: JobTech Taxonomy - SUN utbildningsområde
definition: Annan lärarutbildning för förskola och fritidsverksamhet
broader: Lärarutbildning för förskola och fritidsverksamhet

Biblioteks- och dokumentationsvetenskap
type: Concept
in scheme: JobTech Taxonomy - SUN utbildningsområde
definition: Här ingår utbildningar inriktade mot hur information hanteras, teoretiskt såväl som praktiskt och hur information kan sökas och återanvändas i till exempel biblioteket. Utbildningar om hur informationstekniska hjälpmedel används ingår.
broader: Journalistik och information
narrower: Dokumentations- och informationsvetenskap
narrower: Annan utbildning i biblioteks- och dokumentationsvetenskap
narrower: Bibliotekarieutbildning samt biblioteks- och informationsvetenskap

Pastors-, missionärs- och diakonutbildning
type: Concept
in scheme: JobTech Taxonomy - SUN utbildningsområde
definition: Pastors-, missionärs- och diakonutbildning
broader: Religion
related: bEmi T3n mSa
related: hxLh uSf kx9
related: gmvd 1SP ERg

Grafisk teknik
type: Concept
in scheme: JobTech Taxonomy - SUN utbildningsområde
definition: Omfattar också: · Utbildning till grafisk tryckare Omfattar inte: · Grafisk formgivning, jfr 213d
broader: Medieproduktion
related: aw8g QYn SF5
related: ni9P pwW 3CJ
related: efrM 7wv EQ6
related: mvc1 zSV jqm
related: DQTV fu9 VqZ
related: 9Js4 xSu 7L9
related: q8Ps Dmi he3

Konst och media, övrig och ospecificerad utbildning
type: Concept
in scheme: JobTech Taxonomy - SUN utbildningsområde
definition: Konst och media, övrig och ospecificerad utbildning
broader: Konst och media, övrig och ospecificerad utbildning

Ingenjörsutbildning, maskinteknik
type: Concept
in scheme: JobTech Taxonomy - SUN utbildningsområde
definition: Omfattar: · Gymnasieingenjörsutbildning, inriktning produktionsteknik · Ingenjörsutbildning i design och produktutveckling · Ingenjörsutbildning i grafisk teknik · Ingenjörsutbildning i mekatronik · Övriga ingenjörsutbildningar i maskinteknik
broader: Maskinteknik och verkstadsteknik
related: pfjR mgH FsJ
related: fG2s Vxm sqb
related: VbSj DPM aCU
related: 3iSP mWS qkf
related: Xrv7 qSi 3tZ
related: afpi 3ZL rMc
related: 9Ez7 y3H 6fo
related: cuuZ xPB ZLu
related: 4Zza Ceq LKH
related: yMVh 2MQ kQw
related: K596 g6A uP5
related: fsVe U7N GDx
related: YvtM bDS uAc
related: 6jzF e9h pM2
related: 8jMm RRV 2zE

Miljövetenskap
type: Concept
in scheme: JobTech Taxonomy - SUN utbildningsområde
definition: Omfattar: · Utbildningar i ekologi · Utbildningar i humanekologi · Övriga utbildningar i miljövetenskap Omfattar inte: · Utbildningar i biologi, jfr 421a · Utbildningar i limnologi, jfr 421a · Utbildningar i miljöteknik och miljökontroll, jfr 527 · Utbildningar i miljövård och miljöskydd, jfr 423z · Utbildningar i toxikologi, jfr 421b
broader: Miljövetenskap
related: W89z vxc upT
related: TN83 pob QAc
related: j6Hy agk bjx
related: 2T3v Cnr 6hp
related: xoeW HZY KXx

Tandhygienistutbildning
type: Concept
in scheme: JobTech Taxonomy - SUN utbildningsområde
definition: Tandhygienistutbildning
broader: Tandvård
related: cZD5 jqc 6Td

Lantbruk, trädgård, skog och fiske, allmän utbildning
type: Concept
in scheme: JobTech Taxonomy - SUN utbildningsområde
definition: Här ingår utbildningar inriktade på hur människan på olika sätt brukar naturen. Under denna rubrik klassificeras utbildningar inom området utan specialisering mot någon av de övriga inriktningarna inom 62.
broader: Lantbruk, trädgård, skog och fiske
narrower: Lantbruk, trädgård, skog och fiske, allmän utbildning

Biologi och miljövetenskap, övrig och ospecificerad utbildning
type: Concept
in scheme: JobTech Taxonomy - SUN utbildningsområde
definition: Biologi och miljövetenskap, övrig och ospecificerad utbildning
broader: Biologi och miljövetenskap, övrig och ospecificerad utbildning

Humaniora, övrig och ospecificerad utbildning
type: Concept
in scheme: JobTech Taxonomy - SUN utbildningsområde
definition: Här ingår utbildningar inriktade mot humaniora som inte kan klassificeras under någon av de övriga utbildningarna inom 22 och som inte kan betraktas som breda utbildningar inom området.
broader: Humaniora
narrower: Humaniora, övrig och ospecificerad utbildning

Agronomutbildning
type: Concept
in scheme: JobTech Taxonomy - SUN utbildningsområde
definition: Agronomutbildning
broader: Lantbruk
related: CBZ6 Wxq ZgV

Bred, generell utbildning, annan inriktning
type: Concept
in scheme: JobTech Taxonomy - SUN utbildningsområde
definition: Omfattar också: · Gymnasieskolans IB-program Omfattar inte: · Gymnasieskolans teknikprogram, jfr 52, 54 och 58 · Gymnasieskolans yrkesförberedande program
broader: Bred, generell utbildning
related: fyd4 fTa Pq2

Utbildning i djurvård
type: Concept
in scheme: JobTech Taxonomy - SUN utbildningsområde
definition: Omfattar också: · Klövvårdarutbildning
broader: Lantbruk
related: z4Yp 9nL r3m
related: 5uJJ RNE x6c
related: hX6q xhz eei

Medieproduktion
type: Concept
in scheme: JobTech Taxonomy - SUN utbildningsområde
definition: Här ingår utbildningar inriktade mot tekniker och färdigheter för att framställa böcker, tidningar, radio- och tv-produktioner, film- och videoproduktioner, musikinspelningar och grafiska produkter oavsett distributionsformat. Utbildningar i illustration; foto och datorgrafik; utformning av trycksaker med avseende på rubrikers, textytors och bilders placering i förhållande till varandra ingår.
broader: Konst och media
narrower: Annan utbildning inom medieproduktion
narrower: Film-, radio- och tv-produktion
narrower: Grafisk teknik
narrower: Medieproduktion, allmän utbildning
narrower: Grafisk design och foto

Annan utbildning inom barn och ungdom
type: Concept
in scheme: JobTech Taxonomy - SUN utbildningsområde
definition: Omfattar inte: · Hälso- och sjukvård för barn och ungdom, jfr 723
broader: Barn och ungdom
related: qKo2 8oH 3tC

Företagsekonomi, redovisning
type: Concept
in scheme: JobTech Taxonomy - SUN utbildningsområde
definition: Omfattar inte: · Yrkeshögskoleutbildningar inom redovisning, jfr 344z
broader: Företagsekonomi, handel och administration, allmän utbildning
related: ssZf uag DwE

Religion
type: Concept
in scheme: JobTech Taxonomy - SUN utbildningsområde
definition: Här ingår utbildningar inriktade mot religioners och livsåskådnings-traditioners roller i kulturer och samhällen. Studier av nutida utformningar och historiska bakgrunder avseende såväl kristendomen som andra världsreligioner omfattas.
broader: Humaniora
narrower: Religionsvetenskap och teologi
narrower: Annan utbildning i religion
narrower: Pastors-, missionärs- och diakonutbildning

Läkarutbildning, laboratoriemedicinska specialiteter
type: Concept
in scheme: JobTech Taxonomy - SUN utbildningsområde
definition: Läkarutbildning, laboratoriemedicinska specialiteter
broader: Medicin
related: 94Uo E4W 5jJ
related: U5Hn 5uS zDn
related: 4KYf ayL x57
related: 4Fdw Ehv gUi
related: UHnm 8Zg RoJ
related: x7Qm kFM 3G6
related: cnop phd nGb
related: inrd soa qfa
related: K1mF 7E5 mLx
related: 2BCh xUx wBq
related: Wojn n5S xo3
related: ssjN oTz NdM

Utbildning inom hår- och skönhetsvård
type: Concept
in scheme: JobTech Taxonomy - SUN utbildningsområde
definition: Omfattar: · Hud- och spaterapeututbildning · Utbildning till barberare · Utbildning till hår- och makeupstylist · Utbildning till stylist, annan än inom hår- och makeup · Övriga utbildningar inom hår- och skönhetsvård
broader: Hårvård, skönhetsvård och massage
related: 6L4H kbw 3jZ
related: GHMC yJq RLu
related: RkA4 A3M 7Nr
related: 4NkC E8U a1n
related: Qizu ua7 3Vb
related: Szh3 DHW vxb

Datavetenskap
type: Concept
in scheme: JobTech Taxonomy - SUN utbildningsområde
definition: Omfattar: · Utbildningar i datalogi · Utbildningar i datavetenskap med matematisk, naturvetenskaplig eller teknisk inriktning · Övriga utbildningar i datavetenskap Omfattar inte: · Civilingenjörs- och ingenjörsutbildningar i datateknik, informationsteknologi, eller medieteknik, jfr 523
broader: Datavetenskap och systemvetenskap
related: 982Y uef gRY
related: W9n5 7CZ t8M

Farmaci
type: Concept
in scheme: JobTech Taxonomy - SUN utbildningsområde
definition: Här ingår utbildningar inriktade mot läkemedelshantering och läkemedlens effekter på människan. Läkemedelsframställning, teknisk hantering av läkemedel, att ge information om läkemedlens användning och effekter m.m. ingår i denna inriktning.
broader: Hälso- och sjukvård
narrower: Annan utbildning inom farmaci
narrower: Receptarieutbildning
narrower: Apotekarutbildning

Tandteknikerutbildning
type: Concept
in scheme: JobTech Taxonomy - SUN utbildningsområde
definition: Tandteknikerutbildning
broader: Tandvård
related: VK84 RYA XB8

Hårvård, skönhetsvård och massage
type: Concept
in scheme: JobTech Taxonomy - SUN utbildningsområde
definition: Här ingår utbildningar inriktade mot hår- och skönhetsvård och massageterapi.
broader: Personliga tjänster
narrower: Utbildning inom hår- och skönhetsvård
narrower: Massageutbildning
narrower: Annan utbildning inom hår- och skönhetsvård samt massage

Lärarutbildning i annat yrkesämne och praktisk-estetiska ämnen
type: Concept
in scheme: JobTech Taxonomy - SUN utbildningsområde
definition: Omfattar: · Flyginstruktörutbildning · Trafiklärarutbildning · Övriga lärarutbildningar i annat yrkesämne och praktisk-estetiska ämnen Omfattar inte: · Didaktik i praktiska ämnen, jfr 142z
broader: Lärarutbildning i yrkesämne och praktisk-estetiska ämnen
related: KAi4 6So Tdw
related: 842z oGT mBQ
related: EA9D 9Cu f4Y
related: Dsac nsz Dw6
related: oMi6 PTP Rsw
related: BXuc U9u pF3
related: kQBN Qfk avH
related: visp CR6 dqx

Arbetsterapeututbildning
type: Concept
in scheme: JobTech Taxonomy - SUN utbildningsområde
definition: Arbetsterapeututbildning
broader: Terapi, rehabilitering och kostbehandling
related: TgUu rHU yeU

Annan utbildning i kemi- och bioteknik
type: Concept
in scheme: JobTech Taxonomy - SUN utbildningsområde
definition: Omfattar: · Utbildning som leder till generell examen i bioteknik · Utbildning som leder till generell examen i kemiteknik · Övrig utbildning i kemi- och bioteknik Omfattar inte: · Utbildningar i biokemi, jfr 421b · Utbildningar i biomedicinsk laboratorieteknik, jfr 725d · Utbildningar i kemi, jfr 442z · Utbildningar i tillverkning av trä-, pappers-, glas-, porslins- och plastprodukter, jfr 543 · Utbildningar i tillverkning och hantering av livsmedel, jfr 541
broader: Kemi- och bioteknik
related: djag gDo tGc
related: H5WU 3up mtc
related: Jndn Xz8 ths
related: gJKE xKp ZFi
related: max1 TCP uUk
related: xYWD 5WK 1Pv
related: RK3e j3u m18
related: 7opt Dzt 3HT

Ingenjörsutbildning, kemi- och bioteknik
type: Concept
in scheme: JobTech Taxonomy - SUN utbildningsområde
definition: Ingenjörsutbildning, kemi- och bioteknik
broader: Kemi- och bioteknik
related: qGcy DXx VJJ
related: YGUR LWU 4H4
related: Z28J Noz xqn
related: zrmu RTY q4w

Annan utbildning i fordons- och farkostteknik
type: Concept
in scheme: JobTech Taxonomy - SUN utbildningsområde
definition: Omfattar: · Utbildning som leder till generell examen i farkostteknik · Utbildning som leder till generell examen i flygteknik · Övrig utbildning i fordons- och farkostteknik Omfattar inte: · Transportutbildningar, jfr 840 · Utbildningar för tillverkning av icke motordrivna fordon som exempelvis båtar, jfr 543c, och cyklar, jfr 521c
broader: Fordons- och farkostteknik
related: uz5P V7E wsg
related: Cfrf 7Et S4u
related: 22mb LqB vVB

Tyska
type: Concept
in scheme: JobTech Taxonomy - SUN utbildningsområde
definition: Tyska
broader: Främmande språk och språkvetenskap
related: uhbU qGs TcH

Datoranvändning
type: Concept
in scheme: JobTech Taxonomy - SUN utbildningsområde
definition: Utbildningar som ingår här är inriktade mot användning av datorer och olika program. Det rör sig vanligen om kortare utbildningar.
broader: Informations- och kommunikationsteknik (IKT)
narrower: Datoranvändning

Skogsmästar-, skogstekniker- och skogsingenjörsutbildning
type: Concept
in scheme: JobTech Taxonomy - SUN utbildningsområde
definition: Skogsmästar-, skogstekniker- och skogsingenjörsutbildning
broader: Skog
related: V2pG Ec4 w1y
related: fhwy dJE rCw
related: kfoW EaH 2hv

Arbetsmiljö och renhållning, övrig och ospecificerad utbildning
type: Concept
in scheme: JobTech Taxonomy - SUN utbildningsområde
definition: Arbetsmiljö och renhållning, övrig och ospecificerad utbildning
broader: Arbetsmiljö och renhållning, övrig och ospecificerad utbildning

Konst och media, allmän utbildning
type: Concept
in scheme: JobTech Taxonomy - SUN utbildningsområde
definition: Konst och media, allmän utbildning
broader: Konst och media, allmän utbildning
related: jNzN vnx x85

Kemi
type: Concept
in scheme: JobTech Taxonomy - SUN utbildningsområde
definition: Omfattar: · Utbildning i läkemedelskemi · Utbildning i organisk kemi · Utbildning i oorganisk kemi · Övriga utbildningar i kemi Omfattar inte: · Kemiteknik, jfr 524 · Livsmedelskemi, jfr 541x · Utbildningar i biokemi, jfr 421b
broader: Kemi
related: iHMb zvr ygD
related: pKq8 mMd dDi
related: TTvw BpL Sx4
related: 4ujG 8Me sKR
related: D9T7 7sy d2r
related: Ndft 3TQ fMr
related: z1KJ V8A qie

Ämneslärarutbildning, matematik, data, naturvetenskap och teknik i kombination med språk
type: Concept
in scheme: JobTech Taxonomy - SUN utbildningsområde
definition: Ämneslärarutbildning, matematik, data, naturvetenskap och teknik i kombination med språk
broader: Ämneslärarutbildning
related: AR1o VmC ukE

Ledarskap, organisation och styrning
type: Concept
in scheme: JobTech Taxonomy - SUN utbildningsområde
definition: Omfattar: · Logistikutbildning, tyngdpunkt ledning och administration · Utbildning i affärslogistik · Övriga utbildningar inom ledarskap, organisation och styrning Omfattar inte: · Logistikutbildning som ingår i utbildning i industriell ekonomi, jfr 526 · Logistikutbildning som ingår i utbildning i transporttjänster, jfr 840a · Utbildning i företagsekonomi, inriktning logistik, jfr 340f · Utbildning i företagsekonomi, inriktning management, jfr 340d · Utbildning i ledarskap avseende egen personlig utveckling, jfr 090z
broader: Ledning och administration
related: 1DJw ikQ JHz
related: gHq8 9rW LWM
related: FPw9 GaZ oCv
related: g5yC k9c sfj

Företagsekonomi, handel och administration, övrig och ospecificerad utbildning
type: Concept
in scheme: JobTech Taxonomy - SUN utbildningsområde
definition: Här ingår utbildningar inriktade mot företagsekonomi, handel och administration som inte kan klassificeras under någon av de övriga inriktningarna inom 34 och som inte kan betraktas som breda utbildningar inom området.
broader: Företagsekonomi, handel och administration
narrower: Företagsekonomi, handel och administration, övrig och ospecificerad utbildning

Fysik
type: Concept
in scheme: JobTech Taxonomy - SUN utbildningsområde
definition: Omfattar: · Utbildningar i astrofysik · Utbildningar i astronomi · Utbildningar i rymdvetenskap · Utbildningar i teoretisk fysik · Övriga utbildningar i fysik Omfattar inte: · Sjukhusfysikerutbildning, jfr 725e · Utbildningar i teknisk fysik, jfr 520
broader: Fysik
related: LTn4 CxL U1F
related: i9su LEm 4gR
related: 8nuH 516 kqF
related: 6AvP MNn 8GK
related: CfD8 wnz jnh

Beteendevetenskap, allmän utbildning
type: Concept
in scheme: JobTech Taxonomy - SUN utbildningsområde
definition: Omfattar inte: · Ospecificerade utbildningar inom beteendevetenskap, jfr 319z · Utbildningar i beteendevetenskap med tyngdpunkt på personaladministration, jfr 345c · Utbildningar i pedagogik, jfr 142z
broader: Samhälls- och beteendevetenskap, allmän utbildning
related: k7CL yLH xoY

Datavetenskap och systemvetenskap
type: Concept
in scheme: JobTech Taxonomy - SUN utbildningsområde
definition: Utbildningar som ingår här är inriktade mot systemutveckling och programmering samt datavetenskap. Utbildningarna kan omfatta analys, utveckling, test- och kravanalys och programmering av webb- och programvaruapplikationer. Även utbildningar med inriktning mot metoder för matematiska beräkningar ingår.
broader: Informations- och kommunikationsteknik (IKT)
narrower: Systemutveckling och programmering
narrower: Annan utbildning inom datavetenskap och systemvetenskap
narrower: Datavetenskap

Lärarutbildning, hem- och konsumentkunskap
type: Concept
in scheme: JobTech Taxonomy - SUN utbildningsområde
definition: Omfattar också: · Lärarutbildning, inriktning hushållsvetenskap
broader: Lärarutbildning i yrkesämne och praktisk-estetiska ämnen
related: PvB7 6YV DDZ
related: cU1J 6sf Vxo

Annan utbildning i sociologi, etnologi och kulturgeografi
type: Concept
in scheme: JobTech Taxonomy - SUN utbildningsområde
definition: Omfattar: · Utbildning i etniska relationer · Utbildning i internationell migration · Utbildning inom demografi · Övrig utbildning i sociologi, etnologi och kulturgeografi
broader: Sociologi, etnologi och kulturgeografi
related: ec4M 1u5 tHZ
related: D5UG c4b ub8
related: jz8r SCB Yu7
related: WQ2Y bhV Xfr
related: gNYH LcF 4xy

Rättsvetenskaplig utbildning
type: Concept
in scheme: JobTech Taxonomy - SUN utbildningsområde
definition: Omfattar: · Utbildningar inom affärsrätt · Utbildningar inom arbetsrätt · Utbildningar inom handelsrätt · Övriga rättsvetenskapliga utbildningar
broader: Juridik och rättsvetenskap
related: 9znu 5xo Kq8
related: 41SF 6iL KQi
related: tW2E BSU wue
related: wYZN Fwg HY5
related: AvFi kjx E7W
related: r2V7 fCH Erc
related: sTsC eVC BpD
related: 5fLM eg2 mHA
related: x2Yz 7PZ iti

Industri och verkstadsteknik
type: Concept
in scheme: JobTech Taxonomy - SUN utbildningsområde
definition: Omfattar: · Gymnasieskolans industritekniska program · Utbildning till CAD-tekniker · Utbildning till CNC-tekniker · Utbildning till produktionstekniker · Utbildning till produktionsutvecklare · Utbildning till underhållstekniker · Utbildning till verktygstekniker · Övriga utbildningar i industri och verkstadsteknik
broader: Maskinteknik och verkstadsteknik
related: fpA8 XFc 122
related: vB86 ovN Y8S
related: UxgM KuE pwv
related: bWfV o7j 215
related: zZx5 sAj x3c
related: cz8d 9EH NyV
related: Exat DKZ QzX
related: oQ4h jn2 5B7
related: piUP GG5 ouS
related: 8JyC LE1 bFR
related: 4Fk9 qY2 Fm4
related: XrYz RCG CBY
related: tfss vRw TdC
related: m9kq A9e 416
related: LcZM TLH Mi6
related: eFmJ pxb G6P
related: YzFT Xjk MT1
related: grL4 tqw shX
related: F2rb 9mV beW
related: LCib ueo f6w
related: cSTz sn5 8cG

Fysioterapeututbildning
type: Concept
in scheme: JobTech Taxonomy - SUN utbildningsområde
definition: Fysioterapeututbildning
broader: Terapi, rehabilitering och kostbehandling
related: Zk4F v7F bbT

Bred, generell utbildning, allmän inriktning
type: Concept
in scheme: JobTech Taxonomy - SUN utbildningsområde
definition: Omfattar: · Grundskoleutbildning Omfattar också: · Utländsk utbildning motsvarande grundskoleutbildning
broader: Bred, generell utbildning
related: gRkL pup tds
related: t46s qBm sda

Specialistsjuksköterskeutbildning, intensivvård
type: Concept
in scheme: JobTech Taxonomy - SUN utbildningsområde
definition: Specialistsjuksköterskeutbildning, intensivvård
broader: Omvårdnad
related: 9bs5 dHX 35F

Lärarutbildning, vård och omsorg
type: Concept
in scheme: JobTech Taxonomy - SUN utbildningsområde
definition: Lärarutbildning, vård och omsorg
broader: Lärarutbildning i yrkesämne och praktisk-estetiska ämnen

Arbetsmiljö och renhållning, allmän utbildning
type: Concept
in scheme: JobTech Taxonomy - SUN utbildningsområde
definition: Arbetsmiljö och renhållning, allmän utbildning
broader: Arbetsmiljö och renhållning, allmän utbildning

Informations- och kommunikationsteknik (IKT)
type: Concept
in scheme: JobTech Taxonomy - SUN utbildningsområde
definition: Informations- och kommunikationsteknik (IKT)
broader: Naturvetenskap, matematik och informations- och kommunikationsteknik (IKT)
narrower: Datoranvändning
narrower: Informations- och kommunikationsteknik (IKT), övrig och ospecificerad utbildning
narrower: Datavetenskap och systemvetenskap
narrower: Informations- och kommunikationsteknik (IKT), allmän utbildning

Säkerhetstjänster, övrig och ospecificerad utbildning
type: Concept
in scheme: JobTech Taxonomy - SUN utbildningsområde
definition: Militär utbildning omfattar utbildningar inriktade mot försvar i samhället, i fred, kris och krig.
broader: Säkerhetstjänster
narrower: Säkerhetstjänster, övrig och ospecificerad utbildning

Berg- och mineralteknik
type: Concept
in scheme: JobTech Taxonomy - SUN utbildningsområde
definition: Här ingår utbildningar inriktade mot gruv- och järnbrukshantering. Utbildningar inriktade mot metallurgi och mineralteknik inkluderas.
broader: Material och tillverkning
narrower: Civilingenjörsutbildning, berg- och mineralteknik
narrower: Annan utbildning inom berg- och mineralteknik
narrower: Ingenjörsutbildning, berg- och mineralteknik
narrower: Gruv- och järnbruksarbete

Annan utbildning i psykologi
type: Concept
in scheme: JobTech Taxonomy - SUN utbildningsområde
definition: Omfattar: · Utbildning i samtalsterapi · Utbildning som leder till generell examen inom kognitionsvetenskap · Utbildning som leder till generell examen inom psykologi · Utbildning som leder till generell examen inom socialpsykologi · Övriga utbildningar i psykologi Omfattar inte: · Utbildning i kognitionsvetenskap, inriktning informations- och kommunikationsteknik, jfr 489z
broader: Psykologi
related: EeKK ewN MmE
related: 6Jne CdW 9Nk
related: wm2r Ckp vBS
related: XXcP GGv J3V
related: 3xDn Yc2 qJx
related: jrZr 3Fc 7Zg
related: yNGy PJs Qk2
related: Pjiz 5WY HLF
related: 5saG 3LS r6o
related: Jbqn GiG jYA
related: Njhe uDC Xt7
related: WsMz KKe wcp

Annan utbildning inom medieproduktion
type: Concept
in scheme: JobTech Taxonomy - SUN utbildningsområde
definition: Omfattar inte: · Journalistutbildning, jfr 321a · Medie- och kommunikationsvetenskap, jfr 321b · Tekniska utbildningar i medieproduktion, jfr 48 och 52
broader: Medieproduktion

Religionsvetenskap och teologi
type: Concept
in scheme: JobTech Taxonomy - SUN utbildningsområde
definition: Omfattar: · Utbildning som leder till generell examen inom religionsvetenskap · Utbildning som leder till generell examen inom teologi · Övriga högskoleutbildningar i religionsvetenskap och teologi som förbereder för arbete som präst, församlingspedagog eller religionsvetenskaplig forskning Omfattar också: · Utbildning som leder till teologie kandidatexamen Omfattar inte: · Utbildning i bibelvetenskap, jfr 221x · Utbildning i islamologi och judaistik, jfr 221x · Utbildning i religionshistoria, jfr 221x
broader: Religion
related: vTq2 ALp Ge8
related: Ng55 BHY 38R
related: ACD7 oCD Bz9
related: AC5b 2P1 Zhk
related: oGMn TVr VqL

Personlig utveckling
type: Concept
in scheme: JobTech Taxonomy - SUN utbildningsområde
definition: Personlig utveckling
broader: Allmän utbildning
narrower: Personlig utveckling

Annan utbildning i ledning och administration
type: Concept
in scheme: JobTech Taxonomy - SUN utbildningsområde
definition: Omfattar: · Projektledarutbildningar · Utbildningar i arbetsliv · Övriga utbildningar i ledning och administration
broader: Ledning och administration
related: UceZ JCp 23T
related: ZNn7 F8p dym
related: UvpY EWM 9As

Personliga tjänster, allmän utbildning
type: Concept
in scheme: JobTech Taxonomy - SUN utbildningsområde
definition: Personliga tjänster, allmän utbildning
broader: Personliga tjänster, allmän utbildning

Säkerhetstjänster, allmän utbildning
type: Concept
in scheme: JobTech Taxonomy - SUN utbildningsområde
definition: Här ingår breda utbildningar inriktade mot säkerhetstjänster utan någon klar tyngdpunkt mot någon av de övriga inriktningarna inom 86.
broader: Säkerhetstjänster
narrower: Säkerhetstjänster, allmän utbildning

Annan utbildning inom historia och arkeologi
type: Concept
in scheme: JobTech Taxonomy - SUN utbildningsområde
definition: Annan utbildning inom historia och arkeologi
broader: Historia och arkeologi

Modedesign
type: Concept
in scheme: JobTech Taxonomy - SUN utbildningsområde
definition: Omfattar också: · Textildesign
broader: Formgivning
related: fzym vvF SWm
related: 1Ab2 CZM xP2
related: MisP 5Mi ixa
related: Ey4m hRN b7h

Journalistik och information, allmän utbildning
type: Concept
in scheme: JobTech Taxonomy - SUN utbildningsområde
definition: Här ingår breda utbildningar inriktade mot journalistik och information utan klar tyngdpunkt mot någon av de övriga inriktningarna inom 32.
broader: Journalistik och information
narrower: Journalistik och information, allmän utbildning

Socialt arbete och omsorg
type: Concept
in scheme: JobTech Taxonomy - SUN utbildningsområde
definition: Socialt arbete och omsorg
broader: Hälso- och sjukvård samt social omsorg
narrower: Socialt arbete
narrower: Socialt arbete och socialt omsorgsarbete, övrig och ospecificerad utbildning
narrower: Barn och ungdom
narrower: Socialt arbete och socialt omsorgsarbete, allmän utbildning

Utbildning till medicinsk sekreterare
type: Concept
in scheme: JobTech Taxonomy - SUN utbildningsområde
definition: Omfattar också: · Utbildningar till vårdadministratör
broader: Kontorsservice och sekreterartjänster
related: cNQb qHF sSB
related: ot6E zXw vCH
related: Y51C iuK ZK3

Lärarutbildning för grundskolans tidiga åldrar
type: Concept
in scheme: JobTech Taxonomy - SUN utbildningsområde
definition: Här redovisas utbildningar inriktade mot att ge baskunskaper i svenska och matematik samt att ge en orientering inom andra ämnen såsom, historia, geografi, samhällskunskap, religion, naturkunskap, musik och bild under grundskolans tidigare år.
broader: Pedagogik och lärarutbildning
narrower: Annan lärarutbildning för grundskolans tidiga åldrar
narrower: Lärarutbildning, grundskolans tidiga åldrar, svenska och samhällsorienterade ämnen
narrower: Lärarutbildning, grundskolans tidiga åldrar, matematik och naturorienterande ämnen
narrower: Lärarutbildning, grundskolans tidiga åldrar, allmän ämnesinriktning
narrower: Lärarutbildning, grundskolans tidiga åldrar, praktisk-estetiska ämnen

Gruv- och järnbruksarbete
type: Concept
in scheme: JobTech Taxonomy - SUN utbildningsområde
definition: Gruv- och järnbruksarbete
broader: Berg- och mineralteknik
related: Gjua Qp1 Zge
related: 3Tff 9Dg 3TU

Fysik, kemi och geovetenskap, allmän utbildning
type: Concept
in scheme: JobTech Taxonomy - SUN utbildningsområde
definition: Omfattar inte: · Gymnasieskolans naturvetenskapliga program, samtliga inriktningar, jfr 010c
broader: Fysik, kemi och geovetenskap, allmän utbildning

Annan omvårdnadsutbildning, psykiatrisk vård
type: Concept
in scheme: JobTech Taxonomy - SUN utbildningsområde
definition: Omfattar också: · Specialistundersköterskeutbildning inom psykiatri
broader: Omvårdnad
related: GGuh 18p XNJ
related: po5m nBL DFt

Annan omvårdnadsutbildning, äldreomsorg
type: Concept
in scheme: JobTech Taxonomy - SUN utbildningsområde
definition: Omfattar också: · Specialistundersköterskeutbildning inom äldreomsorg
broader: Omvårdnad
related: 6A9V aic m4b
related: bvYW 82M cor
related: tJyM Vme TdU

Statsvetenskap
type: Concept
in scheme: JobTech Taxonomy - SUN utbildningsområde
definition: Omfattar: · Utbildning i Europakunskap · Utbildning i freds- och konfliktkunskap · Utbildning i internationella relationer · Utbildning i mänskliga rättigheter · Utbildning i politologi · Utbildning i utvecklingsstudier · Övriga utbildningar i statsvetenskap Omfattar inte: · Utbildning i politisk ekonomi, jfr 314x · Utbildning i samhällskunskap, jfr 310b
broader: Statsvetenskap
related: 2SXu WLj 2ax
related: ZRf3 pzZ r1T
related: E9gj Gwc UTu
related: RJQn kCQ Kee
related: Xp6W AWC 8pT
related: hJAv oR2 rLa
related: suU5 v5n FB3
related: Z2r2 kYe Jpz

Statistik
type: Concept
in scheme: JobTech Taxonomy - SUN utbildningsområde
definition: Omfattar: · Utbildningar i dataanalys · Utbildningar i matematisk statistik · Utbildningar i sannolikhetslära · Övriga utbildningar i statistik Omfattar inte: · Utbildningar i demografi och befolkningsstudier, jfr 312x
broader: Statistik
related: QV1q coS XtX
related: sEob Z8F sCB
related: vQct cKw xd5
related: 2MUS gGW 1H8
related: eEfy F3d vLP

Specialistsjuksköterskeutbildning, barn och ungdom
type: Concept
in scheme: JobTech Taxonomy - SUN utbildningsområde
definition: Specialistsjuksköterskeutbildning, barn och ungdom
broader: Omvårdnad
related: d6XR b5e nsC

Medicin
type: Concept
in scheme: JobTech Taxonomy - SUN utbildningsområde
definition: Området omfattar utbildningar inriktade mot att utveckla teorier och metoder att förebygga, diagnostisera och behandla sjukdomar och skador hos människan och att upprätthålla hälsa i samhället. Utöver läkarutbildningar, omfattas studier i medicin som inte leder till läkarexamen. Indelningsgrunden för de olika specialistkompetenserna grundar sig på Socialstyrelsens specialitetsförteckning från 2015.
broader: Hälso- och sjukvård
narrower: Läkarutbildning, enskilda basspecialiteter, exklusive allmänmedicin
narrower: Läkarutbildning, neurologiska specialiteter
narrower: Läkarutbildning, kirurgiska specialiteter
narrower: Annan utbildning inom medicin
narrower: Läkarutbildning, barn- och ungdomsmedicinska specialiteter
narrower: Läkarutbildning, bild- och funktionsmedicinska specialiteter
narrower: Läkarutbildning, psykiatriska specialiteter
narrower: Läkarutbildning, allmänmedicin
narrower: Läkarutbildning, inklusive fullgjord allmäntjänstgöring (AT)
narrower: Läkarutbildning, annan specialistkompetens
narrower: Läkarutbildning, tilläggsspecialiteter
narrower: Läkarutbildning, invärtesmedicinska specialiteter
narrower: Läkarutbildning, laboratoriemedicinska specialiteter
narrower: Läkarutbildning

Ingenjörsutbildning, bred inriktning mot byggande
type: Concept
in scheme: JobTech Taxonomy - SUN utbildningsområde
definition: Omfattar: · Ingenjörsutbildning i lantmäteri · Ingenjörsutbildning, inriktning GIS (geografiska informationssystem) · Övriga ingenjörsutbildningar med bred inriktning mot byggande
broader: Samhällsbyggnad och byggnadsteknik, allmän utbildning
related: 3uze 1Bj yGM
related: 9nnv b8o yxZ
related: 144m zPe 9XY

Civilingenjörsutbildning, samhällsbyggnad och samhällsmiljö
type: Concept
in scheme: JobTech Taxonomy - SUN utbildningsområde
definition: Omfattar inte: · Civilingenjörsutbildning med tyngdpunkt på miljöteknik, jfr 527a
broader: Samhällsbyggnad och arkitektur
related: vegw p67 9Wq
related: zigJ PgR 3iT
related: VMj5 uhr pxz

Tandläkarutbildning, specialiteter för barn och ungdomar
type: Concept
in scheme: JobTech Taxonomy - SUN utbildningsområde
definition: Omfattar: · Ortodonti · Pedodonti · Övriga specialiteter för barn och ungdomar
broader: Tandvård
related: Z3C3 n3a BwW
related: sbHd dDr ma3

Hem- och hushållsvetenskap, allmän utbildning
type: Concept
in scheme: JobTech Taxonomy - SUN utbildningsområde
definition: Omfattar också: · Utbildning som leder till generell examen inom hushållsvetenskap
broader: Hushållstjänster och lokalvård
related: p6WG RF7 fV3
related: 9m5g y5G Ajx
related: tM4M gUA n21

Pedagogik och lärarutbildning, övrig och ospecificerad utbildning
type: Concept
in scheme: JobTech Taxonomy - SUN utbildningsområde
definition: Omfattar utbildningar med pedagogiskt innehåll som inte hör hemma under någon av de övriga inriktningarna inom huvudinriktning 14, Pedagogik och lärarutbildning. Utbildningar som redovisas här är inte breda utbildningar utan här inkluderas utbildningar i specialpedagogik, modersmål, skolledarutbildning, speciallärarutbildning och folkhögskollärarutbildning.
broader: Pedagogik och lärarutbildning
narrower: Annan utbildning inom pedagogik och lärarutbildning
narrower: Speciallärarutbildning
narrower: Skolledarutbildning
narrower: Specialpedagogutbildning
narrower: Modersmålslärarutbildning

Tandläkarutbildning, specialiteter för vuxna
type: Concept
in scheme: JobTech Taxonomy - SUN utbildningsområde
definition: Omfattar: · Bettfysiologi · Endodonti · Käkkirurgi · Odontologisk radiologi · Oral protetik · Orofacial medicin · Parodontologi · Övriga specialiteter för vuxna
broader: Tandvård
related: mZ78 Npb gBC
related: 3n3A 6fB BUf
related: W1HU tYg 5BY
related: ZeRj snk 2GT
related: x4zR wRU 6JS
related: 7wuZ M5x ohV
related: JaGW 7Bf adi

Säkerhetstjänster, övrig och ospecificerad utbildning
type: Concept
in scheme: JobTech Taxonomy - SUN utbildningsområde
definition: Säkerhetstjänster, övrig och ospecificerad utbildning
broader: Säkerhetstjänster, övrig och ospecificerad utbildning

Journalistik och medievetenskap
type: Concept
in scheme: JobTech Taxonomy - SUN utbildningsområde
definition: Här ingår breda utbildningar inriktade mot journalistik, masskommunikation och information avseendet formulering och innehåll i meddelanden. Det inkluderar utbildningar om nyhetsrapportering liksom att skriva reportage och artiklar av allmänt intresse.
broader: Journalistik och information
narrower: Medie- och kommunikationsvetenskap
narrower: Annan utbildning i journalistik och medievetenskap
narrower: Journalistik

Djursjukvård
type: Concept
in scheme: JobTech Taxonomy - SUN utbildningsområde
definition: Djursjukvård
broader: Lant- och skogsbruk samt djursjukvård
narrower: Djursjukvård

Idrott och friskvård
type: Concept
in scheme: JobTech Taxonomy - SUN utbildningsområde
definition: Omfattar: · Idrottskonsulentutbildning · Utbildning i friskvårdspedagogik · Utbildning i idrottsvetenskap · Utbildning till badmästare · Utbildning till hälsoutvecklare · Övriga utbildningar inom idrott och friskvård Omfattar inte: · Idrottslärarutbildning, jfr 146k · Utbildningar i folkhälsa, jfr 720z
broader: Idrott och friskvård
related: QV1z Wdx HaM
related: jiLL 1GT VDw
related: eRxR Rqt QjF
related: yoHe xjK qjH
related: 8hoj pGy DHd
related: EgJF jFk NLJ
related: TUAK KRZ fyx
related: HfgF bZu MDo

Dietistutbildning
type: Concept
in scheme: JobTech Taxonomy - SUN utbildningsområde
definition: Omfattar inte: · Utbildningar i näringslära och näringsfysiologi, jfr 421b
broader: Terapi, rehabilitering och kostbehandling
related: s6EY 7wJ bkA

Bibliotekarieutbildning samt biblioteks- och informationsvetenskap
type: Concept
in scheme: JobTech Taxonomy - SUN utbildningsområde
definition: Bibliotekarieutbildning samt biblioteks- och informationsvetenskap
broader: Biblioteks- och dokumentationsvetenskap
related: uFcK S16 nyU
related: SpKi cSv qgZ

Personliga tjänster
type: Concept
in scheme: JobTech Taxonomy - SUN utbildningsområde
definition: Personliga tjänster
broader: Tjänster
narrower: Hårvård, skönhetsvård och massage
narrower: Idrott och friskvård
narrower: Personliga tjänster, allmän utbildning
narrower: Hushållstjänster och lokalvård
narrower: Turism, resor och fritid
narrower: Hotell, restaurang och storhushåll
narrower: Personliga tjänster, övrig och ospecificerad utbildning

Fartygs- och flygteknik
type: Concept
in scheme: JobTech Taxonomy - SUN utbildningsområde
definition: Omfattar: · Maskinteknikerutbildning · Sjöingenjörsutbildning · Utbildningar till flygtekniker · Utbildningar till marintekniker · Övriga utbildningar i fartygs- och flygteknik
broader: Fordons- och farkostteknik
related: rH2h aGU pRi
related: xsBh 6u8 qNs
related: w1PU XqJ baP
related: LAVZ 38i 2dB
related: 3xof MLR ZSy
related: MxYS kW6 dbX
related: Yggu eHm dDQ
related: ePPG kqn qnG

Betong-, anläggnings- och vägarbete
type: Concept
in scheme: JobTech Taxonomy - SUN utbildningsområde
definition: Omfattar: · Gymnasieskolans bygg- och anläggningsprogram, inriktning mark och anläggning · Utbildningar till järnvägsprojektör · Utbildningar till produktionsledare inom betong, anläggning och vägarbete · Utbildningar till rörnätstekniker · Utbildningar till VA-projektör · Övriga utbildningar inom betong, anläggning och vägarbete
broader: Byggnadsteknik och anläggningsteknik
related: yYBd szX YZ6
related: reZy anH isx
related: 72uR rWo dmo
related: bw4U xNM 3eT
related: sv7J 9yk g4j
related: FMrS be9 KFu
related: n1rx sjy 1Ax
related: zT46 PpJ fDH

Ämneslärarutbildning, matematik, data, naturvetenskap och teknik i kombination med historia, samhällsvetenskap och företagsekonomi
type: Concept
in scheme: JobTech Taxonomy - SUN utbildningsområde
definition: Ämneslärarutbildning, matematik, data, naturvetenskap och teknik i kombination med historia, samhällsvetenskap och företagsekonomi
broader: Ämneslärarutbildning
related: EPVz 61y nAX

Annan utbildning i främmande språk
type: Concept
in scheme: JobTech Taxonomy - SUN utbildningsområde
definition: Omfattar inte: · Allmän litteraturvetenskap, jfr 223d · Modersmålsutbildning, andra än svenska minoritetsspråk, jfr 223c · Utbildning i svenska minoritetsspråk, jfr 223b
broader: Främmande språk och språkvetenskap
related: 997V hvi QDg
related: yVQf scU Zj9
related: vngW PNY 5X1
related: 87N3 5JK s4g
related: cS3Z tMZ MZY
related: Zbk7 ktm oi6
related: hUUW i2w 3zZ
related: TvVv FqL msd
related: okW3 w6J aS5
related: JYg3 64E TVM
related: oAPT LGo ctC
related: rkcC 7Jd B1t
related: R74L sEJ wZp
related: C819 XKv 9wU
related: RLL5 q2v ujw
related: BSrK vBz qA3
related: 7ReZ s4E nDf
related: bNGB sWn AEz
related: ceDb 9WG rTW
related: voqG Dq7 D3y
related: fCpt 4Ps x9h
related: BFEs 9ox J3f
related: a6AH 6Xx J4s
related: 93mk UyK SR9
related: 8ofw S3j i7E
related: DUsV ny1 Fu7
related: DHMF yPo Hsc
related: Dh6i WbP Z8n
related: D92G KVQ 32y
related: agdM fwn y8P
related: BUUJ V7h TzY
related: 8NiD dWe HaK
related: FV4i yMX iUx
related: cwwU fek kkV
related: Pryh mKW gUZ

Maskinteknik och verkstadsteknik
type: Concept
in scheme: JobTech Taxonomy - SUN utbildningsområde
definition: Här ingår utbildningar inriktade mot konstruktion, produktutveckling, produktion, drift och underhåll inom det maskintekniska området. Det inkluderar utbildningar med fokus på industriell teknik och produktion, mekanisk industri och metallproduktion.
broader: Teknik och teknisk industri
narrower: Ingenjörsutbildning, maskinteknik
narrower: Annan utbildning i maskinteknik och verkstadsteknik
narrower: Civilingenjörsutbildning, maskinteknik
narrower: Industri och verkstadsteknik

Civilingenjörsutbildning, fordons- och farkostteknik
type: Concept
in scheme: JobTech Taxonomy - SUN utbildningsområde
definition: Civilingenjörsutbildning, fordons- och farkostteknik
broader: Fordons- och farkostteknik
related: PtXN Doi au8

Socialantropologi och etnologi
type: Concept
in scheme: JobTech Taxonomy - SUN utbildningsområde
definition: Socialantropologi och etnologi
broader: Sociologi, etnologi och kulturgeografi
related: QAKf yyp uzS
related: F6J4 FkB awu
related: R4Xq APn U7B

Militär utbildning
type: Concept
in scheme: JobTech Taxonomy - SUN utbildningsområde
definition: Militär utbildning omfattar utbildningar inriktade mot försvar i samhället, i fred, kris och krig.
broader: Säkerhetstjänster
narrower: Annan militär utbildning
narrower: Chefsutbildning för officerare
narrower: Officersutbildning

Juridik och rättsvetenskap
type: Concept
in scheme: JobTech Taxonomy - SUN utbildningsområde
definition: Juridik och rättsvetenskap
broader: Samhällsvetenskap, juridik, handel, administration
narrower: Juridik och rättsvetenskap

Socialt arbete och socialt omsorgsarbete, allmän utbildning
type: Concept
in scheme: JobTech Taxonomy - SUN utbildningsområde
definition: Omfattar också: · Utbildning i socialpedagogik Omfattar inte: · Gymnasial utbildning med inriktning mot social service och omsorg, jfr 762a
broader: Socialt arbete och socialt omsorgsarbete, allmän utbildning
related: 8ppW wWG jEV

Material och tillverkning, allmän utbildning
type: Concept
in scheme: JobTech Taxonomy - SUN utbildningsområde
definition: Här ingår breda utbildningar inriktade mot materialteknik och tillverkningsprocesser utan klar tyngdpunkt på någon av de övriga inriktningarna inom 54.
broader: Material och tillverkning
narrower: Ingenjörsutbildning, materialteknik
narrower: Civilingenjörsutbildning, materialteknik
narrower: Annan bred utbildning i material och tillverkning

Kött och charkuteri
type: Concept
in scheme: JobTech Taxonomy - SUN utbildningsområde
definition: Kött och charkuteri
broader: Tillverkning och hantering av livsmedel
related: uCMJ Dmr WAG

Annan utbildning inom tandvård
type: Concept
in scheme: JobTech Taxonomy - SUN utbildningsområde
definition: Omfattar också: · Utbildning som leder till generell examen inom odontologi
broader: Tandvård
related: ANn2 twF mG8
related: jNZ3 QuF fwM
related: LmSX u3R qKg
related: Jw69 BSy ej2

Idrott och friskvård
type: Concept
in scheme: JobTech Taxonomy - SUN utbildningsområde
definition: Här ingår utbildningar inriktade mot specifika idrotter, såväl utövning som tränarskap. Gruppen inkluderar även utbildningar syftande till att stimulera individer till egna aktiva insatser i hälsobefrämjande syfte.
broader: Personliga tjänster
narrower: Idrott och friskvård

Medie- och kommunikationsvetenskap
type: Concept
in scheme: JobTech Taxonomy - SUN utbildningsområde
definition: Omfattar: · Utbildning till kommunikatör · Utbildningar i information med avseende på innehåll och kommunikation · Övriga utbildningar inom medie- och kommunikationsvetenskap Omfattar inte: · Utbildningar i informationsvetenskap med inriktning mot hantering av information och dokumentering, jfr 322b · Utbildningar i marknadsföring, jfr 340c och 342z · Utbildningar i medieproduktion, jfr 213 · Utbildningar i medieteknik, jfr 481a och 523
broader: Journalistik och medievetenskap
related: qvic JJZ TUm
related: Vc54 CCV XKw
related: BcGv UuN fkH
related: Q5Kq wDQ sN4
related: ZnM8 tSF 1tn

Lärarutbildning, grundskolans tidiga åldrar, allmän ämnesinriktning
type: Concept
in scheme: JobTech Taxonomy - SUN utbildningsområde
definition: Omfattar inte: · Lärarutbildning inriktad mot grundskolans senare år, jfr 145–146
broader: Lärarutbildning för grundskolans tidiga åldrar
related: dvzg 7HV X9X
related: s6t2 6Da Jed
related: JE8M fDp jrt
related: gY6W Puq mzo
related: hZds vab Y8X
related: 9xTo jhE vJR
related: pd5P Egn qQr
related: jGUK f7e CyJ

Okänd
type: Concept
in scheme: JobTech Taxonomy - SUN utbildningsområde
definition: Okänd
broader: Okänd
narrower: Okänd

Material och tillverkning
type: Concept
in scheme: JobTech Taxonomy - SUN utbildningsområde
definition: Material och tillverkning
broader: Teknik och tillverkning
narrower: Tillverkning av produkter av trä, papper, glas, porslin och plast
narrower: Tillverkning och hantering av livsmedel
narrower: Berg- och mineralteknik
narrower: Material och tillverkning, övrig och ospecificerad utbildning
narrower: Material och tillverkning, allmän utbildning
narrower: Tillverkning av textilier, konfektion och lädervaror

Läs- och skrivinlärning för vuxna
type: Concept
in scheme: JobTech Taxonomy - SUN utbildningsområde
definition: Här ingår utbildningar för vuxna elever som av olika anledningar inte lärt sig läsa och skriva.
broader: Läs- och skrivinlärning för vuxna
narrower: Läs- och skrivinlärning för vuxna

Naturvård och djurskydd
type: Concept
in scheme: JobTech Taxonomy - SUN utbildningsområde
definition: Här ingår utbildningar inriktade mot skydd och vård av naturen med utgångspunkt i samspelet mellan levande organismer i sin naturliga miljö. Utbildningar mot restaurering och nyskapande av skadade eller försvunna naturmiljöer samt skötsel av naturreservat och nationalparker ingår, liksom främjande av friluftsliv.
broader: Biologi och miljövetenskap
narrower: Naturvård och djurskydd

Läs- och skrivinlärning för vuxna
type: Concept
in scheme: JobTech Taxonomy - SUN utbildningsområde
definition: Omfattar inte: · Undervisning i svenska för invandrare (SFI), jfr 222g
broader: Läs- och skrivinlärning för vuxna
related: TCku JK3 UrR

Fysik, kemi och geovetenskap, övrig och ospecificerad utbildning
type: Concept
in scheme: JobTech Taxonomy - SUN utbildningsområde
definition: Fysik, kemi och geovetenskap, övrig och ospecificerad utbildning
broader: Fysik, kemi och geovetenskap, övrig och ospecificerad utbildning

Humaniora och konst
type: Concept
in scheme: JobTech Taxonomy - SUN utbildningsområde
top concept of: JobTech Taxonomy - SUN utbildningsområde
definition: Humaniora och konst
narrower: Konst och media
narrower: Humaniora

Grafisk design och foto
type: Concept
in scheme: JobTech Taxonomy - SUN utbildningsområde
definition: Omfattar: · Animationsutbildning · Fotografutbildning · Illustrationsutbildning · Reklamutbildning med inriktning på utformning och framställning · Utbildning i informationsdesign · Utbildning i speldesign, inriktning grafisk design · Övriga utbildningar i grafisk design och foto Omfattar inte: · Kortare utbildningar i användandet av specifik programvara för desktop publishing och webbutveckling (personalutbildning), jfr 482z · Marknadsföring, jfr 342z · Utbildningar i programmering av exempelvis spel, jfr 481a
broader: Medieproduktion
related: WGis 67A Zk4
related: HccJ CMo pZY
related: hRXi MKY WAz
related: Rnqh CKD YrV
related: xee7 wWq j8S
related: JzSS oKa dZy
related: xiLU M82 Rkm
related: TqyF iCW k7C
related: cC1g uMb Lyh
related: KooH iFK GR8
related: La7K R6c YV6

Audionomutbildning
type: Concept
in scheme: JobTech Taxonomy - SUN utbildningsområde
definition: Omfattar också: · Hörselvårdsassistentutbildning
broader: Tekniskt inriktad vårdutbildning
related: 914A kcB E1q
related: p1bc Co4 DsD

Landskapsarkitektutbildning
type: Concept
in scheme: JobTech Taxonomy - SUN utbildningsområde
definition: Landskapsarkitektutbildning
broader: Samhällsbyggnad och arkitektur
related: hymU 7m4 qUp

Kulturvård, kulturadministration och museivetenskap
type: Concept
in scheme: JobTech Taxonomy - SUN utbildningsområde
definition: Omfattar också: · Kulturvetenskapliga utbildningar
broader: Historia och arkeologi
related: UBpz izF 5a1
related: hrEE RcR oQ3
related: L3A4 rbP 2wG
related: Y8MH ZWc shM
related: ccEo ska zuZ
related: pmQC u3k FRy
related: bT48 bzn wpU
related: mNDu eQU VtZ

Teknik och teknisk industri, allmän utbildning
type: Concept
in scheme: JobTech Taxonomy - SUN utbildningsområde
definition: Här ingår breda utbildningar inriktade mot teknik utan tyngdpunkt på någon av de övriga inriktningarna inom 5, Teknik och tillverkning.
broader: Teknik och teknisk industri
narrower: Annan bred utbildning i teknik och teknisk industri
narrower: Civilingenjörsutbildning, generell teknik och teknisk fysik
narrower: Ingenjörsutbildning, generell teknik och teknisk fysik

Annan omvårdnadsutbildning, övriga inriktningar
type: Concept
in scheme: JobTech Taxonomy - SUN utbildningsområde
definition: Omfattar: · Specialistundersköterskeutbildning inom hemsjukvård · Specialistundersköterskeutbildning inom palliativ vård · Utbildning till medicinsk fotterapeut för omvårdnad · Övriga utbildningar inom annan omvårdsutbildning
broader: Omvårdnad
related: zA11 Kbd 9ew
related: 2Esq u3V sP1
related: zCjh Rh5 fN1

Tandvård
type: Concept
in scheme: JobTech Taxonomy - SUN utbildningsområde
definition: Här ingår utbildningar inriktade mot att utveckla teorier och metoder att diagnostisera, behandla och förebygga sjukdomar i tänder, munhåla och käke. Det omfattar utbildningar inriktade mot tillverkning och reparation av tandproteser och inplantat samt mot tandreglering. Även utbildningar inriktade mot att assistera tandläkare klassificeras här, liksom utbildningar i mun- och tandhygienisk verksamhet.
broader: Hälso- och sjukvård
narrower: Tandhygienistutbildning
narrower: Tandläkarutbildning, specialiteter för vuxna
narrower: Annan utbildning inom tandvård
narrower: Tandläkarutbildning, specialiteter för barn och ungdomar
narrower: Tandteknikerutbildning
narrower: Tandsköterskeutbildning
narrower: Tandläkarutbildning

Samhälls- och beteendevetenskap, övrig och ospecificerad utbildning
type: Concept
in scheme: JobTech Taxonomy - SUN utbildningsområde
definition: Här ingår utbildningar inriktade mot samhälls- och beteendevetenskap som inte kan klassificeras under någon av de övriga inriktningarna inom 31 och som inte kan betraktas som breda utbildningar inom området.
broader: Samhälls- och beteendevetenskap
narrower: Samhälls- och beteendevetenskap, övrig och ospecificerad utbildning

Arabiska
type: Concept
in scheme: JobTech Taxonomy - SUN utbildningsområde
definition: Arabiska
broader: Främmande språk och språkvetenskap
related: kk6U YGD 4wb

Utbildning för luftfart
type: Concept
in scheme: JobTech Taxonomy - SUN utbildningsområde
definition: Omfattar: · Flygtrafikledarutbildning · Trafikflygarutbildning · Utbildning för kabinpersonal · Övriga utbildningar för luftfart
broader: Transporttjänster
related: TXD6 A5a qad
related: exBR pyN hFq
related: ZzbC J7W BqQ
related: racm TdX W8k

Journalistik och information, övrig och ospecificerad utbildning
type: Concept
in scheme: JobTech Taxonomy - SUN utbildningsområde
definition: Här ingår utbildningar inriktade mot journalistik och information som inte kan klassificeras under någon av de övriga inriktningarna inom 32 och som inte kan betraktas som breda utbildningar inom området.
broader: Journalistik och information
narrower: Journalistik och information, övrig och ospecificerad utbildning

Civilingenjörsutbildning, materialteknik
type: Concept
in scheme: JobTech Taxonomy - SUN utbildningsområde
definition: Civilingenjörsutbildning, materialteknik
broader: Material och tillverkning, allmän utbildning
related: wBeX Bwn QmK
related: jsNE Bmf HHH
related: d4Js MdR 9iS
related: aTMC GPf q9W

Ämneslärarutbildning, historia, samhällsvetenskap och företagsekonomi
type: Concept
in scheme: JobTech Taxonomy - SUN utbildningsområde
definition: Omfattar: · Ämneslärarutbildning, inriktning geografi · Ämneslärarutbildning, inriktning psykologi · Ämneslärarutbildning, inriktning religionskunskap · Övrig ämneslärarutbildning, historia, samhällsvetenskap och företagsekonomi
broader: Ämneslärarutbildning
related: kkWy WqX ihX
related: xp27 HTe 8HX
related: QRFG X4u 58b
related: Zh7u 1om ndy

Specialistsjuksköterskeutbildning, anestesisjukvård
type: Concept
in scheme: JobTech Taxonomy - SUN utbildningsområde
definition: Specialistsjuksköterskeutbildning, anestesisjukvård
broader: Omvårdnad
related: zrmY XYF 4yE

Annan utbildning i nationalekonomi och ekonomisk historia
type: Concept
in scheme: JobTech Taxonomy - SUN utbildningsområde
definition: Omfattar också: · Utbildning i politisk ekonomi
broader: Nationalekonomi och ekonomisk historia

Kontorsservice och sekreterartjänster
type: Concept
in scheme: JobTech Taxonomy - SUN utbildningsområde
definition: Här ingår utbildningar inriktade mot administrativa rutiner samt allmänna kontorsgöromål. Utbildningar för specifika sekreteraruppgifter såsom utbildning för läkarsekreterare (medicinska sekreterare), advokatsekreterare eller språklig sekreterarutbildning klassificeras här.
broader: Företagsekonomi, handel och administration
narrower: Annan utbildning i kontorsservice och sekreterartjänster
narrower: Utbildning till medicinsk sekreterare

Ortopedingenjörsutbildning
type: Concept
in scheme: JobTech Taxonomy - SUN utbildningsområde
definition: Omfattar också: · Ortopedteknisk utbildning
broader: Tekniskt inriktad vårdutbildning
related: LvhM Z8F oPD

Tillverkning av textilier, konfektion och lädervaror
type: Concept
in scheme: JobTech Taxonomy - SUN utbildningsområde
definition: Här ingår utbildningar inriktade mot tillverkning av textilier och konfektion samt mot tillverkning av skor och andra läderprodukter. Ingenjörsutbildningar inriktade mot textilteknologi inkluderas.
broader: Material och tillverkning
narrower: Civilingenjörsutbildning, textilteknologi
narrower: Tillverkning av textilier och konfektion
narrower: Ingenjörsutbildning, textilteknologi
narrower: Sko- och läderarbete
narrower: Annan utbildning inom textilier, konfektion och läder

Fiske och vattenbruk
type: Concept
in scheme: JobTech Taxonomy - SUN utbildningsområde
definition: Här ingår utbildningar inriktade mot fiske, fiskodling, fisk- och vattenvård. Utbildningar inriktade mot odling av musslor, alger och andra i vattnet förekommande djur och växter ingår.
broader: Lantbruk, trädgård, skog och fiske
narrower: Fiske och vattenbruk

Redovisning och beskattning
type: Concept
in scheme: JobTech Taxonomy - SUN utbildningsområde
definition: Redovisning och beskattning omfattar utbildningar inriktade mot bokföring, granskning och kontroll av finansiella transaktioner.
broader: Företagsekonomi, handel och administration
narrower: Redovisning och beskattning

Samhällsvetenskap, juridik, handel, administration
type: Concept
in scheme: JobTech Taxonomy - SUN utbildningsområde
top concept of: JobTech Taxonomy - SUN utbildningsområde
definition: Samhällsvetenskap, juridik, handel, administration
narrower: Journalistik och information
narrower: Företagsekonomi, handel och administration
narrower: Juridik och rättsvetenskap
narrower: Samhälls- och beteendevetenskap

Fordonsteknik
type: Concept
in scheme: JobTech Taxonomy - SUN utbildningsområde
definition: Omfattar: · Gymnasieskolans fordons- och transportprogram, inriktning karosseri och lackering · Gymnasieskolans fordons- och transportprogram, inriktning lastbil och mobila maskiner · Gymnasieskolans fordons- och transportprogram, inriktning personbil · Övriga utbildningar i fordonsteknik
broader: Fordons- och farkostteknik
related: uUWd uBJ FZW
related: NZF8 DMg BPs
related: JhkB eaL mBP
related: 84Fx oks AUH
related: UKpc 6yx qCb
related: 2fak HaV T96
related: haU4 MnM WcE

Journalistik och information, allmän utbildning
type: Concept
in scheme: JobTech Taxonomy - SUN utbildningsområde
definition: Journalistik och information, allmän utbildning
broader: Journalistik och information, allmän utbildning

Lantbruk, trädgård, skog och fiske, allmän utbildning
type: Concept
in scheme: JobTech Taxonomy - SUN utbildningsområde
definition: Omfattar: · Breda utbildningar i naturbruk utan inriktning mot lantbruk, skogsbruk eller trädgårdsbruk · Utbildningar i markvetenskap · Övriga utbildningar inom lantbruk, trädgård, skog och fiske
broader: Lantbruk, trädgård, skog och fiske, allmän utbildning
related: 7TrA Cph XLA
related: 4LeU szT aXo
related: X7QJ FKq W2J
related: AHvZ jR5 kc9
related: f5Vt Wcw AQw
related: kQp9 wZQ WSm

Hushållstjänster och lokalvård
type: Concept
in scheme: JobTech Taxonomy - SUN utbildningsområde
definition: Hushållstjänster omfattar utbildningar inriktade mot egen verksamhet i och olika tjänster till hemmet såsom hemelektronik, klädvård, tvättservice, hushållsekonomi och sotning. Även utbildning i lokalvård omfattas.
broader: Personliga tjänster
narrower: Annan utbildning inom hushållstjänster och lokalvård
narrower: Utbildning för lokalvård
narrower: Hem- och hushållsvetenskap, allmän utbildning

Utbildning för restaurang
type: Concept
in scheme: JobTech Taxonomy - SUN utbildningsområde
definition: Omfattar: · Gymnasieskolans restaurang- och livsmedelsprogram, inriktning kök och servering · Utbildning till kock · Utbildning till sommelier · Övriga utbildningar för restaurang
broader: Hotell, restaurang och storhushåll
related: 2p1q YMA NkV
related: LDqV p1W 39t
related: QZWP ef1 KWF
related: B4p7 8UK RVs
related: S7A9 FgB QtH
related: sxft qWB HaW
related: TMGT E3v DWz
related: GqXD ArB Mmg
related: sN1S ejr 64b
related: 8Tab QUL 255
related: 62ja BdV Xdo

Lärarutbildning, bild och formkonst
type: Concept
in scheme: JobTech Taxonomy - SUN utbildningsområde
definition: Lärarutbildning, bild och formkonst
broader: Lärarutbildning i yrkesämne och praktisk-estetiska ämnen
related: DZED zcK 2pY

Bank, försäkring och finansiering
type: Concept
in scheme: JobTech Taxonomy - SUN utbildningsområde
definition: Omfattar också: · Utbildningar till rådgivare inom bank och försäkring Omfattar inte: · Utbildning i företagsekonomi, inriktning finansiering, jfr 340b
broader: Bank, försäkring och finansiering
related: uUr7 ngz km6
related: GF39 qDc RRC
related: TjGf BhE 6ps
related: 7SUq USf Tpv

Annan utbildning inom teknik och teknisk industri
type: Concept
in scheme: JobTech Taxonomy - SUN utbildningsområde
definition: Omfattar inte: · Utbildningar i materialteknik, jfr 54 · Utbildningar i samhällsbyggnad och byggnadsteknik, jfr 58
broader: Teknik och teknisk industri, övrig och ospecificerad utbildning
related: bz3i 71G Apf
related: zbQ6 hCR ypX

Fysik
type: Concept
in scheme: JobTech Taxonomy - SUN utbildningsområde
definition: Här ingår breda utbildningar inriktade mot materiens och energins egenskaper och dess uppträdande under skilda betingelser. Utbildningar i astronomi och rymdvetenskap inkluderas.
broader: Fysik, kemi och geovetenskap
narrower: Fysik

Annan utbildning i journalistik och medievetenskap
type: Concept
in scheme: JobTech Taxonomy - SUN utbildningsområde
definition: Annan utbildning i journalistik och medievetenskap
broader: Journalistik och medievetenskap

Pedagogik och lärarutbildning, allmän utbildning
type: Concept
in scheme: JobTech Taxonomy - SUN utbildningsområde
definition: Här ingår breda utbildningar inriktade mot undervisning och pedagogiska metoder, utan särskild tyngdpunkt mot någon av de övriga inriktningarna inom huvudinriktning 14.
broader: Pedagogik och lärarutbildning
narrower: Pedagogik och lärarutbildning, allmän utbildning

Administration och förvaltning
type: Concept
in scheme: JobTech Taxonomy - SUN utbildningsområde
definition: Omfattar inte: · Utbildningar i administration avseende kontorsadministration och sekreterartjänster, jfr 346x
broader: Ledning och administration
related: dBcK fLJ PEj
related: iWGR pWU yBs
related: UJAx YeC muK
related: bsPb TRs bkv
related: TE56 DgF dGa

Annan utbildning i kontorsservice och sekreterartjänster
type: Concept
in scheme: JobTech Taxonomy - SUN utbildningsområde
definition: Omfattar: · Utbildning till receptionist · Utbildning till socialadministratör · Övriga utbildningar i kontorsservice och sekreterartjänster Omfattar inte: · Utbildning till hotellreceptionist, jfr 811b
broader: Kontorsservice och sekreterartjänster
related: mdFm HUD JgP
related: Hyz1 7HF AkP
related: rnth nkC 8AR
related: r6Mw 9nH L4N
related: oMBH Dim wS9

Annan bred utbildning i teknik och teknisk industri
type: Concept
in scheme: JobTech Taxonomy - SUN utbildningsområde
definition: Omfattar: · Gymnasieskolans teknikprogram, inriktning teknikvetenskap · Utbildning som leder till generell examen inom teknisk fysik · Utbildning som leder till generell examen inom teknologi · Utbildningar i teknik och andra områden där tyngdpunkt är på teknik ur ett brett perspektiv, exempelvis teknik och genus, teknik och samhälle · Övrig bred utbildning i teknik och teknisk industri Omfattar inte: · Utbildning i industriell ekonomi, jfr 526 · Utbildning i industriell teknik, jfr 521 · Utbildning i materialteknik, jfr 54
broader: Teknik och teknisk industri, allmän utbildning
related: nFRu 2Nb okL
related: 7z7k 1Zm gXB
related: KQjv TUZ Hy9
related: dXKh NVG hWy
related: xt5j kAq 2gD
related: wLv4 5nM mcZ
related: hMYG YRx hPo
related: UnpN iYA jHy

Ingenjörsutbildning, industriell ekonomi och organisation
type: Concept
in scheme: JobTech Taxonomy - SUN utbildningsområde
definition: Omfattar också: · Ingenjörsutbildning i kvalitetsteknik
broader: Industriell ekonomi och organisation
related: btFt Mrq HEe
related: fmbH Vwu MXb
related: tvJU Mmo phZ
related: Xj8B SWJ SN1
related: dtMC RoK 9m2
related: wckZ qLa SBU

Ingenjörsutbildning, energi- och elektroteknik
type: Concept
in scheme: JobTech Taxonomy - SUN utbildningsområde
definition: Omfattar också: · Ingenjörsutbildning i driftteknik
broader: Energi- och elektroteknik
related: 9RnM HtM S5g
related: PFFR K1j RKA
related: hy98 awM qxy
related: gZVH k3o D7b
related: DATQ ezw nNu
related: NUsg 4ZV 6ZG
related: CL3t w29 Vx7
related: JPiA fEH wzh
related: pQCN Um8 59z
related: CLZG riA sNF
related: Z8TJ cE1 ama
related: Jcfx 5VE rFF
related: npRE qQA WBa
related: URsZ pX1 CTn

Civilingenjörsutbildning, bred inriktning mot byggande
type: Concept
in scheme: JobTech Taxonomy - SUN utbildningsområde
definition: Omfattar också: · Civilingenjörsutbildning i lantmäteri
broader: Samhällsbyggnad och byggnadsteknik, allmän utbildning
related: sSxv Ybk aep

Plåtslageri
type: Concept
in scheme: JobTech Taxonomy - SUN utbildningsområde
definition: Plåtslageri
broader: Byggnadsteknik och anläggningsteknik
related: 1Civ 2bc BAh
related: pVUj Fe4 5L4
related: x5QP RbD r4P
related: zfcv h6H ngS

Transporttjänster, allmän utbildning
type: Concept
in scheme: JobTech Taxonomy - SUN utbildningsområde
definition: Omfattar: · Gymnasieskolans fordons- och transportprogram, inriktning godshantering · Gymnasieskolans fordons- och transportprogram, inriktning transport · Logistikutbildning, inriktning transport och spedition · Övriga utbildningar inom transporttjänster, allmän utbildning Omfattar inte: · Logistikutbildning, inriktning ledning och administration, jfr 345a · Logistikutbildning med tyngdpunkt på teknik, jfr 526
broader: Transporttjänster
related: MTbg zf7 gi4
related: 921D 6HN Lxx
related: 4A6f 4od ysN
related: pDzX Zak Xni
related: 2cVb SQk Ygo

Annan utbildning inom medicin
type: Concept
in scheme: JobTech Taxonomy - SUN utbildningsområde
definition: Omfattar: · Utbildning som leder till generell examen i biomedicin · Utbildning som leder till generell examen i klinisk medicin · Utbildningar i medicin som inte leder till läkarutbildning · Övriga utbildningar inom medicin
broader: Medicin
related: LMAV ZCS wf2
related: Hcf5 gWs Juo
related: rbyf nZA Vvr
related: L55f UQ2 4dZ
related: SAq7 YB9 wam
related: b9Qt viz JaM
related: hXzM rhL us4
related: RCUW Giu FLT
related: vssi 9z3 Qtn
related: fCSf L1D kRM
related: CfBd hGr 9NL

Arbetsmiljö och renhållning, allmän utbildning
type: Concept
in scheme: JobTech Taxonomy - SUN utbildningsområde
definition: Här ingår breda utbildningar inriktade mot arbetsmiljö och renhållning utan tyngdpunkt mot någon av de övriga inriktningarna inom 85.
broader: Arbetsmiljö och renhållning
narrower: Arbetsmiljö och renhållning, allmän utbildning

Läkarutbildning, inklusive fullgjord allmäntjänstgöring (AT)
type: Concept
in scheme: JobTech Taxonomy - SUN utbildningsområde
definition: Omfattar också: · Slutförd bastjänstgöring (BT)
broader: Medicin
related: cHwY 51x jGn

Modersmålsutbildning och teckenspråk
type: Concept
in scheme: JobTech Taxonomy - SUN utbildningsområde
definition: Omfattar inte: · Modersmålsutbildning i svenska minoritetsspråk, jfr 223b
broader: Svenska och litteraturvetenskap
related: PWQK RFG xPf
related: Bfcy 11Q kDe
related: tngT R2E Qmb

Sjukhusfysikerutbildning
type: Concept
in scheme: JobTech Taxonomy - SUN utbildningsområde
definition: Omfattar också: · Radiofysikerutbildning
broader: Tekniskt inriktad vårdutbildning
related: nPmF 4W8 rGq
related: Fhyw dig nJm

Matematik och naturvetenskap, övrig och ospecificerad utbildning
type: Concept
in scheme: JobTech Taxonomy - SUN utbildningsområde
definition: Matematik och naturvetenskap, övrig och ospecificerad utbildning
broader: Matematik och naturvetenskap, övrig och ospecificerad utbildning

Utbildning för brandskydd och annan räddningstjänst
type: Concept
in scheme: JobTech Taxonomy - SUN utbildningsområde
definition: Omfattar inte: · Brandingenjörsutbildning, jfr 582b
broader: Säkerhet i samhället
related: 1WLE TMa yZQ

Personliga tjänster, övrig och ospecificerad utbildning
type: Concept
in scheme: JobTech Taxonomy - SUN utbildningsområde
definition: Här ingår utbildningar inriktade mot olika typer av personliga tjänster som inte kan klassificeras under någon av de övriga inriktningarna inom 81 och som inte kan betraktas som breda inom området.
broader: Personliga tjänster
narrower: Personliga tjänster, övrig och ospecificerad utbildning

Annan bred utbildning inom samhällsbyggnad och byggnadsteknik
type: Concept
in scheme: JobTech Taxonomy - SUN utbildningsområde
definition: Omfattar: · Utbildning i kart- och mätteknik · Utbildning som leder till generell examen inom GIS · Utbildning som leder till generell examen inom GIT (geografisk informationsteknik) · Utbildning till lantmäteritekniker · Övriga utbildningar inom samhällsbyggnad och byggnadsteknik Omfattar inte: · Utbildningar i fastighetsvetenskap, jfr 581x
broader: Samhällsbyggnad och byggnadsteknik, allmän utbildning
related: JXih Mbr ngN
related: 4fKD FaY u8j
related: BewA Ptf aEG
related: WL1g Xay 6c7
related: bcnq ZxS 3in
related: DjWR 5Br r2J

Kriminalvårdsutbildning
type: Concept
in scheme: JobTech Taxonomy - SUN utbildningsområde
definition: Kriminalvårdsutbildning
broader: Säkerhet i samhället
related: WW47 z4A uww

Psykoterapeututbildning
type: Concept
in scheme: JobTech Taxonomy - SUN utbildningsområde
definition: Psykoterapeututbildning
broader: Psykologi
related: 1fXR eqm 7ZB
related: VfiV TZ5 RKJ
related: 6MUZ Nd9 sPJ
related: eP5E N1L w5t
related: CEUN e7S U6C
related: 9ShY pPX dMQ
related: Jcaz zB8 hQy
related: iCdp 1gA EC5
related: 6zxN LG7 3n3
related: WZBc L9P 529

Ingenjörsutbildning, byggnadsteknik
type: Concept
in scheme: JobTech Taxonomy - SUN utbildningsområde
definition: Omfattar: · Brandingenjörsutbildning · Övriga ingenjörsutbildningar i byggnadsteknik
broader: Byggnadsteknik och anläggningsteknik
related: sP52 Lyv 71S
related: u58p Vtb jLx
related: mxHh CQz DaL
related: C9Wi DtK HHg
related: bZdk N2D ah4
related: VJmk DBw SNt
related: UanS xtr fee

Ämneslärarutbildning, historia, samhällsvetenskap och företagsekonomi i kombination med språk
type: Concept
in scheme: JobTech Taxonomy - SUN utbildningsområde
definition: Ämneslärarutbildning, historia, samhällsvetenskap och företagsekonomi i kombination med språk
broader: Ämneslärarutbildning
related: 1kWd zji 1VW

Transporttjänster
type: Concept
in scheme: JobTech Taxonomy - SUN utbildningsområde
definition: Transporttjänster
broader: Tjänster
narrower: Transporttjänster

Annan bred utbildning i samhälls- och beteendevetenskap
type: Concept
in scheme: JobTech Taxonomy - SUN utbildningsområde
definition: Omfattar inte: · Ospecificerade utbildningar inom beteendevetenskap, jfr 319z · Utbildningar i pedagogik, jfr 142z
broader: Samhälls- och beteendevetenskap, allmän utbildning

Annan utbildning inom formgivning
type: Concept
in scheme: JobTech Taxonomy - SUN utbildningsområde
definition: Omfattar: · Utbildning som leder till generell examen inom design · Utbildning som leder till generell examen inom modevetenskap · Övriga utbildningar inom formgivning
broader: Formgivning
related: KC9R LGu ELr
related: uooR Hm9 YjC
related: 2Wxt weC LyM
related: DHne Y5o 5rW
related: a9Bm ce8 ebX

Murarutbildning
type: Concept
in scheme: JobTech Taxonomy - SUN utbildningsområde
definition: Murarutbildning
broader: Byggnadsteknik och anläggningsteknik
related: Ptjx c2B s6H

Geovetenskap och naturgeografi
type: Concept
in scheme: JobTech Taxonomy - SUN utbildningsområde
definition: Här ingår breda utbildningar inriktade mot jordens, inklusive hydrosfärens och atmosfärens, sammansättning, struktur och egenskaper.
broader: Fysik, kemi och geovetenskap
narrower: Geovetenskap och naturgeografi

Veterinärutbildning
type: Concept
in scheme: JobTech Taxonomy - SUN utbildningsområde
definition: Veterinärutbildning
broader: Djursjukvård
related: 7hJo RK7 hH4

Utbildning för lokalvård
type: Concept
in scheme: JobTech Taxonomy - SUN utbildningsområde
definition: Omfattar också: · Utbildningar i lokalvård inriktade mot industrin, skolor och sjukhus
broader: Hushållstjänster och lokalvård
related: dpoa kdf VRa

Lantbruk
type: Concept
in scheme: JobTech Taxonomy - SUN utbildningsområde
definition: Lantbruk omfattar utbildningar inriktade mot växtproduktion, husdjurshållning, maskinteknik, naturresurshushållning och andra ämnen av betydelse för lantbruksdrift. Utbildningar inriktade mot djurvård (friska djur) klassificeras också här.
broader: Lantbruk, trädgård, skog och fiske
narrower: Annan utbildning inom lantbruk
narrower: Utbildning i jordbruk
narrower: Utbildning i lantbruk
narrower: Lantmästarutbildning
narrower: Agronomutbildning
narrower: Utbildning i djurvård
narrower: Utbildning i djurhållning
narrower: Utbildning i hästhållning

Historia och arkeologi
type: Concept
in scheme: JobTech Taxonomy - SUN utbildningsområde
definition: Här redovisas utbildningar inriktade mot politiska, kulturella, ekonomiska och sociala tillstånd och förändringar. Utbildningar i arkeologi, dvs. utbildningar inriktade mot forntida samhällsformer, landskap, naturmiljöer och bebyggelsemönster utifrån utgrävningar i marken inkluderas. Likaså inkluderas utbildningar i kulturvård och museivetenskapliga utbildningar.
broader: Humaniora
narrower: Arkeologi
narrower: Historia
narrower: Annan utbildning inom historia och arkeologi
narrower: Kulturvård, kulturadministration och museivetenskap

Matematik och naturvetenskap, allmän utbildning
type: Concept
in scheme: JobTech Taxonomy - SUN utbildningsområde
definition: Här ingår breda utbildningar inriktade mot matematik, statistik och naturvetenskap utan klar tyngdpunkt mot någon av de övriga inriktningarna inom 46.
broader: Matematik och övrig naturvetenskap
narrower: Matematik och naturvetenskap, allmän utbildning

Ingenjörsutbildning, textilteknologi
type: Concept
in scheme: JobTech Taxonomy - SUN utbildningsområde
definition: Ingenjörsutbildning, textilteknologi
broader: Tillverkning av textilier, konfektion och lädervaror
related: KAd7 XDH rme

Statsvetenskap
type: Concept
in scheme: JobTech Taxonomy - SUN utbildningsområde
definition: Här ingår utbildningar inriktade mot politik och samhällsfrågor. Utbildning om internationella relationer liksom medborgares rättigheter och skyldigheter ingår.
broader: Samhälls- och beteendevetenskap
narrower: Statsvetenskap

Läkarutbildning, annan specialistkompetens
type: Concept
in scheme: JobTech Taxonomy - SUN utbildningsområde
definition: Läkarutbildning, annan specialistkompetens
broader: Medicin

Filosofi och logik
type: Concept
in scheme: JobTech Taxonomy - SUN utbildningsområde
definition: Omfattar: · Etik · Idé- och lärdomshistoria · Vetenskapsteori · Övrig utbildning i filosofi och logik Omfattar inte: · Utbildning i religion, jfr 221
broader: Filosofi och logik
related: F2q9 9c8 cQ7
related: xGKi BUB hNJ
related: M8wo Sk5 jpc
related: 6dVf Y3z z8o
related: AxCG KY3 uMC
related: ZMUY jdA Xwu
related: tGtk CrU 2Th
related: rKZT W6D qgS

Ingenjörsutbildning, övrig och ospecificerad utbildning
type: Concept
in scheme: JobTech Taxonomy - SUN utbildningsområde
definition: Ingenjörsutbildning, övrig och ospecificerad utbildning
broader: Teknik och teknisk industri, övrig och ospecificerad utbildning
related: N6Gu jFC Dst
related: hZkQ Hzc Szo
related: hcnK TPy wxy
related: fQc9 H3G ixT

Annan utbildning i tillverkning och hantering av livsmedel
type: Concept
in scheme: JobTech Taxonomy - SUN utbildningsområde
definition: Omfattar: · Utbildning i bryggeri och vinproduktion · Utbildning i livsmedelsvetenskap · Övrig utbildning i tillverkning och hantering av livsmedel Omfattar inte: · Utbildning till kock, jfr 811c · Utbildningar för kontroll av livsmedelshantering, jfr 527 · Utbildningar i nutrition och näringslära, jfr 421b
broader: Tillverkning och hantering av livsmedel
related: WB3y Pho 87T
related: 4cpY jNS cVo
related: pDny UFe LNt
related: socv WAa ZkT
related: tb3w Xh1 u5D

Ingenjörsutbildning, datateknik
type: Concept
in scheme: JobTech Taxonomy - SUN utbildningsområde
definition: Omfattar: · Gymnasieingenjörsutbildning, inriktning informationsteknik · Ingenjörsutbildning i ljudteknik · Övrig ingenjörsutbildning i datateknik
broader: Elektronik, datateknik och automation
related: uSZs cM9 S8E
related: r3uu L2v RRo
related: jdRF PjG Gpi
related: KoXg JjB 7Uz
related: 58cQ kcC ukx
related: Gcmf UAC h6D
related: aSa8 weY vqC
related: xxPJ fgb Qsx
related: Fvw3 ssu USE
related: moJp zab vat
related: qR4Z e8j wdD

Landskapsingenjörsutbildning
type: Concept
in scheme: JobTech Taxonomy - SUN utbildningsområde
definition: Landskapsingenjörsutbildning
broader: Samhällsbyggnad och arkitektur
related: RPVz 1Py t5G

Tjänster
type: Concept
in scheme: JobTech Taxonomy - SUN utbildningsområde
top concept of: JobTech Taxonomy - SUN utbildningsområde
definition: Tjänster
narrower: Säkerhetstjänster
narrower: Personliga tjänster
narrower: Transporttjänster
narrower: Arbetsmiljö och renhållning

Ingenjörsutbildning, automation och elektronik
type: Concept
in scheme: JobTech Taxonomy - SUN utbildningsområde
definition: Omfattar: · Ingenjörsutbildning i automatisering · Ingenjörsutbildning i teleteknik · Övrig ingenjörsutbildning i automation och elektronik
broader: Elektronik, datateknik och automation
related: q42V dMi rQD
related: xFcG MCt sNR
related: iuQj 5Kc GEL
related: AVF9 VeD AvQ
related: Lm4i 2kG Fo2

Svenska minoritetsspråk
type: Concept
in scheme: JobTech Taxonomy - SUN utbildningsområde
definition: Omfattar: · Utbildningar i finska, jiddisch, meänkieli, romani och samiska
broader: Svenska och litteraturvetenskap
related: pi1w hoo w7v
related: fDyM oyN Fkb
related: 38Ab VA1 Zph
related: yfQX BpR yy6
related: vKoy 7CF H5P

Okänd
type: Concept
in scheme: JobTech Taxonomy - SUN utbildningsområde
top concept of: JobTech Taxonomy - SUN utbildningsområde
definition: Okänd
narrower: Okänd

Tandsköterskeutbildning
type: Concept
in scheme: JobTech Taxonomy - SUN utbildningsområde
definition: Tandsköterskeutbildning
broader: Tandvård
related: z6wp Xb3 Frj
related: 8sX5 dTM 6tj

Renhållning och avfallshantering
type: Concept
in scheme: JobTech Taxonomy - SUN utbildningsområde
definition: Här ingår utbildningar inriktade mot renhållning i samhället och olika typer av avfallssystem. Utbildningar inriktade mot omhändertagande och återvinning av avfall i samhällets olika delar ingår också.
broader: Arbetsmiljö och renhållning
narrower: Renhållning och avfallshantering

Annan militär utbildning
type: Concept
in scheme: JobTech Taxonomy - SUN utbildningsområde
definition: Omfattar: · Fackutbildning för militärer · Taktisk utbildning för militärer · Utbildning som leder till generell examen inom krigsvetenskap · Övriga militära utbildningar Omfattar inte: · Icke militära utbildningar för militär personal, jfr respektive ämnesinriktning
broader: Militär utbildning
related: UcmD AzB 8Sy
related: QLvW 6nz GiC
related: XTYA 9pk kXJ
related: RJ66 SBh AX5

Annan utbildning inom farmaci
type: Concept
in scheme: JobTech Taxonomy - SUN utbildningsområde
definition: Omfattar: · Utbildning som leder till generell examen inom farmaci · Utbildning som leder till generell examen inom klinisk farmaci · Utbildning till apotekstekniker · Övriga utbildningar inom farmaci Omfattar inte: · Utbildningar i farmakologi, jfr 421b
broader: Farmaci
related: qxDC kpH U78
related: qRST iWg fYF
related: 1HMM JU8 Hai

Bank, försäkring och finansiering
type: Concept
in scheme: JobTech Taxonomy - SUN utbildningsområde
definition: Här ingår utbildningar, andra än högskoleutbildningar, inriktade mot planering, styrning, organisering och kontroll av finansiella aktiviteter och tjänster. Utbildningar i kontroll och bevakning av finansiella resurser i organisationer, företag och hos individer ingår, liksom tillhandahållandet av finansiella tjänster på företags- och individnivå.
broader: Företagsekonomi, handel och administration
narrower: Bank, försäkring och finansiering

Byggnadsteknik och anläggningsteknik
type: Concept
in scheme: JobTech Taxonomy - SUN utbildningsområde
definition: Här ingår utbildningar inriktade mot att konstruera, producera samt underhålla hus och alla andra sorters byggobjekt, såsom dammar, hamnar, vägar, järnvägar, reningsverk, vatten- och avloppssystem m.m.
broader: Samhällsbyggnad och byggnadsteknik
narrower: Murarutbildning
narrower: Måleri
narrower: Civilingenjörsutbildning, byggnadsteknik
narrower: Betong-, anläggnings- och vägarbete
narrower: Plåtslageri
narrower: Byggnadssnickeri
narrower: Ingenjörsutbildning, byggnadsteknik
narrower: VVS-utbildning
narrower: Annan utbildning inom byggnads- och anläggningsteknik
narrower: Byggnadsarbete, allmän utbildning

Lärarutbildning, handel och administration
type: Concept
in scheme: JobTech Taxonomy - SUN utbildningsområde
definition: Lärarutbildning, handel och administration
broader: Lärarutbildning i yrkesämne och praktisk-estetiska ämnen

Hälso- och sjukvård, allmän utbildning
type: Concept
in scheme: JobTech Taxonomy - SUN utbildningsområde
definition: Omfattar: · Folkhälsovetenskap · Hälso- och sjukvårdsutveckling · Hälsopedagogik · Internationell och global hälsa Omfattar inte: · Gymnasieskolans vård- och omsorgsprogram, jfr 723 · Utbildningar i friskvård, jfr 813z · Utbildningar till sjuksköterska, jfr 723 · Utbildningar till undersköterska, jfr 723 · Utbildningar till vårdbiträde, jfr 723
broader: Hälso- och sjukvård, allmän utbildning
related: 91dj Coh oNH
related: 7taH vWQ soq
related: hNSM fCv TQg
related: FvFt ann jpy
related: tLpt 9Vs o1o

Massageutbildning
type: Concept
in scheme: JobTech Taxonomy - SUN utbildningsområde
definition: Omfattar: · Utbildning inom fotvård · Utbildning till massageterapeut · Övriga massageutbildningar Omfattar inte: · Utbildning i medicinsk massage och massage inriktad mot rehabilitering, jfr 723u och 726x
broader: Hårvård, skönhetsvård och massage
related: Sknc Dtv u5r
related: STZA Xfn Cgj
related: mcKV moA XN4

Allmän utbildning
type: Concept
in scheme: JobTech Taxonomy - SUN utbildningsområde
top concept of: JobTech Taxonomy - SUN utbildningsområde
definition: Allmän utbildning
narrower: Bred, generell utbildning
narrower: Personlig utveckling
narrower: Läs- och skrivinlärning för vuxna

Skog
type: Concept
in scheme: JobTech Taxonomy - SUN utbildningsområde
definition: Här ingår utbildningar inriktade mot skogsskötsel, skogsbruk och skogsteknik. Även jakt och viltvårdsutbildning ingår.
broader: Lantbruk, trädgård, skog och fiske
narrower: Jägmästar- och skogsvetarutbildning
narrower: Skogsmästar-, skogstekniker- och skogsingenjörsutbildning
narrower: Utbildning i skogsbruk
narrower: Annan utbildning inom skog

Företagsekonomi, marknadsföring
type: Concept
in scheme: JobTech Taxonomy - SUN utbildningsområde
definition: Omfattar inte: · Yrkeshögskoleutbildningar inom marknadsföring, jfr 342z
broader: Företagsekonomi, handel och administration, allmän utbildning
related: cxeK H4m 8xx

Specialistsjuksköterskeutbildning, medicinsk vård
type: Concept
in scheme: JobTech Taxonomy - SUN utbildningsområde
definition: Omfattar också: · Utbildning i internmedicinsk vård
broader: Omvårdnad
related: U1Hn tSN 6eo

Konsthantverk
type: Concept
in scheme: JobTech Taxonomy - SUN utbildningsområde
definition: Här ingår utbildningar inriktade mot tekniker och färdigheter i specifika konsthantverk som keramik, guld- och silversmide, vävning och slöjd.
broader: Konst och media
narrower: Konsthantverk

Ingenjörsutbildning, generell teknik och teknisk fysik
type: Concept
in scheme: JobTech Taxonomy - SUN utbildningsområde
definition: Ingenjörsutbildning, generell teknik och teknisk fysik
broader: Teknik och teknisk industri, allmän utbildning
related: DXxy wLF GkT
related: SE7t uFC HX4
related: MqtF E2o Ccx
related: EZWW iuu Vk5

Pedagogik och lärarutbildning
type: Concept
in scheme: JobTech Taxonomy - SUN utbildningsområde
top concept of: JobTech Taxonomy - SUN utbildningsområde
definition: Pedagogik och lärarutbildning
narrower: Pedagogik och lärarutbildning

Statistik
type: Concept
in scheme: JobTech Taxonomy - SUN utbildningsområde
definition: Här ingår utbildningar inriktade mot insamling, utvärdering och presentation av data. Det inkluderar även utbildningar i sannolikhetslära och dataanalys.
broader: Matematik och övrig naturvetenskap
narrower: Statistik

Personlig utveckling
type: Concept
in scheme: JobTech Taxonomy - SUN utbildningsområde
definition: Personlig utveckling omfattar utbildningar som i huvudsak refererar till individens personliga utveckling och sociala kompetens. Även utbildning som syftar till att öka förmågan att samarbeta, att tala i grupp, att argumentera och föra fram ett budskap ingår.
broader: Personlig utveckling
narrower: Personlig utveckling

Ämneslärarutbildning
type: Concept
in scheme: JobTech Taxonomy - SUN utbildningsområde
definition: Ämneslärarutbildning omfattar utbildningar inriktade mot att undervisa i allmänna och teoretiska ämnen. I första hand avses på grundskolans högre nivåer samt på gymnasial nivå. Även lärarutbildningar som kombinerar teoretiskt ämne med praktisk-estetiska ämnen inkluderas.
broader: Pedagogik och lärarutbildning
narrower: Ämneslärarutbildning, historia, samhällsvetenskap och företagsekonomi i kombination med språk
narrower: Ämneslärarutbildning, språk, i kombination med praktisk-estetiska ämnen
narrower: Annan ämneslärarutbildning
narrower: Ämneslärarutbildning, språk
narrower: Ämneslärarutbildning, matematik, data, naturvetenskap och teknik i kombination med språk
narrower: Ämneslärarutbildning, matematik, data, naturvetenskap och teknik i kombination med praktisk-estetiska ämnen
narrower: Ämneslärarutbildning, matematik, data, naturvetenskap och teknik
narrower: Ämneslärarutbildning, historia, samhällsvetenskap och företagsekonomi
narrower: Ämneslärarutbildning, matematik, data, naturvetenskap och teknik i kombination med historia, samhällsvetenskap och företagsekonomi
narrower: Ämneslärarutbildning, historia, samhällsvetenskap och företagsekonomi i kombination med praktisk-estetiska ämnen

Inköp, försäljning och distribution
type: Concept
in scheme: JobTech Taxonomy - SUN utbildningsområde
definition: Här ingår utbildningar inriktade mot inköp och försäljning av varor och tjänster, inklusive lagerhållning, prissättning, försäljningskanaler m.m. Utbildningar mot detaljhandel och kassaarbete ingår.
broader: Företagsekonomi, handel och administration
narrower: Inköp, försäljning och distribution

Civilingenjörsutbildning, miljöteknik
type: Concept
in scheme: JobTech Taxonomy - SUN utbildningsområde
definition: Omfattar: · Civilingenjörsutbildning i ekosystemteknik · Civilingenjörsutbildning i miljö- och vattenteknik · Civilingenjörsutbildning i riskhantering · Övrig civilingenjörsutbildning i miljöteknik Omfattar inte: · Civilingenjörsutbildningar i samhällsbyggnadsteknik, jfr 581a
broader: Miljöteknik och miljökontroll
related: A3sB idX 93N
related: f6Z8 Kjv jbQ
related: e8Am 58W GkW

Trädgård
type: Concept
in scheme: JobTech Taxonomy - SUN utbildningsområde
definition: Trädgård omfattar utbildningar inriktade mot odling av trädgårdsväxter såsom grönsaker, frukt, bär och prydnadsväxter. Utbildning i växtförädling och utveckling av produktionsprocessen utifrån biologi, teknologi och ekonomi samt trädgårdsanläggning ingår. Även utbildningar inriktade mot anläggning av stadsparker och trädgårdar inkluderas.
broader: Lantbruk, trädgård, skog och fiske
narrower: Hortonomutbildning
narrower: Utbildning i trädgårdsbruk
narrower: Annan utbildning inom trädgård
narrower: Trädgårdsingenjörs- och trädgårdsteknikerutbildning

Annan utbildning inom musik, dans och dramatik
type: Concept
in scheme: JobTech Taxonomy - SUN utbildningsområde
definition: Annan utbildning inom musik, dans och dramatik
broader: Musik, dans och dramatik
related: FWZR AEe qAH

Kultur- och samhällsgeografi
type: Concept
in scheme: JobTech Taxonomy - SUN utbildningsområde
definition: Omfattar: · Afrikastudier · Asienstudier · Latinamerikastudier · Mellanösternkunskap · Övriga utbildningar i kultur- och samhällsgeografi
broader: Sociologi, etnologi och kulturgeografi
related: cg6S 67E g7a
related: Fk96 QKM cg7
related: EuHu a4T K4A
related: SFxP mQP 4Uf
related: Cx9n gxy H9m
related: 4Dn1 D79 GFP
related: Eayw i4b qgS
related: VeSL 6FP EHf
related: neur hgT 27W
related: entj NkY 2pR
related: fgTK Z3i 3Xa

Annan utbildning i biblioteks- och dokumentationsvetenskap
type: Concept
in scheme: JobTech Taxonomy - SUN utbildningsområde
definition: Annan utbildning i biblioteks- och dokumentationsvetenskap
broader: Biblioteks- och dokumentationsvetenskap

Musik, dans och dramatik
type: Concept
in scheme: JobTech Taxonomy - SUN utbildningsområde
definition: Här ingår utbildningar inriktade mot scenframställning som framförande, komposition, scenteknik, scenografi, koreografi och regi. Även teori och historia inom området ingår.
broader: Konst och media
narrower: Musik
narrower: Annan utbildning inom musik, dans och dramatik
narrower: Dans, teater och dramatik
narrower: Musik-, dans-, film- och teatervetenskap samt -historia

Matematik
type: Concept
in scheme: JobTech Taxonomy - SUN utbildningsområde
definition: Matematik omfattar utbildningar inriktade mot problemlösning och metodutveckling av abstrakta och generella problem. Det inkluderar utbildningar i algebra, aritmetik, geometri, analys och tillämpad matematik.
broader: Matematik och övrig naturvetenskap
narrower: Matematik

Sko- och läderarbete
type: Concept
in scheme: JobTech Taxonomy - SUN utbildningsområde
definition: Omfattar också: · Utbildning till sadelmakare
broader: Tillverkning av textilier, konfektion och lädervaror
related: pdx2 c9f eDL
related: L9u3 K72 Gzs
related: 3Rfy WPb D8X

Tillverkning av produkter av trä, papper, glas, porslin och plast
type: Concept
in scheme: JobTech Taxonomy - SUN utbildningsområde
definition: Här ingår utbildningar inriktade mot tillverkning av produkter i ett specifikt material såsom trä, papper, glas, porslin, sten, lera, plast eller gummi. Civilingenjörs- och ingenjörsutbildningar i materialteknik med inriktning mot ett specifikt material ingår.
broader: Material och tillverkning
narrower: Trätekniskt arbete
narrower: Glas- och porslinstillverkning
narrower: Pappersmassa- och papperstillverkning
narrower: Tillverkning av plast- och gummiprodukter
narrower: Annan utbildning i tillverkning i specifikt material
narrower: Civilingenjörsutbildning, trä, papper, glas, porslin och plast
narrower: Ingenjörsutbildning, trä, papper, glas, porslin och plast

Informations- och kommunikationsteknik (IKT), allmän utbildning
type: Concept
in scheme: JobTech Taxonomy - SUN utbildningsområde
definition: Omfattar: · Utbildning som leder till generell examen inom informationsteknologi · Övriga utbildningar i IKT, allmän utbildning Omfattar också: · Utbildning som leder till generell examen inom administrativ databehandling (ADB) Omfattar inte: · Breda utbildningar inom medieproduktion, jfr 213 · Informationsteknologi med tyngdpunkt på teknik, jfr 523
broader: Informations- och kommunikationsteknik (IKT), allmän utbildning
related: gvLB aUR FDp
related: rjJh PME Arf
related: rvVu YMV oCh
related: v4V5 Txg 3Ho
related: kmjk 4Up uhN
related: TR63 s9w 1uo

Lant- och skogsbruk samt djursjukvård
type: Concept
in scheme: JobTech Taxonomy - SUN utbildningsområde
top concept of: JobTech Taxonomy - SUN utbildningsområde
definition: Lant- och skogsbruk samt djursjukvård
narrower: Lantbruk, trädgård, skog och fiske
narrower: Djursjukvård

Civilingenjörsutbildning, datateknik
type: Concept
in scheme: JobTech Taxonomy - SUN utbildningsområde
definition: Omfattar: · Civilingenjörsutbildning i informationsteknologi · Civilingenjörsutbildning i kommunikationsteknik · Civilingenjörsutbildning i ljudteknik · Civilingenjörsutbildning i medieteknik · Övrig civilingenjörsutbildning i datateknik Omfattar inte: · Utbildningar inriktade mot datavetenskap, jfr 481b · Utbildningar inriktade mot systemering och programvaruteknik, jfr 481a
broader: Elektronik, datateknik och automation
related: 2W8F bK7 rAi
related: cUPT 4b8 UtZ
related: Gvdo MtN 2BZ
related: LgLE qkQ KbW
related: auQ9 2FZ KXb
related: SCP7 DQZ 65L
related: xY8J Wjb yKv
related: W1s9 byB LGS

Humaniora
type: Concept
in scheme: JobTech Taxonomy - SUN utbildningsområde
definition: Humaniora
broader: Humaniora och konst
narrower: Filosofi och logik
narrower: Främmande språk och språkvetenskap
narrower: Humaniora, övrig och ospecificerad utbildning
narrower: Historia och arkeologi
narrower: Humaniora, allmän utbildning
narrower: Religion
narrower: Svenska och litteraturvetenskap

Personal- och löneadministration
type: Concept
in scheme: JobTech Taxonomy - SUN utbildningsområde
definition: Omfattar: · Utbildning i beteendevetenskap, inriktning personaladministration · Utbildning till löneadministratör · Övriga utbildningar inom personal- och löneadministration Omfattar inte: · Utbildningar till redovisningsekonom med löneadministration, jfr 344z
broader: Ledning och administration
related: UJsk qUf Epa
related: zMnn pft zni
related: Vfjd uyZ gy8

Specialistsjuksköterskeutbildning, ambulanssjukvård
type: Concept
in scheme: JobTech Taxonomy - SUN utbildningsområde
definition: Specialistsjuksköterskeutbildning, ambulanssjukvård
broader: Omvårdnad
related: UJE5 ory HV8

Annan utbildning inom hushållstjänster och lokalvård
type: Concept
in scheme: JobTech Taxonomy - SUN utbildningsområde
definition: Omfattar: · Utbildning inom begravningstjänster · Utbildning till sotare · Övriga utbildningar inom hushållstjänster och lokalvård Omfattar inte: · Utbildningar i fastighetsskötsel, jfr 582x
broader: Hushållstjänster och lokalvård
related: FCZU iDV qbB
related: dchx cFA e6J
related: wQyV vUU Qi6

Annan omvårdnadsutbildning, funktionsnedsatta
type: Concept
in scheme: JobTech Taxonomy - SUN utbildningsområde
definition: Omfattar också: · Utbildningar för vård av funktionsnedsatta i alla åldrar
broader: Omvårdnad
related: vtpK EYD vhK
related: LzdS jPJ wRt

Specialistsjuksköterskeutbildning, psykiatrisk vård
type: Concept
in scheme: JobTech Taxonomy - SUN utbildningsområde
definition: Specialistsjuksköterskeutbildning, psykiatrisk vård
broader: Omvårdnad
related: yNuq CkW hZC

Japanska
type: Concept
in scheme: JobTech Taxonomy - SUN utbildningsområde
definition: Japanska
broader: Främmande språk och språkvetenskap
related: zBb6 bLJ pcT

Läkarutbildning, enskilda basspecialiteter, exklusive allmänmedicin
type: Concept
in scheme: JobTech Taxonomy - SUN utbildningsområde
definition: Läkarutbildning, enskilda basspecialiteter, exklusive allmänmedicin
broader: Medicin
related: XfCk 9ZC uvS
related: Pphc qAu Hr3
related: Hh1Q 2Mb 5P7
related: vBBA 32z mYG
related: GXoN uKG FyX
related: wPiK bH7 fHa
related: WKfW Xcr 5F3
related: C49k WEp dPJ
related: Eq8R 8S6 Nf2
related: 5Mwb yke YSd
related: Ja6U 1v1 ovh
related: FDe7 DGz Bn6
related: WRqX Uu8 gAz
related: bi25 SPF TFx
related: kkks jaD Anj
related: 7Ffb q5u SGi
related: hdxp Sxg tL9
related: HQyn o7E jcX
related: e8R7 gWd Wgk

Fritidsverksamhet för barn och ungdom
type: Concept
in scheme: JobTech Taxonomy - SUN utbildningsområde
definition: Omfattar också: · Fritidsledarutbildning
broader: Barn och ungdom
related: rX7g LYG GZb
related: nPHE f22 Nnj

Arbetsplatsrelaterad utbildning
type: Concept
in scheme: JobTech Taxonomy - SUN utbildningsområde
definition: Arbetsplatsrelaterad utbildning omfattar utbildningar inriktade mot organisation och verksamheter på arbetsplatsen som exempelvis personalutbildningar.
broader: Företagsekonomi, handel och administration
narrower: Arbetsplatsrelaterad utbildning

Samhällsbyggnad och byggnadsteknik, allmän utbildning
type: Concept
in scheme: JobTech Taxonomy - SUN utbildningsområde
definition: Här ingår breda utbildningar inriktade mot samhällsbyggnad och byggnadsteknik utan tyngdpunkt på någon av de övriga inriktningarna under 58. Här ingår utbildningar i lantmäteri samt i kart- och ritteknik.
broader: Samhällsbyggnad och byggnadsteknik
narrower: Ingenjörsutbildning, bred inriktning mot byggande
narrower: Annan bred utbildning inom samhällsbyggnad och byggnadsteknik
narrower: Civilingenjörsutbildning, bred inriktning mot byggande

Svenska som främmande språk
type: Concept
in scheme: JobTech Taxonomy - SUN utbildningsområde
definition: Svenska som främmande språk
broader: Främmande språk och språkvetenskap
related: zw7J cC4 Mmt
related: 5pFN svy wiR

Lärarutbildning, grundskolans tidiga åldrar, praktisk-estetiska ämnen
type: Concept
in scheme: JobTech Taxonomy - SUN utbildningsområde
definition: Omfattar också: · Lärarutbildning med inriktning mot idrott, bild och musik för grundskolans tidiga åldrar Omfattar inte: · Lärarutbildning inriktad mot grundskolans senare år, jfr 145–146 · Lärarutbildning med inriktning mot idrott, bild och musik för grundskolans senare år, jfr 146
broader: Lärarutbildning för grundskolans tidiga åldrar
related: 2bvq 4z3 NRm

Annan omvårdnadsutbildning, sjukvård
type: Concept
in scheme: JobTech Taxonomy - SUN utbildningsområde
definition: Omfattar: · Omvårdnadsutbildningar för vård av sjuka barn · Specialistundersköterskeutbildning inom akutsjukvård · Specialistundersköterskeutbildning inom kvalificerad sjukvård · Specialistundersköterskeutbildning inom operation, anestesi och intensivvård · Övrig annan omvårdnadsutbildning, inriktning sjukvård Omfattar också: · Undersköterskeutbildning (äldre, oavsett inriktning)
broader: Omvårdnad
related: e7dL kaw rR5
related: 6Ke5 wck f4n
related: cbRd hLA 9ci
related: 6MLH CKN LXt
related: tUzu 1g7 dGQ
related: psNf GGb 44x
related: JabR FNx VFB
related: PABK Mgi cnj

Geovetenskap och naturgeografi
type: Concept
in scheme: JobTech Taxonomy - SUN utbildningsområde
definition: Omfattar: · Utbildning i geofysik · Utbildning i geologi · Utbildning i hydrologi · Utbildning i meteorologi · Utbildning i oceanografi · Övriga utbildningar i geovetenskap och naturgeografi Omfattar inte: · Kultur- och samhällsgeografi, jfr 312c
broader: Geovetenskap och naturgeografi
related: gfbm Quj WjR
related: BvLb yMu RGJ
related: CHAk 8yx jnU
related: WdaC 44Q E57
related: XS3r Li8 ms2
related: 1LjN Gjw QhW
related: ttvL rst GuY
related: sXRy 7Mx PWK
related: jGpX qTq TeS
related: huYT tSE zsT
related: 4DRN h3T UMC
related: CoPs UJ1 Z1w
related: QyuV kuA uoU
related: 4quJ 2RP rdo

Företagsekonomi, organisation och management
type: Concept
in scheme: JobTech Taxonomy - SUN utbildningsområde
definition: Företagsekonomi, organisation och management
broader: Företagsekonomi, handel och administration, allmän utbildning
related: 8Dj5 bMv 1KV

Tillverkning och hantering av livsmedel, allmän utbildning
type: Concept
in scheme: JobTech Taxonomy - SUN utbildningsområde
definition: Omfattar också: · Utbildning till processtekniker inom tillverkning och hantering av livsmedel
broader: Tillverkning och hantering av livsmedel
related: XM2m mND TLA
related: 5gXq i3b 9eG
related: GpNw Pp4 m5t
related: ui7y 67m Wkz
related: 3e6J GCb 2gu
related: cgs8 bUh 6GS

Företagsekonomi, finansiering
type: Concept
in scheme: JobTech Taxonomy - SUN utbildningsområde
definition: Omfattar inte: · Yrkeshögskoleutbildningar inom finansiering, jfr 343z
broader: Företagsekonomi, handel och administration, allmän utbildning
related: MjjP RJ3 rMQ

Röntgensjuksköterskeutbildning
type: Concept
in scheme: JobTech Taxonomy - SUN utbildningsområde
definition: Omfattar: · Röntgenassistent- och radioterapiassistentutbildning · Övrig röntgensjuksköterskeutbildning
broader: Tekniskt inriktad vårdutbildning
related: ffAN VjY 34p
related: KSL5 GJg WBg
related: 1Ntg XD6 zwD

Fysik, kemi och geovetenskap, övrig och ospecificerad utbildning
type: Concept
in scheme: JobTech Taxonomy - SUN utbildningsområde
definition: Denna utbildningsgrupp omfattar utbildningar inriktade mot fysik, kemi eller geovetenskap som inte kan klassificeras under någon av de övriga inriktningarna inom 44 och som inte kan betraktas som breda utbildningar inom området.
broader: Fysik, kemi och geovetenskap
narrower: Fysik, kemi och geovetenskap, övrig och ospecificerad utbildning

Byggnadsarbete, allmän utbildning
type: Concept
in scheme: JobTech Taxonomy - SUN utbildningsområde
definition: Omfattar: · Byggproduktionsledarutbildning · Gymnasieskolans bygg- och anläggningsprogram, inriktning husbyggnad · Övriga utbildningar i byggnadsarbete
broader: Byggnadsteknik och anläggningsteknik
related: iPkZ C9p 3yZ
related: Xd7e erz DNU
related: cH6v inP pBN
related: hksB x4t o5K
related: 5VpX aAx Wts
related: H3Nk xKw oiN
related: oWTj aur reC
related: j4No V9T 6nR

Naprapatutbildning
type: Concept
in scheme: JobTech Taxonomy - SUN utbildningsområde
definition: Naprapatutbildning
broader: Terapi, rehabilitering och kostbehandling
related: Pvtd sCU ye9

Journalistik och information, övrig och ospecificerad utbildning
type: Concept
in scheme: JobTech Taxonomy - SUN utbildningsområde
definition: Journalistik och information, övrig och ospecificerad utbildning
broader: Journalistik och information, övrig och ospecificerad utbildning

Inredningsarkitektur och inredningsdesign
type: Concept
in scheme: JobTech Taxonomy - SUN utbildningsområde
definition: Inredningsarkitektur och inredningsdesign
broader: Formgivning
related: xdPP h65 GWr
related: 5oUZ Vw4 arU

Annan bred utbildning i företagsekonomi, handel och administration
type: Concept
in scheme: JobTech Taxonomy - SUN utbildningsområde
definition: Omfattar också: · Utbildningar till affärsutvecklare
broader: Företagsekonomi, handel och administration, allmän utbildning
related: KKAh s2M Jsz
related: fxGP Unf RJZ
related: zgV5 X3h GgS
related: 9Ruz NXc rsJ
related: uELo 6Nn L8s
related: 2uBC 7P9 QA8

Litteraturvetenskap och litteraturhistoria
type: Concept
in scheme: JobTech Taxonomy - SUN utbildningsområde
definition: Omfattar inte: · Litteraturvetenskap som är direkt knuten till ett främmande språk, jfr 222
broader: Svenska och litteraturvetenskap
related: JHyM ryR zSp
related: iJ5o ygU RzZ
related: 75Lw fq1 CAy
related: oMKJ CfZ 3FP

Lärarutbildning, hotell och restaurang
type: Concept
in scheme: JobTech Taxonomy - SUN utbildningsområde
definition: Lärarutbildning, hotell och restaurang
broader: Lärarutbildning i yrkesämne och praktisk-estetiska ämnen

Civilingenjörsutbildning, kemi- och bioteknik
type: Concept
in scheme: JobTech Taxonomy - SUN utbildningsområde
definition: Omfattar också: · Civilingenjörsutbildning i teknisk biologi
broader: Kemi- och bioteknik
related: 7767 vwD SGn
related: NLUC FNK Y8X
related: zcGo 1Lb SDh
related: JNCQ DBr ECg
related: R1qP EP5 x1s
related: VT9k nhk WQG
related: xYdY Qzd zTQ
related: mQP7 FjQ eJK

Lärarutbildning, medieproduktion
type: Concept
in scheme: JobTech Taxonomy - SUN utbildningsområde
definition: Lärarutbildning, medieproduktion
broader: Lärarutbildning i yrkesämne och praktisk-estetiska ämnen

Kinesiska
type: Concept
in scheme: JobTech Taxonomy - SUN utbildningsområde
definition: Kinesiska
broader: Främmande språk och språkvetenskap
related: pPN2 mPH 2a1

Lärarutbildning, grundskolans tidiga åldrar, svenska och samhällsorienterade ämnen
type: Concept
in scheme: JobTech Taxonomy - SUN utbildningsområde
definition: Omfattar inte: · Lärarutbildning inriktad mot grundskolans senare år, jfr 145–146
broader: Lärarutbildning för grundskolans tidiga åldrar
related: HmBz r7J DGi
related: v6sG 4n6 XRh

Humaniora, allmän utbildning
type: Concept
in scheme: JobTech Taxonomy - SUN utbildningsområde
definition: Här ingår breda utbildningar inriktade mot humaniora utan tydlig tyngdpunkt på någon av de övriga inriktningarna under 22, Humaniora.
broader: Humaniora
narrower: Humaniora, allmän utbildning

Samhälls- och beteendevetenskap
type: Concept
in scheme: JobTech Taxonomy - SUN utbildningsområde
definition: Samhälls- och beteendevetenskap
broader: Samhällsvetenskap, juridik, handel, administration
narrower: Statsvetenskap
narrower: Sociologi, etnologi och kulturgeografi
narrower: Samhälls- och beteendevetenskap, övrig och ospecificerad utbildning
narrower: Samhälls- och beteendevetenskap, allmän utbildning
narrower: Nationalekonomi och ekonomisk historia
narrower: Psykologi

Hälso- och sjukvård samt social omsorg
type: Concept
in scheme: JobTech Taxonomy - SUN utbildningsområde
top concept of: JobTech Taxonomy - SUN utbildningsområde
definition: Hälso- och sjukvård samt social omsorg
narrower: Hälso- och sjukvård
narrower: Socialt arbete och omsorg

Terapi, rehabilitering och kostbehandling
type: Concept
in scheme: JobTech Taxonomy - SUN utbildningsområde
definition: Här ingår utbildningar inriktade mot att återställa hälsa och funktionalitet hos personer med tillfällig eller bestående funktionsnedsättning.
broader: Hälso- och sjukvård
narrower: Annan utbildning inom terapi, rehabilitering och kostbehandling
narrower: Dietistutbildning
narrower: Logopedutbildning
narrower: Kiropraktorutbildning
narrower: Arbetsterapeututbildning
narrower: Naprapatutbildning
narrower: Fysioterapeututbildning

Utbildning i lantbruk
type: Concept
in scheme: JobTech Taxonomy - SUN utbildningsområde
definition: Omfattar: · Gymnasieskolans naturbruksprogram, inriktning lantbruk · Utbildning till driftledare inom lantbruk · Övriga utbildningar i lantbruk
broader: Lantbruk
related: DvUa c7e xDq
related: u4Vd Jtt xP6

Specialistsjuksköterskeutbildning, operationssjukvård
type: Concept
in scheme: JobTech Taxonomy - SUN utbildningsområde
definition: Omfattar också: · Utbildning till operationsassistent
broader: Omvårdnad
related: QiDu vuA QfB
related: Nrp2 GPc Sch

Fysik, kemi och geovetenskap, allmän utbildning
type: Concept
in scheme: JobTech Taxonomy - SUN utbildningsområde
definition: Här ingår breda utbildningar inriktade mot fysik, kemi och geovetenskap utan någon klar tyngdpunkt mot någon av de övriga inriktningarna inom 44.
broader: Fysik, kemi och geovetenskap
narrower: Fysik, kemi och geovetenskap, allmän utbildning

Hälso- och sjukvårdskuratorutbildning
type: Concept
in scheme: JobTech Taxonomy - SUN utbildningsområde
definition: Hälso- och sjukvårdskuratorutbildning
broader: Socialt arbete
related: 1Gd1 GWn wDP

Arbetsplatsrelaterad utbildning
type: Concept
in scheme: JobTech Taxonomy - SUN utbildningsområde
definition: Omfattar: · Fackliga utbildningar · Introduktionsutbildningar · Utbildning i arbetsrelaterad kvalitetsutveckling · Övriga arbetsplatsrelaterade utbildningar som inte går att klassificera inom övriga inriktningar Omfattar inte: · Personalutbildning som kan klassificeras inom någon av de övriga ämnesinriktningarna · Utbildningar i arbetsmiljö och arbetarskydd, jfr 851z · Utbildningar i kvalitetssäkring av teknisk karaktär, jfr 52 · Utbildningar i personlig utveckling, jfr 090z · Utbildningar, företrädesvis på eftergymnasial nivå, inriktade mot arbetsliv, klassificeras efter sitt huvudsakliga ämnesinnehåll, jfr 310, 312 och 345
broader: Arbetsplatsrelaterad utbildning
related: Bq5Q eGW Y2f
related: j2Df Fw9 9xj
related: xk4b 999 TGb
related: Dr6v 3m6 ovv
related: 1yeq w3c uTx
related: QKRo 5d7 pLp

Samhälls- och beteendevetenskap, allmän utbildning
type: Concept
in scheme: JobTech Taxonomy - SUN utbildningsområde
definition: Här ingår breda utbildningar inriktade mot samhälls- och beteendevetenskap utan klar tyngdpunkt mot någon av de övriga inriktningarna inom 31.
broader: Samhälls- och beteendevetenskap
narrower: Beteendevetenskap, allmän utbildning
narrower: Annan bred utbildning i samhälls- och beteendevetenskap
narrower: Samhällsvetenskap, allmän utbildning

Civilingenjörsutbildning, generell teknik och teknisk fysik
type: Concept
in scheme: JobTech Taxonomy - SUN utbildningsområde
definition: Omfattar också: · Civilingenjörsutbildning i nanoteknik
broader: Teknik och teknisk industri, allmän utbildning
related: na46 Lrm znA
related: yFJ4 6SC DN3
related: JxwV TPy fXB
related: rV9a Bi9 GvG

Psykologutbildning
type: Concept
in scheme: JobTech Taxonomy - SUN utbildningsområde
definition: Omfattar inte: · Psykologutbildning med fullgjord praktiktjänstgöring, jfr 311b
broader: Psykologi
related: Kvk9 4fN VkS

Arbetsmiljö och arbetarskydd
type: Concept
in scheme: JobTech Taxonomy - SUN utbildningsområde
definition: Omfattar: · Utbildning som leder till generell examen i arbetsvetenskap · Utbildning som leder till generell examen i ergonomi · Övriga utbildningar inom arbetsmiljö och arbetsskydd Omfattar inte: · Civilingenjörs- och ingenjörsutbildningar inriktade mot arbetsmiljö, jfr 521a och 521b · Utbildning i arbetsrätt, jfr 380x
broader: Arbetsmiljö och arbetarskydd
related: C5Kz TWZ Uy8
related: gFjS dHF 8Mi
related: rE8B tik nt6
related: K1NM y6P PkH
related: ybX4 pKN VYo

Humaniora, allmän utbildning
type: Concept
in scheme: JobTech Taxonomy - SUN utbildningsområde
definition: Omfattar inte: · Gymnasieskolans humanistiska program, jfr 010b
broader: Humaniora, allmän utbildning

Miljövetenskap
type: Concept
in scheme: JobTech Taxonomy - SUN utbildningsområde
definition: Miljövetenskap omfattar utbildningar inriktade mot de levande organismerna i relation till varandra och i samspel med omvärlden.
broader: Biologi och miljövetenskap
narrower: Miljövetenskap

Film-, radio- och tv-produktion
type: Concept
in scheme: JobTech Taxonomy - SUN utbildningsområde
definition: Omfattar: · Utbildning i produktion av podcasts · Utbildning i produktion av webbradio och webb-tv · Utbildning till manusförfattare · Övriga utbildningar inom film-, radio- och tv-produktion Omfattar inte: · Civil- och ingenjörsutbildningar, jfr 523
broader: Medieproduktion
related: 6wDt P4v Rsn
related: SxCB grd AB5
related: zNT5 8aP CEm
related: XRhc TRv 5AV
related: eEzL p8h zWN

Matematik och naturvetenskap, allmän utbildning
type: Concept
in scheme: JobTech Taxonomy - SUN utbildningsområde
definition: Omfattar inte: · Gymnasieskolans naturvetenskapliga program, samtliga inriktningar, jfr 010c
broader: Matematik och naturvetenskap, allmän utbildning

Chefsutbildning för officerare
type: Concept
in scheme: JobTech Taxonomy - SUN utbildningsområde
definition: Omfattar: · Högre officersprogram · Högre specialistofficersutbildning · Högre stabsofficersutbildning, olika inriktningar · Militärteknisk påbyggnadsutbildning · Stabsutbildning för militärer · Övrig chefsutbildning för officerare
broader: Militär utbildning
related: bxL8 TVA pib
related: f4qx Sf7 uuy
related: uoth ey4 hqv
related: m9Lz BsM H2H
related: 3VAe iZo ugx

Socialt omsorgsarbete, allmän utbildning
type: Concept
in scheme: JobTech Taxonomy - SUN utbildningsområde
definition: Omfattar: · Gymnasial utbildning med inriktning mot social service och omsorg · Utbildning som leder till generell examen inom social omsorg · Övriga utbildningar inom socialt omsorgsarbete, allmän utbildning Omfattar inte: · Utbildning i socialpedagogik, jfr 760z
broader: Socialt arbete
related: Sw4N 2Vt PVD
related: e69d LBp rHk
related: NxsY DV8 5Lm

Lärarutbildning, trä- och metallslöjd samt textilslöjd
type: Concept
in scheme: JobTech Taxonomy - SUN utbildningsområde
definition: Lärarutbildning, trä- och metallslöjd samt textilslöjd
broader: Lärarutbildning i yrkesämne och praktisk-estetiska ämnen
related: Jw1w 7Jf H2Z
related: Zm2q 7n5 gwz

Ingenjörsutbildning, materialteknik
type: Concept
in scheme: JobTech Taxonomy - SUN utbildningsområde
definition: Ingenjörsutbildning, materialteknik
broader: Material och tillverkning, allmän utbildning
related: PUYZ Zem 5xa

Annan utbildning i energi- och elektroteknik
type: Concept
in scheme: JobTech Taxonomy - SUN utbildningsområde
definition: Omfattar: · Utbildning som leder till generell examen inom elektroteknik · Utbildning som leder till generell examen inom energiteknik · Övriga utbildningar i energi- och elektroteknik Omfattar inte: · Utbildningar med tyngdpunkt på elektronik och elektronikbaserade system, jfr 523
broader: Energi- och elektroteknik
related: Qcoz HMf oa2
related: 45ih n74 nVk
related: xCRu Tq8 6hr
related: EYxU wp9 1am
related: rAGZ S2t F5v

Annan utbildning inom berg- och mineralteknik
type: Concept
in scheme: JobTech Taxonomy - SUN utbildningsområde
definition: Omfattar också: · Utbildningar i materialteknik, inriktning metallurgi eller bergsvetenskap Omfattar inte: · Utbildningar i geologi och geovetenskap, jfr 443z · Utbildningar inriktade mot verkstadsteknik och metallarbete, jfr 521c
broader: Berg- och mineralteknik
related: pfK4 EA9 onF
related: bUGU aNQ fXB
related: k64u JiU kBq
related: bZgg uGC WJs
related: pNPv tQe 9W5
related: Jmcu VT6 qEY
related: ijXE W93 K7U

Byggnadssnickeri
type: Concept
in scheme: JobTech Taxonomy - SUN utbildningsområde
definition: Byggnadssnickeri
broader: Byggnadsteknik och anläggningsteknik
related: v6A9 Nni dNc

Informations- och kommunikationsteknik (IKT), övrig och ospecificerad utbildning
type: Concept
in scheme: JobTech Taxonomy - SUN utbildningsområde
definition: Omfattar: · Utbildningar i UX-design · Utbildningar till nätverkstekniker, mjukvara · Utbildningar till supporttekniker · Övriga utbildningar inom IKT, övrig och ospecificerad utbildning Omfattar inte: · Utbildningar med tyngdpunkt på teknik, jfr 523
broader: Informations- och kommunikationsteknik (IKT), övrig och ospecificerad utbildning
related: Uf6J vPs yeL
related: PTYG goE TxP
related: WiPT AAR 512

Redovisning och beskattning
type: Concept
in scheme: JobTech Taxonomy - SUN utbildningsområde
definition: Omfattar också: · Utbildningar till redovisningsekonom Omfattar inte: · Gymnasieskolans ekonomiprogram, jfr 340a · Utbildning i företagsekonomi, inriktning redovisning, jfr 340e
broader: Redovisning och beskattning
related: waxf iLx ZP5
related: Toue ncd MgV
related: uZF4 Zmf x2f

Speciallärarutbildning
type: Concept
in scheme: JobTech Taxonomy - SUN utbildningsområde
definition: Speciallärarutbildning
broader: Pedagogik och lärarutbildning, övrig och ospecificerad utbildning
related: vBp6 3TQ rwY

Annan utbildning inom bild- och formkonst
type: Concept
in scheme: JobTech Taxonomy - SUN utbildningsområde
definition: Omfattar inte: · Utbildningar i arkitektur, jfr 581 · Utbildningar i konsthantverk, jfr 215z
broader: Bild- och formkonst

Pedagogik och lärarutbildning
type: Concept
in scheme: JobTech Taxonomy - SUN utbildningsområde
definition: Pedagogik och lärarutbildning
broader: Pedagogik och lärarutbildning
narrower: Pedagogik och lärarutbildning, allmän utbildning
narrower: Ämneslärarutbildning
narrower: Lärarutbildning för grundskolans tidiga åldrar
narrower: Pedagogik
narrower: Lärarutbildning för förskola och fritidsverksamhet
narrower: Pedagogik och lärarutbildning, övrig och ospecificerad utbildning
narrower: Lärarutbildning i yrkesämne och praktisk-estetiska ämnen

Utbildning för storhushåll
type: Concept
in scheme: JobTech Taxonomy - SUN utbildningsområde
definition: Utbildning för storhushåll
broader: Hotell, restaurang och storhushåll
related: VfLr eEg ABZ
related: bVqi 1Y6 eDu
related: Qx2Q 6hU yRQ
related: uHR3 VEJ qTF

Arbetsmiljö och arbetarskydd
type: Concept
in scheme: JobTech Taxonomy - SUN utbildningsområde
definition: Arbetsmiljö och arbetarskydd
broader: Arbetsmiljö och renhållning
narrower: Arbetsmiljö och arbetarskydd

Hälso- och sjukvård, allmän utbildning
type: Concept
in scheme: JobTech Taxonomy - SUN utbildningsområde
definition: Här ingår breda utbildningar inom området hälso- och sjukvård utan specialisering mot någon av de övriga inriktningarna inom 72. Även utbildningar inom hälsa och folkhälsa klassificeras här.
broader: Hälso- och sjukvård
narrower: Hälso- och sjukvård, allmän utbildning

Ledning och administration
type: Concept
in scheme: JobTech Taxonomy - SUN utbildningsområde
definition: Här ingår utbildningar inriktade mot planering, ledarskap och styrning i företag och andra organisationer. Utbildningar i ledarskap och administration där även finansiering och ekonomi ingår klassificeras här om tyngdpunkten ligger på ledarskap och administration. Utbildningar inriktade mot offentlig förvaltning och förvaltningsekonomi inkluderas också.
broader: Företagsekonomi, handel och administration
narrower: Annan utbildning i ledning och administration
narrower: Administration och förvaltning
narrower: Personal- och löneadministration
narrower: Ledarskap, organisation och styrning

Dokumentations- och informationsvetenskap
type: Concept
in scheme: JobTech Taxonomy - SUN utbildningsområde
definition: Omfattar: · Utbildningar i arkivvetenskap · Utbildningar i informationsvetenskap med inriktning mot hantering av information och dokumentering · Övriga utbildningar i dokumentations- och informationsvetenskap Omfattar inte: · Utbildningar i information, med avseende på innehåll och kommunikation, jfr 321b
broader: Biblioteks- och dokumentationsvetenskap
related: QP2G 1pA cPV
related: jodz kWf iKx
related: qTjY Xjh 6UA
related: hZQz da1 75c
related: 3HuW oSx wUB

Fiske och vattenbruk
type: Concept
in scheme: JobTech Taxonomy - SUN utbildningsområde
definition: Omfattar inte: · Utbildningar i vattenvård, inriktning mot ekologi, jfr 422z · Utbildningar inriktade mot industriell fiskhantering, jfr 541x
broader: Fiske och vattenbruk
related: D3bW LF3 9rU
related: wY59 MHW aTC
related: xzEF ytG bYa
related: kpZm ah5 KGQ

Barn och ungdom, allmän utbildning
type: Concept
in scheme: JobTech Taxonomy - SUN utbildningsområde
definition: Omfattar: · Barn- och ungdomskultur · Gymnasieskolans barn- och fritidsprogram · Övriga utbildningar inom barn och ungdom, allmän utbildning Omfattar inte · Fritidspedagogutbildning, jfr 143b · Förskollärarutbildning, jfr 143a
broader: Barn och ungdom
related: NLJt CVa 8Mg
related: 4r2m M4r tv5
related: cm19 3aQ xcy
related: Mxd8 hZT mBZ
related: eR1U kjh z4C
related: rQgh CRc psQ

Teknik och teknisk industri, övrig och ospecificerad utbildning
type: Concept
in scheme: JobTech Taxonomy - SUN utbildningsområde
definition: Här ingår utbildningar med inriktning mot teknik och teknisk industri som inte hör hemma under någon av de övriga inriktningarna under 5, Teknik och tillverkning.
broader: Teknik och teknisk industri
narrower: Annan utbildning inom teknik och teknisk industri
narrower: Civilingenjörsutbildning, övrig och ospecificerad utbildning
narrower: Ingenjörsutbildning, övrig och ospecificerad utbildning

Ämneslärarutbildning, matematik, data, naturvetenskap och teknik
type: Concept
in scheme: JobTech Taxonomy - SUN utbildningsområde
definition: Ämneslärarutbildning, matematik, data, naturvetenskap och teknik
broader: Ämneslärarutbildning
related: pywY SNs 2NZ

Elektronik, datateknik och automation
type: Concept
in scheme: JobTech Taxonomy - SUN utbildningsområde
definition: Här ingår tekniska utbildningar inriktade mot konstruktion, produktion, reparation och underhåll av elektronik och elektronikbaserade system samt av datorer och datorbaserade system. Utbildningar inom området styr- och reglerteknik inkluderas.
broader: Teknik och teknisk industri
narrower: Ingenjörsutbildning, automation och elektronik
narrower: Elektronik-, tele- och datatekniskt arbete
narrower: Automation
narrower: Civilingenjörsutbildning, automation och elektronik
narrower: Ingenjörsutbildning, datateknik
narrower: Civilingenjörsutbildning, datateknik
narrower: Annan utbildning i elektronik, datateknik och automation

Tillverkning och hantering av livsmedel
type: Concept
in scheme: JobTech Taxonomy - SUN utbildningsområde
definition: Här ingår utbildningar inriktade mot såväl produktion och utveckling av livsmedelsprodukter som mot hantering av livsmedel vid transporter, försäljning och förvaring.
broader: Material och tillverkning
narrower: Bageri och konditori
narrower: Civilingenjörsutbildning, livsmedel
narrower: Tillverkning och hantering av livsmedel, allmän utbildning
narrower: Kött och charkuteri
narrower: Annan utbildning i tillverkning och hantering av livsmedel
narrower: Ingenjörsutbildning, livsmedel

Samhällsbyggnad och byggnadsteknik
type: Concept
in scheme: JobTech Taxonomy - SUN utbildningsområde
definition: Samhällsbyggnad och byggnadsteknik
broader: Teknik och tillverkning
narrower: Byggnadsteknik och anläggningsteknik
narrower: Samhällsbyggnad och byggnadsteknik, övrig och ospecificerad utbildning
narrower: Samhällsbyggnad och byggnadsteknik, allmän utbildning
narrower: Samhällsbyggnad och arkitektur

Omvårdnad
type: Concept
in scheme: JobTech Taxonomy - SUN utbildningsområde
definition: Här ingår utbildningar inriktade mot vård, omsorg, stöd och service inom hälso- och sjukvård, psykiatri, funktionshinderomsorg och äldreomsorg. Sjuksköterskeutbildningar med specialisering före 1993 klassificeras som specialistsjuksköterskeutbildningar 723b–723m.
broader: Hälso- och sjukvård
narrower: Annan omvårdnadsutbildning, sjukvård
narrower: Annan omvårdnadsutbildning, psykiskt funktionsnedsatta
narrower: Annan utbildning inom omvårdnad
narrower: Specialistsjuksköterskeutbildning, anestesisjukvård
narrower: Specialistsjuksköterskeutbildning, intensivvård
narrower: Annan omvårdnadsutbildning, funktionsnedsatta
narrower: Annan omvårdnadsutbildning, allmän vård och omsorg
narrower: Specialistsjuksköterskeutbildning, vård av äldre
narrower: Specialistsjuksköterskeutbildning, medicinsk vård
narrower: Specialistsjuksköterskeutbildning, barn och ungdom
narrower: Annan omvårdnadsutbildning, äldreomsorg
narrower: Specialistsjuksköterskeutbildning, öppen och annan inriktning
narrower: Specialistsjuksköterskeutbildning, operationssjukvård
narrower: Barnmorskeutbildning
narrower: Specialistsjuksköterskeutbildning, psykiatrisk vård
narrower: Annan omvårdnadsutbildning, övriga inriktningar
narrower: Specialistsjuksköterskeutbildning, onkologisk vård
narrower: Sjuksköterskeutbildning, grundutbildning
narrower: Specialistsjuksköterskeutbildning, distriktssköterska
narrower: Specialistsjuksköterskeutbildning, ambulanssjukvård
narrower: Annan omvårdnadsutbildning, psykiatrisk vård
narrower: Specialistsjuksköterskeutbildning, kirurgisk vård

Laboratorieteknik
type: Concept
in scheme: JobTech Taxonomy - SUN utbildningsområde
definition: Laboratorieteknik
broader: Kemi- och bioteknik
related: hwCv Zc3 HSC

Personlig utveckling
type: Concept
in scheme: JobTech Taxonomy - SUN utbildningsområde
definition: Omfattar: · Kurser i ledarskap · Kurser i retorik · Personalutbildning som utvecklar individens sociala och mentala kompetens · Söka-jobb-kurser Omfattar inte: · Utbildningar i ledarskap inriktade mot planering, organisation och styrning, jfr 345a
broader: Personlig utveckling
related: cVXh ZXj Wp3
related: pbCN eh4 H1S
related: T3DW SpV 94p
related: GTdr sTC 8vK
related: uHLE Xpi zoX
related: ZWXC avx 69p
related: nbB9 Wcf f6k

Lärarutbildning, fritidsverksamhet
type: Concept
in scheme: JobTech Taxonomy - SUN utbildningsområde
definition: Omfattar inte: · Fritidsledarutbildning, jfr 761c
broader: Lärarutbildning för förskola och fritidsverksamhet
related: ar8R i11 hSe
related: Meyu RNQ Ekk

Översättning och tolkning
type: Concept
in scheme: JobTech Taxonomy - SUN utbildningsområde
definition: Omfattar också: · Kontakttolkutbildning · Utbildning som leder till generell examen i översättningsvetenskap Omfattar inte: · Utbildning för teckenspråk, jfr 223c
broader: Främmande språk och språkvetenskap
related: dWGk aNy A6Y
related: E3GF B9a XF6
related: yuPA yS5 fVu

Tillverkning av textilier och konfektion
type: Concept
in scheme: JobTech Taxonomy - SUN utbildningsområde
definition: Omfattar också: · Utbildning till skräddare
broader: Tillverkning av textilier, konfektion och lädervaror
related: X5bm yX8 XtB
related: sFTe x1z ywL
related: Cz91 AhH Zcc
related: eXsP xis o41
related: zgPq iGW frK
related: z4s5 KHn Kmf
related: pbsv JTJ UAt
related: W6rc WJJ wb6
related: zkJw bwW qg1

Läkarutbildning, allmänmedicin
type: Concept
in scheme: JobTech Taxonomy - SUN utbildningsområde
definition: Läkarutbildning, allmänmedicin
broader: Medicin
related: 3A4e Fss vh2

Djursjukvård
type: Concept
in scheme: JobTech Taxonomy - SUN utbildningsområde
definition: Djursjukvård omfattar utbildningar inriktade mot att utveckla teorier och metoder att förebygga, diagnostisera och behandla sjukdomar och skador hos djur. Även utbildningar inriktade mot att assistera veterinärer ingår.
broader: Djursjukvård
narrower: Annan utbildning inom djursjukvård
narrower: Djursjukskötarutbildning
narrower: Veterinärutbildning

Humaniora, övrig och ospecificerad utbildning
type: Concept
in scheme: JobTech Taxonomy - SUN utbildningsområde
definition: Omfattar inte: · Breda utbildningar inriktade mot humaniora, jfr 220z
broader: Humaniora, övrig och ospecificerad utbildning

Juristutbildning (juristexamen), inklusive fullgjord notarietjänstgöring
type: Concept
in scheme: JobTech Taxonomy - SUN utbildningsområde
definition: Juristutbildning (juristexamen), inklusive fullgjord notarietjänstgöring
broader: Juridik och rättsvetenskap
related: UvmV 2KC mtp

Säkerhet i samhället
type: Concept
in scheme: JobTech Taxonomy - SUN utbildningsområde
definition: Säkerhet i samhället omfattar utbildningar inriktade mot skydd av individer och egendom.
broader: Säkerhetstjänster
narrower: Polisutbildning
narrower: Kriminalvårdsutbildning
narrower: Utbildning för brandskydd och annan räddningstjänst
narrower: Annan utbildning inom säkerhet i samhället

Tandläkarutbildning
type: Concept
in scheme: JobTech Taxonomy - SUN utbildningsområde
definition: Tandläkarutbildning
broader: Tandvård
related: DnKv ULd th4

Sociologi
type: Concept
in scheme: JobTech Taxonomy - SUN utbildningsområde
definition: Omfattar: · Utbildning i kriminologi · Utbildning i rättssociologi · Övriga utbildningar i sociologi Omfattar inte: · Socionomutbildning, jfr 762d · Utbildning i socialt arbete, jfr 762
broader: Sociologi, etnologi och kulturgeografi
related: hZH4 aqh n3K
related: qf4i cNF Nre
related: XAAz yTm jTk

Svenska och litteraturvetenskap
type: Concept
in scheme: JobTech Taxonomy - SUN utbildningsområde
definition: Här ingår utbildningar inriktade mot det svenska språket, dess litteratur och språkvetenskap. Även allmän litteraturvetenskap och litteraturhistoria.
broader: Humaniora
narrower: Litteraturvetenskap och litteraturhistoria
narrower: Annan utbildning i svenska och litteraturvetenskap
narrower: Svenska minoritetsspråk
narrower: Svenska och nordiska språk
narrower: Modersmålsutbildning och teckenspråk

Civilingenjörsutbildning, automation och elektronik
type: Concept
in scheme: JobTech Taxonomy - SUN utbildningsområde
definition: Omfattar: · Civilingenjörsutbildning i automatisering · Civilingenjörsutbildning i elektronikdesign · Civilingenjörsutbildning i robotteknik · Övrig civilingenjörsutbildning i automation och elektronik
broader: Elektronik, datateknik och automation
related: Z8xk WpD nHF
related: uNDV Qo9 EoD
related: WQ2v W97 fDA
related: SDKb Yr9 oie
related: sTJH NuN xFm
related: hihP Kot zdB

Ämneslärarutbildning, historia, samhällsvetenskap och företagsekonomi i kombination med praktisk-estetiska ämnen
type: Concept
in scheme: JobTech Taxonomy - SUN utbildningsområde
definition: Ämneslärarutbildning, historia, samhällsvetenskap och företagsekonomi i kombination med praktisk-estetiska ämnen
broader: Ämneslärarutbildning
related: sn7t D8Q kyq

Ingenjörsutbildning, miljöteknik
type: Concept
in scheme: JobTech Taxonomy - SUN utbildningsområde
definition: Omfattar också: · Ingenjörsutbildning i naturvård Omfattar inte: · Ingenjörsutbildningar i samhällsbyggnadsteknik, jfr 581b
broader: Miljöteknik och miljökontroll
related: nonw 61S Lcf
related: QGMt 6ws RqW
related: Baxg R5b jbG
related: WVT9 CLd Uco

Annan utbildning inom datavetenskap och systemvetenskap
type: Concept
in scheme: JobTech Taxonomy - SUN utbildningsområde
definition: Omfattar: · Projektledarutbildningar mot IT · Utbildningar i artificiell intelligens (AI) · Utbildningar i IT-säkerhet · Övriga utbildningar inom datavetenskap och systemvetenskap Omfattar inte: · Utbildningar i systemvetenskap och programvaruteknik, jfr 481a
broader: Datavetenskap och systemvetenskap
related: 4wN1 Voe 7p9
related: nefP Uuk x9v
related: KF7V H1U vHv

Annan omvårdnadsutbildning, allmän vård och omsorg
type: Concept
in scheme: JobTech Taxonomy - SUN utbildningsområde
definition: Omfattar: · Gymnasieskolans vård- och omsorgsprogram · Undersköterskeutbildning inom vuxenutbildning · Övrig annan omvårdnadsutbildning, allmän vård och omsorg
broader: Omvårdnad
related: nXZ3 v4W WCS
related: azLN 53u wzR
related: TMPa MvN AW3

Bred, generell utbildning, naturvetenskaplig inriktning
type: Concept
in scheme: JobTech Taxonomy - SUN utbildningsområde
definition: Omfattar: · Gymnasieskolans naturvetenskapliga program, samtliga inriktningar · Tekniskt och naturvetenskapligt basår Omfattar inte: · Gymnasieskolans teknikprogram, jfr 52, 54 och 58
broader: Bred, generell utbildning
related: yyfv 3hB TP8
related: BaGV FQz U5R
related: khku 7w7 p1L

Annan lärarutbildning för grundskolans tidiga åldrar
type: Concept
in scheme: JobTech Taxonomy - SUN utbildningsområde
definition: Omfattar inte: · Modersmålslärarutbildning, jfr 149b · Speciallärarutbildning, jfr 149d · Specialpedagogutbildning, jfr 149a
broader: Lärarutbildning för grundskolans tidiga åldrar

Annan utbildning i svenska och litteraturvetenskap
type: Concept
in scheme: JobTech Taxonomy - SUN utbildningsområde
definition: Annan utbildning i svenska och litteraturvetenskap
broader: Svenska och litteraturvetenskap
related: o6ro bSU EEh
related: mtwY aZR gQR
related: Y9eb p3b jLf

Social omsorgsutbildning, äldre och funktionsnedsatta
type: Concept
in scheme: JobTech Taxonomy - SUN utbildningsområde
definition: Social omsorgsutbildning, äldre och funktionsnedsatta
broader: Socialt arbete
related: jnWU S4b 2Ys

Social omsorgsutbildning, socialpedagogisk behandling
type: Concept
in scheme: JobTech Taxonomy - SUN utbildningsområde
definition: Omfattar också: · Utbildning till behandlingspedagog
broader: Socialt arbete
related: 2Xkd r95 NRn
related: J6vg Hss Vyz
related: hPdX 9rS cWt

Annan tekniskt inriktad vårdutbildning
type: Concept
in scheme: JobTech Taxonomy - SUN utbildningsområde
definition: Omfattar: · Utbildning till steriltekniker · Utbildningar för assisterande personal till övriga inom 725 · Övrig tekniskt inriktad vårdutbildning Omfattar också: · Utbildning som leder till generell examen inom audionomi · Utbildning som leder till generell examen inom biomedicinsk laboratorievetenskap · Utbildning som leder till generell examen inom hörselvetenskap · Utbildning som leder till generell examen inom optometri · Utbildning som leder till generell examen inom ortopedteknik · Utbildning som leder till generell examen inom radiologi · Utbildning som leder till generell examen inom rehabiliteringsteknik Omfattar inte: · Allmän laboratorieteknik, jfr 524c · Laboratorieteknik där tyngdpunkten lagts mot en specifik inriktning (biologi, fysik, kemi etc.) klassificeras under respektive inriktning, jfr 421, 441, 442 etc. · Operationsassistentutbildning, jfr 723e · Sjuksköterskeutbildning med specialisering mot diagnostisk radiologi och onkologi, jfr 723m och 723j · Utbildningar i tandteknik, jfr 724f
broader: Tekniskt inriktad vårdutbildning
related: 8kem nMz TBt
related: qQ6a mPK QEG
related: 5dA9 5No TaA
related: biZh PkN Wfd
related: bQk2 oG2 VAi
related: Rq2B bMP 4WK
related: 3KiX rn1 4RU
related: Dusn MLN gzY
related: EHfk HPb kLb
related: RuXq Kfw LYg
related: axiC WEA oLd

Processindustriteknik
type: Concept
in scheme: JobTech Taxonomy - SUN utbildningsområde
definition: Omfattar också: · Gymnasieskolans industritekniska program, inriktning processteknik
broader: Kemi- och bioteknik
related: Xy5a hyf pp1
related: 6Yvg BFw fir
related: gavY KF9 kfS

Annan utbildning i maskinteknik och verkstadsteknik
type: Concept
in scheme: JobTech Taxonomy - SUN utbildningsområde
definition: Omfattar: · Gymnasieskolans teknikprogram, inriktning design och produktutveckling · Gymnasieskolans teknikprogram, inriktning produktionsteknik · Utbildning som leder till generell examen inom maskinteknik · Utbildning som leder till generell examen inom produktutveckling · Övriga utbildningar i maskinteknik och verkstadsteknik Omfattar inte: · Utbildningar i fordons- och farkostteknik, jfr 525 · Utbildningar i grafisk teknik, jfr 213c · Utbildningar i industriell ekonomi och organisation, jfr 526 · Utbildningar i materialteknik, jfr 54 · Utbildningar i mekatronik, inriktning automation, jfr 523f · Utbildningar i mekatronik, inriktning elektronik, jfr 523e
broader: Maskinteknik och verkstadsteknik
related: Xtok d41 PfA
related: qNzA Pjq Udm
related: 9XY5 LHJ zTj
related: mqha 11n qmg
related: cLrd xer Chi
related: HfhT xXs BK2
related: AY36 qFb c7g
related: Urh4 7uS ZUd
related: G5sR Gr1 wnM
related: PCbc 54k 4Hr
related: J7Wc VFv Yrt
related: SsbS HNb vkt
related: i2KY RRW ofK
related: tKP9 cru wXQ
related: h6jA 2gk dWo
related: j4iQ qAm vD4
related: Z91t B9x Big
related: 8ggf bdt exP
related: mgC1 xbr ekz

Hotell, restaurang och storhushåll
type: Concept
in scheme: JobTech Taxonomy - SUN utbildningsområde
definition: Här ingår utbildningar inriktade mot tillredning och servering av mat och dryck samt övrig måltidsservice. Utbildningar mot service på hotell och liknande anläggningar ingår.
broader: Personliga tjänster
narrower: Utbildning för hotell
narrower: Hotell, restaurang och storhushåll, allmän utbildning
narrower: Annan utbildning inom hotell, restaurang och storhushåll
narrower: Utbildning för restaurang
narrower: Utbildning för storhushåll

Annan utbildning inom terapi, rehabilitering och kostbehandling
type: Concept
in scheme: JobTech Taxonomy - SUN utbildningsområde
definition: Omfattar: · Medicinsk massage, rehabilitering · Osteopatutbildning · Övriga utbildningar inom terapi, rehabilitering och kostbehandling Omfattar också: · Utbildning som leder till generell examen inom arbetsterapi · Utbildning som leder till generell examen inom fysioterapi · Utbildning som leder till generell examen inom kostterapi · Utbildning som leder till generell examen inom logopedi · Utbildning som leder till generell examen inom rehabiliteringsvetenskap Omfattar inte: · Psykolog- och psykoterapeututbildning, jfr 311 · Utbildning till medicinsk fotterapeut för omvårdnad, jfr 723u · Utbildningar i samtalsterapi, jfr 311x
broader: Terapi, rehabilitering och kostbehandling
related: X6DG rHK yH5
related: qvRK 3Kt fkP
related: r2Fr sgm z6u
related: 9AY1 63p rNQ
related: ScTG aGG x8H
related: EP3r KDJ Rc9
related: dfRv sh1 RKs
related: WJ6N ANT vzS
related: mSgq qDh j6Z
related: vN8V oca bk7

Filosofi och logik
type: Concept
in scheme: JobTech Taxonomy - SUN utbildningsområde
definition: Filosofi och logik omfattar utbildningar inriktade mot grunderna för vetande och tänkande samt mänskliga värderingar och dess grund.
broader: Humaniora
narrower: Filosofi och logik

Ingenjörsutbildning, berg- och mineralteknik
type: Concept
in scheme: JobTech Taxonomy - SUN utbildningsområde
definition: Ingenjörsutbildning, berg- och mineralteknik
broader: Berg- och mineralteknik
related: qFgm 4bv owY
related: E9iL DMS 1C2

Sjuksköterskeutbildning, grundutbildning
type: Concept
in scheme: JobTech Taxonomy - SUN utbildningsområde
definition: Sjuksköterskeutbildning, grundutbildning
broader: Omvårdnad
related: tK2m HjV K8X

Okänd
type: Concept
in scheme: JobTech Taxonomy - SUN utbildningsområde
definition: Om information saknas om utbildningen kodas utbildningen enligt nedan: 9 Okänd 99 Okänd 999 Okänd 999z Okänd
broader: Okänd
narrower: Okänd

Ämneslärarutbildning, språk
type: Concept
in scheme: JobTech Taxonomy - SUN utbildningsområde
definition: Omfattar inte: · Ämneslärarutbildning i modersmål, jfr 149b
broader: Ämneslärarutbildning
related: KwjL 5zB yP2

Läkarutbildning, invärtesmedicinska specialiteter
type: Concept
in scheme: JobTech Taxonomy - SUN utbildningsområde
definition: Omfattar också: · Geriatrik
broader: Medicin
related: cko1 uHC 5mC
related: rxys o55 mM1
related: z92S EtZ Kkk
related: w2Ey YXF 6su
related: y72N wa5 AH5
related: hYQe vBm vtg
related: DLJu ikG 1Tk
related: Ackp tL8 wSL
related: GjWk ZrT LYw
related: oM7Z qhr nTM
related: np5b UZM G6T
related: mXUg 5wD wHT
related: At1e Uz8 pTH
related: LnJz Me6 K4u

Civilingenjörsutbildning, övrig och ospecificerad utbildning
type: Concept
in scheme: JobTech Taxonomy - SUN utbildningsområde
definition: Civilingenjörsutbildning, övrig och ospecificerad utbildning
broader: Teknik och teknisk industri, övrig och ospecificerad utbildning
related: whwb gpz rBg
related: e8Mk Urf RfY
related: 86qo NMt RBw
related: k5FT sAY vwg

Civilingenjörsutbildning, textilteknologi
type: Concept
in scheme: JobTech Taxonomy - SUN utbildningsområde
definition: Civilingenjörsutbildning, textilteknologi
broader: Tillverkning av textilier, konfektion och lädervaror
related: CKcv LTm 32m

Utbildning i djurhållning
type: Concept
in scheme: JobTech Taxonomy - SUN utbildningsområde
definition: Omfattar: · Gymnasieskolans naturbruksprogram, inriktning djur · Utbildning som leder till generell examen inom husdjursvetenskap · Övriga utbildningar i djurhållning Omfattar inte: · Utbildningar i hästhållning, jfr 621f
broader: Lantbruk
related: Ragd Vvd npT
related: DNtU pnw uZT
related: ZEfX 3Sp CRV
related: BWum SUJ Wj7

Annan utbildning i juridik och rättsvetenskap
type: Concept
in scheme: JobTech Taxonomy - SUN utbildningsområde
definition: Omfattar: · Utbildningar till juristassistent (paralegal) · Övriga utbildningar inom juridik och rättsvetenskap Omfattar inte: · Utbildningar i kriminologi, jfr 312a · Gymnasieskolans ekonomiprogram, inriktning juridik, jfr 340a
broader: Juridik och rättsvetenskap
related: mCMa LA9 KX1
related: Z9ZH 7XU Kkb

Material och tillverkning, övrig och ospecificerad utbildning
type: Concept
in scheme: JobTech Taxonomy - SUN utbildningsområde
definition: Här ingår utbildningar i material och tillverkning som inte kan klassificeras under någon av de övriga inriktningarna inom område 54 Material och tillverkning alternativt under någon av inriktningarna inom område 52, Teknik och teknisk industri.
broader: Material och tillverkning
narrower: Material och tillverkning, övrig och ospecificerad utbildning

Renhållning och avfallshantering
type: Concept
in scheme: JobTech Taxonomy - SUN utbildningsområde
definition: Omfattar inte: · Civilingenjörs- och ingenjörsutbildningar i miljöteknik, jfr 527a och 527b · Utbildningar i miljöteknik och miljövårdsteknik, jfr 527x
broader: Renhållning och avfallshantering
related: LpUq uRY GTs
related: 1eVm yZa 9yi

Spanska
type: Concept
in scheme: JobTech Taxonomy - SUN utbildningsområde
definition: Spanska
broader: Främmande språk och språkvetenskap
related: j1wV 2az DMk

Turism, resor och fritid
type: Concept
in scheme: JobTech Taxonomy - SUN utbildningsområde
definition: Här ingår utbildningar inriktade mot marknadsföring, försäljning och genomförande av resor och turistevenemang samt övriga kultur- och fritidsevenemang.
broader: Personliga tjänster
narrower: Turism, resor och fritid

Personliga tjänster, övrig och ospecificerad utbildning
type: Concept
in scheme: JobTech Taxonomy - SUN utbildningsområde
definition: Personliga tjänster, övrig och ospecificerad utbildning
broader: Personliga tjänster, övrig och ospecificerad utbildning

Informations- och kommunikationsteknik (IKT), allmän utbildning
type: Concept
in scheme: JobTech Taxonomy - SUN utbildningsområde
definition: Här ingår breda utbildningar inom IKT, utan tyngdpunkt på någon av de övriga utbildningarna under 48. Utbildningar med tyngdpunkt på teknik redovisas under 523.
broader: Informations- och kommunikationsteknik (IKT)
narrower: Informations- och kommunikationsteknik (IKT), allmän utbildning

Lärarutbildning, musik
type: Concept
in scheme: JobTech Taxonomy - SUN utbildningsområde
definition: Lärarutbildning, musik
broader: Lärarutbildning i yrkesämne och praktisk-estetiska ämnen
related: 2o1y rJs p14
related: ZiKZ 3aN N7N

Matematik och övrig naturvetenskap
type: Concept
in scheme: JobTech Taxonomy - SUN utbildningsområde
definition: Matematik och övrig naturvetenskap
broader: Naturvetenskap, matematik och informations- och kommunikationsteknik (IKT)
narrower: Matematik och naturvetenskap, övrig och ospecificerad utbildning
narrower: Matematik
narrower: Matematik och naturvetenskap, allmän utbildning
narrower: Statistik

Arbetsmiljö och renhållning, övrig och ospecificerad utbildning
type: Concept
in scheme: JobTech Taxonomy - SUN utbildningsområde
definition: Här ingår utbildningar i arbetsmiljö och renhållning som inte kan klassificeras under någon av de övriga inriktningarna inom 85 och som inte kan betraktas som breda inom området.
broader: Arbetsmiljö och renhållning
narrower: Arbetsmiljö och renhållning, övrig och ospecificerad utbildning

Annan utbildning inom socialt arbete
type: Concept
in scheme: JobTech Taxonomy - SUN utbildningsområde
definition: Omfattar också: · Utbildning som leder till generell examen inom socialt arbete Omfattar inte: · Utbildningar som omfattar både social omsorg och hälso- och sjukvård, jfr 723
broader: Socialt arbete
related: 6STb qSk 5Tx
related: kAuo 2zk Gfa

Lärarutbildning, förskola
type: Concept
in scheme: JobTech Taxonomy - SUN utbildningsområde
definition: Omfattar inte: · Barnskötarutbildning, jfr 761b
broader: Lärarutbildning för förskola och fritidsverksamhet
related: aCR9 ULU A7F
related: DAMJ udg yhu
related: FkBe YvK 8nw
related: KoqU XdE Uha

Utbildning i jordbruk
type: Concept
in scheme: JobTech Taxonomy - SUN utbildningsområde
definition: Omfattar också: · Utbildningar i frukt- och grönsaksodling i livsmedelsproducerande syfte
broader: Lantbruk
related: oiEP Pks gzT
related: 3QwP PYm Hkt

Receptarieutbildning
type: Concept
in scheme: JobTech Taxonomy - SUN utbildningsområde
definition: Receptarieutbildning
broader: Farmaci
related: D4So p9Q LCc

Informations- och kommunikationsteknik (IKT), övrig och ospecificerad utbildning
type: Concept
in scheme: JobTech Taxonomy - SUN utbildningsområde
definition: Här ingår utbildningar som inte kan klassificeras under någon av de övriga inriktningarna inom 48 och som inte kan betraktas som breda utbildningar inom området.
broader: Informations- och kommunikationsteknik (IKT)
narrower: Informations- och kommunikationsteknik (IKT), övrig och ospecificerad utbildning

Utbildning för sjöfart
type: Concept
in scheme: JobTech Taxonomy - SUN utbildningsområde
definition: Omfattar: · Sjökaptensutbildning · Styrmansutbildning · Övriga utbildningar för sjöfart Omfattar inte: · Maskinteknikerutbildning, jfr 525d · Sjöingenjörsutbildning, jfr 525d
broader: Transporttjänster
related: qi8Y bQw yXk
related: wPt4 1Xo 5aW
related: dPnT MNK XB5

Ekonomisk historia
type: Concept
in scheme: JobTech Taxonomy - SUN utbildningsområde
definition: Ekonomisk historia
broader: Nationalekonomi och ekonomisk historia
related: X3K2 jJk Wvo

Säkerhetstjänster, allmän utbildning
type: Concept
in scheme: JobTech Taxonomy - SUN utbildningsområde
definition: Säkerhetstjänster, allmän utbildning
broader: Säkerhetstjänster, allmän utbildning

Utbildning i trädgårdsbruk
type: Concept
in scheme: JobTech Taxonomy - SUN utbildningsområde
definition: Omfattar: · Gymnasieskolans naturbruksprogram, inriktning trädgård · Utbildningar till trädgårdsanläggare · Utbildningar till trädgårdsmästare · Övriga utbildningar i trädgårdsbruk
broader: Trädgård
related: NYJp Y6U KHV
related: RGL8 8Xn RWo
related: nHgb vSN dx2
related: 57WC szp pe6

Miljöteknik och miljökontroll
type: Concept
in scheme: JobTech Taxonomy - SUN utbildningsområde
definition: Här ingår utbildningar inriktade mot processer som minimerar utsläpp och avfall för att undvika miljöförstöring. Det inkluderar utbildningar för kontroll av bland andra livsmedelshygien, vatten, luft och mark. Utbildningar inriktade mot samhällsbyggnadsteknik med miljöprofil inkluderas.
broader: Teknik och teknisk industri
narrower: Civilingenjörsutbildning, miljöteknik
narrower: Annan utbildning i miljöteknik och miljökontroll
narrower: Ingenjörsutbildning, miljöteknik

Annan utbildning i industriell ekonomi och organisation
type: Concept
in scheme: JobTech Taxonomy - SUN utbildningsområde
definition: Omfattar: · Tekniska utbildningar med inriktning på kvalitetsutveckling · Utbildning i logistik med teknikinnehåll · Övrig utbildning i industriell ekonomi och organisation
broader: Industriell ekonomi och organisation
related: eTLf 5Ku xxP
related: PKRc TGu BRo
related: R672 6Yw d8Q
related: 78wn GxL H4x
related: zHJz PgY fBD
related: ufyj 1mG Aof

Konstvetenskap och konsthistoria
type: Concept
in scheme: JobTech Taxonomy - SUN utbildningsområde
definition: Omfattar också: · Utbildning i estetik
broader: Bild- och formkonst
related: nFxg AFf H7G
related: DCBb mjG AqS
related: W8iS WCY t2t
related: HeoH HYe CnD

Specialistsjuksköterskeutbildning, onkologisk vård
type: Concept
in scheme: JobTech Taxonomy - SUN utbildningsområde
definition: Specialistsjuksköterskeutbildning, onkologisk vård
broader: Omvårdnad
related: iiK5 hjx z7U

Naturvetenskap, matematik och informations- och kommunikationsteknik (IKT)
type: Concept
in scheme: JobTech Taxonomy - SUN utbildningsområde
top concept of: JobTech Taxonomy - SUN utbildningsområde
definition: Naturvetenskap, matematik och informations- och kommunikationsteknik (IKT)
narrower: Fysik, kemi och geovetenskap
narrower: Biologi och miljövetenskap
narrower: Matematik och övrig naturvetenskap
narrower: Informations- och kommunikationsteknik (IKT)

Lärarutbildning, grundskolans tidiga åldrar, matematik och naturorienterande ämnen
type: Concept
in scheme: JobTech Taxonomy - SUN utbildningsområde
definition: Omfattar inte: · Lärarutbildning inriktad mot grundskolans senare år, jfr 145–146
broader: Lärarutbildning för grundskolans tidiga åldrar
related: LAcx 1Z9 PUL
related: sDHN BbQ LfG

Specialistsjuksköterskeutbildning, kirurgisk vård
type: Concept
in scheme: JobTech Taxonomy - SUN utbildningsområde
definition: Specialistsjuksköterskeutbildning, kirurgisk vård
broader: Omvårdnad
related: oSoy Fkz fCu

Lantbruk, trädgård, skog och fiske, övrig och ospecificerad utbildning
type: Concept
in scheme: JobTech Taxonomy - SUN utbildningsområde
definition: Lantbruk, trädgård, skog och fiske, övrig och ospecificerad utbildning
broader: Lantbruk, trädgård, skog och fiske, övrig och ospecificerad utbildning

Musik
type: Concept
in scheme: JobTech Taxonomy - SUN utbildningsområde
definition: Omfattar: · Gymnasieskolans estetiska program, inriktning musik · Musikalutbildning · Musikerutbildning · Musikproducentutbildning · Utbildning i opera · Utbildning till kantor · Övriga utbildningar inom musik Omfattar inte: · Lärarutbildning i musik, jfr 146g
broader: Musik, dans och dramatik
related: rfoK 9rZ Gdm
related: d29n 1Kc GuL
related: YjCp owJ erz
related: BgK2 wFG 85P
related: 9bWG yPL Lp7
related: 63y7 5Fi 5DJ
related: Bt5a nrH m52
related: kxE7 sg3 wVv
related: 1oG2 Zwt xmc
related: Zrri tvW egQ
related: eESF 8Qa pBs
related: JvT4 4PH P1Q

Optikerutbildning
type: Concept
in scheme: JobTech Taxonomy - SUN utbildningsområde
definition: Optikerutbildning
broader: Tekniskt inriktad vårdutbildning
related: txBk v8c eAk

Marknadsföring
type: Concept
in scheme: JobTech Taxonomy - SUN utbildningsområde
definition: Här ingår utbildningar (andra än högskoleutbildningar) inriktade mot aktiviteter som krävs för att en utbytesprocess av varor och tjänster ska kunna äga rum. Utbildningar i produktutveckling, prissättning, distributionskanaler och marknadskommunikation ingår.
broader: Företagsekonomi, handel och administration
narrower: Marknadsföring

Lärarutbildning, dans och teater
type: Concept
in scheme: JobTech Taxonomy - SUN utbildningsområde
definition: Lärarutbildning, dans och teater
broader: Lärarutbildning i yrkesämne och praktisk-estetiska ämnen
related: artm nrX 5BT
related: 9wbu RkV BZL

Bred, generell utbildning
type: Concept
in scheme: JobTech Taxonomy - SUN utbildningsområde
definition: Bred, generell utbildning
broader: Allmän utbildning
narrower: Bred, generell utbildning

Barnomsorg
type: Concept
in scheme: JobTech Taxonomy - SUN utbildningsområde
definition: Omfattar också: · Barnskötarutbildning
broader: Barn och ungdom
related: zQSz T95 Pmu

Konsthantverk
type: Concept
in scheme: JobTech Taxonomy - SUN utbildningsområde
definition: Omfattar: · Floristutbildning · Glasblåsarutbildning · Instrumentmakarutbildning · Järnsmidesutbildning · Keramikerutbildning · Pianoteknikerutbildning · Utbildningar i tekniker för att bevara gamla hantverkstraditioner · Övriga utbildningar i konsthantverk Omfattar inte: · Bokbinderi, jfr 213c · Lärarutbildning i slöjd, jfr 146j · Utbildning för industriell tillverkning av keramik, smide, glas, etc., jfr 54
broader: Konsthantverk
related: 116y iup oCe
related: 5ssz 2Et uc2
related: f8Ke ACn Zg4
related: yUUQ qXQ YTR
related: 7hMy g9Z qSN
related: yLiF hwd JMA
related: aYCV WPX 9sn
related: 3vqC 5T5 KUf
related: v8Gx ySQ gHG
related: W6M7 fqN mQ6
related: pCC5 tzN jdE
related: 8gUx vuj Em1
related: m6Q1 6xh T1Q
related: U61e rjH 47k

Teknik och teknisk industri
type: Concept
in scheme: JobTech Taxonomy - SUN utbildningsområde
definition: Teknik och teknisk industri
broader: Teknik och tillverkning
narrower: Maskinteknik och verkstadsteknik
narrower: Kemi- och bioteknik
narrower: Fordons- och farkostteknik
narrower: Teknik och teknisk industri, övrig och ospecificerad utbildning
narrower: Miljöteknik och miljökontroll
narrower: Industriell ekonomi och organisation
narrower: Teknik och teknisk industri, allmän utbildning
narrower: Elektronik, datateknik och automation
narrower: Energi- och elektroteknik

Modersmålslärarutbildning
type: Concept
in scheme: JobTech Taxonomy - SUN utbildningsområde
definition: Modersmålslärarutbildning
broader: Pedagogik och lärarutbildning, övrig och ospecificerad utbildning
related: FrBL 2Pq Wxo
related: LRju fUh Wvg

Material och tillverkning, övrig och ospecificerad utbildning
type: Concept
in scheme: JobTech Taxonomy - SUN utbildningsområde
definition: Material och tillverkning, övrig och ospecificerad utbildning
broader: Material och tillverkning, övrig och ospecificerad utbildning

Hälso- och sjukvård, övrig och ospecificerad utbildning
type: Concept
in scheme: JobTech Taxonomy - SUN utbildningsområde
definition: Här ingår utbildningar i hälso- och sjukvård som inte passar in under någon av de andra inriktningarna under 72 och som inte kan betraktas som breda inom området.
broader: Hälso- och sjukvård
narrower: Hälso- och sjukvård, övrig och ospecificerad utbildning

Läkarutbildning, neurologiska specialiteter
type: Concept
in scheme: JobTech Taxonomy - SUN utbildningsområde
definition: Omfattar också: · Neurokirurgi
broader: Medicin
related: 8jLU Cnn SEA
related: s24W siy XUt
related: Uh72 bia Lvd
related: onXh yfx rhK
related: Bs3Q Nnn aRm
related: nLMQ 8km 5ig

Civilingenjörsutbildning, industriell ekonomi och organisation
type: Concept
in scheme: JobTech Taxonomy - SUN utbildningsområde
definition: Civilingenjörsutbildning, industriell ekonomi och organisation
broader: Industriell ekonomi och organisation
related: r3dn KvU 6hQ

Annan utbildning i biologi och biokemi
type: Concept
in scheme: JobTech Taxonomy - SUN utbildningsområde
definition: Omfattar inte: · Dietistutbildning, jfr 726d · Utbildning i biomedicin, jfr 721x · Utbildning i bioteknik, jfr 524 · Utbildning i ekologi, jfr 422z
broader: Biologi och biokemi
related: kPfK dUp iyR

Annan utbildning inom hår- och skönhetsvård samt massage
type: Concept
in scheme: JobTech Taxonomy - SUN utbildningsområde
definition: Annan utbildning inom hår- och skönhetsvård samt massage
broader: Hårvård, skönhetsvård och massage
related: hAC5 H1S mT6

Elektrisk installation och elmekanik
type: Concept
in scheme: JobTech Taxonomy - SUN utbildningsområde
definition: Omfattar: · Gymnasieskolans el- och energiprogram, inriktning elteknik · Utbildningar till elinstallatör · Utbildningar till elkonstruktör · Utbildningar till elkrafttekniker · Utbildningar till högspänningstekniker · Utbildningar till signaltekniker · Övriga utbildningar i elektrisk installation och el-mekanik
broader: Energi- och elektroteknik
related: KTPX 3gJ Uud
related: 4mp3 dcf azJ
related: Rz94 ja7 Gno
related: M5F6 8Cn fMd
related: WY1G 6bD Uve
related: pVwG R4v WPR
related: ZZS4 Pd2 uvd
related: c4hC ASk 6eh
related: y2A3 ra7 8y5
related: o6qb KZ4 zZb
related: EztG 5zD 71M
related: ewFj iAJ Q7X

Bild- och formkonstnärlig utbildning
type: Concept
in scheme: JobTech Taxonomy - SUN utbildningsområde
definition: Omfattar: · Gymnasieskolans estetiska program, inriktning bild och formgivning · Utbildning i fri konst · Övrig bild- och formkonstnärlig utbildning Omfattar inte: · Lärarutbildning i bild- och formkonst, jfr 146h · Utbildningar i formgivning, jfr 214
broader: Bild- och formkonst
related: zFnm 4Sw Dnf
related: dw7D sCR yJG
related: aiNd qnA kua
related: kWPd jeT zLF
related: 5zEA tpo wCh
related: bfiu nxV PWJ

Företagsekonomi, handel och administration, övrig och ospecificerad utbildning
type: Concept
in scheme: JobTech Taxonomy - SUN utbildningsområde
definition: Omfattar: · Utbildningar i fastighetsekonomi · Utbildningar i kost- och näringsekonomi, med tonvikt på ekonomi · Utbildningar i textilekonomi · Utbildningar i transportekonomi · Övriga utbildningar inom företagsekonomi, handel, administration, övrig och ospecificerad utbildning Omfattar inte: · Breda utbildningar i företagsekonomi, jfr 340 · Utbildningar i affärslogistik, jfr 345a
broader: Företagsekonomi, handel och administration, övrig och ospecificerad utbildning
related: zMKP Dda BCn
related: YFaZ PiR fL5
related: if3H Z4E gH6
related: 1R6b Lkm V9v

Socionomutbildning
type: Concept
in scheme: JobTech Taxonomy - SUN utbildningsområde
definition: Omfattar inte: · Utbildningar i sociologi, jfr 312a
broader: Socialt arbete
related: YAzX vbx 4PP
related: iNJi pFe cpD
related: zv1X 5EB 6ZB

Ryska
type: Concept
in scheme: JobTech Taxonomy - SUN utbildningsområde
definition: Ryska
broader: Främmande språk och språkvetenskap
related: rwiT JUG VEX

Samhällsvetenskap, allmän utbildning
type: Concept
in scheme: JobTech Taxonomy - SUN utbildningsområde
definition: Omfattar: · Utbildningar i samhällskunskap · Utbildningar inriktade mot samhällsplanering (ej fysisk och teknisk) · Övrig samhällsvetenskap, allmän utbildning Omfattar också: · Äldre pol mag-utbildning utan tydlig ämnesinriktning Omfattar inte: · Breda utbildningar inriktade mot humaniora, jfr 220z · Gymnasieskolans samhällsvetenskapliga program, jfr 010b · Ospecificerade utbildningar inom samhällsvetenskap, jfr 319z · Utbildningar inriktade mot fysisk eller teknisk samhällsplanering, jfr 581
broader: Samhälls- och beteendevetenskap, allmän utbildning
related: uxm6 8r3 L6U
related: WUS8 6R7 9Mo
related: axcq YHK 7Fw

Specialpedagogutbildning
type: Concept
in scheme: JobTech Taxonomy - SUN utbildningsområde
definition: Specialpedagogutbildning
broader: Pedagogik och lärarutbildning, övrig och ospecificerad utbildning
related: ZMnq u9e Ckd

Annan omvårdnadsutbildning, psykiskt funktionsnedsatta
type: Concept
in scheme: JobTech Taxonomy - SUN utbildningsområde
definition: Omfattar också: · Utbildningar för vård av psykiskt funktionsnedsatta i alla åldrar
broader: Omvårdnad
related: rZ6y yE6 gwC
related: Dumd MeV DB7

Barn och ungdom
type: Concept
in scheme: JobTech Taxonomy - SUN utbildningsområde
definition: Här ingår utbildningar inriktade på barn och ungdomars aktiviteter och utveckling. Både omsorgs- och fritidsverksamheter inkluderas samt allmänna utbildningar inriktade mot barn- och ungdomsvetenskap.
broader: Socialt arbete och omsorg
narrower: Fritidsverksamhet för barn och ungdom
narrower: Annan utbildning inom barn och ungdom
narrower: Barn och ungdom, allmän utbildning
narrower: Barnomsorg

Annan utbildning i tillverkning i specifikt material
type: Concept
in scheme: JobTech Taxonomy - SUN utbildningsområde
definition: Omfattar: · Utbildning till möbeltapetserare · Utbildningar som leder till generell examen i träteknologi Omfattar inte: · Byggnadssnickeriutbildningar, jfr 582d · Utbildningar i grafisk teknik, jfr 213c · Utbildningar i konsthantverk, jfr 215z · Utbildningar inom skogsbruk och skogsteknik, jfr 623 · Utbildningar inriktade mot metallarbete, jfr 521c
broader: Tillverkning av produkter av trä, papper, glas, porslin och plast
related: TXwp 669 t54
related: 3JFU XuD M1J
related: j3fL kLH hTi
related: x3An pUb DQd
related: qboD pyN VPQ
related: n1VU YDR 3gt
related: VDF4 3vN oi9

Okänd
type: Concept
in scheme: JobTech Taxonomy - SUN utbildningsområde
definition: Okänd
broader: Okänd

Hälso- och sjukvård, övrig och ospecificerad utbildning
type: Concept
in scheme: JobTech Taxonomy - SUN utbildningsområde
definition: Hälso- och sjukvård, övrig och ospecificerad utbildning
broader: Hälso- och sjukvård, övrig och ospecificerad utbildning

Civilingenjörsutbildning, byggnadsteknik
type: Concept
in scheme: JobTech Taxonomy - SUN utbildningsområde
definition: Omfattar också: · Civilingenjörsutbildning i väg- och vattenbyggnadsteknik Omfattar inte: · Civilingenjörsutbildning i miljö- och vattenteknik, jfr 527a
broader: Byggnadsteknik och anläggningsteknik
related: UP7D eRk 3Km
related: M865 AWZ XzZ

Läkarutbildning
type: Concept
in scheme: JobTech Taxonomy - SUN utbildningsområde
definition: Läkarutbildning
broader: Medicin
related: d7DC rqd fgL

Bred, generell utbildning, samhällsvetenskaplig och humanistisk inriktning
type: Concept
in scheme: JobTech Taxonomy - SUN utbildningsområde
definition: Omfattar: · Gymnasieskolans samhällsvetenskapliga och humanistiska program, samtliga inriktningar Omfattar inte: · Gymnasieskolans estetiska program, jfr 21
broader: Bred, generell utbildning
related: RvKh PgX wT2
related: nf4s A8F Vgf
related: ULyv xov Lv9
related: R1xV cdz YJy
related: jbFJ yDZ RgB

Studie- och yrkesvägledarutbildning
type: Concept
in scheme: JobTech Taxonomy - SUN utbildningsområde
definition: Studie- och yrkesvägledarutbildning
broader: Socialt arbete
related: hAsC 7cq RLA

Måleri
type: Concept
in scheme: JobTech Taxonomy - SUN utbildningsområde
definition: Måleri
broader: Byggnadsteknik och anläggningsteknik
related: PF1q LvZ eBy
related: 5uwy Zn9 EQZ
related: 53oV 4vn GLW
related: aABM Bsk VEN

Kiropraktorutbildning
type: Concept
in scheme: JobTech Taxonomy - SUN utbildningsområde
definition: Kiropraktorutbildning
broader: Terapi, rehabilitering och kostbehandling
related: XzR8 FEX U3u

Lärarutbildning, industri och hantverk
type: Concept
in scheme: JobTech Taxonomy - SUN utbildningsområde
definition: Omfattar: · Lärarutbildning, inriktning bygg- och anläggning · Lärarutbildning, inriktning el · Lärarutbildning, inriktning energi · Lärarutbildning, inriktning fordon · Lärarutbildning, inriktning frisör · Övrig lärarutbildning inom industri och hantverk
broader: Lärarutbildning i yrkesämne och praktisk-estetiska ämnen
related: YZh7 Ybd kxu
related: R8eR J9p b1A
related: 4i3b vnw ucK
related: 2nUJ wq4 b3L
related: TGgS YkU z2z
related: dGwL eLY fx9

Matematik
type: Concept
in scheme: JobTech Taxonomy - SUN utbildningsområde
definition: Omfattar också: · Utbildningar inom numerisk analys Omfattar inte: · Matematisk statistik, jfr 462z
broader: Matematik
related: H5pu 21Z W5s
related: tLSf oFr 98X
related: Go2N 5jt KLw
related: qe7g KHz mJg

Annan utbildning inom transporttjänster
type: Concept
in scheme: JobTech Taxonomy - SUN utbildningsområde
definition: Omfattar inte: · Utbildningar i fordons- och farkostteknik, jfr 525 · Utbildningar i transportekonomi, jfr 349z
broader: Transporttjänster
related: 1mF9 P6E 2Re

Lärarutbildning, naturbruk
type: Concept
in scheme: JobTech Taxonomy - SUN utbildningsområde
definition: Lärarutbildning, naturbruk
broader: Lärarutbildning i yrkesämne och praktisk-estetiska ämnen

Socialt arbete och socialt omsorgsarbete, allmän utbildning
type: Concept
in scheme: JobTech Taxonomy - SUN utbildningsområde
definition: Här ingår breda utbildningar inriktade på socialt arbete och omsorg utan tydlig tyngdpunkt på någon av de övriga inriktningarna under 76.
broader: Socialt arbete och omsorg
narrower: Socialt arbete och socialt omsorgsarbete, allmän utbildning

Miljövård och miljöskydd
type: Concept
in scheme: JobTech Taxonomy - SUN utbildningsområde
definition: Här ingår utbildningar inriktade mot miljövård och miljöskydd.
broader: Biologi och miljövetenskap
narrower: Miljövård och miljöskydd

Utbildning i skogsbruk
type: Concept
in scheme: JobTech Taxonomy - SUN utbildningsområde
definition: Omfattar också: · Gymnasieskolans naturbruksprogram, inriktning skog
broader: Skog
related: bhGS abq cp9
related: SwC1 jsL utK
related: F77n n67 vgH

Polisutbildning
type: Concept
in scheme: JobTech Taxonomy - SUN utbildningsområde
definition: Omfattar inte: · Kriminologi, jfr 312a
broader: Säkerhet i samhället
related: NPMw Jqp mAV

Industriell ekonomi och organisation
type: Concept
in scheme: JobTech Taxonomy - SUN utbildningsområde
definition: Här ingår utbildningar inriktade på industriell teknik i kombination med ekonomi och på förmåga att se dessa områden som en helhet. Det inkluderar tekniska utbildningar inriktade mot ledarskap och organisation, produktionsutveckling, logistik, materialstyrning och kvalitetsteknik.
broader: Teknik och teknisk industri
narrower: Annan utbildning i industriell ekonomi och organisation
narrower: Civilingenjörsutbildning, industriell ekonomi och organisation
narrower: Ingenjörsutbildning, industriell ekonomi och organisation

Ingenjörsutbildning, trä, papper, glas, porslin och plast
type: Concept
in scheme: JobTech Taxonomy - SUN utbildningsområde
definition: Omfattar inte: · Ingenjörsutbildningar i materialteknik om tyngdpunkten ligger på metallurgi, jfr 544b
broader: Tillverkning av produkter av trä, papper, glas, porslin och plast
related: AEWr Gn5 QGW
related: sX1h 3NG Zp8
related: KEZo yVD X4G

Utbildning i hästhållning
type: Concept
in scheme: JobTech Taxonomy - SUN utbildningsområde
definition: Omfattar: · Hippologutbildning · Utbildning som leder till generell examen inom hippologi · Utbildning till hovslagare · Övriga utbildningar i hästhållning
broader: Lantbruk
related: TPj4 fq4 YJN
related: 4ZhW so3 jNF
related: W6fP cee M74
related: M6Rq 5aY uRv

Läkarutbildning, barn- och ungdomsmedicinska specialiteter
type: Concept
in scheme: JobTech Taxonomy - SUN utbildningsområde
definition: Läkarutbildning, barn- och ungdomsmedicinska specialiteter
broader: Medicin
related: 3UvV ELh tKP
related: J3BQ fzb UKP
related: Uzaa eFF sDi
related: JtYe kQ3 DYV
related: Z3td 4Yw mLY
related: DBjK U7H pVU
related: UZPV Suu 8km
related: VmGx gFN Gj4
related: mAML MNE 38V

Samhällsbyggnad och byggnadsteknik, övrig och ospecificerad utbildning
type: Concept
in scheme: JobTech Taxonomy - SUN utbildningsområde
definition: Här ingår utbildningar inriktade mot samhällsbyggande och byggnadsteknik som inte kan klassificeras under någon av de andra inriktningarna under 58.
broader: Samhällsbyggnad och byggnadsteknik
narrower: Samhällsbyggnad och byggnadsteknik, övrig och ospecificerad utbildning

Skolledarutbildning
type: Concept
in scheme: JobTech Taxonomy - SUN utbildningsområde
definition: Skolledarutbildning
broader: Pedagogik och lärarutbildning, övrig och ospecificerad utbildning
related: CsxC pPp 4kZ

Utbildning för landtransporter
type: Concept
in scheme: JobTech Taxonomy - SUN utbildningsområde
definition: Omfattar också: · Lokförarutbildning
broader: Transporttjänster
related: Gwpj RyU 6ds
related: tbkt xJJ qCu

Annan utbildning inom lantbruk
type: Concept
in scheme: JobTech Taxonomy - SUN utbildningsområde
definition: Omfattar också: · Utbildning som leder till generell examen inom lantbruksvetenskap Omfattar inte: · Utbildningar i allmän markvetenskap, jfr 620z · Utbildningar i djursjukvård, jfr 640x · Utbildningar i vinproduktion, jfr 541x
broader: Lantbruk
related: 8GqQ cZK ydf
related: 5Zx7 VLM pUn
related: hjyP E6h 1ko
related: Kvnm QjJ 8wH

Arkeologi
type: Concept
in scheme: JobTech Taxonomy - SUN utbildningsområde
definition: Omfattar också: · Historisk osteologi
broader: Historia och arkeologi
related: gzFL 3gY 84k
related: FgeM d3p HkM
related: zgrV Scj 4DA

Naturvård och djurskydd
type: Concept
in scheme: JobTech Taxonomy - SUN utbildningsområde
definition: Omfattar inte: · Utbildningar i fiske, jfr 624z · Utbildningar i jakt, jfr 623x · Utbildningar i skogsbruk, jfr 623c · Utbildningar i trädgårdsbruk, jfr 622c
broader: Naturvård och djurskydd
related: oiXC FH2 Szz
related: qgYx RG2 Q6R

Annan utbildning inom samhällsbyggnad och arkitektur
type: Concept
in scheme: JobTech Taxonomy - SUN utbildningsområde
definition: Omfattar: · Gymnasieskolans teknikprogram, inriktning samhällsbyggande · Utbildning som leder till generell examen inom arkitektur · Utbildning som leder till generell examen inom fastighetsvetenskap · Utbildning som leder till generell examen inom fysisk planering · Utbildning som leder till generell examen inom landskapsarkitektur · Utbildning som leder till generell examen inom landskapsplanering · Utbildning till bygglovshandläggare · Övriga utbildningar inom samhällsbyggnad och arkitektur Omfattar inte: · Utbildningar i miljöteknik, andra än ingenjörsutbildningar, jfr 527x · Utbildningar i miljövetenskap, jfr 422z
broader: Samhällsbyggnad och arkitektur
related: KLnL D4k PZG
related: Xhti er1 fvg
related: 9NCP FXB tiP
related: NoyF FdA EzB
related: spqq 5c8 kzv
related: 95wK bsG FZs
related: YUjj uF7 kdG
related: RJAK cSa 9ud
related: nhcR kWU Xg9
related: 8TCp ehn EhH
related: Ck1r fzp xnQ
related: f9Mo ARE Gsm

Elektronik-, tele- och datatekniskt arbete
type: Concept
in scheme: JobTech Taxonomy - SUN utbildningsområde
definition: Omfattar: · Gymnasieskolans el- och energiprogram, inriktning dator- och kommunikationsteknik · Utbildningar till elektroniktekniker · Utbildningar till ljudtekniker · Utbildningar till mekatroniker, inriktning elektronik · Utbildningar till nätplanerare · Utbildningar till nättekniker · Utbildningar till teletekniker · Övriga utbildningar i elektronik-, tele- och datatekniskt arbete Omfattar inte: · Civilingenjörs- och ingenjörsutbildningar, jfr 523a–523d
broader: Elektronik, datateknik och automation
related: DV51 ed1 uot
related: LkN8 oeb jvh
related: m7yZ dFt guw
related: VMGp qtu Ccv
related: PABv Qkv ujt
related: 9w85 DPn 3cZ
related: goB2 gbq duQ
related: oFnd HtU VDM
related: Dqzp VA6 m1Q
related: NknS BM6 dFB
related: MsGE sfm NL6
related: UeHa CNR hDW

Civilingenjörsutbildning, maskinteknik
type: Concept
in scheme: JobTech Taxonomy - SUN utbildningsområde
definition: Omfattar: · Civilingenjörsutbildning i industriell arbetsmiljö · Civilingenjörsutbildning i teknisk design · Övriga civilingenjörsutbildningar i maskinteknik Omfattar inte: · Utbildning i fordons- och farkostteknik, jfr 525 · Utbildning i industriell ekonomi, jfr 526 · Utbildning i materialteknik, jfr 54
broader: Maskinteknik och verkstadsteknik
related: B8BC LRu kps
related: friX qx1 ycy
related: eSwz ZFi SaV
related: 7Wvw nNw FKq

Nationalekonomi och ekonomisk historia
type: Concept
in scheme: JobTech Taxonomy - SUN utbildningsområde
definition: Här ingår breda utbildningar mot hushållning av samhällets resurser, ekonomisk teori och beslutsfattande.
broader: Samhälls- och beteendevetenskap
narrower: Annan utbildning i nationalekonomi och ekonomisk historia
narrower: Ekonomisk historia
narrower: Nationalekonomi

Läs- och skrivinlärning för vuxna
type: Concept
in scheme: JobTech Taxonomy - SUN utbildningsområde
definition: Läs- och skrivinlärning för vuxna
broader: Allmän utbildning
narrower: Läs- och skrivinlärning för vuxna

Specialistsjuksköterskeutbildning, distriktssköterska
type: Concept
in scheme: JobTech Taxonomy - SUN utbildningsområde
definition: Specialistsjuksköterskeutbildning, distriktssköterska
broader: Omvårdnad
related: TfKa WUf Far

Ingenjörsutbildning, samhällsbyggnad och samhällsmiljö
type: Concept
in scheme: JobTech Taxonomy - SUN utbildningsområde
definition: Omfattar: · Gymnasieingenjörsutbildning, inriktning samhällsbyggande · Ingenjörsutbildning i fysisk planering och samhällsplanering Omfattar inte: · Ingenjörsutbildning med tyngdpunkt på miljöteknik, jfr 527b
broader: Samhällsbyggnad och arkitektur
related: TjH3 Dbd kCR
related: n8UF xWx dpV

Apotekarutbildning
type: Concept
in scheme: JobTech Taxonomy - SUN utbildningsområde
definition: Apotekarutbildning
broader: Farmaci
related: eW8G gNA ys1

Biologi och miljövetenskap, övrig och ospecificerad utbildning
type: Concept
in scheme: JobTech Taxonomy - SUN utbildningsområde
definition: Här ingår utbildningar inriktade mot biologi, miljövetenskap, miljö- och naturvård som inte kan klassificeras under någon av de övriga inriktningarna inom 42 och som inte kan betraktas som breda utbildningar inom området.
broader: Biologi och miljövetenskap
narrower: Biologi och miljövetenskap, övrig och ospecificerad utbildning

Annan bred utbildning i material och tillverkning
type: Concept
in scheme: JobTech Taxonomy - SUN utbildningsområde
definition: Omfattar inte: · Utbildningar i materialteknik om tyngdpunkten ligger på polymera, keramiska material, trä, papper eller metallurgi, jfr 543 och 544
broader: Material och tillverkning, allmän utbildning
related: aFDf u7r wc1
related: ZnPZ bZ1 WdV

Annan utbildning inom hotell, restaurang och storhushåll
type: Concept
in scheme: JobTech Taxonomy - SUN utbildningsområde
definition: Omfattar också: · Utbildning som leder till generell examen inom måltids- och hushållskunskap Omfattar inte: · Utbildningar i industriell tillverkning och hantering av livsmedel, jfr 541
broader: Hotell, restaurang och storhushåll
related: A5na cww fZ9

Socialt arbete
type: Concept
in scheme: JobTech Taxonomy - SUN utbildningsområde
definition: Här redovisas utbildningar som är inriktade mot människan och hennes sociala villkor. Inom detta område studeras socialt arbete på individ-, familje-, grupp- och samhällsnivå där arbetet kan vara stödjande, behandlande eller förebyggande. Även utbildningar i att bedriva, leda, samordna och utveckla social omsorgsverksamhet i olika former ingår.
broader: Socialt arbete och omsorg
narrower: Hälso- och sjukvårdskuratorutbildning
narrower: Studie- och yrkesvägledarutbildning
narrower: Socionomutbildning
narrower: Social omsorgsutbildning, äldre och funktionsnedsatta
narrower: Socialt omsorgsarbete, allmän utbildning
narrower: Social omsorgsutbildning, socialpedagogisk behandling
narrower: Annan utbildning inom socialt arbete

Personliga tjänster, allmän utbildning
type: Concept
in scheme: JobTech Taxonomy - SUN utbildningsområde
definition: Här ingår breda utbildningar inriktade mot personliga tjänster utan klar tyngdpunkt mot någon av de övriga inriktningarna inom 81.
broader: Personliga tjänster
narrower: Personliga tjänster, allmän utbildning

Automation
type: Concept
in scheme: JobTech Taxonomy - SUN utbildningsområde
definition: Omfattar: · Gymnasieskolans el- och energiprogram, inriktning automation · Utbildningar i styr- och reglerteknik · Utbildningar till automationstekniker · Utbildningar till hydraulsystemtekniker · Utbildningar till mekatroniker, inriktning automation · Utbildningar till robottekniker · Övriga utbildningar i automation Omfattar inte: · Civilingenjörs- och ingenjörsutbildningar, jfr 523a–523d
broader: Elektronik, datateknik och automation
related: FYvv 2Zq jR1
related: DKZ5 Gj9 3tZ
related: d7m6 Nh4 LLF
related: TyKN nSQ Xaw
related: i67g 4B2 tfr
related: F4jM DSE RJJ
related: 3b7N QCP k7A
related: 7sfV ULp AbP
related: VTgU epW dQz
related: cm1r 1xF FkR
related: SD2Q 2oE RcT

Ämneslärarutbildning, matematik, data, naturvetenskap och teknik i kombination med praktisk-estetiska ämnen
type: Concept
in scheme: JobTech Taxonomy - SUN utbildningsområde
definition: Ämneslärarutbildning, matematik, data, naturvetenskap och teknik i kombination med praktisk-estetiska ämnen
broader: Ämneslärarutbildning
related: emDF MEK E4g

Företagsekonomi, allmän utbildning
type: Concept
in scheme: JobTech Taxonomy - SUN utbildningsområde
definition: Omfattar: · Breda utbildningar inom företagsekonomi · Civilekonomutbildning, inriktning företagsekonomi · Gymnasieskolans ekonomiprogram, alla inriktningar · Övriga utbildningar i företagsekonomi, allmän utbildning Omfattar inte: · Utbildningar i företagsekonomi med fördjupning, jfr 340b–340f · Utbildningar i företagsekonomi, handel och administration där tyngdpunkten ligger på någon av de övriga inriktningarna inom 34 · Utbildningar i nationalekonomi, jfr 314a
broader: Företagsekonomi, handel och administration, allmän utbildning
related: C6vS q8x 623
related: Tnvu 9pq JaF
related: FC1z XEi v3D
related: T79J 75S s9L
related: aPPi oEC TGG
related: J2Fu YT9 JiY
related: RqmZ 11w Xbb

Biologi och biokemi
type: Concept
in scheme: JobTech Taxonomy - SUN utbildningsområde
definition: Biologi och biokemi omfattar utbildningar inriktade mot levande organismers struktur, fysiologi, ärftlighet, reproduktion, utveckling och beteende. Utbildningar inom biologins närbesläktade vetenskaper inkluderas liksom utbildningar om kemin hos levande organismer.
broader: Biologi och miljövetenskap
narrower: Biokemi, toxikologi, farmakologi och nutrition
narrower: Annan utbildning i biologi och biokemi
narrower: Biologi

Hotell, restaurang och storhushåll, allmän utbildning
type: Concept
in scheme: JobTech Taxonomy - SUN utbildningsområde
definition: Hotell, restaurang och storhushåll, allmän utbildning
broader: Hotell, restaurang och storhushåll
related: F5kB F4h yc5

Annan utbildning inom byggnads- och anläggningsteknik
type: Concept
in scheme: JobTech Taxonomy - SUN utbildningsområde
definition: Omfattar: · Gymnasieskolans VVS- och fastighetsprogram, inriktning fastighet · Tekniska utbildningar i fastighetsskötsel och fastighetsförvaltning · Övriga utbildningar inom byggnads- och anläggningsteknik Omfattar inte: · Utbildningar i elektrisk installation och inneklimat, jfr 522
broader: Byggnadsteknik och anläggningsteknik
related: AwXg SSH k6A
related: nxV5 LB3 BmA
related: aXn4 Maq 5FK
related: whKP y3y 2ry
related: kiE7 pGv fuT
related: xtBJ FRn GRE
related: pATN JRV NGK
related: 4zRx ySq w1T
related: a6F5 SoL eCM
related: 2HpP Lcw 1nj
related: Mgpb E51 mpT
related: 6RNF Lvv mfB
related: Wn3t s7u 39q
related: Fb2d 6TN Uov
related: 7yyL 6de vjM

Trätekniskt arbete
type: Concept
in scheme: JobTech Taxonomy - SUN utbildningsområde
definition: Trätekniskt arbete
broader: Tillverkning av produkter av trä, papper, glas, porslin och plast
related: 4UDA jQg 5Da
related: NUjZ Ymc 3fv
related: fHNW QSK 4CF
related: jBdp dwk dvT
related: SFD9 68A oAX
related: aWcV sFz fGw
related: L599 px4 Q2Z

Företagsekonomi, handel och administration, allmän utbildning
type: Concept
in scheme: JobTech Taxonomy - SUN utbildningsområde
definition: Här ingår breda utbildningar inom företagsekonomi, handel och administration i privata och offentliga organisationer, med eller utan fördjupning.
broader: Företagsekonomi, handel och administration
narrower: Företagsekonomi, finansiering
narrower: Handel och administration
narrower: Företagsekonomi, organisation och management
narrower: Företagsekonomi, allmän utbildning
narrower: Annan bred utbildning i företagsekonomi, handel och administration
narrower: Företagsekonomi, annan inriktning
narrower: Företagsekonomi, redovisning
narrower: Företagsekonomi, marknadsföring

Djursjukskötarutbildning
type: Concept
in scheme: JobTech Taxonomy - SUN utbildningsområde
definition: Omfattar också: · Utbildning till djursjukvårdare
broader: Djursjukvård
related: kzc6 nJh Ljr

Lantbruk, trädgård, skog och fiske, övrig och ospecificerad utbildning
type: Concept
in scheme: JobTech Taxonomy - SUN utbildningsområde
definition: Här ingår utbildningar i naturbruk som inte passar in under någon av de andra inriktningarna under 62 och som inte kan betraktas som breda inom området.
broader: Lantbruk, trädgård, skog och fiske
narrower: Lantbruk, trädgård, skog och fiske, övrig och ospecificerad utbildning

Civilingenjörsutbildning, energi- och elektroteknik
type: Concept
in scheme: JobTech Taxonomy - SUN utbildningsområde
definition: Civilingenjörsutbildning, energi- och elektroteknik
broader: Energi- och elektroteknik
related: Vzg5 p73 x7u
related: sfv8 adf ALj
related: Qy8E EJ4 nEb
related: pCgM knW cDF
related: xsNf MxJ xeC

Socialt arbete och socialt omsorgsarbete, övrig och ospecificerad utbildning
type: Concept
in scheme: JobTech Taxonomy - SUN utbildningsområde
definition: Här ingår breda utbildningar inriktade på socialt arbete och omsorg utan tydlig tyngdpunkt på någon av de övriga inriktningarna under 76.
broader: Socialt arbete och omsorg
narrower: Socialt arbete och socialt omsorgsarbete, övrig och ospecificerad utbildning

Musik-, dans-, film- och teatervetenskap samt -historia
type: Concept
in scheme: JobTech Taxonomy - SUN utbildningsområde
definition: Musik-, dans-, film- och teatervetenskap samt -historia
broader: Musik, dans och dramatik
related: TYdo qbN YBF
related: NqVF VxM Z9X
related: yF9q 8Uh NrL
related: 78AG WU2 kKJ
related: vqXp aJa y7T
related: 9Kqc zUR g48

Pedagogik och lärarutbildning, allmän utbildning
type: Concept
in scheme: JobTech Taxonomy - SUN utbildningsområde
definition: Omfattar: · Utbildning som leder till generell examen inom pedagogiskt arbete · Utbildning som leder till generell examen inom utbildningsvetenskap · Övriga utbildningar inom pedagogik och lärarutbildning, allmän utbildning
broader: Pedagogik och lärarutbildning, allmän utbildning
related: 1Dtf 9iC yAN
related: Vkix mPy fNB
related: NXqi A8a X1b

Allmän språkkunskap och allmänt språkliga utbildningar
type: Concept
in scheme: JobTech Taxonomy - SUN utbildningsområde
definition: Omfattar: · Utbildning i fonetik · Utbildning i lingvistik · Övriga utbildningar i allmän språkkunskap och allmänt språkliga utbildningar
broader: Främmande språk och språkvetenskap
related: MCAg gjL ZkH
related: eYe7 FXn gpc
related: xF6b 7aF jRy
related: f3A1 T3y sb5
related: A1co 6M9 Jfr

Hortonomutbildning
type: Concept
in scheme: JobTech Taxonomy - SUN utbildningsområde
definition: Hortonomutbildning
broader: Trädgård
related: qzgQ QgF maB

Biomedicinsk analytikerutbildning
type: Concept
in scheme: JobTech Taxonomy - SUN utbildningsområde
definition: Omfattar också: · Utbildning till laboratorieassistent
broader: Tekniskt inriktad vårdutbildning
related: houg 5WE bzS
related: yZiN 7PS cfy

Matematik och naturvetenskap, övrig och ospecificerad utbildning
type: Concept
in scheme: JobTech Taxonomy - SUN utbildningsområde
definition: Här ingår utbildningar som till huvuddelen innehåller naturvetenskapliga ämnen, men som inte går att klassificera under någon av de övriga ämnesinriktningarna inom 42, 44 eller 46.
broader: Matematik och övrig naturvetenskap
narrower: Matematik och naturvetenskap, övrig och ospecificerad utbildning

Bild- och formkonst
type: Concept
in scheme: JobTech Taxonomy - SUN utbildningsområde
definition: Här ingår utbildningar inriktade mot framställning av konst, konstnärliga tekniker, utställningskunskap, konsthistoria och samtidsteori.
broader: Konst och media
narrower: Annan utbildning inom bild- och formkonst
narrower: Konstvetenskap och konsthistoria
narrower: Bild- och formkonstnärlig utbildning

Pedagogik
type: Concept
in scheme: JobTech Taxonomy - SUN utbildningsområde
definition: Med pedagogik avses utbildningar inriktade mot lärandets processer samt teorier och metoder för undervisning, uppfostran och utbildning. I första hand inkluderas utbildningar inom vetenskapen pedagogik. Utbildningar i pedagogik och didaktik inriktade mot ett specifikt ämnesområde ingår inte.
broader: Pedagogik och lärarutbildning
narrower: Pedagogik

Kemi
type: Concept
in scheme: JobTech Taxonomy - SUN utbildningsområde
definition: Här ingår breda utbildningar inriktade mot grundämnens och kemiska föreningars uppbyggnad och egenskaper samt deras reaktioner med varandra.
broader: Fysik, kemi och geovetenskap
narrower: Kemi

Jägmästar- och skogsvetarutbildning
type: Concept
in scheme: JobTech Taxonomy - SUN utbildningsområde
definition: Jägmästar- och skogsvetarutbildning
broader: Skog
related: Bju8 nji kHD
related: nmQP xPY 3E6

Nationalekonomi
type: Concept
in scheme: JobTech Taxonomy - SUN utbildningsområde
definition: Omfattar: · Utbildning i ekonometri · Utbildning i internationell ekonomi · Övriga utbildningar inom nationalekonomi Omfattar inte: · Ekonomutbildningar med annan inriktning än nationalekonomi och ekonomisk historia, jfr 34 · Utbildning i företagsekonomi, inriktning internationell ekonomi, jfr 340f
broader: Nationalekonomi och ekonomisk historia
related: Psds RU5 t1P
related: VHh2 9ej XhV
related: sTPF pXT kcm

Engelska
type: Concept
in scheme: JobTech Taxonomy - SUN utbildningsområde
definition: Engelska
broader: Främmande språk och språkvetenskap
related: xiD7 snJ D8x

Bred, generell utbildning
type: Concept
in scheme: JobTech Taxonomy - SUN utbildningsområde
definition: Här ingår utbildningar som ger kunskaper i svenska och matematik samtidigt som de ger kunskaper inom andra ämnesområden som främmande språk, historia, religion, samhällskunskap och naturvetenskap. Samtliga utbildningar på grundskolenivå omfattas. Breda, teoretiska och studieförberedande gymnasieutbildningar inkluderas också, jfr 010b, 010c.
broader: Bred, generell utbildning
narrower: Bred, generell utbildning, annan inriktning
narrower: Bred, generell utbildning, allmän inriktning
narrower: Bred, generell utbildning, naturvetenskaplig inriktning
narrower: Bred, generell utbildning, samhällsvetenskaplig och humanistisk inriktning

Ingenjörsutbildning, fordons- och farkostteknik
type: Concept
in scheme: JobTech Taxonomy - SUN utbildningsområde
definition: Ingenjörsutbildning, fordons- och farkostteknik
broader: Fordons- och farkostteknik
related: pDaL bJt 7x6

Arkitektutbildning
type: Concept
in scheme: JobTech Taxonomy - SUN utbildningsområde
definition: Arkitektutbildning
broader: Samhällsbyggnad och arkitektur
related: Abqg 7sU Dwj

Officersutbildning
type: Concept
in scheme: JobTech Taxonomy - SUN utbildningsområde
definition: Omfattar: · Officersprogrammet · Reservofficersutbildning · Specialistofficersutbildning · Särskild officersutbildning · Övrig officersutbildning
broader: Militär utbildning
related: UExe haA MSM
related: PBzk WVa pjb
related: hRsV y8m Z7n
related: 2454 qUn j5X

Tillverkning av plast- och gummiprodukter
type: Concept
in scheme: JobTech Taxonomy - SUN utbildningsområde
definition: Omfattar också: · Utbildning till processtekniker inom plastindustri
broader: Tillverkning av produkter av trä, papper, glas, porslin och plast
related: qWeW o3c xWv
related: 8ywj fQa Qud
related: ZU2W 8io bY5

Annan utbildning inom trädgård
type: Concept
in scheme: JobTech Taxonomy - SUN utbildningsområde
definition: Omfattar också: · Utbildning som leder till generell examen i trädgårdsvetenskap Omfattar inte: · Utbildningar i landskapsarkitektur, jfr 581 · Utbildningar inriktade mot markvetenskap, jfr 620z · Utbildningar inriktade mot nationalparkers skötsel och förvaltning, jfr 424z · Utbildningar inriktade mot växtodling i livsmedelsproducerande syfte som exempelvis spannmål, frukt och grönsaker, jfr 621d
broader: Trädgård
related: w1zx 3mE ry6

Energi- och elektroteknik
type: Concept
in scheme: JobTech Taxonomy - SUN utbildningsområde
definition: Här ingår tekniska utbildningar inriktade mot energi och elektroteknik. Utbildningar inriktade mot utvinning av energi inkluderas, likaså utbildningar inriktade mot energiteknik med miljöprofil. Utbildningar inriktade mot utveckling, installation, reparation och underhåll av system för elkraftsdistribution, elektriska ledningsnät samt elektrisk apparatur ingår också.
broader: Teknik och teknisk industri
narrower: Ingenjörsutbildning, energi- och elektroteknik
narrower: Civilingenjörsutbildning, energi- och elektroteknik
narrower: Elektrisk installation och elmekanik
narrower: Energi, drift och underhåll
narrower: Annan utbildning i energi- och elektroteknik

Utbildning för hotell
type: Concept
in scheme: JobTech Taxonomy - SUN utbildningsområde
definition: Omfattar: · Gymnasieskolans hotell- och turismprogram, inriktning hotell och konferens · Utbildning till hotellreceptionist · Övriga utbildningar för hotell Omfattar inte: · Utbildning till receptionist, annan än för hotell, jfr 346x
broader: Hotell, restaurang och storhushåll
related: 3bbQ E5e mAR
related: khqe pi6 NTW
related: LTfS rBd arX
related: Jrrg iiS 2yp
related: DrXH 8mJ m7f

Hälso- och sjukvård
type: Concept
in scheme: JobTech Taxonomy - SUN utbildningsområde
definition: Hälso- och sjukvård
broader: Hälso- och sjukvård samt social omsorg
narrower: Medicin
narrower: Hälso- och sjukvård, allmän utbildning
narrower: Omvårdnad
narrower: Tekniskt inriktad vårdutbildning
narrower: Hälso- och sjukvård, övrig och ospecificerad utbildning
narrower: Farmaci
narrower: Tandvård
narrower: Terapi, rehabilitering och kostbehandling

Annan utbildning inom pedagogik och lärarutbildning
type: Concept
in scheme: JobTech Taxonomy - SUN utbildningsområde
definition: Omfattar: · Folkhögskollärarutbildning · Utbildning till studiehandledare · Utbildning till lärarassistent · Övriga utbildningar inom pedagogik och lärarutbildning Omfattar inte: · Generella examina i specialpedagogik, jfr 142z
broader: Pedagogik och lärarutbildning, övrig och ospecificerad utbildning
related: nAYR gTT 8nF
related: 63V9 72x i6v
related: fcbc bdB DTX

Juristutbildning (juristexamen)
type: Concept
in scheme: JobTech Taxonomy - SUN utbildningsområde
definition: Juristutbildning (juristexamen)
broader: Juridik och rättsvetenskap
related: m6JS nJx Pdz
related: VEsF TFw Ckd

Annan utbildning inom textilier, konfektion och läder
type: Concept
in scheme: JobTech Taxonomy - SUN utbildningsområde
definition: Omfattar också: · Utbildningar som leder till generell examen i textilteknologi Omfattar inte: · Utbildningar inom konsthantverk, jfr 215z · Utbildningar inom modedesign, jfr 214a
broader: Tillverkning av textilier, konfektion och lädervaror
related: z4zF dEJ viV
related: US21 kap 95x

Datoranvändning
type: Concept
in scheme: JobTech Taxonomy - SUN utbildningsområde
definition: Omfattar: · Personalutbildningar i datoranvändning och datorprogram · Utbildningar i användning av exempelvis Officeprogram · Övriga utbildningar inom datoranvändning
broader: Datoranvändning
related: qx1q aKF NxA

Teknik och tillverkning
type: Concept
in scheme: JobTech Taxonomy - SUN utbildningsområde
top concept of: JobTech Taxonomy - SUN utbildningsområde
definition: Teknik och tillverkning
narrower: Samhällsbyggnad och byggnadsteknik
narrower: Material och tillverkning
narrower: Teknik och teknisk industri

Logopedutbildning
type: Concept
in scheme: JobTech Taxonomy - SUN utbildningsområde
definition: Logopedutbildning
broader: Terapi, rehabilitering och kostbehandling
related: QiU6 MU1 XXx

Annan ämneslärarutbildning
type: Concept
in scheme: JobTech Taxonomy - SUN utbildningsområde
definition: Omfattar inte: · Folkhögskollärarutbildning, jfr 149x · Didaktik i teoretiska ämnen, jfr 142z
broader: Ämneslärarutbildning
related: KuL3 7J9 dwV
related: e5ro btd gtH
related: 8DLX eZo aEV
related: PZGS jQi yJH
related: LSSy hSM p69

Psykologutbildning, inklusive fullgjord praktiktjänstgöring (PTP)
type: Concept
in scheme: JobTech Taxonomy - SUN utbildningsområde
definition: Psykologutbildning, inklusive fullgjord praktiktjänstgöring (PTP)
broader: Psykologi
related: eKi1 S9s bvg

Samhälls- och beteendevetenskap, övrig och ospecificerad utbildning
type: Concept
in scheme: JobTech Taxonomy - SUN utbildningsområde
definition: Omfattar: · Utbildningar i genusvetenskap · Utbildningar i handikappvetenskap · Utbildningar i kvinnovetenskap · Övriga utbildningar i samhälls- och beteendevetenskap, övrig och ospecificerad utbildning Omfattar inte: · Breda utbildningar inriktade mot samhälls- och beteendevetenskap, jfr 310
broader: Samhälls- och beteendevetenskap, övrig och ospecificerad utbildning
related: hvyJ MxA 9us
related: WgGj zNt Pzz
related: jTCu mBL NXT
related: dDx8 RAg Axq

Inköp, försäljning och distribution
type: Concept
in scheme: JobTech Taxonomy - SUN utbildningsområde
definition: Omfattar: · Utbildningar i e-handel · Utbildningar i offentlig upphandling · Övriga utbildningar inom inköp, försäljning och distribution Omfattar också: · Utbildningar till fastighetsmäklare Omfattar inte: · Utbildningar i e-handel med fokus på IT-utveckling, jfr 481a · Utbildningar i företagsekonomi, inriktning marknadsföring, jfr 340c · Utbildningar i försäljning av resor, jfr 812z · Utbildningar i utformning av marknadsföring och reklam, jfr 213d och 342z
broader: Inköp, försäljning och distribution
related: 9i7K 3Zr HYu
related: yxpW N32 YMK
related: hPWL HNB UFP
related: 5EB7 vBs f68
related: 8tSq qT1 ZSZ
related: qPyg Zo8 EEd
related: cKYr Y4o WvV

Lantbruk, trädgård, skog och fiske
type: Concept
in scheme: JobTech Taxonomy - SUN utbildningsområde
definition: Lantbruk, trädgård, skog och fiske
broader: Lant- och skogsbruk samt djursjukvård
narrower: Skog
narrower: Lantbruk, trädgård, skog och fiske, allmän utbildning
narrower: Fiske och vattenbruk
narrower: Lantbruk, trädgård, skog och fiske, övrig och ospecificerad utbildning
narrower: Lantbruk
narrower: Trädgård

Dans, teater och dramatik
type: Concept
in scheme: JobTech Taxonomy - SUN utbildningsområde
definition: Omfattar: · Gymnasieskolans estetiska program, inriktning dans och teater · Utbildningar i scenografi · Utbildningar i scenteknik · Övriga utbildningar inom dans, teater och dramatik Omfattar inte: · Lärarutbildning i dans, teater och dramatik, jfr 146i · Scen- och teaterteknikerutbildning med tyngdpunkt på teknik, jfr 523x
broader: Musik, dans och dramatik
related: h8W4 XWo eYJ
related: tobe oHP ka3
related: TysP nWe KJ9
related: u7zK VKN 8Ht
related: uyTo gut mdm
related: jvK4 Rpa 9g3
related: w7MG 76K e91
related: qbba 4SU yvV
related: iBJi jLj 6nY
related: yoP6 opX fY9
related: Wqo3 zSi eNj
related: 6QnD b84 4kD

Transporttjänster
type: Concept
in scheme: JobTech Taxonomy - SUN utbildningsområde
definition: Transporttjänster inkluderar utbildningar inriktade mot planering, genomförande och ledning av transporter till lands till sjöss och i luften samt service i anslutning till desamma.
broader: Transporttjänster
narrower: Annan utbildning inom transporttjänster
narrower: Utbildning för sjöfart
narrower: Utbildning för postservice
narrower: Utbildning för landtransporter
narrower: Utbildning för luftfart
narrower: Transporttjänster, allmän utbildning

Läkarutbildning, psykiatriska specialiteter
type: Concept
in scheme: JobTech Taxonomy - SUN utbildningsområde
definition: Omfattar också: · Barn- och ungdomspsykiatri
broader: Medicin
related: Ji5i dDM RPF
related: dbVV N9w SRw
related: y7Ek BrR 3bk
related: g7z9 qwV Med

Historia
type: Concept
in scheme: JobTech Taxonomy - SUN utbildningsområde
definition: Omfattar också: · Utbildningar i historiska kulturer, exempelvis egyptologi och assyriologi Omfattar inte: · Ekonomisk historia, jfr 314b · Historisk osteologi, jfr 225b · Idé- och lärdomshistoria, jfr 226z · Konsthistoria, jfr 211b · Litteraturhistoria, jfr 223d · Musik-, film-, dans- och teaterhistoria, jfr 212c · Religionshistoria, jfr 221x
broader: Historia och arkeologi
related: rS2F 7sr Lgi
related: 6Suf y2s y9D
related: t5mH PUB ggC
related: Wq5p j4S YbJ
related: q2SC 2hA 1Rc
related: wpz4 Lsc mMz
related: NNBg zr8 ai7

Lärarutbildning för förskola och fritidsverksamhet
type: Concept
in scheme: JobTech Taxonomy - SUN utbildningsområde
definition: Här ingår utbildningar inriktade mot att undervisa barn i förskoleåldern (3–6 år). Även utbildningar för fritidspedagoger inkluderas.
broader: Pedagogik och lärarutbildning
narrower: Annan lärarutbildning för förskola och fritidsverksamhet
narrower: Lärarutbildning, fritidsverksamhet
narrower: Lärarutbildning, förskola

Turism, resor och fritid
type: Concept
in scheme: JobTech Taxonomy - SUN utbildningsområde
definition: Omfattar: · Gymnasieskolans hotell- och turismprogram, inriktning turism och resor · Utbildning som leder till generell examen inom turism- och fritidsvetenskap · Utbildning till eventarrangör · Utbildning till reseledare · Övriga utbildningar inom turism, resor och fritid
broader: Turism, resor och fritid
related: mj44 gFW 1X5
related: 7goz uuv JWu
related: FbhR shS md2
related: j6Tq x4H ESU
related: yqTo 6qh PCM
related: SvUZ JST uTm
related: tFSc CtP 4B6

Annan utbildning inom skog
type: Concept
in scheme: JobTech Taxonomy - SUN utbildningsområde
definition: Omfattar: · Utbildning som leder till generell examen inom skogshushållning · Utbildning som leder till generell examen inom skogsvetenskap · Övriga utbildningar inom skog Omfattar inte: · Utbildningar inriktade mot nationalparkers skötsel och förvaltning, jfr 424z · Utbildning i träteknik, jfr 543
broader: Skog
related: ToYa 8D5 gDh
related: t3jR pif 3fS
related: fJKR 1qt 89e
related: hbnn EFn WW8

Juridik och rättsvetenskap
type: Concept
in scheme: JobTech Taxonomy - SUN utbildningsområde
definition: Juridik och rättsvetenskap omfattar utbildningar inriktade mot rättsreglerna och deras tillämpning. Det inkluderar även ekonomiska och samhällsvetenskapliga utbildningar om tyngdpunkten ligger på rättsvetenskap.
broader: Juridik och rättsvetenskap
narrower: Annan utbildning i juridik och rättsvetenskap
narrower: Juristutbildning (juristexamen), inklusive fullgjord notarietjänstgöring
narrower: Juristutbildning (juristexamen)
narrower: Rättsvetenskaplig utbildning

Annan utbildning i religion
type: Concept
in scheme: JobTech Taxonomy - SUN utbildningsområde
definition: Omfattar: · Utbildningar i bibelvetenskap · Utbildningar i islamologi och judaistik · Utbildningar i religionshistoria · Övriga utbildningar i religion
broader: Religion
related: WRNJ v82 dLF
related: 4gUq p9u CzG
related: 4Yyj Y8N QMW
related: MH6q jZQ tL2
related: S2zX Jom Muk
related: qpSK 4Jg bMd
related: 6LBo YBJ Dqa
related: t27M EtR D3B
related: Npzu zSH qWJ

Miljövård och miljöskydd
type: Concept
in scheme: JobTech Taxonomy - SUN utbildningsområde
definition: Omfattar: · Utbildningar i hållbar utveckling · Utbildning som leder till generell examen inom miljö- och hälsoskydd · Utbildning som leder till generell examen inom miljövård · Övriga utbildningar i miljövård och miljöskydd Omfattar inte: · Ekologi, jfr 422z · Miljövetenskap, jfr 422z
broader: Miljövård och miljöskydd
related: mRiu Eaf yEx
related: RKw3 zWW 1pf
related: v5Fo 6Gp imd
related: Jqei k5E u48

Annan utbildning inom säkerhet i samhället
type: Concept
in scheme: JobTech Taxonomy - SUN utbildningsområde
definition: Omfattar: · Civilförsvarsutbildning · Utbildning för bevakningstjänster · Utbildning för kustbevakning · Utbildning för tullrelaterad verksamhet · Övriga utbildningar inom säkerhet i samhället Omfattar inte: · Utbildning i juridik, jfr 380
broader: Säkerhet i samhället
related: vMH3 rnF uNT
related: kXcd jmN 1Hd
related: FBR8 BRd BEU
related: k57M 1xq C5i

Biokemi, toxikologi, farmakologi och nutrition
type: Concept
in scheme: JobTech Taxonomy - SUN utbildningsområde
definition: Omfattar: · Utbildningar i bioinformatik · Utbildningar i klinisk nutrition · Utbildningar i kostvetenskap · Utbildningar inom farmaceutisk biovetenskap · Utbildningar inom näringslära och näringsfysiologi · Övriga utbildningar i biokemi, toxikologi, farmakologi och nutrition
broader: Biologi och biokemi
related: Y9QB XuB Vuc
related: Nczc oTy rff
related: tgiq Whb 8B3
related: DZtG EvM StW
related: 2AmS pEq Yhw
related: WYsC S1u vcw
related: xpv4 cwe o4W
related: qptt gUa Ln9
related: nQD8 r91 YjV
related: D2S4 CqW boy

Formgivning
type: Concept
in scheme: JobTech Taxonomy - SUN utbildningsområde
definition: Här ingår utbildningar inriktade mot en kreativ utformning av ett föremål eller en miljö där hänsyn tas till form, material och funktionalitet.
broader: Konst och media
narrower: Inredningsarkitektur och inredningsdesign
narrower: Modedesign
narrower: Industri- och produktdesign
narrower: Annan utbildning inom formgivning

Specialistsjuksköterskeutbildning, vård av äldre
type: Concept
in scheme: JobTech Taxonomy - SUN utbildningsområde
definition: Omfattar: · Demensvård · Palliativ vård · Övrig specialistsjuksköterskeutbildning, inriktning vård av äldre
broader: Omvårdnad
related: XxE6 7uc fuT
related: kikR 9hL hXM
related: DotU sYo Stg

Sociologi, etnologi och kulturgeografi
type: Concept
in scheme: JobTech Taxonomy - SUN utbildningsområde
definition: Här ingår utbildningar inriktade mot människors beteende i grupper och i relation till samhället. Folklivsforskning liksom hur människor organiserar sig och utnyttjar jordens resurser ingår.
broader: Samhälls- och beteendevetenskap
narrower: Socialantropologi och etnologi
narrower: Annan utbildning i sociologi, etnologi och kulturgeografi
narrower: Sociologi
narrower: Kultur- och samhällsgeografi

Marknadsföring
type: Concept
in scheme: JobTech Taxonomy - SUN utbildningsområde
definition: Omfattar: · Utbildningar inom butikskommunikation · Övriga utbildningar inom marknadsföring Omfattar inte: · Utbildningar i företagsekonomi, inriktning marknadsföring, jfr 340c · Utbildningar i utformning och framställning av reklam, jfr 213d
broader: Marknadsföring
related: nYan zib hXG
related: kuUQ P2f E4w

Medieproduktion, allmän utbildning
type: Concept
in scheme: JobTech Taxonomy - SUN utbildningsområde
definition: Omfattar också: · Gymnasieskolans estetiska program, inriktning estetik och media · Konstnärlig utbildning, inriktning medieproduktion Omfattar inte: · Civil- och ingenjörsutbildningar, jfr 523
broader: Medieproduktion
related: i3NZ eDZ tX1
related: VwXK Yne hGT
related: wACW G8s URL

Pedagogik
type: Concept
in scheme: JobTech Taxonomy - SUN utbildningsområde
definition: Omfattar: · Utbildning i didaktik · Utbildning i didaktik i teoretiska och praktiska ämnen vid lärarutbildning · Utbildning i pedagogik som leder till generell examen inom områden som vård, IT, drama, idrott, musik och dans · Utbildning i pedagogiska vetenskaper · Utbildning i specialpedagogik · Utbildning i yrkespedagogik · Övriga utbildningar i pedagogik Omfattar inte: · Friskvårdspedagogik, jfr 813z · Lärarutbildningar, jfr 143–146 · Socialpedagogik, jfr 760z · Speciallärarutbildning och specialpedagogutbildning, jfr 149
broader: Pedagogik
related: GzSm f1g eB7
related: gmWz Jeq yUc
related: BfvR cY8 3he
related: VhPs r8y vA4
related: E9o2 R1e JEp
related: fiBb yTJ xjC
related: 3Nek voe sCQ
related: xak3 LbQ 2QN
related: dLU7 RJ9 BCL
related: EkAQ g8N SDG
related: tScv TjC 36g
related: tajW RwB Kp4
related: hSQt ETo HBp