JobTech Taxonomy - Kompetenssamling
type: ConceptScheme
description: Terminologi för begrepp av typerna 'skill-collection'
publisher: https://jobtechdev.se/en

JobTech Taxonomy - Kompetenssamling
type: Collection
description: Begrepp av typen 'Kompetenssamling' (kod 'skill-collection')
member: Reglerande behörigheter
member: Kompetensbegrepp med grön koppling
member: Kompetensbegrepp med digital koppling
member: Yrkeslegitimationer

Kompetensbegrepp med digital koppling
type: Concept
in scheme: JobTech Taxonomy - Kompetenssamling
top concept of: JobTech Taxonomy - Kompetenssamling
definition: Samlingen innehåller kompetensbegrepp som har en mappningsrelation till en eller flera digitala ESCO-kompetenser. ESCO har specificerat vilka av de kompetenser som ingår i den klassifikationen som kan anses vara digitala. Se ESCOs metoddokument för mer detaljerad beskrivning av ESCOs metod för att definiera vilka kompetenser som är digitala: https://esco.ec.europa.eu/system/files/2023-07/Green%20Skills%20and%20Knowledge%20-%20Labelling%20ESCO.pdf Kompetensbegreppens mappningsrelation till ESCO-kompetenserna beskriver grad av överensstämmels, det vill säga att innebörden i ett kompetensbegrepp delar innebörd med ESCO-kompetenserna. Hur stor överensstämmelsen i innebörd är specificeras med typ av mappningsrelation enligt skos. För mer detaljerad beskrivning av mappningsrelationer, se ESCOs metoddokument: https://esco.ec.europa.eu/system/files/2021-07/425b7a5f-3048-4377-a816-5402c00e9a9505_A_Annex_Draft_ESCO_Implementation_manual.pdf
related: xSLo P6B 2AF
related: 7Y6d qDZ Eyt
related: eTW8 AY5 tpe
related: abgV e4C gwj
related: DW4R Ejt Y35
related: 5ySf wD5 zXz
related: DJgq zBj bKt
related: NfDv 1zP NsD
related: kZaX Qog mPK
related: N7xh Dms MuG
related: 6RVe ZFT p8o
related: Eizh YsE amu
related: CtvK s26 dNs
related: e4tA b22 rfY
related: sq2c q5d zXN
related: gj5K CAe FpZ
related: pWTc PxX xX6
related: ZefA esM Z9F
related: tkH5 VYd Y58
related: 7PHz phA t1T
related: 8J5k b1M 39R
related: bBrA 5Pv YPa
related: wynY a5Q F6t
related: ZuYj ADn tk7
related: xZLY ZU5 E1q
related: Yfsb 5XM edc
related: aBHv 9Df NWV
related: s867 Bcw ebU
related: tCER yDZ XnW
related: JfDs FE6 EKy
related: T5KD ZPr ysR
related: B5cf yxV Zpz
related: vTY5 WmQ vF8
related: wbj8 LR2 aZ8
related: BMjs Jmm GJj
related: X4Xd GYT Yn6
related: HWTe SaB wiT
related: 7H4j dRM Vbo
related: JQRo XJx YX9
related: NnaR bCQ hK1
related: k9C9 rCw tuZ
related: BEva hvD fyY
related: hb1q 7u6 bqH
related: dpPY 3ww 6em
related: udqs kCm YJ6
related: rPMH yr9 h7d
related: 3zuH m51 LHq
related: RBEr gJP ECq
related: j13L B4B Ucu
related: q6QD 6et rcJ
related: Kz5c MjD fMT
related: XVip VKv Ac4
related: juME 7Ek CBR
related: tx8m dhy jwZ
related: igAK 9XZ E2a
related: DHhX uVf y6X
related: uvcb DuX NW8
related: Gk4E H9x ssE
related: payW 4G9 EcQ
related: A5HJ aMw BQt
related: PNvt F2Y xrr
related: 6fA8 Pag kiG
related: oRCp wLd dWd
related: HKgZ SWa vn8
related: W4Ud Do3 B6S
related: VQs1 A6F bvi
related: jYGN rDK tM2
related: LeES iac 1Qx
related: wVLZ NqT 2Z1
related: wE24 qV6 pJV
related: g7bY vJ5 XC8
related: mfxk qAC E8y
related: beea hNs XWo
related: W5A6 NGs aM9
related: wqXe tsX y7s

Reglerande behörigheter
type: Concept
in scheme: JobTech Taxonomy - Kompetenssamling
top concept of: JobTech Taxonomy - Kompetenssamling
definition: En kompetenssamling som innehåller behörigheter/utbildning som krävs för att utöva ett reglerat yrke enligt svensk lag. Informationen inhämtad från Verksamt.se.
related: viQT 1Vf hvu
related: 9ntP jdL 3iG
related: sicB 2Xi eQh
related: oKbA wEE pxf
related: 4sDr kFf cjc
related: Azca cCi Y21
related: hAZR 5Ho Jdw
related: wu3w XsW e72
related: ybPq Egg Dap
related: yKnk W7X Zvk
related: ci3b VjY RyA
related: Tpvt 9yv KAw
related: U4ay wtk yJy
related: vsdz cNF c2C
related: Tnb9 91i XC8
related: ZZok D3i 1pR
related: kWzP mt7 77b
related: 5GDg kKH HSr
related: dJa5 Nao mDS
related: QnaD AmN 3da
related: LETZ XGi W5P
related: PyXu cE2 tRa
related: 6Suw 3c1 47a
related: aE2d iRJ iVz
related: 6Xi5 uCw L8D
related: W7Tf sPz jpH
related: JmAY xSA tpE
related: 9RTm B69 6ec
related: nDE1 gZr UJX
related: 5agw dEi Ag4
related: TnB9 3bm SHm
related: bf1f 57g 2Bo
related: MJBg yfx HK7
related: Y3vb WoB mZR
related: 47LN 8Ac dX8
related: B4E8 NBS irE

Yrkeslegitimationer
type: Concept
in scheme: JobTech Taxonomy - Kompetenssamling
top concept of: JobTech Taxonomy - Kompetenssamling
definition: En kompetenssamling där de yrkeslegitimationer som Socialstyrelsen, Skolverket och Jordbruksverket utfärdar finns samlade.
related: viQT 1Vf hvu
related: 9ntP jdL 3iG
related: oKbA wEE pxf
related: Azca cCi Y21
related: hAZR 5Ho Jdw
related: wu3w XsW e72
related: ybPq Egg Dap
related: yKnk W7X Zvk
related: U4ay wtk yJy
related: Tnb9 91i XC8
related: 5GDg kKH HSr
related: dJa5 Nao mDS
related: QnaD AmN 3da
related: PyXu cE2 tRa
related: 6Suw 3c1 47a
related: aE2d iRJ iVz
related: 6Xi5 uCw L8D
related: JmAY xSA tpE
related: 9RTm B69 6ec
related: nDE1 gZr UJX
related: 5agw dEi Ag4
related: TnB9 3bm SHm
related: bf1f 57g 2Bo
related: MJBg yfx HK7
related: 47LN 8Ac dX8
related: B4E8 NBS irE

Kompetensbegrepp med grön koppling
type: Concept
in scheme: JobTech Taxonomy - Kompetenssamling
top concept of: JobTech Taxonomy - Kompetenssamling
definition: Samlingen innehåller kompetensbegrepp som har en mappningsrelation till en eller flera gröna ESCO-kompetenser. ESCO har specificerat vilka av de kompetenser som ingår i den klassifikationen som kan anses vara gröna. Se ESCOs metoddokument för mer detaljerad beskrivning av ESCOs metod för att definiera vilka kompetenser som är gröna: https://esco.ec.europa.eu/system/files/2023-07/Green%20Skills%20and%20Knowledge%20-%20Labelling%20ESCO.pdf Kompetensbegreppens mappningsrelation till ESCO-kompetenserna beskriver grad av överensstämmelse, det vill säga att innebörden i ett kompetensbegrepp delar innebörd med ESCO-kompetenserna. Hur stor överensstämmelsen i innebörd är specificeras med typ av mappningsrelation enligt skos. För mer detaljerad beskrivning av mappningsrelationer, se ESCOs metoddokument: https://esco.ec.europa.eu/system/files/2021-07/425b7a5f-3048-4377-a816-5402c00e9a9505_A_Annex_Draft_ESCO_Implementation_manual.pdf
related: 3SSP AZw 3TS
related: pQbF zp2 3so
related: mg8h fe2 kDM
related: HACr 3sZ 4gm
related: 8R6B ypK iSj
related: Agyj 9gw G3U
related: E98q sFV 4FT
related: ux5Q z4z dsL
related: Bjhz qeH rQR
related: E13X ZF3 PAb
related: vAS3 M5r RUx
related: FmhN LEM XAM
related: jA7U EuF ibi
related: mR9a pbf 4tv
related: 3uhh iPw fXj
related: sjeK fJW v9T
related: NNeS FUZ Z2r
related: WStg Eag 4oi
related: yP5y T2Q xL7
related: 4veg R5f SSS
related: uE9W cjo dTw
related: yc3o fvU E6V
related: 9t6n 99j BMU
related: 6md5 wPp d4S
related: HYth uQt hAk
related: 1aiY zW7 5Gb
related: Rnrj haw eMR
related: dpBU 3E1 JAx
related: Asgf FwD KGZ
related: aSt1 LXQ MCx
related: CY3S ton bPV
related: XaJV v7o vgX
related: BvCR wvx Bpa
related: CbKj Tme k2U
related: GN1z Mve mR4
related: jcJj Ek8 D6Q
related: Qg8J Y3i sW3
related: 48zu t6j A28
related: Ev5U yQH AU8
related: H75h 4ob Y7p
related: 9xBC Q2v wt6
related: GxW1 hAb 5ZS
related: D8Qb A75 bDH
related: pS7e L46 x1p
related: r2MT yTq xZu
related: Dbcb xEu dVS
related: c7Fv prd bBL
related: Kxs2 SWY MjX
related: uw7i bUK eex
related: cCMP ufr 9Ke
related: 7ijD koM unx
related: 95yM 6W4 Zyj
related: wkwA awm s42
related: tdFQ q6Y 7nM
related: WkEt Pmq xW6
related: nuRM zb9 2wV
related: LyKu BaG Ars
related: 3EaU 8Ta bev
related: 11L4 Q2Z 8tM
related: FyAL 3mK dYH
related: DKfP skK MFK
related: cnkK 3ev Ccf
related: GEEJ kt6 Zcb
related: Xuhg PcG kq2
related: CPkF 611 wtC
related: 74Mw JUN VKx
related: wLYv Pyd uSZ
related: yNyX Wa5 X2d
related: ieS3 RVa vb6
related: G117 cFe ufg
related: 9H62 7be GL9
related: moSc 5RL aYx
related: tqRJ 2Ds GJG
related: tqNp SBC LSx
related: 8sKj VoT hKR