JobTech Taxonomy - Yrke
type: ConceptScheme
description: Terminologi för begrepp av typerna 'occupation-name', 'ssyk-level-1', 'ssyk-level-2', 'ssyk-level-3', 'ssyk-level-4'
publisher: https://jobtechdev.se/en

JobTech Taxonomy - Yrkesbenämning
type: Collection
description: Begrepp av typen 'Yrkesbenämning' (kod 'occupation-name')
member: Kranmontör
member: Brandskyddskoordinator
member: Maskinförare lantbruk
member: UX-designer
member: Dataanalytiker
member: BT-läkare
member: Webbanalytiker
member: Specialistläkare, socialmedicin
member: Forskare, statskunskap
member: Repetitör, opera
member: Ergonom
member: 2:e Styrman
member: Account manager/AM
member: Accounting controller
member: AD-assistent
member: Administrativ chef
member: Advokat
member: Energiexpert
member: Affärsarkitekt
member: Affärsjurist
member: Affärskonsult, IT
member: Affärsområdeschef
member: Affärsutvecklare
member: Agronom
member: Akademisekreterare
member: Akrobat
member: Aktieanalytiker
member: Aktiechef
member: Aktiemäklare
member: Akupressör
member: Akupunktör
member: Data scientist
member: Akutsjuksköterska
member: Ambassadråd
member: Ambassadsekreterare
member: Ambassadör
member: Ambulanssjuksköterska
member: Ambulanssjukvårdare
member: Analytisk kemist
member: Anbudsansvarig/Bid Manager
member: Anestesisjuksköterska
member: Anhörigkonsulent
member: Animationsoperatör
member: Animatör
member: Anläggningsdykare
member: Annonsproducent
member: Antagningschef, utbildning
member: Antagningssekreterare, utbildning
member: Antikvarie
member: Antropolog
member: Apoteksassistent
member: Apotekschef
member: Apotekstekniker
member: Applikationsingenjör
member: Applikationsutvecklare
member: Arbetsförmedlare
member: Arbetsförmedlingschef
member: Arbetsledare, anläggning
member: Arbetsledare, golv
member: Arbetsledare, gruvbrytning och metallproduktion
member: Arbetsledare, husbyggnad
member: Arbetsledare, maskintillverkning, verkstadsprodukter
member: Arbetsledare, murning
member: Djurskötare lantbruk
member: Arbetsledare, måleri
member: Arbetsledare, rivning
member: Arbetsledare, tillverkning, elektroniska produkter
member: Arbetsledare, tillverkning, elkrafttekniska produkter
member: Arbetsledare, tillverkning kemiska produkter
member: Arbetsledare, tillverkning, textil- och träprodukter
member: Arbetsledare, tryckeri
member: Arbetsledare, ventilation
member: Solcellsinstallatör
member: Arbetsledare, VVS
member: Arbetsmiljöingenjör
member: Arbetsmiljöinspektör
member: Arbetsrättsjurist

JobTech Taxonomy - SSYK nivå 1
type: Collection
description: Begrepp av typen 'SSYK nivå 1' (kod 'ssyk-level-1')
member: Yrken med krav på kortare utbildning eller introduktion
member: Chefsyrken
member: Yrken inom maskinell tillverkning och transport m.m.
member: Militära yrken
member: Yrken inom lantbruk, trädgård, skogsbruk och fiske
member: Yrken inom byggverksamhet och tillverkning
member: Yrken med krav på högskolekompetens eller motsvarande
member: Service-, omsorgs- och försäljningsyrken
member: Yrken inom administration och kundtjänst
member: Yrken med krav på fördjupad högskolekompetens

JobTech Taxonomy - SSYK nivå 2
type: Collection
description: Begrepp av typen 'SSYK nivå 2' (kod 'ssyk-level-2')
member: Snabbmatspersonal, köks- och restaurangbiträden m.fl.
member: Yrken med krav på högskolekompetens eller motsvarande inom teknik
member: Kundserviceyrken
member: Yrken med krav på fördjupad högskolekompetens inom hälso- och sjukvård
member: Politiker, verkställande direktörer och högre ämbetsmän m.fl.
member: Chefer inom bank, finans och försäkring
member: Officerare
member: Kontorsassistenter och sekreterare
member: Andra kontors- och kundserviceyrken
member: Bärplockare och plantörer m.fl.
member: Yrken med krav på högskolekompetens eller motsvarande inom hälso- och sjukvård samt laboratorium
member: Hantverksyrken inom trä, textil m.m.
member: Yrken med krav på fördjupad högskolekompetens inom naturvetenskap och teknik
member: Städyrken
member: Livsmedelsförädlare
member: Chefer inom ekonomi, HR, marknadsföring och försäljning samt annan administration m.m.
member: Yrken med krav på fördjupad högskolekompetens inom juridik, kultur och socialt arbete m.m.
member: Yrken med krav på fördjupad högskolekompetens inom utbildning
member: Yrken med krav på högskolekompetens eller motsvarande inom kultur, friskvård och socialt arbete m.m.
member: Chefer inom IT, logistik, FoU, fastighetsbolag, bygg- och ingenjörsverksamhet samt tillverkning m.m.
member: Försäljningsyrken inom detaljhandeln m.m.
member: Chefer inom utbildning
member: Specialistofficerare
member: Yrken med krav på högskolekompetens eller motsvarande inom IT, ljud- och ljusteknik m.m.
member: Installations- och serviceyrken inom el och elektronik
member: Montörer
member: Yrken med krav på fördjupad högskolekompetens inom IT
member: Chefer inom hälso- och sjukvård samt annan samhällsservice
member: Metallhantverks- och reparatörsyrken
member: Torg- och marknadsförsäljare
member: Lantbruks- och trädgårdsyrken
member: Process- och maskinoperatörer
member: Omsorgsyrken
member: Yrken med krav på högskolekompetens eller motsvarande inom ekonomi och förvaltning
member: Transport- och maskinföraryrken
member: Yrken med krav på fördjupad högskolekompetens inom ekonomi och förvaltning
member: Soldater m.fl.
member: Andra bevaknings- och säkerhetsyrken
member: Serviceyrken
member: Andra yrken inom bygg, tillverkning och godshantering
member: Yrken inom materialförvaltning m.m.
member: Återvinningsarbetare, tidningsdistributörer och övriga servicearbetare
member: Chefer inom övrig servicenäring
member: Skogsarbetare, fiskodlare och fiskare
member: Finmekaniska, grafiska och konsthantverksyrken
member: Byggnads- och anläggningsyrken

JobTech Taxonomy - SSYK nivå 3
type: Collection
description: Begrepp av typen 'SSYK nivå 3' (kod 'ssyk-level-3')
member: Djursjukskötare och veterinärassistenter
member: Bil-, motorcykel- och cykelförare
member: Eventsäljare och telefonförsäljare m.fl.
member: Restaurang- och kökschefer
member: Officerare
member: Ekonomi- och finanschefer
member: Personal- och HR-chefer
member: Installations- och industrielektriker m.fl.
member: Fiskodlare och fiskare
member: Köksmästare och souschefer
member: Smeder och verktygsmakare m.fl.
member: Behandlingsassistenter och pastorer
member: Prepresstekniker, tryckare och bokbindare m.fl.
member: Resesäljare, kundtjänstpersonal och receptionister m.fl.
member: Förvaltare inom skogsbruk och lantbruk m.fl.
member: Fotografer, dekoratörer och underhållningsartister m.fl.
member: Chefer inom grund- och gymnasieskola samt vuxenutbildning
member: Arkitekter och lantmätare
member: Fysiker, kemister m.fl.
member: Skötare, vårdare och personliga assistenter m.fl.
member: Chefer inom handel
member: Specialistofficerare
member: Finmekaniker och konsthantverkare m.fl.
member: Andra specialister inom hälso- och sjukvård
member: Universitets- och högskolelärare
member: Andra pedagoger med teoretisk specialistkompetens
member: Lastbils- och bussförare
member: Övriga chefer inom utbildning
member: Jurister
member: Organisationsutvecklare, utredare och HR-specialister m.fl.
member: Fordonsmekaniker och reparatörer m.fl.
member: Skräddare, tapetserare och läderhantverkare m.fl.
member: Tandsköterskor
member: Övriga administrations- och servicechefer
member: Lokförare och bangårdspersonal
member: Övrig servicepersonal
member: Maskinoperatörer, gummi-, plast- och pappersvaruindustri
member: Präster och diakoner
member: Barnskötare och elevassistenter m.fl.
member: Arbetsledare inom bygg och tillverkning m.m.
member: Politiker och högre ämbetsmän
member: Socialsekreterare och kuratorer m.fl.
member: Fastighets- och förvaltningschefer
member: IT-arkitekter, systemutvecklare och testledare m.fl.
member: Växtodlare inom jordbruk och trädgård
member: Maskinoperatörer, kemiska och farmaceutiska produkter m.m.
member: Naprapater, sjukgymnaster och arbetsterapeuter m.fl.
member: Drift-, support- och nätverkstekniker m.fl.
member: Övriga chefer inom samhällsservice
member: Juristsekreterare, chefssekreterare och institutionssekreterare m.fl.
member: Hovmästare, servitörer och bartendrar
member: Djuruppfödare och djurskötare
member: Snickare, murare och anläggningsarbetare
member: Kabinpersonal, tågmästare och guider m.fl.
member: Sjuksköterskor (fortsättning)
member: Bärplockare och plantörer m.fl.
member: Marknadsförare och informatörer m.fl.
member: Tidningsdistributörer, vaktmästare och övriga servicearbetare
member: Drifttekniker och processövervakare
member: Specialister inom miljö- och hälsoskydd
member: Idrottsutövare och fritidsledare m.fl.
member: Lärare i yrkesämnen
member: Förvaltnings- och planeringschefer
member: Butikspersonal
member: Montörer
member: Skatte- och socialförsäkringshandläggare m.fl.
member: Matroser och jungmän m.fl.
member: Tandläkare
member: Läkare
member: Chefer inom förskoleverksamhet
member: Civilingenjörsyrken
member: Försäljnings- och marknadschefer
member: Malmförädlingsyrken och brunnsborrare m.fl.
member: Chefer och ledare inom trossamfund
member: Poliser
member: Skogsarbetare
member: Snabbmatspersonal, köks- och restaurangbiträden m.fl.

JobTech Taxonomy - SSYK nivå 4
type: Collection
description: Begrepp av typen 'SSYK nivå 4' (kod 'ssyk-level-4')
member: Officerare
member: Specialistofficerare
member: Soldater m.fl.
member: Politiker
member: General-, landstings- och kommundirektörer m.fl.
member: Chefstjänstemän i intresseorganisationer
member: Verkställande direktörer m.fl.
member: Ekonomi- och finanschefer
member: Personal- och HR-chefer
member: Förvaltnings- och planeringschefer
member: Informations-, kommunikations- och PR-chefer
member: Försäljnings- och marknadschefer
member: Övriga administrations- och servicechefer
member: IT-chefer
member: Inköps-, logistik- och transportchefer
member: Forsknings- och utvecklingschefer
member: Chefer inom arkitekt- och ingenjörsverksamhet
member: Fastighets- och förvaltningschefer
member: Driftchefer inom bygg, anläggning och gruva
member: Produktionschefer inom tillverkning
member: Förvaltare inom skogsbruk och lantbruk m.fl.
member: Chefer inom grund- och gymnasieskola samt vuxenutbildning
member: Chefer inom förskoleverksamhet
member: Övriga chefer inom utbildning
member: Chefer inom hälso- och sjukvård
member: Chefer inom socialt och kurativt arbete
member: Chefer inom äldreomsorg
member: Chefer och ledare inom trossamfund
member: Övriga chefer inom samhällsservice
member: Chefer inom bank, finans och försäkring
member: Hotell- och konferenschefer
member: Restaurang- och kökschefer
member: Chefer inom handel
member: Chefer inom friskvård, sport och fritid
member: Övriga chefer inom övrig servicenäring
member: Fysiker och astronomer
member: Meteorologer
member: Kemister
member: Geologer och geofysiker m.fl.
member: Matematiker och aktuarier
member: Statistiker
member: Cell- och molekylärbiologer m.fl.
member: Växt- och djurbiologer
member: Farmakologer och biomedicinare
member: Specialister och rådgivare inom lantbruk m.m.
member: Specialister och rådgivare inom skogsbruk
member: Civilingenjörsyrken inom logistik och produktionsplanering
member: Civilingenjörsyrken inom bygg och anläggning
member: Civilingenjörsyrken inom elektroteknik
member: Civilingenjörsyrken inom maskinteknik
member: Civilingenjörsyrken inom kemi och kemiteknik
member: Civilingenjörsyrken inom gruvteknik och metallurgi
member: Övriga civilingenjörsyrken
member: Arkitekter m.fl.
member: Landskapsarkitekter
member: Planeringsarkitekter m.fl.
member: Lantmätare
member: Industridesigner
member: Grafiska formgivare m.fl.
member: Designer inom spel och digitala medier
member: Övriga designer och formgivare
member: Arbetsmiljöingenjörer, yrkes- och miljöhygieniker
member: Miljö- och hälsoskyddsinspektörer
member: Specialister inom miljöskydd och miljöteknik
member: Specialistläkare
member: ST-läkare
member: AT-läkare
member: Övriga läkare
member: Grundutbildade sjuksköterskor
member: Barnmorskor
member: Anestesisjuksköterskor
member: Distriktssköterskor
member: Psykiatrisjuksköterskor
member: Ambulanssjuksköterskor m.fl.
member: Geriatriksjuksköterskor
member: Intensivvårdssjuksköterskor
member: Operationssjuksköterskor

Drifttekniker, IT
type: Concept
in scheme: JobTech Taxonomy - Yrke
definition: Sköter daglig drift av informations- och kommunikationssystem, kringutrustning, maskinvara, programvara och annan datorutrustning för att identifiera och förebygga fel och driftstörningar.
broader: Drift-, support- och nätverkstekniker m.fl.
related: pWTc PxX xX6
related: wynY a5Q F6t
related: NnaR bCQ hK1
related: hb1q 7u6 bqH
related: XVip VKv Ac4
related: igAK 9XZ E2a
related: oRCp wLd dWd
related: LeES iac 1Qx
related: wqXe tsX y7s
related: C3511
related: szCq AR6 CaF
related: qVjQ w6H dns
related: N8Tu Tsn 2VD
related: aB7G VwT AfU
related: ZxHj Wvj 39H
related: C4Ev voX wwz
related: TFQD onf Tid
related: zxNe iWG wqf
related: Zd17 7XH myf
related: urLT mLe FHv
related: ofcY XXh G4k
related: KAVh Qyx GPu
related: bT7R xGv GnZ
related: bJ3T CwH a2j
related: Lrrv HyL PzJ
related: 7d2G KP4 eFb
related: bCPt NW1 v2o
related: 5q4a wi4 WYk
related: V2u7 DEg 6i8
related: bKM3 9g1 WWC
related: 2vCi hQz Y9o
related: 8Qjp Myj xnv
related: 1FS5 pZc X5o
related: WQdS Jtu qPC
related: GZEU zfs Fcc
related: yoeN KxU Wp1
related: YiDr LYX u61
related: HQJ2 68A AiZ
related: xTkt sZQ eVq
related: N9zP r7b yiK
related: gtoY Bwt 23m
related: 3H7m pt8 7b2
related: QN8t 2kG kzL
related: pYJh yqM cfy
related: 4Mfr 6nP VLM
related: nhXC MeA vzi
related: cScr 7z5 gAg
related: uBLB rJz L99
related: 4qaY nGh gq1
related: pqTD 5Mi 3mx
related: N9we hv9 hsc
related: q2v1 YcS Dff
related: 85vp 6Vr 4N1
related: zU9b joy UL6
related: yHvf EiK QUF
related: 7DD2 xWS Ehp
related: T7DS X2X Y4N
related: sPhy WnE 1Xd
related: G4sF xod zoq
related: t78J nRk xGn
related: GLUa Sxn Uqx
related: xGPG PpL zWN
related: oQLY 2c5 vSg
related: Np6W aQg Rkn
related: hfRX 1xN X8Z
related: dzye AGW bsc
related: voW2 EsY 1Vj
related: pnX9 gFn CLt
related: a4W9 9Mz sWY
related: 2dyp mQp ezF
related: rdQ2 dyF 8J8
related: 9qgQ QyK VVh
related: GRfY oZH D9E
related: k5XN 2ar j7D
related: ZDFR 2Mr Hpn

SFI-lärare
type: Concept
in scheme: JobTech Taxonomy - Yrke
definition: SFI-lärare
broader: Övriga pedagoger med teoretisk specialistkompetens
related: xqbk 1wY EcX
related: 5ofh GVz MaL
related: e8JY 7RY XQR
related: MVqp eS8 kDZ
related: pZET 8KT tKw
related: j3ep 8vv nLH
broad match: C2353

Skolvärd
type: Concept
in scheme: JobTech Taxonomy - Yrke
definition: Skolvärdar arbetar i skolans gemensamma utrymmen med att stödja elever och personal under skoldagen. Arbetsuppgifter inkluderar att ge praktisk hjälp till elever vid behov, bidra till en trygg och säker skolmiljö samt hantera enklare konflikter. Skolvärd samarbetar med skolpersonal och deltar i aktiviteter och raster för att skapa en trivsam miljö. Beroende på arbetsplats kan det även ingå att följa med under bussresor till och från skola. Skolvärdar har god kännedom om skolans rutiner och arbetar för att förebygga och hantera situationer som kan uppstå under skoldagen. Källa: Arbetsförmedlingen
alternative label: Skolvärdinna
broader: Elevassistenter m.fl.
related: UdVa jRr 9DE
related: MVqp eS8 kDZ
related: DvLw tdL Lzt
broad match: C5312

Bilskadereparatör
type: Concept
in scheme: JobTech Taxonomy - Yrke
definition: Bilskadereparatörer återställer skadade bilar. Arbetet innebär att återställa bilens ursprungliga form och struktur. Man behöver i yrket ta hänsyn till fordons form, teknik, mekanik och olika material. Vanligt förekommande arbetsuppgifter är att rikta bärande delar av karossen, reparera bucklor och repor i samt åtgärda rostskador. Arbetet utförs med specialverktyg och databaser med detaljinformation om bilmodeller. Yrket kräver kunskap om fordonsteknik, mekanik och olika material. Källa: Transportföretagen, Arbetsförmedlingen
broader: Tunnplåtslagare
related: dkKP j7e hGq
related: z9bS gn1 kpw
related: er7G zS6 fmG
related: T6N3 kdY Nhg
related: tEsS wUh Wib
related: upKa qjc 58K
related: thnm 2di J7c
related: otdz 1o1 5TQ
related: NNJb LC8 pUg
related: RSCL 3oy o9b
related: poL7 g39 55T
related: wTEr CBC bqh
related: TZkp 9XV pF6
related: nWZG ekX Wnc
related: JezX oUD TZr
broad match: C7213

Övriga utbildare och instruktörer
type: Concept
in scheme: JobTech Taxonomy - Yrke
definition: Leder studiecirklar och kurser utanför det reguljära utbildningsväsendet. Exempel på arbetsuppgifter: Lär ut språk, datakunskap, dans, musik, slöjd och hantverkstekniker. Undervisar på utbildningsföretag i datakunskap, ledarskap m.m. Organiserar bl.a. fortbildning av anställda inom företag.
broader: Trafiklärare och instruktörer
related: xSLo P6B 2AF
related: 7Y6d qDZ Eyt
related: DJgq zBj bKt
related: s867 Bcw ebU
related: XHAq 71w 6ds
related: RUC7 GK7 xhi
related: ux5Q z4z dsL
related: 3zuH m51 LHq
related: Kz5c MjD fMT
related: C2424
related: LDAz 2Bx oM1
related: WkbY ztM fMi
related: pTKH VFm xkk
related: FsqP Eu4 AxU
related: C2354
related: 9bUZ 8ez RqS
related: qVjQ w6H dns
related: DyVB t9F Ucr
related: y3bL sR7 viK
related: N8Tu Tsn 2VD
related: aB7G VwT AfU
related: M5f1 xKf eN9
related: kQVR Hbt KgR
related: TFQD onf Tid
related: zxNe iWG wqf
related: pJFq jT2 ggv
related: C29A LND A5N
related: F65K to1 svo
related: jpcS H9h 7qK
related: urLT mLe FHv
related: C2359
related: bT7R xGv GnZ
related: bJ3T CwH a2j
related: Lkq7 B8A 9Pe
related: Uyxo Y4T X4k
related: w2C9 ji1 46T
related: aUr6 Rjg ja2
related: wM5o tYh jVc
related: C2353
related: aKHq D3Y L3M
related: QEt5 KUz 6oF
related: R9MA bax BHa
related: kjop UjM GNT
related: sURo MBj hGS
related: SpRR JX9 6o6
related: vSeh uuU kAh
related: bCPt NW1 v2o
related: C2355
related: 3HjW 1BP k3S
related: s9Ys tMu iKM
related: uWb5 Hrd 9XN
related: WoCj JK3 uY4
related: SUNf PJQ p1J
related: 3vYj Rhf Voh
related: u7xx pds tCc
related: V2u7 DEg 6i8
related: hV1u h8C 6Gn
related: TUzi ouJ rsk
related: ooLP cHi X9L
related: Uv9y v2g efa
related: Tmps QPE g3V
related: Ehac yJ5 7oh
related: ViEb giB 7EV
related: qjeU 6sK 9Uf
related: 1FS5 pZc X5o
related: zJZd pDs SDf
related: WQdS Jtu qPC
related: V5EN xw2 itk
related: nhy1 TuC qeo
related: GZEU zfs Fcc
related: kcUc Kyz tFA
related: 9mrh j9j fQp
related: mVXq Xyf Hps
related: SoCn F6f iYd
related: oLnc YZn 3bm

Arkivutredare
type: Concept
in scheme: JobTech Taxonomy - Yrke
definition: Arkivutredare
broader: Planerare och utredare m.fl.
related: X82t awd Qyc
related: TZe9 NsN uce
broad match: C2422

EU-handläggare
type: Concept
in scheme: JobTech Taxonomy - Yrke
definition: EU-handläggare
broader: Planerare och utredare m.fl.
related: yA6e nRc 9Db
related: X82t awd Qyc
related: Yb1w sSy Rh9
related: WT2u qzo 7Sj
related: 9zvh VHM NWV
related: zweW uWr sD2
related: TZe9 NsN uce
related: A3vz KPF TeP
broad match: C2422

Bärplockare och plantörer m.fl.
type: Concept
in scheme: JobTech Taxonomy - Yrke
definition: Skördar grönsaker, frukt och bär. Röjer, gräver, planterar, rensar, gallrar, stackar m.m., med hjälp av handredskap och handverktyg. Rengör stallar och ladugårdar.
broader: Bärplockare och plantörer m.fl.
related: C9211
related: C9212
related: C9214
related: oYDh d6r cSu
related: yNyX Wa5 X2d
related: 76zY Jy9 KSt
related: pGts PKK c8W
related: yAip asH hQX
related: VwVK evr TjJ
related: C9213
related: jnhn HSM 2eC
related: C9216
related: YUDN n3n tdz
related: C9215
related: ZRNy Z9P iuc
related: PfHC b9Z KGa
narrower: Skördearbetare
narrower: Växtskötare
narrower: Bärplockare
narrower: Plantskolearbetare
narrower: Plantör
broad match: VuuL 7CH adj

Administrativ chef
type: Concept
in scheme: JobTech Taxonomy - Yrke
definition: Administrativ chef
broader: Övriga administrations- och servicechefer
related: igt6 iSd JVB
related: pZg2 hLK jua
related: FXR7 B38 o9V
related: Xp2r cea VVU
related: X82t awd Qyc
related: epLc SkD cbT
related: Pxxx NVs Q7f
related: w17e tfU bqH
related: bh3H Y3h 5eD
related: EhLE h9i PXg
related: jcMb yHT 3kr
related: v3gd atB x6u
related: vCZE apR 55f
related: mHuB yv1 Jo1
broad match: C1219

Processoperatörer, papper
type: Concept
in scheme: JobTech Taxonomy - Yrke
definition: Styr och övervakar anläggningar som tillverkar papper, papp m.m. av pappersmassa. Sköter maskiner för efterbehandling av papper eller kartong.
broader: Processoperatörer, trä- och pappersindustri
related: C8171
related: VPF1 UZM 9Kd
related: ECs4 p2b JiU
related: 74Mw JUN VKx
related: 2pjc Vto TGH
related: eSku Mcf 3BD
related: pGts PKK c8W
related: aF3J SgE uck
related: qQ61 EQR rcz
related: VTwt 5Fe 6bW
related: MGhr ekY tSp
related: KDzy Hra iVr
related: 1vX4 pj1 yao
related: RS2d JVy 5Yg
related: D6K9 tbz ZxW
related: GCYi 9tC 1pP
related: YimK SJi Dpx
related: Rbju P7i 12U
related: 59Y2 2ck CUR
related: BGie HPa fNA
related: 4y7C Lsh EPM
related: uenm 75h fEh
related: MT1a Nyq DGQ
related: qn22 kbi Mwa
related: dWbY gXC Frx
related: sLyd JC8 FhH
related: LhvF NZc r6N
related: MJgU 13b swh
narrower: Processoperatör papper
broad match: wTEr CBC bqh

Arbetsledare, ventilation
type: Concept
in scheme: JobTech Taxonomy - Yrke
definition: Arbetsledaren inom ventilation är den som leder ventilationsarbetena på byggarbetsplatsen. Arbetsledaren bevakar att maskiner och material finns på plats och samordnar arbetet med entreprenörer. Arbetsledaren har ansvaret för att arbetet utförs enligt gällande ritningar och anvisningar och för att säkerhetsföreskrifterna följs. Källa: Arbetsförmedlingen
broader: Arbetsledare inom bygg, anläggning och gruva
related: j7Cq ZJe GkT
related: AY1X oKu 2VV
related: ja7J P8X YC9
broad match: C3123

Hyreskonsulent
type: Concept
in scheme: JobTech Taxonomy - Yrke
definition: Hyreskonsulent
broader: Fastighetsförvaltare
related: 6Hq3 tKo V57
related: WDoL Rzs 4G1
related: pBFg vVh yYL
related: qDhZ 9jw EUr
related: U9JK s97 ZY6
broad match: C3334

Väskmakare
type: Concept
in scheme: JobTech Taxonomy - Yrke
definition: Väskmakare är läderhantverkare som tillverkar och renoverar bland annat väskor och etuier. Väskmakare har som specialiserat sig inom sadelmakeri mot att tillverka väskor, portföljer, etuier, askar och fodral. Väskmakare tillverkar även heminredningsdetaljer så som skålar, fat och smycken av läder. Yrket delar hantverk och teknik med sadelmakare och bilsadelmakare. Gemensamt för de som arbetar med sadelmakeri är att man har goda och hantverksmässiga kunskaper om läder. Källa: Arbetsförmedlingen, Sadelmakarnas branschorganisation
broader: Läderhantverkare och skomakare
related: PaxQ o1G wWH
broad match: C7536

Fotograf
type: Concept
in scheme: JobTech Taxonomy - Yrke
definition: En fotograf fångar ögonblick och berättar historier genom bilder. De använder kameran som sitt främsta verktyg för att skapa visuella berättelser, dokumentera händelser eller uttrycka konstnärliga visioner. En fotograf kan specialisera sig inom olika områden som porträtt, landskap, mode, reklam eller reportage. Källa: Arbetsförmedlingen
broader: Fotografer
related: yVCe 2Wp RgA
related: E7pn bWe mNo
related: EUSK GVs 835
related: GkDF Pzp TkV
related: aPrm GZf ops
related: E9Fx 8DU 8Qu
related: W1Gi jy9 QzT
related: 9kom Ycw Ba6
related: 3UtJ wzr 98C
related: qh1Z vhz 4EW
related: e9B8 3r6 Aj1
related: rzAi Xnm r9g
related: Uyjg kzq VoF
related: CpZQ fww Q73
related: 3BtC GBq VPq
related: 8too bEs 7NU
related: 9puE nYg crq
related: YuEZ iQK D2T
related: Rdeu uws 1Bm
related: A5UL C17 Adi
related: FsLT i1B NNa
related: Cx6N yNR Zn6
related: BNFU a1X fd6
broad match: C3431

Fin-, inrednings- och möbelsnickare
type: Concept
in scheme: JobTech Taxonomy - Yrke
definition: Tillverkar och reparerar möbler, modeller, båtar och andra träprodukter på hantverksmässigt sätt. Tillverkar, monterar och reparerar inredningar för exempelvis affärer, banker och restauranger.
broader: Ytbehandlare, trä och möbelsnickare m.fl.
related: sKfH MGG 3CS
related: rhxo 4e2 5Gj
related: C7522
related: PktN Uav zKf
related: LGtP Gca NVj
related: Qg8J Y3i sW3
related: 6sNj upt KbP
related: ZXkM jpm p2r
related: VqTN DcE EJc
related: aHCV VsV LiD
related: LS7F M7b w4C
related: K84U fRp jCj
related: Q7eC B7g QiU
related: bjUC ifJ jeA
related: TB5z d2p VKh
related: 6hij n3p RbR
related: BZUR w5p XJJ
related: dGM4 VNo D7w
related: SxZy 3gn xFg
related: AThj o5R e8w
related: wYYj eRy Hok
related: Vrh6 MwU tMD
related: jd3r rtB qNH
related: fhcp fFw Lbj
related: yeUJ snJ z7Y
related: cmSE SZZ rfK
related: 5XhW VQA 2CW
related: 5dUU XLt C1Y
related: E6xZ ZMJ 77a
related: Bumt 8bQ nx8
related: KgEX Xpt xLq
related: eGvq 3pu WJT
related: g8fP 1ze JCo
related: NgvP A87 SuB
related: Z3nB Ecc B6h
related: C7115
related: jFiq 2fM KY2
related: wBu8 sKV SiA
related: WfAZ bJH rUo
related: 2vrR rF1 rfe
related: 1ntS 4nX nTq
related: wn7T k1d TBe
related: UPx7 WPj h9V
related: ukzr kg6 tDz
related: DDwi f63 YVH
related: DkdQ Wrp DWV
related: sKrn Bq9 j8r
related: PDJs KCy vt9
narrower: Möbelsnickare
narrower: Modellbyggare
narrower: Attributmakare
narrower: Dekorsnickare/Teatersnickare
narrower: Båtbyggare
narrower: Inredningssnickare/Specialsnickare
broad match: PaxQ o1G wWH

Idrottsutövare och fritidsledare m.fl.
type: Concept
in scheme: JobTech Taxonomy - Yrke
definition: Idrottsutövare och fritidsledare m.fl.
broader: Yrken med krav på högskolekompetens eller motsvarande inom kultur, friskvård och socialt arbete m.m.
narrower: Friskvårdskonsulenter och hälsopedagoger m.fl.
narrower: Idrottstränare och instruktörer m.fl.
narrower: Professionella idrottsutövare
narrower: Fritidsledare m.fl.

Kabinpersonal m.fl.
type: Concept
in scheme: JobTech Taxonomy - Yrke
definition: Svarar för passagerares säkerhet ombord på flygplanet. Informerar om säkerhetsföreskrifter m.m. Serverar måltider och drycker samt säljer olika varor. Planerar och samordnar service och aktiviteter på fartyg.
broader: Kabinpersonal, tågmästare och guider m.fl.
related: g6vZ i7N ZeJ
related: zMmn 1mh 6D5
related: oU2m KaW Bj6
related: C5111
related: vaa5 RpE psm
related: j1Yr UhC X16
related: hYpk RYx y3V
related: SLJj daq YsY
narrower: Kabinpersonal
narrower: Båtvärd
narrower: Purser
broad match: ASGV zcE bWf

Scrum master
type: Concept
in scheme: JobTech Taxonomy - Yrke
definition: Scrum master
broader: Övriga IT-specialister
related: apaJ 2ja LuF
broad match: C2519

Kontrollmätare virke
type: Concept
in scheme: JobTech Taxonomy - Yrke
definition: Kontrollmätare granskar redan genomförda virkesmätningar. Syftet med kontrollmätning är att följa upp Kontrollen syftar till att följa upp och säkerställa att virkesmätning och mätutrustning håller bestämd kvalitet. Som köpare eller säljare av virke kan man begära kontroll av redan genomfört virkesmätning. Kontrollmätare kan även syssla med att kvalitetssäkra skogsmaskiner, mer bestämt hur väl mätutrustning fungerar på skördare. Kontrollmätare är vanligtvis mer erfanra virkesmätare och beronde på arbetsplats kan även upplärning av virkesmätare ingå i arbetsuppgifterna. Källa: Arbetsförmedlingen
broader: Skogsarbetare
related: tRGc STG tNt
related: X82t awd Qyc
related: xAEY CVS H2t
related: VuuL 7CH adj
broad match: C6210

SOS-operatör
type: Concept
in scheme: JobTech Taxonomy - Yrke
definition: SOS-operatörer besvarar och hanterar inkommande nödsamtal via larmnumret 112. Arbetsuppgifterna innebär att bedöma situationer genom att ställa relevanta frågor för att identifiera vad som har hänt, var det har inträffat och vilken hjälp som behövs. Baserat på denna information larmas och samordnas insatser från exempelvis ambulans, räddningstjänst eller polis. Vanliga arbetsredskap inkluderar datorer, radio och telefoner. Arbetsuppgifer: hantera larm Källa: SOS Alarm
broader: SOS-operatörer m.fl.
related: NYW6 mP6 vwf
related: AX9D Raz DMF
related: E7hm BLq fqZ
related: ZXmK Fuk ogD
related: Pxoe 5vx GK6
related: w9PW uMd cTm
broad match: C4223

Regiassistent
type: Concept
in scheme: JobTech Taxonomy - Yrke
definition: Regiassistent arbetar som regissörens stöd och ansvarar för att organisera och koordinera produktionen så att inspelningar eller repetitionerna följer schemat och fungerar smidigt. Vanliga arbetsuppgifter är att skapa inspelningsscheman och koordinera mellan regissör, fotograf och andra avdelningar, upprätthålla produktionsdokumentation och säkerhetsrutiner på inspelningsplatsen, organisera och koordinera statister, hålla ordning på tidsscheman och vara stöd i logistiken under inspelningarna. Källa: Arbetsförmedlingen, Yrkesnämnden för Film och TV
broader: Inspicienter och scriptor m.fl.
related: 8too bEs 7NU
related: 9puE nYg crq
broad match: C3435

Riksbibliotekarie
type: Concept
in scheme: JobTech Taxonomy - Yrke
definition: Riksbibliotekarie
broader: General-, landstings- och kommundirektörer m.fl.
related: bh3H Y3h 5eD
broad match: C1112

HR-strateg
type: Concept
in scheme: JobTech Taxonomy - Yrke
definition: HR-strateg
broader: Personal- och HR-specialister
related: U39e DS1 WnE
related: m7gK jFU vY8
related: upyT prv xAD
related: 1dKw JPc oyg
related: X82t awd Qyc
related: 6So5 T8E CVA
related: cUoE tAC ygr
related: FymD YyW qZE
related: hju8 2pw kpg
related: pyNJ Xcf xzg
related: kGVr GVA ZT3
broad match: C2423

Trafikplanerare, offentlig förvaltning
type: Concept
in scheme: JobTech Taxonomy - Yrke
definition: Trafikplanerare, offentlig förvaltning
broader: Planerare och utredare m.fl.
related: TbZR Ho4 Dq6
related: XmfY 3sq 4dC
related: fzFj 7qh wwT
related: oxKY FkA fa5
related: joKC 1ER 5hN
related: hD5T ZxZ BRc
related: X82t awd Qyc
related: Jt81 R3k Yez
related: CmJs sTw FtY
related: Zju7 MHW ELS
related: TZe9 NsN uce
related: 8HJy wXs sNj
related: qRcv hJb Uak
related: Xowx mE8 Nrx
broad match: C2422

Universitets- och högskolelärare
type: Concept
in scheme: JobTech Taxonomy - Yrke
definition: Universitets- och högskolelärare
broader: Yrken med krav på fördjupad högskolekompetens inom utbildning
narrower: Professorer
narrower: Doktorander
narrower: Universitets- och högskolelektorer
narrower: Övriga universitets- och högskolelärare
narrower: Forskarassistenter m.fl.

HR-konsult/PA-konsult
type: Concept
in scheme: JobTech Taxonomy - Yrke
definition: HR-konsult/PA-konsult
alternative label: HR-konsult
alternative label: PA-konsult
broader: Personal- och HR-specialister
related: uUbz P9j Ghm
related: EEB3 CiA icu
related: YWft bBn Jyt
related: F7Vg 36t roE
related: wEDA Xti 4JT
related: X82t awd Qyc
related: tmog xxh r5Q
related: yDnY DV7 8an
related: pyNJ Xcf xzg
related: fnhW EBh bfJ
related: nNP4 8nW ayo
related: BQ5r AiN 8Bj
related: F5ja wFi 2rN
related: 3nJR WEZ cN2
broad match: C2423

Fastighetsmäklare
type: Concept
in scheme: JobTech Taxonomy - Yrke
definition: Fastighetsmäklare
broader: Fastighetsmäklare
related: N1EH QD7 cck
related: RPTn bxG ExZ
related: Ld6h 4Zt 146
related: tvtJ 5bU NsJ
related: LDYx Uz5 wdz
related: cbV7 AxF ikn
broad match: C3334

Hovrättsråd
type: Concept
in scheme: JobTech Taxonomy - Yrke
definition: Hovrättsråd är domare vid hovrätten som leder och avgör mål och ärenden i den andra instansen. Arbetsuppgifterna innefattar granskning av rättsliga underlag, ledning av förhandlingar, utskrift av domar samt tolkning och tillämpning av lagar och rättspraxis. Hovrättsråd deltar i både brottmål och tvistemål samt överklagade ärenden från lägre domstolar. Rollen innebär samarbete inom rättsliga team och bidrar till rättssäkerhet och rättsutveckling i hovrätten. Källa: Sveriges Domstolar
broader: Domare
related: X82t awd Qyc
related: x4Wi NWW ogB
broad match: C2612
broad match: C1112

Bostadsförvaltare
type: Concept
in scheme: JobTech Taxonomy - Yrke
definition: Bostadsförvaltare
broader: Fastighetsförvaltare
related: 6Hq3 tKo V57
related: xEgu A21 KMD
related: y9b1 e9s 8EK
related: WDoL Rzs 4G1
related: sLfN mQP DUZ
related: yhCP AqT tns
related: in8X EJR 9uc
related: LuGo fGo Fng
related: 7NJF ZSE CsL
broad match: C3334

Kyltekniker
type: Concept
in scheme: JobTech Taxonomy - Yrke
definition: Som kyltekniker arbetar du med felsökning, installation, service och driftsättning av kylanläggningar, i bl a fastigheter, butiker och industrier. Kylteknik används framförallt i livsmedelsbutiker, men också i luftkonditioneringssystem, i industriprocesser som behöver kylas, inom medicinteknik och vid isbanor. Yrket innehåller både teoretiska och praktiska moment. Källa: Arbetsförmedlingen
broader: Kyl- och värmepumpstekniker m.fl.
related: z7wN JwX f6b
related: yhCP AqT tns
related: rJNP XGH Zim
related: ja7J P8X YC9
related: qLXL jCo 5Fp
broad match: C7127

Projektledare, el
type: Concept
in scheme: JobTech Taxonomy - Yrke
definition: Projektledaren har det övergripande ansvaret för olika projekt och ansvarar för ekonomin, ser till att tidsplaneringen följs, tar fram riskanalyser och planer för kvalitéts- och miljöarbetet. Projektledarens arbete omfattar analys, planering, kvalitetskontroll, uppföljning, kundkontakt och samarbete. Källa: Installatörsföretagen, EBR
broader: Ingenjörer och tekniker inom elektroteknik
related: 9pbt eaS jHg
related: M7XP 689 jCN
related: L7yy iVC yBb
related: SvAW coW dGN
related: yhCP AqT tns
related: NRTA dvQ 5WR
related: yXSE wvx EAN
related: 1szM XTb bfz
related: VQCg pwK 9xg
related: i1YK gWh CCi
related: taLT d6L Gz5
related: iQwY h1V 7Db
related: kNgz tQe 5FB
broad match: C3113

Miljö- och klimatstrateg
type: Concept
in scheme: JobTech Taxonomy - Yrke
definition: Miljö- och klimatstrateg
alternative label: Klimatstrateg
alternative label: Miljöstrateg
broader: Planerare och utredare m.fl.
related: L4Yc ZZe R91
related: BJdo 3MN vgv
related: X82t awd Qyc
related: TZe9 NsN uce
related: 1qxB 9q9 4LM
related: DQ4M 3Vn zyF
related: A48z rec sU9
broad match: C2422

Sjukhuskemist
type: Concept
in scheme: JobTech Taxonomy - Yrke
definition: Sjukhuskemist
broader: Kemister
related: kJeN wmw 9wX
related: Yr11 UKD on1
broad match: C2113

Hållbarhetsutvecklare
type: Concept
in scheme: JobTech Taxonomy - Yrke
definition: Hållbarhetsutvecklare
broader: Planerare och utredare m.fl.
related: wY8T xoc VKR
related: ytoD e7v 4yf
related: X82t awd Qyc
related: SM3T wHP 7Q9
related: am3X Jb9 DtD
related: KSjR uua kqd
related: A1t5 qmi 1HU
related: wVoH ryC J7b
related: 4jG8 Xcd nWG
related: TZe9 NsN uce
related: mMGs MJP Gqn
related: g9TF p7F SGs
related: yGy9 qrz R5q
broad match: C2422

Trähusindustriarbetare
type: Concept
in scheme: JobTech Taxonomy - Yrke
definition: Trähusindustriarbetare arbetar med att tillverka byggelement av trä till husbyggen. Arbetet sker oftast i fabrik där byggelement sedan fraktas till byggplatser för montering. Trähusproduktion innebär kunskaper i bland annat ritningsläsning, underhåll, mätteknik, materiallära och maskin- samt produktionsutrustning. Källa: Trä- och möbelföretagen
broader: Maskinsnickare och maskinoperatörer, träindustri
related: d6d8 sMv 4MG
related: g5LC kdV VJF
related: ot66 P4J ua7
related: cwax WQx uzr
related: QNCA 9cz JLR
related: wTEr CBC bqh
related: bQQk 6w7 my2
broad match: C7523

Character artist
type: Concept
in scheme: JobTech Taxonomy - Yrke
definition: Character artist skapar och utvecklar digitala karaktärer för spel och andra interaktiva medier. Vanliga arbetsuppgifter är att omvandla konceptbilder till detaljerade 3D-modeller, skulptera karaktärsdetaljer, applicerar realistiska eller stiliserade texturer och säkerställa att karaktärer stämmer överens med spelets visuella stil och tekniska krav. Källa: Arbetsförmedlingen, Yrgo
broader: Designer inom spel och digitala medier
related: oeHg J1V PEg
related: apaJ 2ja LuF
related: 8too bEs 7NU
related: 9puE nYg crq
broad match: C2166

Eventpersonal
type: Concept
in scheme: JobTech Taxonomy - Yrke
definition: Eventpersonal arbetar med att stödja och genomföra olika typer av evenemang, såsom konferenser, mässor, konserter, sportevenemang, produktlanseringar och privata tillställningar. Rollen är central för att säkerställa att evenemanget löper smidigt och att deltagarna får en positiv upplevelse. Eventpersonalens uppgift att se till att alla gäster och besökare får en upplevelse som är lika positiv som den de förväntar sig. Källa: Arbetsförmedlingen
broader: Hotellreceptionister m.fl.
related: wWEp zYu pJo
related: pdDP goh M92
related: hFDX e9z ovJ
related: DjpC e5r HT6
related: dNmP L3z tFg
related: 4vT9 Ymm wiV
related: x8hg qj2 CUi
related: w2je cUX vUZ
related: 9Z6Q k8k 7oU
related: ScKy FHB 7wT
related: JDLQ 8eN taf
related: 4GpY HpK oPs
related: TQD2 XBm ZYv
broad match: C4224

Yrken med krav på fördjupad högskolekompetens inom hälso- och sjukvård
type: Concept
in scheme: JobTech Taxonomy - Yrke
definition: Yrken med krav på fördjupad högskolekompetens inom hälso- och sjukvård
broader: Yrken med krav på fördjupad högskolekompetens
narrower: Veterinärer
narrower: Sjuksköterskor (fortsättning)
narrower: Sjuksköterskor
narrower: Tandläkare
narrower: Läkare
narrower: Andra specialister inom hälso- och sjukvård
narrower: Naprapater, sjukgymnaster och arbetsterapeuter m.fl.
narrower: Psykologer och psykoterapeuter

Röntgensjuksköterskor
type: Concept
in scheme: JobTech Taxonomy - Yrke
definition: Utför röntgenundersökningar eller andra radiologiska undersökningar inför diagnostik och behandling. Ställer i ordning och kontrollerar medicinteknisk apparatur och utrustning.
broader: Sjuksköterskor (fortsättning)
related: aBHv 9Df NWV
related: 4QAE wtY gJh
related: c9Hk Y2Q ic4
related: C1qR L83 nzh
related: 9Fna GUm HWL
related: Mmxs Qrv cpG
related: N7Xw LmJ TYe
related: C3211
related: CFGL C5S eLA
related: 2aNh 7y1 aL8
related: 3V84 7u9 kSN
related: a1Sf mey gVk
related: QnaD AmN 3da
related: Lqnz Zqw nQ9
related: eThQ HCv mY6
related: F7nJ k5s L29
related: Wv7A env 1X7
related: LMx4 LbA vxB
related: wBPu wTW RgG
related: aS2X 4ZL 9h7
related: 2GuF gtz xfW
related: rF7s hX1 ECH
related: rVUL AgV ZTH
related: WGwu 82g A8B
related: 5Kym 2ad Pqi
related: pGBH BkG qJa
related: yV9B PxJ TxS
narrower: Röntgensjuksköterska
broad match: NYW6 mP6 vwf

Chefer inom förskoleverksamhet
type: Concept
in scheme: JobTech Taxonomy - Yrke
definition: Formulerar och ansvarar för mål och strategier för verksamhet inom förskolan eller annan omsorg för barn. Planerar och ansvarar för pedagogisk verksamhet. Utformar riktlinjer, följer upp och utvärderar verksamheten mot uppsatta mål. Ser till att myndighetsregler efterlevs. Svarar för budget samt fördelar resurserna inom verksamheten. Har personalansvar.
broader: Chefer inom förskoleverksamhet
related: yyJQ gFx TKr
related: UH9g R5v MCx
related: SmZd Jaa BeY
related: 8tYq EXD Xwm
related: ZzN5 m7B 5CY
related: detQ YNb 9nG
related: SFG4 nMN cXH
related: Nksx 4oe fEQ
related: C1341
related: eThQ HCv mY6
related: 6Suw 3c1 47a
related: 5PjX 999 uLZ
related: Wkga 1FL tK7
related: Gt5f wdi FSJ
related: D6ev Zwt x83
related: zXNU zXR hGd
narrower: Biträdande förskolerektor
narrower: Områdeschef, barnomsorg
narrower: Förskolerektor
broad match: bh3H Y3h 5eD

Driftchefer inom bygg, anläggning och gruva
type: Concept
in scheme: JobTech Taxonomy - Yrke
definition: Driftchefer inom bygg, anläggning och gruva
broader: Chefer inom IT, logistik, FoU, fastighetsbolag, bygg- och ingenjörsverksamhet samt tillverkning m.m.
narrower: Driftchefer inom bygg, anläggning och gruva

Hårdlödare
type: Concept
in scheme: JobTech Taxonomy - Yrke
definition: Hårdlödare fogar samman metaller med hjälp av smält metall eller legering vid höga temperaturer. Arbetsuppgifterna omfattar förberedelse av arbetsstycken och lödmaterial, uppvärmning av metaller, applicering av lödsmältan samt kontroll av färdiga fogar. Hårdlödare arbetar huvudsakligen inom verkstadsmiljö med tillverkning, montering och ibland reparation av metallprodukter. Arbetsmomenten kan även inkludera specialiserad lödning av rör, komponenter och olika metalldelar, särskilt inom industri och tillverkningsprocesser. Källa: Arbetsförmedlingen
broader: Svetsare och gasskärare
related: UHQf 1Gz aRp
related: 3eb4 Lu3 2DT
related: wTEr CBC bqh
broad match: C7212

Kafé- och konditoribiträden
type: Concept
in scheme: JobTech Taxonomy - Yrke
definition: Säljer och serverar kaffebröd, kaffe och andra drycker samt bereder, säljer och serverar smörgåsar, sallader och andra smårätter på ett kafé eller i konditori. Tar betalt och ansvarar för kassa. Hit hör inte Barista/Kaffebartender (5132)
broader: Snabbmatspersonal, köks- och restaurangbiträden m.fl.
related: ib92 FER 3Dd
related: C5246
related: Dywf BPg usG
related: qHYG sNy yeJ
related: TPX3 gmd fau
related: f2Nt 4bK HNX
related: 5fAq Squ o7p
related: hYpk RYx y3V
related: zjQb VwQ eaC
related: pT39 hq7 jAW
narrower: Kafébiträde/Konditoribiträde
broad match: ScKy FHB 7wT

Platschef reseföretag
type: Concept
in scheme: JobTech Taxonomy - Yrke
definition: Platschef i reseföretag leder personal och samordnar verksamhet på resmål. Arbetsuppgifter omfattar planering av bemanning, kontakt med lokala leverantörer, hantering av gästers problem, krisberedskap och kvalitetssäkring av reseupplevelser. Källa: Arbetsförmedlingen
broader: Guider och reseledare
related: RPTn bxG ExZ
related: epLc SkD cbT
related: NuAy JMj 8as
broad match: C5113

Sångpedagog
type: Concept
in scheme: JobTech Taxonomy - Yrke
definition: Sångpedagog
broader: Övriga pedagoger med teoretisk specialistkompetens
related: pVzY rff Amk
related: MVqp eS8 kDZ
related: 8d5u nKJ k1b
related: ubb6 RZ6 3iA
related: wJjT Hbo aDd
related: e4eQ kzD BCA
broad match: C2359

Relationsmarknadsförare
type: Concept
in scheme: JobTech Taxonomy - Yrke
definition: Relationsmarknadsförare
broader: Marknadsanalytiker och marknadsförare m.fl.
related: RPTn bxG ExZ
related: 4XyY MCb svG
related: uJpV gYe jmd
broad match: C2431

Resehandläggare
type: Concept
in scheme: JobTech Taxonomy - Yrke
definition: Resehandläggare planerar, bokar och administrerar resor, möten och konferenser inom offentlig sektor. Arbetsuppgifterna omfattar bokning av både inrikes- och utrikestransporter, hotell samt grupp- och konferensresor via digitala bokningssystem. Resehandläggare hanterar löpande kontakt med resenärer och leverantörer, upprättar och uppdaterar riktlinjer, fakturerar och administrerar reseräkningar samt ger rådgivning kring rese- och konferenspolicy. Rollen inkluderar även utveckling av interna rutiner, utbildning av kollegor och stöd till andra administrativa enheter. Arbetet utförs både självständigt och i team, med inslag av beredskapstid. Resehandläggare kan även arbeta med att boka sjukresor inom vården. Se även yrket resesäljare, där arbetsuppgifterna till stor del liknar de för resehandläggare. Källa: Arbetsförmedlingen
broader: Resesäljare och trafikassistenter m.fl.
related: RPTn bxG ExZ
related: ASGV zcE bWf
broad match: C4221

Resebyråchef
type: Concept
in scheme: JobTech Taxonomy - Yrke
definition: Resebyråchef
broader: Övriga chefer inom övrig servicenäring
related: epLc SkD cbT
related: bh3H Y3h 5eD
related: QTyf wgJ nDG
broad match: C1439

HR business partner/HR BP
type: Concept
in scheme: JobTech Taxonomy - Yrke
definition: HR business partner/HR BP
broader: Personal- och HR-specialister
related: X82t awd Qyc
related: Bpv2 s7m zMC
related: pyNJ Xcf xzg
related: TeAU Uwd cNo
related: weFB om6 s4t
related: oKQF FTp q8Q
broad match: C2423

Kostymmästare
type: Concept
in scheme: JobTech Taxonomy - Yrke
definition: Kostymmästare ansvarar för tillverkning, underhåll och skötsel av alla kostymer inom en teater-, film- eller tv-produktion samt leder kostymgruppen. Vanliga arbetsuppgifter är planera och anpassa kostymer, organisera kostymhantering under inspelningar och samarbeta med regissör, kostymdesigner och andra i produktionsgruppen. Källa: Arbetsförmedlingen, Yrkesnämnden för Film och TV
broader: Skräddare och ateljésömmerskor m.fl.
related: u7zK VKN 8Ht
related: 8too bEs 7NU
related: 9puE nYg crq
broad match: C7531

Psykologer och psykoterapeuter
type: Concept
in scheme: JobTech Taxonomy - Yrke
definition: Psykologer och psykoterapeuter
broader: Yrken med krav på fördjupad högskolekompetens inom hälso- och sjukvård
narrower: Psykoterapeuter
narrower: Psykologer

Försäkringshandläggare, försäkringskassa
type: Concept
in scheme: JobTech Taxonomy - Yrke
definition: Försäkringshandläggare på Försäkringskassan hjälper människor att ta del av socialförsäkringen utifrån sina behov. Arbetet innebär i huvudsak att utreda och handlägga ärenden om stöd från socialförsäkringen med stöd i lagar och regelverk. Man kan arbeta med olika delar av socialförsäkringen, till exempel föräldraförsäkringen eller bostadsbidrag. Man beräknar och fattar beslut om ersättning, dokumenterar och vid behov kommunicerar med sökande och försäkrade. Källa: Försäkringskassan, Arbetsförmedlingen
broader: Socialförsäkringshandläggare
related: X82t awd Qyc
related: rpDg ka4 P5w
related: 3Paz Gqc khp
broad match: C3353

Specialistläkare, neurologi
type: Concept
in scheme: JobTech Taxonomy - Yrke
definition: Specialistläkare, neurologi är en specialiserad legitimerad läkare med en djupare kunskap och kompetens inom sitt område. Specialistläkare är en skyddad titel och bara den som har bevis om specialistkompetens får kalla sig specialist i sin specialitet. Specialistläkare ansvarar för att diagnostisera, behandla och förebygga sjukdomar inom sin specialitet. Vanliga arbetsuppgifter är mottagningsarbete med patientbesök, rondarbete på avdelning, handledning av yngre läkare samt konsultationer till andra yrkesgrupper och specialiteter. Specialistläkare ansvarar även för att följa och leda utvecklingen inom sitt medicinska område och utför omfattande medicinsk dokumentation och administration. Källa: Arbetsförmedlingen, Karolinska Institutet, Socialstyrelsen, Sveriges Kommuner och Regioner, Sveriges läkarförbund
broader: Specialistläkare
related: NYW6 mP6 vwf
related: qSbw XHD Ycd
related: TChC u37 rt2
related: qZCz gsE daj
related: EBX9 7gC eLt
related: vFjb AHi a54
related: jFHU uSj 4ke
related: KALC VvK 17U
related: 7y5M uEP QrH
related: CwEt AMW 4B3
related: RNb7 PxK 75J
related: QSeQ MpU wpW
related: 89LR AwA UqR
broad match: C2212

Studiotekniker
type: Concept
in scheme: JobTech Taxonomy - Yrke
definition: Studiotekniker hanterar och underhåller teknisk utrustning som ljud-, ljus- och bildsystem i musik-, TV- och inspelningsstudior. Vanliga arbetsuppgifter inkluderar att rigga, kalibrera och justera utrustning såsom mikrofoner, kameror, mixerbord och ljudsystem. Studioteknikern ansvarar för teknisk support under inspelningar och sändningar. Källa: Arbetsförmedlingen, StagePool
broader: Bild- och sändningstekniker
related: fdLj 3H5 rRn
related: 8too bEs 7NU
related: 9puE nYg crq
related: d1Ao 9bY 7Kn
broad match: C3521

Marknadskonsult
type: Concept
in scheme: JobTech Taxonomy - Yrke
definition: Marknadskonsult
broader: Marknadsanalytiker och marknadsförare m.fl.
related: RPTn bxG ExZ
related: Yb1w sSy Rh9
related: ZWFK X3h xc4
related: 4XyY MCb svG
related: Axmh JPX s7N
broad match: C2431

Musikhandledare
type: Concept
in scheme: JobTech Taxonomy - Yrke
definition: Musikhandledare
broader: Övriga utbildare och instruktörer
related: MVqp eS8 kDZ
broad match: C2354

Finansanalytiker
type: Concept
in scheme: JobTech Taxonomy - Yrke
definition: Finansanalytiker
broader: Finansanalytiker och investeringsrådgivare m.fl.
related: ALgw JY5 e2V
related: E5L2 v3t kc6
related: RbsF qLv jeg
related: JqZ9 eRB Pf6
related: X82t awd Qyc
related: zZfA T8K ydx
related: SFqN YKh hyd
related: vw7i 55Q xxT
related: eK34 cVp SNx
related: ynyT QmU TeE
related: ZaZW WnV F9v
related: rXmy a3m RPC
related: 5dFw NPa Swz
related: 546E L48 kXF
related: 2A1v zrZ 9U3
broad match: C2413

Civilingenjör, produktion, elektronik
type: Concept
in scheme: JobTech Taxonomy - Yrke
definition: Civilingenjör, produktion, elektronik
broader: Civilingenjörsyrken inom elektroteknik
related: 6Hq3 tKo V57
related: kDRm Yaa jAB
broad match: C2152

Platschef, försäkringskassa/Områdeschef, försäkringskassa
type: Concept
in scheme: JobTech Taxonomy - Yrke
definition: Platschef, försäkringskassa/Områdeschef, försäkringskassa
alternative label: Områdeschef, försäkringskassa
alternative label: Platschef, försäkringskassa
broader: Övriga chefer inom samhällsservice
related: epLc SkD cbT
related: bh3H Y3h 5eD
broad match: C1213
broad match: C1349

Grundläggningsmaskinförare
type: Concept
in scheme: JobTech Taxonomy - Yrke
definition: En Grundläggningsmaskinförare kan framföra olika maskintyper t ex pålmaskin, spontmaskin, borrmaskin eller stabiliseringsmaskin vid grundläggningsarbeten på en byggarbetsplats. Pålning är ett klassiskt tillvägagångssätt för att utföra grundläggning av till exempel känsliga byggnader, vid svåra jordförhållanden eller tunga laster. Grundläggningsmaskinföraren kan ansöka om sitt yrkesbevis efter teoretisk grundutbildning och lärlingsanställning. Källa: Arbetsförmedlingen
broader: Anläggningsmaskinförare m.fl.
related: GkoR bEV 1Ww
related: utMs mwa ZgJ
related: yFzY uoS M3p
related: z6aC 5Vw Nvx
related: 4HN8 stD pKA
related: j7Cq ZJe GkT
related: wMva ByU SbC
related: ZjjX RXa cV4
related: ja7J P8X YC9
related: Mxyf t2J iLA
broad match: C8342

Skogsarbetare
type: Concept
in scheme: JobTech Taxonomy - Yrke
definition: Skogsarbetare
broader: Skogsarbetare, fiskodlare och fiskare
narrower: Skogsarbetare

Strukturkemist
type: Concept
in scheme: JobTech Taxonomy - Yrke
definition: Strukturkemist
broader: Kemister
related: kJeN wmw 9wX
related: Yr11 UKD on1
broad match: C2113

Belysningstekniker: scen, film, TV
type: Concept
in scheme: JobTech Taxonomy - Yrke
definition: Belysningstekniker: scen, film, TV
alternative label: Belysningstekniker, TV
alternative label: Belysningstekniker, film
alternative label: Belysningstekniker, scen
broader: Ljus-, ljud- och scentekniker
related: 8too bEs 7NU
related: 9puE nYg crq
related: yhCP AqT tns
related: d1Ao 9bY 7Kn
related: MfLL hsw ffu
broad match: C3435

Präster
type: Concept
in scheme: JobTech Taxonomy - Yrke
definition: Leder och planerar församlingsarbete i Svenska kyrkan eller annat trossamfund utom frikyrkoförsamlingar. Leder gudstjänst eller mässa samt predikar och förrättar altartjänst. Förrättar dop, vigslar och begravningar. Uttolkar heliga skrifter samt ansvarar för kyrkans lära och undervisar i trosfrågor. Mottar bikt och utövar själavård.
broader: Präster och diakoner
related: 2qrj cV2 z8H
related: kb9z LG1 CZE
related: Phd3 dMW BLu
related: SkzU qDQ Lho
related: C2636
related: rbka PL5 MRM
related: Vs9D tov UN5
related: Qcej yyR HG3
related: sGky Wqy QvZ
narrower: Präst, annat trossamfund
narrower: Rabbin
narrower: Kontraktsadjunkt
narrower: Församlingspräst med specialuppgifter
narrower: Präst, romersk-katolsk kyrka
narrower: Komminister
narrower: Sjukhuspräst
narrower: Imam
narrower: Buddhistpräst
narrower: Präst, grekisk-ortodox kyrka
narrower: Stiftsadjunkt
narrower: Pastorsadjunkt
broad match: GazW 2TU kJw

Social media manager/Social media specialist
type: Concept
in scheme: JobTech Taxonomy - Yrke
definition: Social media manager/Social media specialist
alternative label: Social media manager
alternative label: Social media specialist
broader: Informatörer, kommunikatörer och PR-specialister
related: 9oEQ JDp v8w
related: DJDx Hka J1X
related: 6Gyg NGV y4f
related: RPTn bxG ExZ
related: X82t awd Qyc
related: KTQz jBN B8P
related: vwxR MbC XjW
related: iEoT 8KC ZJ6
broad match: C2432

Bokförläggare
type: Concept
in scheme: JobTech Taxonomy - Yrke
definition: Bokförläggare ansvarar för att planera och leda bokförlagets utgivning av böcker, med fokus på att välja ut manus och utveckla nya titlar. Vanliga arbetsuppgifter att hitta och bedöma manus, förhandla och teckna avtal med författare, driva manusutveckling, följa upp budget, samordna produktion, arbeta med marknadsföring och försäljning och knyta kontakter med författare och andra parter. Källa: Arbetsförmedlingen, DIK (Facket för kultur och språk), Svenska Förläggareföreningen
broader: Verkställande direktörer m.fl.
related: bh3H Y3h 5eD
related: 8too bEs 7NU
related: 9puE nYg crq
related: jtoT 4g9 4Ty
broad match: C1120

Serviceingenjör, maskin
type: Concept
in scheme: JobTech Taxonomy - Yrke
definition: Serviceingenjör, maskin
broader: Ingenjörer och tekniker inom maskinteknik
related: 6Hq3 tKo V57
related: 9aEn jPz gJs
related: PgY8 ZYt ydC
broad match: C3115

Sjöfarts- och hamnskyddskontrollant
type: Concept
in scheme: JobTech Taxonomy - Yrke
definition: Sjöfarts- och hamnskyddskontrollanter övervakar hamnanläggningar. I arbetsuppgifterna ingår att utföra kontroller på personer, bagage och last i syfte att förebygga och förhindra terroristbrott mot hamnanläggningar och fartyg. Arbetet sker under ledning av polisen. Förordnande som sjöfarts- och hamnsskyddskontrollant utfärdas av Polisen efter genomgången utbildning. Fortbildning ska genomföras vart tredje år för att förordnandet ska kunna förnyas. Källa: Bevakningsbranschens yrkes- och arbetsmiljönämnd, Polisen
alternative label: Hamnskyddskontrollant
alternative label: Sjöfartskontrollant
broader: Övrig bevaknings- och säkerhetspersonal
related: E7hm BLq fqZ
broad match: C5419

Konfektionssömmerska
type: Concept
in scheme: JobTech Taxonomy - Yrke
definition: Konfektionssömmerskor sköter maskiner för tillverkning av kläder och accessoarer. Arbetet innebär att använda industrisymaskiner för sammanfogning, montering, förstärkning, lagning och modifiering. Beroende på arbetsplats och typ av produkt kan man använda mer automatiserade processer i tillverkningen. Yrket liknar industrisömmerska, där skillnaden är att konfektionssömmerskor är mer inriktade på att sy kläder och accessoarer. Källa: Arbetsförmedlingen.
broader: Övriga maskinoperatörer, textil-, skinn- och läderindustri
related: HEuS FqK mF9
related: wTEr CBC bqh
broad match: C8153

Omsorgsyrken
type: Concept
in scheme: JobTech Taxonomy - Yrke
definition: Omsorgsyrken
broader: Service-, omsorgs- och försäljningsyrken
narrower: Tandsköterskor
narrower: Barnskötare och elevassistenter m.fl.
narrower: Vårdbiträden
narrower: Undersköterskor
narrower: Skötare, vårdare och personliga assistenter m.fl.

Metallurg
type: Concept
in scheme: JobTech Taxonomy - Yrke
definition: Metallurg
broader: Civilingenjörsyrken inom gruvteknik och metallurgi
related: 6Hq3 tKo V57
related: AZPQ Dz2 LGF
related: pMmQ 7av x51
broad match: C2146

Skomakare
type: Concept
in scheme: JobTech Taxonomy - Yrke
definition: Skomakare arbetar med tillverkning, reparation, lagning och sulning av skor. Yrket delas in i tre huvudinriktningar: beställningsskomakeri, reparationsskomakeri och ortopedskomakeri. Se separat yrkesbenämning Ortopedskomakare/Ortopedskotekniker. Beställningsskomakare tillverkar skor på beställning – tar mått på kundens fot, anpassar lästen, skapar modell och utför tillverkningen. Reparationsskomakare fokuserar på att klacka, repara och underhålla skor. Arbetsplatsen är ofta en egen verkstad. Beroende på arbetsplats kan andra arbetsuppgifter även ingå, så som sömnad, kundmottagning och försäljning av skor samt relaterade produkter. Källa: Hantverksakademin, Arbetsförmedlingen
broader: Läderhantverkare och skomakare
related: 1At8 WZm NUy
related: PaxQ o1G wWH
related: wQ5H GdY VMf
broad match: C7536

Fogarbetare, hus och anläggning
type: Concept
in scheme: JobTech Taxonomy - Yrke
definition: En fogarbetare utför fogningsarbeten på byggnader och anläggningar mellan olika byggmaterial för att säkerställa täthet och hållbarhet i konstruktioner. Arbetet utförs för att säkra att t ex fukt, temperatur och ljud inte vandrar vidare i byggnader. Brandskyddstätning är också ett arbete som utförs av fogarbetare. Fogarbeten utförs både invändigt och utvändigt. Källa: Arbetsförmedlingen
broader: Övriga byggnads- och anläggningsarbetare
related: j7Cq ZJe GkT
related: ja7J P8X YC9
broad match: C7119

Saneringsarbetare
type: Concept
in scheme: JobTech Taxonomy - Yrke
definition: Saneringsarbetare rengör och återställa miljöer som har utsatts för olika typer av föroreningar eller skador. Arbetsuppgifterna varierar beroende på specialisering och kan inkludera bland annat mögelsanering, klottersanering och industrisanering. Det är särskilt vanligt att arbeta med skadesanering efter bränder och vattenskador i byggnader. Det är inte ovanligt att arbete sker i hälsofarliga miljöer, varför skyddsutrustning och kunskaper i hantering av specialiserad utrustning är viktigt. Arbetet sker oftast ute hos kund, varför körkort kan vara ett krav. Källa: Arbetsförmedlingen
broader: Saneringsarbetare m.fl.
related: qZQj Qmu 1FC
related: wnhc znP T39
related: whao Q6A ScE
related: KSv1 qhH VYL
related: TiFv Vud YPr
related: NQ1h uUb s34
related: 9hGT V6G TiK
related: 8obu HvU DbR
related: DmJB bS6 7kN
related: HECr cRb wYu
related: u1cP 1NS Cwt
related: PZQe bHN G5L
related: 77Kt k7f Td1
related: Ynsk AJz WTC
broad match: C7133

Miljöinspektör
type: Concept
in scheme: JobTech Taxonomy - Yrke
definition: Miljöinspektör
broader: Specialister inom miljöskydd och miljöteknik
related: G6pB BdL 1Ns
related: kJeN wmw 9wX
related: Tsbx soC tmt
related: B4rq gwC 6TV
related: 4ff1 4gB Dew
related: Frzw FpL hHT
broad match: C2133

Belysningsmästare
type: Concept
in scheme: JobTech Taxonomy - Yrke
definition: Belysningsmästare planerar, riggar och styr all belysningsutrustning vid inspelningar, evenemang, teaterföreställningar och konserter. Vanliga arbetsuppgifter är att utforma belysningskoncept, välja och placera ljuskällor, programmera och styra ljusbord, samt övervaka och justera ljus under produktionens gång. Belysningsmästaren ansvarar för felsökning, underhåll och logistik kring belysningsutrustning samt schemaläggning och arbetsledning inom ljusteamet. Källa: Arbetsförmedlingen, Myndigheten för yrkeshögskolan, Yrkesnämnden för Film och TV
broader: Ljus-, ljud- och scentekniker
related: 8too bEs 7NU
related: 9puE nYg crq
related: d1Ao 9bY 7Kn
broad match: C3435

Forskarassistent
type: Concept
in scheme: JobTech Taxonomy - Yrke
definition: Forskarassistent
broader: Forskarassistenter m.fl.
related: u3Kv nGD o53
related: YBMk rmD BpR
related: MVqp eS8 kDZ
broad match: C2310

Medicinska sekreterare, vårdadministratörer m.fl.
type: Concept
in scheme: JobTech Taxonomy - Yrke
definition: Skriver och hanterar patientjournaler utifrån information från läkare eller annan vårdgivare. Sköter administration, remisshantering och tar emot patienter.
broader: Kontorsassistenter och sekreterare
related: 7H4j dRM Vbo
related: 515e Tvy Zgj
related: bwjW 1SE XWZ
related: pNBv 3pt JWH
related: C8Vw RWy GLt
related: Xw3d 9qU TAj
related: HEia YGh KRv
related: C3344
related: cPrZ ijm eEe
related: kLJc JV7 39P
related: GYz6 5Jt Wmy
related: Em9g vpP fDo
related: rtCg THP 6Lj
related: Cp5v HYB nsp
related: zcpC rmm yBC
narrower: Vårdkoordinator
narrower: Medicinsk sekreterare
broad match: X82t awd Qyc

Frisöraspirant
type: Concept
in scheme: JobTech Taxonomy - Yrke
definition: Frisöraspiranter avser person som genomgått grundutbildning till frisör och arbetar under handledning. Efter grundutbildning kan man göra Frisörföretagarnas delprov, som är en del av gesällprovet. Efter följer färdigutbildning som frisöraspirant på ett frisörföretag i 2000 timmar innan man kan göra det slutliga gesällprovet och bli behörig frisör. Källa: Frisörföretagarna, Arbetsförmedlingen
broader: Frisörer
related: Bt76 s5N D4t
related: Uuf1 GMh Uvw
related: kxUL f3p yX2
related: 8ot5 yun g7p
broad match: C5141

Matros, inre fart
type: Concept
in scheme: JobTech Taxonomy - Yrke
definition: En matros i skärgårdstrafiken (inre fart) har ett omväxlande arbete, som skiftar beroende på vilken typ av fartyg man tjänstgör på. Matrosen möter passagerarna när de stiger ombord och blir på så sätt rederiets ansikte utåt. Matrosen har särskilda uppgifter vid avgång och tillägg. En matros har ofta ansvar även för maskinerna ombord. Matrosens huvuduppgift är också vakttjänstgöring på bryggan, vilket bl.a. innefattar utkik och övning i att manövrera fartyget. Källa: Skärgårdsredarna
broader: Matroser och jungmän m.fl.
related: dRFw Rcu dX7
related: gs65 ynn fcr
related: ASGV zcE bWf
related: XouD cCj HZN
related: QQJR 11D LXL
broad match: C8350

Bild-, ljud- och ljustekniker m.fl.
type: Concept
in scheme: JobTech Taxonomy - Yrke
definition: Bild-, ljud- och ljustekniker m.fl.
broader: Yrken med krav på högskolekompetens eller motsvarande inom IT, ljud- och ljusteknik m.m.
narrower: Ljus-, ljud- och scentekniker
narrower: Bild- och sändningstekniker

Industristädare
type: Concept
in scheme: JobTech Taxonomy - Yrke
definition: Industristädare städar och rengör industriella anläggningar Industristädare arbetar med renhållning på anläggningar inom olika industrier. Industristädning bidrar till att produktiviteten och effektiviteten vid en anläggning behålls eller förbättras. Arbetsuppgifter som ingår kan vara hantering av överblivet material, vilket kan inkludera farligt avfall. Rengöring av produktionsmaskiner från olja, smuts och damm kan även ingå. Beroende på arbetsplats kan det finnas höga krav på hygien och renlighet, till exempel vid anläggningar som hanterar livsmedel. Källa: Arbetsförmedlingen
broader: Städare
related: aRoR gHX VvX
related: whao Q6A ScE
related: VuMj Sv3 RhZ
related: UdVa jRr 9DE
related: aVbe MQQ ocC
related: aC3t U7Z V5i
related: 4j4y LCf 3Y2
related: MCA4 jeg CM4
broad match: C9112

Skulptör
type: Concept
in scheme: JobTech Taxonomy - Yrke
definition: Skulptör skapar tredimensionella konstverk genom att forma material som sten, lera, metall och trä. Vanliga arbetsuppgifter är att utforma och modellera konstverk och skulpturer, ofta utifrån ett konstnärligt koncept eller beställning, och kan omfatta allt från mindre figurer till stora offentliga utsmyckningar. Många skulptörer är egenföretagare och ansvarar också för administration, kundkontakt och försäljning. Källa: Arbetsförmedlingen
broader: Bildkonstnärer m.fl.
related: ZaCg vWz ms4
related: 8too bEs 7NU
related: 9puE nYg crq
broad match: C2651

Förvaltningsekonom
type: Concept
in scheme: JobTech Taxonomy - Yrke
definition: Förvaltningsekonom
broader: Övriga ekonomer
related: BW5c Zin CaX
related: X82t awd Qyc
related: 2swr 9AD 5b3
related: dTJP Ne2 Rzw
related: eBQs p5w Jkj
related: HzFa 2Tt F8d
related: X2wn gHp J4L
related: vfBj FHE FQm
related: tAM2 4Hf CYR
broad match: C2411

Besiktningsingenjör, försäkring
type: Concept
in scheme: JobTech Taxonomy - Yrke
definition: Besiktningsingenjör, försäkring
broader: Skadereglerare och värderare
related: X82t awd Qyc
broad match: C3315

Forensiker, kemist
type: Concept
in scheme: JobTech Taxonomy - Yrke
definition: Forensiker, kemist
broader: Kemister
related: kJeN wmw 9wX
related: Yr11 UKD on1
broad match: C2113

Lärare i yrkesämnen
type: Concept
in scheme: JobTech Taxonomy - Yrke
definition: Undervisar på gymnasial och eftergymnasial nivå i yrkesämnen. Planerar, genomför och utvärderar undervisningen i enlighet med läro- och ämnesplaner. Utför bedömning och betygsättning.
broader: Lärare i yrkesämnen
related: 7Y6d qDZ Eyt
related: eU6Y ve7 nBC
related: tFQp CMY XaS
related: E4xx DDx g75
related: umCR Xa1 HKq
related: GYSn 9yz QAb
related: zgbR pMp zMB
related: Tp1G 2jt rN4
related: ZfnY Lf3 uuq
related: DkM7 iyf 1jy
related: QuZ4 Sg4 aK5
related: SpRR JX9 6o6
related: yKnk W7X Zvk
related: 9AMe wHs BU7
related: jLoM Cde Xzu
related: CXiG sHf heV
related: zJZd pDs SDf
related: MVLu Hyu icX
related: V5EN xw2 itk
related: 4Jam Qwj AEo
related: bsdC aAW gsF
related: oLnc YZn 3bm
related: ih5r cvT bwu
related: fbmx gPv bDg
related: UiN1 VDs An3
related: KNGr cYU zko
related: cjvf YjZ UkM
related: RgrC PUH 9V5
related: SGWu X5V B9V
related: L7CJ gKn kTb
related: yPqy kCf qVA
related: 7ytF sAd 1He
related: C3Fc BSX rpH
related: epum uTL ZG8
related: zzHa WZz Gre
related: fL9K JBY 9oQ
related: C2320
related: SxfZ k7F cJ2
related: 2RRg yhu 5u7
related: inM7 UGP vz4
related: cS5D iQN PWA
related: Zs9F xfL nk5
related: F1TT MpK WF5
related: bhEa d1Z sEm
related: Sg51 iG1 ny2
related: bhjq z6a zpP
related: jLjH 9tQ wxn
related: sgN7 MCQ j5M
related: 5xsd oFo RXw
related: BcSr 7ZY 5nn
related: eAtP 7Dm HgR
narrower: Skogslärare/Skogsbrukslärare/Skogsbruksinstruktör
narrower: Yrkeslärare
broad match: MVqp eS8 kDZ

Trädgårdsodlare
type: Concept
in scheme: JobTech Taxonomy - Yrke
definition: Bedriver trädgårdsodling. Odlar och skördar köksväxter i växthus samt plantskoleväxter, prydnadsväxter och svamp. Sår, förökar, planterar, gallrar och beskär trädgårdsväxter. Bearbetar jorden, gödslar och rensar ogräs.
broader: Växtodlare inom jordbruk och trädgård
related: AUrv buc hYw
related: Bjhz qeH rQR
related: WStg Eag 4oi
related: F1Mf Yru 39T
related: LyKu BaG Ars
related: oYDh d6r cSu
related: 9Pxd 4ub Kkt
related: GEEJ kt6 Zcb
related: qGzK fjg N6W
related: 2ZCT iLL F2v
related: yNyX Wa5 X2d
related: gnTF vSG 2Eq
related: 6E3h uR9 pxh
related: zauG HQ3 4So
related: YsdN Q9t kTY
related: xi3m 2EA yii
related: ba8g LRR Sj2
related: jqEe ruX oUG
related: tKd2 9Ei PTQ
related: Vig6 18E ZVA
related: KZ6t r3k bMU
related: GvD8 zoZ 3fb
related: ZzN5 m7B 5CY
related: zuXd SyF vPg
related: wtBK LcN D6J
related: xCih Ym5 jwb
related: cSPw e1s iau
related: qs7C 22K 89a
related: evqS BsZ p78
related: r5Si 2g9 Err
related: mRxb SRc xne
related: GNHJ kNN fLn
related: AJB8 zVZ v9j
related: CiMi 7ax tXs
related: YUDN n3n tdz
related: bsCj 9YH Mbq
related: r6JM xDi BDY
related: pXEi DEw QmR
related: 6Rxx zRM Dqc
related: YDfu xv3 S2j
related: Gano TLF 58d
related: C6113
related: muE9 4kR zkx
related: Hnsg Mpz 6KT
related: AAaS o41 sEg
related: FSHx ZUd vNG
related: CQCp gX8 zQJ
related: Dzc3 JXb rxC
related: X51E Edf cfG
related: TFCa CfD LdU
related: J8tW XPs MPp
narrower: Odlingsarbetare trädgård
narrower: Trädgårdsmästare odling
narrower: Arbetsledare trädgårdsodling
broad match: VuuL 7CH adj

Yrken inom byggverksamhet och tillverkning
type: Concept
in scheme: JobTech Taxonomy - Yrke
top concept of: JobTech Taxonomy - Yrke
definition: Yrken inom byggverksamhet och tillverkning
narrower: Byggnads- och anläggningsyrken
narrower: Metallhantverks- och reparatörsyrken
narrower: Hantverksyrken inom trä, textil m.m.
narrower: Installations- och serviceyrken inom el och elektronik
narrower: Finmekaniska, grafiska och konsthantverksyrken
narrower: Livsmedelsförädlare

Lastbils- och bussförare
type: Concept
in scheme: JobTech Taxonomy - Yrke
definition: Lastbils- och bussförare
broader: Transport- och maskinföraryrken
narrower: Buss- och spårvagnsförare
narrower: Lastbilsförare m.fl.

Bergarbetare, bygg och anläggning
type: Concept
in scheme: JobTech Taxonomy - Yrke
definition: En bergarbetare borrar och spränger bort berg, såväl ovan som under jord, för att skapa rätt förutsättningar för byggen genom att spränga bort små bergklackar till att driva tunnlar för väg- och järnväg. Berg är det bästa underlaget för att anlägga hus, broar, tunnlar och andra konstruktioner. Oftast måste delar av berget sprängas eller borras bort för att få rätt höjd till den byggkonstruktion som ska uppföras. Därför är bergarbetaren en av de första på plats. Som bergarbetare har du kunskap om bergets egenart och kan avgöra hur arbetet bäst ska utföras, till exempel vilken mängd laddning som behövs vid sprängningen. För att ansvara för sprängningar krävs dock en vidareutbildning, Sprängkort. Bergarbetaren kan ansöka om sitt yrkesbevis efter teoretisk grundutbildning och lärlingsanställning. Källa: BYN
broader: Gruv- och stenbrottsarbetare
related: PQHZ U9m hiq
related: j7Cq ZJe GkT
related: ja7J P8X YC9
related: Ko11 x9t Lr6
related: mSma YbQ 9VD
broad match: C8111

Produktutvecklare
type: Concept
in scheme: JobTech Taxonomy - Yrke
definition: Produktutvecklare
broader: Övriga civilingenjörsyrken
related: 6Hq3 tKo V57
related: MCKr Gm1 3iX
related: TLmS 5wr 62q
related: cP1H 1Ah B3V
related: Sp7u KmQ pvN
related: QLcQ FY7 L7t
related: bhtf KhB PNd
related: QTti YhZ 4gu
related: hfrP SLK uhT
related: sDga Dby gNw
related: Nv9A VBA N16
related: yiQP sYa n6f
related: z79P ohc BDP
broad match: C2149

Förrådsansvarig
type: Concept
in scheme: JobTech Taxonomy - Yrke
definition: Förrådsansvariga planerar, organiserar och utvecklar arbetet med lagerhållning och materialförsörjning. Arbetsuppgifter kan omfattar att strukturera fysiska och digitala lager, samordna inköp av reservdelar och förbrukningsmaterial. Förrådsansvarigs kanske främsta uppgift är att säkerställa att rätt material finns tillgängligt i rätt tid. I rollen ingår även att utveckla rutiner för lagerflöden, initiera förbättringsprojekt samt koordinera samarbetet mellan förråd, produktion, inköp och andra verksamhetsdelar. Förrådsansvariga leder ofta arbetet i samverkan med tekniker, inköpare eller annan produktionspersonal. I vissa verksamheter ingår även underhåll av verktyg, maskiner och lagerutrustning. Liknande arbetsuppgifter finns även inom yrkena Reservdelsansvarig samt Arbetsledare inom lager och terminl.
alternative label: Förrådschef
broader: Arbetsledare inom lager och terminal
related: epLc SkD cbT
related: ASGV zcE bWf
broad match: C4321

Ingenjörer och tekniker inom industri, logistik och produktionsplanering
type: Concept
in scheme: JobTech Taxonomy - Yrke
definition: Utför operativt produktions-, informations- och materialplanering baserat på skattade volymer, faktiskt åtgång och lagerhållning. Granskar konstruktioner i samråd med konstruktör utifrån funktionella och bearbetningstekniska krav. Tidsätter operationer, kalkylerar arbets-, lager-, transport-, tjänste- och produktionskostnader. Hit hör inte Civilingenjörsyrken inom logistik och produktionsplanering (2141)
broader: Ingenjörer och tekniker
related: uvcb DuX NW8
related: eHy7 eMm 1mG
related: tg8L maz wMN
related: 61zA BvK zDd
related: z1pf B99 fpz
related: VzFf zRa QWe
related: hb3b fH2 bvK
related: oaiv GsB AFK
related: 11rR H3J EQQ
related: ofcY XXh G4k
related: 74Mw JUN VKx
related: aHCV VsV LiD
related: yh11 sgo Z29
related: YK2s pxn YWW
related: 7tVG 9zf 7mw
related: Bb7a V49 Da8
related: bwYY qC7 5xE
related: YAdb Wwj b3N
related: C3323
related: HW3B CwN pst
related: VTwt 5Fe 6bW
related: ot7L iNF Uyg
related: zRtu fYj XC4
related: jSAi QKc JQk
related: uwev L2n fpz
related: C3115
related: ob2k Bcp XHY
related: UH9g R5v MCx
related: SmZd Jaa BeY
related: rvxX tBy dHM
related: irPd z5v 2o1
related: ZzN5 m7B 5CY
related: f4qz 9GW pwH
related: 2a2s bSc MrV
related: 8cdE rAR qFH
related: a1Sf mey gVk
related: 9Kew syY f5Z
related: 2rqG WLp em4
related: Q6DB h8V mc7
related: UJcF SrQ Jvw
related: juuL xEW Ebd
related: svq3 7VJ Zst
related: Rf1n 6Sj exu
related: PCWc UHq 6G3
related: PuQP aBK nqJ
related: Gt5f wdi FSJ
related: W4er Syp Wrt
related: PkRJ QEL xm5
related: kvLG 4uo M5p
related: q7Mx gjU F9q
related: yXmf iKi 7ci
related: nTdr FJz ioy
related: NB2C zFs C9F
related: v1kW h4M Kej
related: eKuz edm kmi
related: Y197 2oc uoE
related: AEgv 4gP ndv
related: oXnh Ffg j7m
related: gn6h J5L oGf
related: 4fRg DA4 Dj3
related: 52KN A45 kXN
related: 4y7C Lsh EPM
related: 3Sj1 uuL y1A
related: 3zgs 61Q etM
related: kJrF R2t t6F
related: Bbj8 8y7 XJ5
narrower: Inköpsplanerare
narrower: Beredare underhåll inom industriell tillverkning
narrower: Produktionsberedare inom industriell tillverkning
narrower: SQE Supplier Quality Engineer
narrower: Projektledare, industri
broad match: 6Hq3 tKo V57

Bildkonstnärer m.fl.
type: Concept
in scheme: JobTech Taxonomy - Yrke
definition: Skapar konst i olika former t.ex. måleri, grafik, teckning och skulptur, video och film, relationell konst, objekt, installation, miljögestaltning, performance, ljuskonst m.m. Vårdar, konserverar, restaurerar och preparerar föremål och material. Gör bokomslag, bokillustrationer, skisser till kläder m.m.
broader: Konstnärer, musiker och skådespelare m.fl.
related: za8B ctw Kew
related: oXnX PRu 6Q8
related: HWTe SaB wiT
related: rPMH yr9 h7d
related: C7522
related: RBEr gJP ECq
related: yeXm 6v5 w3x
related: beea hNs XWo
related: TNfP oGb U7Y
related: E44v wYZ wjx
related: C7323
related: wA4h Hyv cob
related: Eqx1 Q87 nV5
related: pVsx cf6 hfi
related: WuTn vAS YNx
related: 5JyH NJ2 N6V
related: 6sNj upt KbP
related: CixP Crc RzV
related: 15aN ATt Rb2
related: 3MdV 7Md ux1
related: t1Hp VUs WSf
related: NoVy xc8 wdR
related: oXx9 dMz j5N
related: RBFh BjH AsD
related: VqTN DcE EJc
related: oxYi vfW UWx
related: XWkp 28S HY1
related: dWxZ bGs fJ9
related: wXRm Aq3 9D8
related: 6uCy RbZ aDM
related: ZX72 hKB 3mB
related: yNFR Pqb KJz
related: uDsx kt2 aYy
related: awZg mBS c5M
related: XjE9 ee3 9si
related: wChN 7nd SFk
related: 6Td4 TJq Bgs
related: FQAi Nxv 4VZ
related: aF5k 7at 3sZ
related: KWKg Jte WxV
related: vH2w kqg Usb
related: DbWk xnY CAh
related: C7318
related: ok5k V9L k73
related: 4poo tgz pYe
related: Ddz9 bNV nbY
related: wvPt 3SZ B69
related: 6hij n3p RbR
related: EfCw Dhn vMP
related: HgSd s3w W93
related: TZcg h4T aMT
related: JXoP TaL Uc6
related: zxxJ VTR hpo
related: bCHJ RTc sVi
related: vSry 1wJ PPt
related: SxZy 3gn xFg
related: J3yH raM d7m
related: G34D s8A Mop
related: i7AP ut3 TKX
related: zLNm Vee qn5
related: 4z3c rYn W6S
related: N1iH fcB 7PR
related: Mmjo afd b4G
related: nwvi DYC Mz1
related: M9j1 r9e mvr
related: xNyv PTi fSa
related: qBUP ESk k2s
related: s2Sw EzL Jf9
related: KoMU LJN 94D
related: Xvpz tfe Tsn
related: 28YD XEz LJV
related: 58Pn Hts fzP
related: cmSE SZZ rfK
related: Tx7B rMD A1X
related: mYrC eXr 2hM

Hårdvarukonstruktör
type: Concept
in scheme: JobTech Taxonomy - Yrke
definition: Hårdvarukonstruktör
broader: Civilingenjörsyrken inom elektroteknik
related: 6Hq3 tKo V57
related: 1fLD fZv LqE
related: PopG WTK Hwb
related: NHyx yBP xz3
related: kDRm Yaa jAB
related: EiX1 ALx Vft
related: ZmBR 3WC Aq5
broad match: C2152

Customer success manager/CSM
type: Concept
in scheme: JobTech Taxonomy - Yrke
definition: Customer success manager/CSM
broader: Företagssäljare
related: RPTn bxG ExZ
related: ak4J 3aX Yb7
related: kGn2 ZXs ges
related: z2fG 725 8A8
related: Z6fj LrT rtX
related: Dc3s mJg 5pq
related: ciBw gLG dmK
broad match: C3322

Tandtekniker och ortopedingenjörer m.fl.
type: Concept
in scheme: JobTech Taxonomy - Yrke
definition: Tillverkar tandställning, tandprotes och annan tandersättning. Analyserar behov och önskemål samt utformar och tillverkar ortoped- och hörseltekniska hjälpmedel m.m.
broader: Biomedicinska analytiker, tandtekniker och laboratorieingenjörer m.fl.
related: f4z4 xDq bgg
related: UwZ6 kUf BHU
related: zdZS gv4 hXU
related: 4Vzz nhw 1Nr
related: ybPq Egg Dap
related: dYKL 9m2 grm
related: LMLV ejq t4M
related: Xbkj Ztr mdA
related: AYg8 JBs 5yd
related: du5j oyG ju6
related: xW5W pbE Z23
related: ArpG SCi YB5
related: 3Sjc B3m rQ9
related: C3214
related: wBEn j4R NPh
related: CaRJ bRy pph
related: 3T9D rUe GhL
related: Rf1n 6Sj exu
related: zoXm tw7 GHN
related: 3uLv 2P1 1gz
related: BxbX 16Y qBr
related: MhR3 ax6 uZ9
related: MJb4 VAz XeW
related: iiQT 5cD rqD
related: cEuD 8pg yYF
related: EcFg 78M H9o
related: wRrP jcM Mz2
related: C334 qvU FEA
related: sGky Wqy QvZ
related: FjqL Fvy iwc
narrower: Tandtekniker
narrower: Hörselvårdsingenjör/Hörselingenjör
narrower: Hörselvårdstekniker
narrower: Ortopedingenjör
narrower: Anaplastolog
narrower: Ortopedtekniker
broad match: 6Hq3 tKo V57

Garvare
type: Concept
in scheme: JobTech Taxonomy - Yrke
definition: Garvare, även kallat skinnberedare, arbetar med garvning av djurhudar. Garvning är en process där djurhudar omvandlas till mjukt och hållbart läder. Garvning utförs i garverier. Det är ett hantverksyrke men där mycket av arbete sker maskinellt. Det är vanligt att man roterar mellan de olika arbetsstationer som finns vid garverier. Garvare är ett fysiskt krävande yrke. Andra arbetsuppgifter är kvalitetskontroll och förberedelse för leverans. Källa: Arbetsförmedlingen
broader: Läderhantverkare och skomakare
related: b8gx 2tJ YKD
related: dth1 zEf a6C
related: PaxQ o1G wWH
related: 9Umy cpd A7p
related: S2ai uTu H4t
broad match: C7535

Undersköterskor
type: Concept
in scheme: JobTech Taxonomy - Yrke
definition: Undersköterskor
broader: Omsorgsyrken
narrower: Undersköterskor, hemtjänst, hemsjukvård, äldreboende och habilitering
narrower: Undersköterskor, vård- och specialavdelning och mottagning
narrower: Ambulanssjukvårdare
narrower: Barnsköterskor

Naprapat
type: Concept
in scheme: JobTech Taxonomy - Yrke
definition: Napraprat undersöker, diagnostiserar och behandlar smärttillstånd relaterade till hela kroppen med särskilt fokus på mjuka delar. Naprapat är en skyddad titel med legitimationskrav. Vanliga arbetsuppgifter är diagnostisera och behandla smärttillstånd och funktionsstörningar i rörelse- och stödjeorganen med hjälp av behandlingar såsom massage, stretching, ledmobilisering och olika mjukdelstekniker. Det ingår att ge råd om träning, ergonomi och förebyggande åtgärder. Naprapatens verktyg är huvudsakligen händerna. Källa: Arbetsförmedlingen, Naprapathögskolan, SACO, Socialstyrelsen
broader: Kiropraktorer och naprapater m.fl.
related: NYW6 mP6 vwf
related: sqvh gTy 6Sj
broad match: C2269

Speciallärare och specialpedagoger m.fl.
type: Concept
in scheme: JobTech Taxonomy - Yrke
definition: Undervisar elever med behov av särskilt stöd i förskola och förskoleklass samt grund- och gymnasieskola. Anpassar undervisningen efter elevernas förutsättningar och använder speciella hjälpmedel och arbetsmetoder. Ger specialpedagogiskt stöd till lärare och utvecklar undervisningsmetodik. Utvärderar och inspekterar tillämpningen av skollag, läroplaner och förordningar.
broader: Andra pedagoger med teoretisk specialistkompetens
related: 7Y6d qDZ Eyt
related: ppox 6V9 ZTo
related: P25q 2hT rWN
related: 9bdT Hrb LjG
related: s5SS 7bW 1Gh
related: 8V12 wQM NWp
related: Cczf DnX 7Hu
related: uj9N 8yo T72
related: Ejkw DnA p1V
related: XEL1 u2t 9aw
related: aKfe KPS gyK
related: QuZ4 Sg4 aK5
related: yKnk W7X Zvk
related: 9AMe wHs BU7
related: VNRs wiA RqV
related: p3oC U7R r37
related: mpEZ YAm Wph
related: V5EN xw2 itk
related: ZuiC nRu EFE
related: fC19 bPk 8Ta
related: oLnc YZn 3bm
related: XEyF LCb UAX
related: MmjF Lm4 aqC
related: tg1e QpF xdX
related: C2352
related: eThQ HCv mY6
related: Mt3F 4Xm z1i
related: 6Suw 3c1 47a
related: 5PjX 999 uLZ
related: US4W Foa CSg
related: C3Fc BSX rpH
related: CU49 i2B 7Cv
related: fBpn 7r5 QJ5
related: GNLF bPG BBM
related: H7Xf ifW SX4
related: z8Zg 56f kX4
related: C2351
related: 4y7C Lsh EPM
related: Gq47 Va4 rFY
related: 5xsd oFo RXw
related: SEXM gQx bSK
related: yRaA b6w MJP
related: ppes Qh1 sKn
related: GvLd 9eG A23
narrower: Skolkonsulent
narrower: Fortbildningskonsulent
narrower: Förskolekonsulent
narrower: Synpedagog
narrower: Specialpedagog
narrower: Speciallärare
narrower: Läromedelsintendent
narrower: Talpedagog
narrower: Skolinspektör
narrower: Utbildningskonsulent, skola
narrower: Hörselpedagog
narrower: Läkepedagog
broad match: MVqp eS8 kDZ

UI-designer
type: Concept
in scheme: JobTech Taxonomy - Yrke
definition: UI-designer
broader: Designer inom spel och digitala medier
related: oeHg J1V PEg
related: xHTu HGg nq5
related: apaJ 2ja LuF
related: 9puE nYg crq
related: xJ3z tXQ GmT
broad match: C2166

Ambulanssjukvårdare
type: Concept
in scheme: JobTech Taxonomy - Yrke
definition: Utför ambulanstransporter. Undersöker och behandlar patienten innan och under transport till sjukhus.
broader: Undersköterskor
related: C3258
related: 4QAE wtY gJh
related: C1qR L83 nzh
related: k8ng 1vy ffT
related: GZhS hNz Xo6
related: JB6R Ccj BP1
related: 7xZ7 skn RYk
related: wBPu wTW RgG
related: rF7s hX1 ECH
related: rVUL AgV ZTH
related: 5Kym 2ad Pqi
related: yV9B PxJ TxS
related: rtCg THP 6Lj
narrower: Sjuktransportör
narrower: Ambulanssjukvårdare
broad match: NYW6 mP6 vwf

Utvecklingschef
type: Concept
in scheme: JobTech Taxonomy - Yrke
definition: Utvecklingschef
broader: Forsknings- och utvecklingschefer
related: kfBv 8ce yzP
related: aq6s CAo Y4R
related: 4SDf bdq hgr
related: XLwd g5D p6P
related: epLc SkD cbT
related: 2QZC W4P hwS
related: PfSA rBz r7j
related: QHQh qvo Q9q
related: JLk2 NSD 2Tx
related: bh3H Y3h 5eD
related: fecL B5k fpz
related: 2FwQ 3gK Agh
related: gYsa sqK kHH
related: cWkJ fFL z23
related: ywYH yp8 cVi
related: wZbQ igj 8KM
related: JjjH eXs Fkd
related: LLrX U5R tRb
related: rveU xM4 9ov
related: FCzB UTD uHK
broad match: C1223

Specialistläkare, reumatologi
type: Concept
in scheme: JobTech Taxonomy - Yrke
definition: Specialistläkare, reumatologi är en specialiserad legitimerad läkare med en djupare kunskap och kompetens inom sitt område. Specialistläkare är en skyddad titel och bara den som har bevis om specialistkompetens får kalla sig specialist i sin specialitet. Specialistläkare ansvarar för att diagnostisera, behandla och förebygga sjukdomar inom sin specialitet. Vanliga arbetsuppgifter är mottagningsarbete med patientbesök, rondarbete på avdelning, handledning av yngre läkare samt konsultationer till andra yrkesgrupper och specialiteter. Specialistläkare ansvarar även för att följa och leda utvecklingen inom sitt medicinska område och utför omfattande medicinsk dokumentation och administration. Källa: Arbetsförmedlingen, Karolinska Institutet, Socialstyrelsen, Sveriges Kommuner och Regioner, Sveriges läkarförbund
broader: Specialistläkare
related: NYW6 mP6 vwf
related: qSbw XHD Ycd
related: TChC u37 rt2
related: EBX9 7gC eLt
related: HzxK iXp DVx
related: vFjb AHi a54
related: jFHU uSj 4ke
related: KALC VvK 17U
related: QSeQ MpU wpW
related: 89LR AwA UqR
broad match: C2212

Fotografer
type: Concept
in scheme: JobTech Taxonomy - Yrke
definition: Tar stillbilder och rörliga bilder för kommersiella, konstnärliga, industriella och vetenskapliga ändamål. Bearbetar bildkomposition. Sammanställer och redigerar inspelat material till färdigt program eller film.
broader: Fotografer, dekoratörer och underhållningsartister m.fl.
related: 27SK YN7 i8o
related: 6RVe ZFT p8o
related: Eizh YsE amu
related: ZefA esM Z9F
related: j2Nm bxT X8R
related: jYGN rDK tM2
related: 7JvD uRU 389
related: c9dk AKz 1Db
related: BZDw 9aj p4S
related: poUy FfV mr3
related: Diz9 YkB THm
related: 5kzq otj mTk
related: jMr4 gFw Ppi
related: assp hgx pSE
related: bzFf qDr Brc
related: KpqX tAL Nq7
related: EEFJ g2T biH
related: aHCV VsV LiD
related: ayfb EoM HAD
related: B83k mVq 771
related: pSb6 EzY ePy
related: wXRm Aq3 9D8
related: kmFW EKW yWf
related: CrAp axc CEZ
related: 4z4f Tzu S2s
related: DD51 76k t7F
related: nvXa KhJ VWE
related: afZ1 jd6 Hmk
related: y1Wx UpU Gi3
related: vSqz 6Hj Jrg
related: 2JEv m3q khc
related: puiy Nb9 yUF
related: MjGw w7j Vm5
related: E2ZW X4f Tub
related: 4dTw UTp 6YJ
related: PcoX jAC kA5
related: yBqE ukA 2uH
related: E8uW GK1 AQi
related: JUie YPp G7W
related: F66e iju Ajk
related: XCdg UJK w2q
related: qhJ9 N4G BQg
related: UeNE hDv k4m
related: 7TzF yWs ryn
related: Fpn1 bAJ rJw
related: pLyW JYJ TFq
related: 4QgZ EtG Nx2
related: nXUc H3H Ct5
related: QQk4 pHA ynw
related: vvYA pay Yhj
related: Krbu VkM PdQ
related: xNyv PTi fSa
related: GCMj xLD mj6
related: sjcy d9R ZGE
related: eDRW peR vvs
related: tSaL nLg uDL
related: roq8 r2b 7dm
related: pu2H vu2 wSj
related: C3431
related: VVj2 4Uu LL9
related: D5p7 wzU NXV
related: CR2o UpP 3sZ
related: rjGr Usv AHy
related: t9A6 jvd 6h5
related: 5xQz 7SQ pFq
related: iMEL yvq cPA
related: jMSg L9C NZh
related: SdBw 3e9 1ph
related: AWcT vfc wYb
related: 9ZPm H1K tPW
related: qPMJ D7M au8
related: GwVM TQi LAx
related: qJFE yzh yiM
related: Yhyn QdP Q1i
related: 3wuo aBe m2e

Specialister och rådgivare inom skogsbruk
type: Concept
in scheme: JobTech Taxonomy - Yrke
definition: Bedriver försök och ger råd och upplysningar om skogsbruk, jakt och naturvård. Deltar i produktutveckling, marknadsföring och försäljning. Inventerar viltbestånd och värderar skog samt utarbetar skogsbruksplaner, avverkningsplaner m.m. Bedriver yrkesmässig jakt på vilda djur och skadedjur.
broader: Biologer, farmakologer och specialister inom lant- och skogsbruk m.fl.
related: C3143
related: JsAw WWK wbb
related: hGug af2 p1b
related: qo65 Rvp 32c
related: 9t6n 99j BMU
related: eox4 5Lc W7C
related: jcJj Ek8 D6Q
related: ph2f wuM ae1
related: j5yx R68 xtU
related: yNyX Wa5 X2d
related: sURo MBj hGS
related: 6E3h uR9 pxh
related: RU6V bcD cG7
related: RCcY Ccr i1y
related: upaJ 42d WtR
related: yMp7 AwC zqx
related: uwev L2n fpz
related: C6224
related: C2132
related: a1Fd V76 tZ2
related: Vig6 18E ZVA
related: DSqY EhV RGr
related: FGuh iVi jCA
related: 5KHd EHE Pe6
related: J5iL sjS QxW
related: b3we MUE xYW
related: Y5AU Rub 9TR
related: qs7C 22K 89a
related: vrsj EUw NS5
related: ZCdu Rqm stk
related: zR8a F23 17p
related: Gxyx mAZ Lrn
related: zve2 ooW xhy
related: DnL5 sXM WRb
related: 6nLi H4q 9ZX
related: s6Ed L64 JXc
related: eHN2 mra VzK
related: SNjy Mqa UYh
related: yK4r ToR zg7
related: yXmf iKi 7ci
related: VfP9 2xd g2h
related: pHeH DcY dML
related: sLZX 5ZG ujh
related: pWHA yeq VjT
related: XRfU bRB DwH
related: CWfM RL9 V4t
related: 37ZU mdJ hhK
related: gwEa xAY vUT
related: h2KM 7vh ZTC
related: WKz6 1tc tHk
related: BkCz fjg Am7
related: pTEz GD2 J9b
related: bqTE qbn JZh
related: un4e o8o W1p
related: K4g7 rek mda
related: KK88 XEV 67e
related: 5FXr YFu UCK
narrower: Skogsplanläggare
narrower: Skogsinspektor
narrower: Skogskonsulent
narrower: Viltmästare
narrower: Jaktvårdare/Viltvårdare
narrower: Forskare, skogsbruk
narrower: Jaktvårdskonsulent/Jaktvårdsrådgivare
narrower: Avverkningsledare, skogsbruk
narrower: Skogsbruksrådgivare
narrower: Virkesköpare/Virkesinköpare
narrower: Yrkesjägare
narrower: Jaktkonsulent/Viltkonsulent
broad match: VuuL 7CH adj

Lastbilsförare m.fl.
type: Concept
in scheme: JobTech Taxonomy - Yrke
definition: Kör tung lastbil och transporterar och hanterar gods. Beräknar godsets vikt och volym och medverkar i lastning och lossning. Transporterar och bärgar fordon. Kör bokbuss.
broader: Lastbils- och bussförare
related: swdt CX9 tHZ
related: Asgf FwD KGZ
related: 64HX EdQ BiP
related: CGmy DLN mcA
related: 5S7x 3uD Us8
related: Ahfa KuY 4HZ
related: tWch mrP ECi
related: EqRh UqX wFB
related: cQAr Hfb taV
related: rBz4 QSX yfw
related: drxo a5a Q4Y
related: pGts PKK c8W
related: HPfU aG2 m9r
related: HeXq amc ABd
related: io6P NAA Kqy
related: Zk4h jP4 e85
related: Dddv JRP MMh
related: EK7a 5s8 mKA
related: KRc7 jYT iwS
related: 88Dg 2p6 SXq
related: Kzvi T2N vx6
related: SGEy RLA TBU
related: vRUW 21M 5Eg
related: iLUr RJV 3xW
related: W8Vw 5oR 7EV
related: sKLW XyF UGt
related: oj7o xyD 5Jw
related: 3JX4 aDd 5w6
related: J455 EA8 ZxD
related: iGY5 duK aGg
related: zf1U Xnn g1Z
related: XGCK 5qV wPd
related: C8332
related: WtGk Hi4 NEr
related: pHfK hCS b8E
related: Rfvy DUn VfE
related: awfd 4Vt m3V
related: ENrQ eiN i3i
related: drj3 CKp Mpp
related: imVM 9XE Rrm
related: Jhct jPi 94u
related: EMap oik DBH
related: kYAc qLg PVG
related: Dh7i 2oJ RRK
related: CUMe R2M JXi
related: HnQ2 FhC xgt
related: 8GZn XsP qg8
related: F8iA MB6 iY3
related: X6Pi hDT KDA
related: ykyf hFy V5o
related: 32oR XF4 qdy
related: kkST 7Zo xNK
related: Enuq cMG 7pw
related: KwWd Ffq 2kE
related: bZjt jkc hNd
related: X9LH ff4 MZM
related: XQet 5J6 HGj
related: hFN6 Rbb Apq
related: avFv FXV FEq
related: D5j7 31a adT
related: YYdi Fqb 834
related: pWqJ Rxq beZ
related: bSPE 8iz gxp
related: cSVE 38v SmY
related: bdEb 1Mn 9XY
related: LPC3 6X3 1bv
related: hqeB M19 eA6
related: gvks iLU X1b
related: R3V1 d6N Tb8
narrower: Bokbussförare
narrower: Specialtransportförare
narrower: Distributionsförare
narrower: Renhållningsförare
narrower: Fjärrbilsförare
narrower: Tank- och bulkbilsförare

Forskare, trafiksäkerhet
type: Concept
in scheme: JobTech Taxonomy - Yrke
definition: Forskare, trafiksäkerhet
broader: Övriga civilingenjörsyrken
related: 6Hq3 tKo V57
broad match: C2149

Tulltjänsteman
type: Concept
in scheme: JobTech Taxonomy - Yrke
definition: Tulltjänstemän arbetar på Tullverket med att kontrollera varor som kommer in och ut ur landet. Arbetet innebär att bekämpa brottslighet samt ta och ta in tull, skatter och andra avgifter. Yrket kan rymma olika roller. Som tullinspektör arbetar man bland annat med att se till att endast godkända varor passerar Sveriges gräns. Det kan innefatta kontroll av fordon, containrar och bagage. Arbete som tullinspektör föregås av en anställning under utbildning som tullaspirant. Förutom inspektion kan man även arbeta med underrättelse, brottsutredning samt handel och tullhantering. Källa: Tullverket
broader: Tull- och kustbevakningstjänstemän
related: E7hm BLq fqZ
related: CM2W vei Uxb
related: B2Rd hQk 9KL
broad match: C3351

Specialistsjuksköterska inom palliativ vård
type: Concept
in scheme: JobTech Taxonomy - Yrke
definition: Specialistsjuksköterska inom palliativ vård ansvarar för omvårdnad av patienter i livets slutskede med komplexa vårdbehov, i nära samarbete med patient, närstående och ett tvärprofessionellt team. Specialistsjuksköterska inom palliativ vård är en skyddad titel med krav på både legitimation och specialistsjuksköterskeexamen. Vanliga arbetsuppgifter är att bedöma och planera omvårdnad, ge symtomlindring och stödja patienter och deras närstående fysiskt, psykiskt och socialt. Arbetet innefattar också handledning av kollegor. Källa: Arbetsförmedlingen, Socialstyrelsen, Svensk sjuksköterskeförening
broader: Övriga specialistsjuksköterskor
related: NYW6 mP6 vwf
related: ytRi QuA XLX
related: 1f7B E5K sh3
broad match: C2221

Process- och maskinoperatörer, vid stål- och metallverk
type: Concept
in scheme: JobTech Taxonomy - Yrke
definition: Process- och maskinoperatörer, vid stål- och metallverk
broader: Process- och maskinoperatörer
narrower: Maskinoperatörer, ytbehandling
narrower: Valsverksoperatörer
narrower: Övriga maskin- och processoperatörer vid stål- och metallverk

Bankdirektör
type: Concept
in scheme: JobTech Taxonomy - Yrke
definition: Bankdirektör
broader: Verkställande direktörer m.fl.
related: Dgaz R7K hNB
related: X82t awd Qyc
related: epLc SkD cbT
related: bh3H Y3h 5eD
broad match: C1120

Bergsprängare
type: Concept
in scheme: JobTech Taxonomy - Yrke
definition: Bergsprängare är en specialist som arbetar med att spränga berg och stora stenblock, vilket ofta sker i samband med byggen av vägar, tunnlar eller andra större konstruktioner. Bergsprängare måste ha en särskild utbildning och certifiering för att hantera sprängämnen och genomföra sprängarbeten på ett säkert sätt. Bergarbetare bygg och anläggning eller Bergarbetare gruva är två yrken som är vanligast att en Bergsprängare jobbar inom. Källa: Arbetsförmedlingen
broader: Bergsprängare
related: 6mCZ 6Hu LLP
related: j7Cq ZJe GkT
related: Zshs 4kY Uia
related: ja7J P8X YC9
broad match: C7542

Biträdande jurist
type: Concept
in scheme: JobTech Taxonomy - Yrke
definition: En biträdande jurist är en jurist som arbetar på en advokatbyrå och biträder advokater i deras arbete. De har en juristexamen men är inte ännu advokater, utan genomgår en utbildningsperiod för att samla nödvändig erfarenhet för att kunna bli advokat. Biträdande jurister kan ha egna ärenden och uppdrag, men står under tillsyn av en eller flera advokater. Källa: Advokatsamfundet
broader: Övriga jurister
related: X82t awd Qyc
related: x4Wi NWW ogB
related: Abcb QtH isZ
broad match: C2619

Polissekreterare
type: Concept
in scheme: JobTech Taxonomy - Yrke
definition: Polissekreterare
broader: Övriga chefer inom samhällsservice
related: E7hm BLq fqZ
related: epLc SkD cbT
related: bh3H Y3h 5eD
broad match: C1349

Turistbyråchef
type: Concept
in scheme: JobTech Taxonomy - Yrke
definition: Turistbyråchef
broader: Övriga chefer inom övrig servicenäring
related: DSFW UjA 77Q
related: epLc SkD cbT
related: bh3H Y3h 5eD
related: 9RfA ctv 9g4
broad match: C1439

Kyl- och värmepumpstekniker m.fl.
type: Concept
in scheme: JobTech Taxonomy - Yrke
definition: Installerar och servar kyl- och värmepumpsanläggningar samt tillhörande styr- och övervakningssystem.
broader: Takmontörer, golvläggare och VVS-montörer m.fl.
related: pQbF zp2 3so
related: sKfH MGG 3CS
related: wBLK nWZ 7ek
related: VWmQ 9fd GLL
related: 37Pm JnZ u3y
related: BV5y wau Zxz
related: aHCV VsV LiD
related: 8wuS ceN nBu
related: VvvT DJ3 aPH
related: KnpQ pxH wq3
related: pk4K pdQ g77
related: 1JaM 2oZ iQ3
related: 1YZS 1ch vDZ
related: rm5H xiU 5bN
related: PELm cH9 AE9
related: PHC9 9uW Bcv
related: Q7eC B7g QiU
related: E6uE hqh VZW
related: M7C1 DAy UTK
related: fjoN ZHr XG4
related: fhcp fFw Lbj
related: nkhA jPz pcE
related: 2ccg jZF 1u5
related: ynWd oCo o61
related: xeoH rao GgZ
related: ynW8 Jr4 5tT
related: t17v Hrq yLk
related: fhu6 H74 uuN
related: PbNh Mek pPr
related: GCYi 9tC 1pP
related: C5BH gEG 5gV
related: vqgm Ggp u5d
related: c14d Mgx MFA
related: WLAi BDr 5fW
related: KfEn V5y npV
related: SpsE Fzz yiX
related: C7127
related: madj KDg KQq
related: AEgv 4gP ndv
related: HmXd ehy QT9
related: uJoK dM3 8AM
related: WzYZ 341 Cn9
related: wZpC X9a xzG
related: 4mNF 7vZ vCx
related: xShN Vkr s7D
related: bBEQ oAd M9B
related: ZTk2 7eo CUb
related: vNG6 jSH UKV
related: jZzL yV6 PmA
narrower: Kyl- och värmepumpstekniker
narrower: Distributionstekniker fjärrvärmenät och fjärrkylenät
narrower: Kyltekniker
broad match: j7Cq ZJe GkT

Museilektor
type: Concept
in scheme: JobTech Taxonomy - Yrke
definition: Museilektor
broader: Övriga pedagoger med teoretisk specialistkompetens
related: pVzY rff Amk
related: MVqp eS8 kDZ
broad match: C2359

Hjullastarförare, godshantering
type: Concept
in scheme: JobTech Taxonomy - Yrke
definition: Hjullastarförare inom godshantering kör hjullastare där gods lastas, förflyttas och lossas. Här används skopa, kranarm och pallgafflar, men även hydrauliska redskap såsom sopvals eller snöslunga. I arbetet ingår att sköta underhåll och enklare reparationer av maskinens kringutrustning. Källa: Arbetsförmedlingen
broader: Anläggningsmaskinförare m.fl.
related: j7Cq ZJe GkT
related: grKR xWx NNb
related: WUHH Jpr Zeh
related: KLfo nwj UCQ
related: Mxyf t2J iLA
related: tj8W QcR dTC
related: 26mT 8by 5bR
broad match: C8342

Bildproducent
type: Concept
in scheme: JobTech Taxonomy - Yrke
definition: Bildproducent leder och koordinerar den visuella bildproduktionen vid direktsändningar, evenemang och TV-produktioner. Vanliga arbetsuppgifter är att styra bildflödet från flera kameror, välja lämpliga bildvinklar och säkerställa sändningens tekniska och visuella kvalitet. Arbetet sker ofta i nära samarbete med tekniker, regissörer och programledare i kontrollrum. Källa: Arbetsförmedlingen
broader: Bild- och sändningstekniker
related: 8too bEs 7NU
related: 9puE nYg crq
related: d1Ao 9bY 7Kn
broad match: C3521

Verksamhetskonsult
type: Concept
in scheme: JobTech Taxonomy - Yrke
definition: Verksamhetskonsult
broader: Lednings- och organisationsutvecklare
related: XNz1 2sG LTn
related: sXfH wMW bAz
related: YWft bBn Jyt
related: X82t awd Qyc
related: DFn3 9Ue a2z
related: Wo8D xys Lew
related: S9rc cSm HpA
related: jBMV UHp QBc
related: fnhW EBh bfJ
broad match: C2421

Anläggningsmaskinförare m.fl.
type: Concept
in scheme: JobTech Taxonomy - Yrke
definition: Kör maskiner för grävning, schaktning och lastning av till exempel jord, sten, grus och sand samt för beläggning av asfalt, betong m.m. Sköter och övervakar mudderverk och pålmaskiner. Kör maskiner för gatusopning och snöröjning samt is- och pistmaskiner.
broader: Maskinförare
related: z4r8 crC XDC
related: EirM Asx dUb
related: uuEN jWu bRm
related: 6Ry2 oyZ d1N
related: yc3o fvU E6V
related: Asgf FwD KGZ
related: 7kjR Ce5 vYw
related: C8342
related: 95yM 6W4 Zyj
related: nuRM zb9 2wV
related: wv7t xyY xhn
related: aHCV VsV LiD
related: tWch mrP ECi
related: rBz4 QSX yfw
related: HPfU aG2 m9r
related: Q7Uq rmo pzv
related: t2C9 CEe qdq
related: 5LhV Kg4 hCv
related: Q7eC B7g QiU
related: eky8 ytp KMd
related: BQa2 sAB euB
related: iLUr RJV 3xW
related: ULYb K54 nHi
related: M7C1 DAy UTK
related: D6xD cSH rZN
related: Ty8v puq yxx
related: YshH J3e Rgy
related: fhcp fFw Lbj
related: 8Yqr o72 jqv
related: uXtA mGM ar6
related: 7jFS 6oq ZGv
related: 6Nga Uap 9dB
related: autP kQ8 Tdx
related: ynWd oCo o61
related: eZhm QyX GTu
related: drj3 CKp Mpp
related: xeoH rao GgZ
related: hoV7 upN Q26
related: fhu6 H74 uuN
related: yKgh gy7 e4M
related: HnQ2 FhC xgt
related: WGqY bSx yoF
related: 4bwR JVU usd
related: ykyf hFy V5o
related: WLAi BDr 5fW
related: KfEn V5y npV
related: 5Av7 qB2 msb
related: HmXd ehy QT9
related: B5nX c1h fdY
related: hFN6 Rbb Apq
related: us91 jB5 a3A
related: YYdi Fqb 834
related: uG7n rkM WoS
narrower: Beläggningsmaskinförare
narrower: Bandschaktarförare
narrower: Hjullastarförare, godshantering
narrower: Mudderverkskötare
narrower: Lärling grundläggningsmaskinförare
narrower: Lärling, motorschaktvagnförare
narrower: Teleskoptruckförare, anläggning
narrower: Lärling, teleskoptruckförare
narrower: Grundläggningsmaskinförare
narrower: Grävlastarförare, anläggning
narrower: Lärling, väghyvelförare
narrower: Lärling, beläggningsmaskinförare
narrower: Lärling, grävlastare
narrower: Vältförare
narrower: Renhållningsmaskinförare
narrower: Grävmaskinförare
narrower: Lärling, bandschaktarförare
narrower: Lärling, grävmaskinförare
narrower: Lärling, lastmaskinförare
narrower: Hjullastarförare, anläggning
narrower: Motorschaktvagnförare
narrower: Väghyvelförare

Marknadskoordinator
type: Concept
in scheme: JobTech Taxonomy - Yrke
definition: Marknadskoordinator
broader: Marknadsanalytiker och marknadsförare m.fl.
related: g2Tr n87 J6S
related: FfDD gxA Bsr
related: N2LD uDK Zzt
related: RPTn bxG ExZ
related: HDRy EAr uFt
related: U7h2 D2H zSo
related: Yb1w sSy Rh9
related: eZka B18 e9P
related: HMVi Xzd NNJ
related: 4XyY MCb svG
related: Axmh JPX s7N
broad match: C2431

Kvalitetsingenjör, textil, trä, glas, förpackningar
type: Concept
in scheme: JobTech Taxonomy - Yrke
definition: Kvalitetsingenjör, textil, trä, glas, förpackningar
broader: Övriga ingenjörer och tekniker
related: 6Hq3 tKo V57
related: Xq4X npX 7zP
broad match: C3119

Limnolog
type: Concept
in scheme: JobTech Taxonomy - Yrke
definition: Limnolog
broader: Växt- och djurbiologer
related: kJeN wmw 9wX
related: hay1 KVv 6S4
related: 4Xio hXo CGS
related: 4ff1 4gB Dew
broad match: C2131

Produktionsassistent: kultur, media, film, dataspel
type: Concept
in scheme: JobTech Taxonomy - Yrke
definition: Produktionsassistent: kultur, media, film, dataspel
broader: Inspicienter och scriptor m.fl.
related: 8too bEs 7NU
related: 9puE nYg crq
related: jJPn em1 Byv
broad match: C3435

Forskare, historia
type: Concept
in scheme: JobTech Taxonomy - Yrke
definition: Forskare, historia
broader: Arkeologer och specialister inom humaniora m.m.
related: X82t awd Qyc
related: KdA4 eDJ GAJ
broad match: C2633

Hydrobiolog
type: Concept
in scheme: JobTech Taxonomy - Yrke
definition: Hydrobiolog
broader: Växt- och djurbiologer
related: kJeN wmw 9wX
broad match: C2131

Takmontörer
type: Concept
in scheme: JobTech Taxonomy - Yrke
definition: Täcker yttertak med tätskikt av olika material och monterar värmeisolering. Sätter upp innetak.
broader: Takmontörer, golvläggare och VVS-montörer m.fl.
related: GrwT qSP Jed
related: GHrt TJi 62K
related: nuRM zb9 2wV
related: aHCV VsV LiD
related: ax2t Yyg 2Sy
related: CeDL st5 5WY
related: PELm cH9 AE9
related: Q7eC B7g QiU
related: bABh HN5 u4v
related: C7121
related: M7C1 DAy UTK
related: KBa5 cH5 nxQ
related: y3yv k5d NB4
related: fhcp fFw Lbj
related: KGWL Pvt 6r3
related: nkhA jPz pcE
related: ynWd oCo o61
related: xeoH rao GgZ
related: kNST GaY dFK
related: fhu6 H74 uuN
related: 3Zeh 4RX kA4
related: 6BpN oXk 7SL
related: YCM8 WjA b4E
related: i7bG yie BMx
related: WLAi BDr 5fW
related: KfEn V5y npV
related: 5Av7 qB2 msb
related: HmXd ehy QT9
related: xNTz SeC WRw
narrower: Undertaksmontör
narrower: Lärling, undertaksmontör
narrower: Tak- och tätskiktsmontör, utan yrkesbevis
narrower: Undertaksmontör, utan yrkesbevis
narrower: Tak- och tätskiktsmontör
narrower: Lärling, tak- och tätskiktsmontör
broad match: j7Cq ZJe GkT

Specialistläkare, laboratoriemedicin
type: Concept
in scheme: JobTech Taxonomy - Yrke
definition: Specialistläkare, laboratoriemedicin är en specialiserad legitimerad läkare med en djupare kunskap och kompetens inom sitt område. Specialistläkare är en skyddad titel och bara den som har bevis om specialistkompetens får kalla sig specialist i sin specialitet. Specialistläkare ansvarar för att diagnostisera, behandla och förebygga sjukdomar inom sin specialitet. Vanliga arbetsuppgifter är mottagningsarbete med patientbesök, rondarbete på avdelning, handledning av yngre läkare samt konsultationer till andra yrkesgrupper och specialiteter. Specialistläkare ansvarar även för att följa och leda utvecklingen inom sitt medicinska område och utför omfattande medicinsk dokumentation och administration. Källa: Arbetsförmedlingen, Karolinska Institutet, Socialstyrelsen, Sveriges Kommuner och Regioner, Sveriges läkarförbund
broader: Specialistläkare
related: NYW6 mP6 vwf
related: 5MTC SDc txF
related: qSbw XHD Ycd
related: TChC u37 rt2
related: GnRp 8Wa Rmf
related: EBX9 7gC eLt
related: vFjb AHi a54
related: jFHU uSj 4ke
related: KALC VvK 17U
related: QSeQ MpU wpW
related: 89LR AwA UqR
broad match: C2212

Verkställande direktörer m.fl.
type: Concept
in scheme: JobTech Taxonomy - Yrke
definition: Verkställande direktörer m.fl.
broader: Politiker, verkställande direktörer och högre ämbetsmän m.fl.
narrower: Verkställande direktörer m.fl.

Verkställande direktörer m.fl.
type: Concept
in scheme: JobTech Taxonomy - Yrke
definition: Planerar, leder och samordnar verksamhet i företag och affärsverk med stöd från andra chefer, efter riktlinjer fastställda av en styrelse eller ledning. Formulerar och beslutar om mål och policy. Fattar beslut om arbetsorganisation och större investeringar. Representerar företaget i dess förehavanden med andra företag, organisationer och myndigheter. Redovisar resultat till styrelsen eller ledningen. Hit hör inte Generaldirektör, myndighet (1112) Verkställande direktör i företag utan chefshierarki (se respektive verksamhet)
broader: Verkställande direktörer m.fl.
related: zDmn yT9 xtd
related: t4f1 Akp Afr
related: WrPS DDb nuP
related: icvA Gu9 EqB
related: vBbK 9v3 Toq
related: YS7V c8n MrS
related: qgoa T8m Qe1
related: G7Qq r7L 5Jo
related: 71e2 zAu 1KK
related: UH9g R5v MCx
related: oLnc YZn 3bm
related: 8tYq EXD Xwm
related: Gmv8 UGX d3e
related: ZzN5 m7B 5CY
related: eogS 3w5 Rh2
related: 6zBd GJZ J5t
related: 8m5V 7k8 wJ3
related: APnJ sVP C4z
related: 5PjX 999 uLZ
related: YBuN Wgv 19X
related: 1dVh cZS Exw
related: Ghj3 9BH FWe
related: Gt5f wdi FSJ
related: NBXf eTy S19
related: q7Mx gjU F9q
related: Nh7B mMG KeK
related: VfP9 2xd g2h
related: zXNU zXR hGd
related: 6yxL ufm 3uS
related: C1120
related: Cc3k 5X1 NCv
related: 4fRg DA4 Dj3
related: 43v8 evE cUE
related: 8yuR ozZ wg4
narrower: Universitetsrektor
narrower: Orkesterchef
narrower: Verkställande direktör/VD
narrower: Bankdirektör
narrower: Sjukhusdirektör
narrower: Prorektor
narrower: Bokförläggare
narrower: Chefredaktör
narrower: Museichef/Museidirektör
narrower: Operachef
narrower: Hamnchef
narrower: Musikförläggare
narrower: Teaterchef
narrower: Flygplatschef
narrower: Vicerektor
broad match: bh3H Y3h 5eD

Försäkringshandläggare
type: Concept
in scheme: JobTech Taxonomy - Yrke
definition: En försäkringshandläggare på ett försäkringsbolag utreder, bedömer och hanterar försäkringsärenden. Detta kan inkludera allt från att utreda skador och besluta om ersättning, till att handlägga nyteckningar, ändringar och avslut av försäkringar. De har också kontakt med kunder, både via telefon och skriftligen, för att ge information och vägledning. Källa: Arbetsförmedlingen, Folksam
broader: Försäkringssäljare och försäkringsrådgivare
related: X82t awd Qyc
broad match: C3321

Ingenjörer och tekniker inom gruvteknik och metallurgi
type: Concept
in scheme: JobTech Taxonomy - Yrke
definition: Utför tekniskt arbete vid utvinning av metaller, olja och gas eller vid framställning av metaller, legeringar och metallurgiska produkter samt vid underhåll och reparation av gruvinstallationer. Utför kvalitets- och produktkontroller i samband med stål- och metallframställning m.m. Hit hör inte Civilingenjörsyrken inom gruvteknik och metallurgi (2146)
broader: Ingenjörer och tekniker
related: HACr 3sZ 4gm
related: tCER yDZ XnW
related: uvcb DuX NW8
related: t73q zoU MT6
related: Z6GN aCQ MDc
related: eHy7 eMm 1mG
related: 9Hvc DYG iqB
related: tg8L maz wMN
related: 61zA BvK zDd
related: d4fX YoT QQc
related: LXoc wxV 73h
related: 74Mw JUN VKx
related: K5JR yfk 8oj
related: kLLw dnR M38
related: duiL WtX t46
related: YK2s pxn YWW
related: Ks1q VaN 4iP
related: yFgG g8k r6r
related: PGDh 8HQ 4BZ
related: bwYY qC7 5xE
related: Ry2v 4Hx 6ta
related: YAdb Wwj b3N
related: HW3B CwN pst
related: Bh9h t3B M8h
related: jSAi QKc JQk
related: nA5p Ske 4zb
related: xsSg pg2 Bpq
related: YSMf UrF L4E
related: Z2XD GQ9 qvM
related: cCGX 6Y8 87C
related: Udbb Eay MuR
related: ppUe nsQ hn5
related: oPP6 byU yyn
related: ZzN5 m7B 5CY
related: BcFG Ckm S65
related: 2rqG WLp em4
related: C3117
related: MfG9 ybe zVS
related: t6ot 8TC pKs
related: JRvh wrY RmW
related: Rf1n 6Sj exu
related: fizC gvj YaQ
related: PuQP aBK nqJ
related: W4er Syp Wrt
related: tZ8d VuQ V7z
related: fKNz Mn2 YCQ
related: Y197 2oc uoE
related: AjDN 1rp vzp
related: oXnh Ffg j7m
related: gn6h J5L oGf
related: dnXS Zcy Bn1
related: 4y7C Lsh EPM
related: Lgt8 xjP 7Fq
related: 3Sj1 uuL y1A
related: XgGJ nFz J5g
related: nDqs 2d5 jqu
related: Zchn wqo NUQ
related: c1VR Sgw DZ6
related: 2ZDh 43R pbp
related: A8yh 3Ck Qww
related: zSbb 3rY Z7H
related: Bbj8 8y7 XJ5
related: cjzD 31U USf
related: kAbQ DBs kYx
narrower: Borrledare, petroleumutvinning
narrower: Kontrollingenjör, gruv, metallurgi
narrower: Serviceingenjör, metallurgi
narrower: Produktionsingenjör, gruv, metallurgi
narrower: Sprängingenjör
narrower: Underhållschef
narrower: Projektledare, gruva
narrower: Produktionstekniker, petroleumutvinning
narrower: Kvalitetsingenjör, metallurgi/Kvalitetstekniker, metallurgi
narrower: Laboratorieingenjör, metallurgi
narrower: Planeringstekniker, metallurgi

Hotellreceptionist
type: Concept
in scheme: JobTech Taxonomy - Yrke
definition: Hotellreceptionist hanterar in- och utcheckning av gäster, registrerar gäster och lämnar ut nyckelkort eller rumsnyckel. I arbetsuppgifterna ingår bland annat även att informera om hotellets service, hjälpa gäster med bordsbokning på restauranger, informera om sevärdheter, boka biljetter till nöjesevenemang och beställa taxi. Hotellreceptionister stämmer av hotellräkningen och tar emot betalning vid utcheckning. Yrket omfattar även mottagande av konferensgäster, hantering av rumsbokningar och fakturering samt administration av telefonväxel och e-post. Arbetsrotation förekommer, exempelvis arbete med konferensverksamhet, servering i restaurang eller städning. Hotellreceptionist kan arbeta både dag- och nattpass, på olika typer av hotell och pensionat. Se även yrket Hotellvärd, där receptionsarbete kan förekomma. Källa: Arbetsförmedlingen
broader: Hotellreceptionister m.fl.
related: dJYn qGR rgS
related: 7goz uuv JWu
related: 6737 Zjq gTF
related: E2Hr f87 SBq
related: 8tJ8 pqV TD5
related: ff21 zoX ij9
related: GqR9 A2i 6Nc
related: dNmP L3z tFg
related: abT6 mwf smS
related: UHwG mz7 JZx
related: DG6k fk2 iGE
related: ECZi GCz EJT
related: ScKy FHB 7wT
related: VXH7 nRn DJX
related: EKtK 5mt fum
related: bLtf UwD 5ks
related: 2g2j Kki Agk
related: s1gA udW wnZ
related: E8Cr tr2 YpR
broad match: C4224

Landsbygdsutvecklare
type: Concept
in scheme: JobTech Taxonomy - Yrke
definition: Landsbygdsutvecklare
broader: Specialister och rådgivare inom lantbruk m.m.
related: 6nbS RdB kzm
related: VuuL 7CH adj
broad match: C2132

Processkemist
type: Concept
in scheme: JobTech Taxonomy - Yrke
definition: Processkemist
broader: Kemister
related: CpFD aoS pkZ
related: kJeN wmw 9wX
related: Yr11 UKD on1
related: fM7t axJ RNN
broad match: C2113

Beroendeterapeut
type: Concept
in scheme: JobTech Taxonomy - Yrke
definition: Beroendeterapeuter arbetar med behandling och stöd till personer med olika typer av beroendeproblematik, såsom alkohol, droger, spel eller läkemedel. Arbetsuppgifter omfattar samtal och behandling enskilt och i grupp, kartläggning och bedömning av beroendeproblematik, utveckling av individuella behandlingsplaner samt samverkan med anhöriga och andra yrkesgrupper. Beroendeterapeuter använder strukturerade metoder som motiverande samtal (MI), KBT, 12-stegsmodellen. Arbetet sker både inom öppenvård, slutenvård, och på behandlingshem, samt i kommunala och privata verksamheter. Källa: Beroendemottagningar, Arbetsförmedlingen
broader: Behandlingsassistenter och socialpedagoger m.fl.
related: J8rZ Vmw 9gv
related: Z394 nH4 c2G
related: b4zK wen zeT
related: fsjg Lar B5E
related: GHtB qHe Sbv
related: GazW 2TU kJw
related: o3VN 1Hs RMC
related: XmMz mL5 9Qy
related: 4DBi cqD HtM
related: 6pay Ygz r6P
related: iUJK B15 5Gj
broad match: C3412

Grovarbetare, bygg och anläggning
type: Concept
in scheme: JobTech Taxonomy - Yrke
definition: Grovarbetaren är en resurs och hantlangare till andra yrkesgrupper på en byggarbetsplats. Grovarbetaren hjälper till vid betongarbeten såsom gjutning samt river form efter gjutning. Ser till att t ex träarbetare och murare har material på rätt ställe på byggarbetsplatsen. Grovarbetare assisterar maskinföraren vid schaktarbete. Källa: Arbetsförmedlingen
broader: Grovarbetare inom bygg och anläggning
related: 1iRB oaL bXT
related: UdVa jRr 9DE
related: j7Cq ZJe GkT
related: 4mbj Rat zKd
related: ja7J P8X YC9
related: Wakm MJg vch
related: kdFX 1wd Cea
related: RBHr GzW tbN
broad match: C9313

Orderassistent
type: Concept
in scheme: JobTech Taxonomy - Yrke
definition: Orderassistent hanterar och administrerar beställningar inom företag och organisationer. Arbetsuppgifterna omfattar mottagning och registrering av kundorder, uppföljning av leveranser, kontakt med leverantörer och koordinering med lager och logistik. Arbetet sker främst på kontor men kan även innefatta moment nära lager eller produktion beroende på verksamhetens art. Orderassistenter har vanligtvis goda kunskaper om affärssystem, orderhantering och logistik. Källa: Arbetsförmedlingen
broader: Inköps- och orderassistenter
related: SYgk g4N qDh
related: RPTn bxG ExZ
broad match: C4322

Kontrolltekniker, textil, trä, glas, förpackningar
type: Concept
in scheme: JobTech Taxonomy - Yrke
definition: Kontrolltekniker, textil, trä, glas, förpackningar
broader: Övriga ingenjörer och tekniker
related: 6Hq3 tKo V57
broad match: C3119

Organisationsutvecklare
type: Concept
in scheme: JobTech Taxonomy - Yrke
definition: Organisationsutvecklare utreder och förändrar verksamheter för att nå resultat och mål. Typiska arbetsuppgifter är att analysera och utreda verksamheter, stötta projekt och förvaltning när det gäller prioriteringar, utveckling av arbetssätt och metoder. Det kan vara processförbättringar, tjänsteutveckling, förändringsledning och att utbilda personal. Ofta fungerar organisationsutvecklaren som ett stöd till ledningen. Källa: Arbetsförmedlingen - Hitta yrken
broader: Lednings- och organisationsutvecklare
related: RKNZ 35U xHM
related: YWft bBn Jyt
related: XXc5 Psb AN4
related: X82t awd Qyc
related: 3b72 9bi AC9
related: Yb1w sSy Rh9
related: Wo8D xys Lew
related: fajF bZb J71
related: fnhW EBh bfJ
related: PRoL im5 XYD
related: ambj mLm gCu
related: qYfG 798 Uj7
broad match: C2421

Entrévärd
type: Concept
in scheme: JobTech Taxonomy - Yrke
definition: Entrévärdar tar emot och kontrollerar besökare vid offentliga och privata tillställningar. Vanliga arbetsplatser är nattklubbar, restauranger och vid evenemangs. Arbetsuppgifterna kan innefatta att kontrollera besökares biljetter, ålder, nykterhet, följa lagkrav gällande maxantal personer på en yta samt upprätthålla ordningen. Entrévärdar samarbetar ofta med ordningsvakter och kontrollerar verksamheten följer alkohollagen och andra riktlinjer. Se även yrket publikvärd. Källa: Arbetsförmedlingen
broader: Övriga servicearbetare
related: UdVa jRr 9DE
related: E7hm BLq fqZ
related: Jjti 8Mb bn5
related: AtN6 CkN A79
related: ScKy FHB 7wT
related: URav X6W WcY
broad match: C9629

Mättekniker, metallprodukter
type: Concept
in scheme: JobTech Taxonomy - Yrke
definition: Mättekniker, metallprodukter
broader: Övriga ingenjörer och tekniker
related: 6Hq3 tKo V57
broad match: C3119

Länsjurist
type: Concept
in scheme: JobTech Taxonomy - Yrke
definition: Länsjurist
broader: Förvaltnings- och organisationsjurister
related: X82t awd Qyc
related: x4Wi NWW ogB
related: Abcb QtH isZ
broad match: C2619

Apotekstekniker
type: Concept
in scheme: JobTech Taxonomy - Yrke
definition: Ger råd om och säljer egenvårdsprodukter och receptfria läkemedel. Packar upp, prismärker samt fyller på varor i apotek.
broader: Butikspersonal
related: UofT hW8 S5L
related: vVXb pYT E1z
related: C5329
related: WM8A Yp3 TUS
related: TGFT 7y2 ryH
related: 9kw3 UiG 7VA
related: hYpk RYx y3V
narrower: Apotekstekniker
narrower: Apoteksassistent
broad match: RPTn bxG ExZ

Arkitekter m.fl.
type: Concept
in scheme: JobTech Taxonomy - Yrke
definition: Utformar, projekterar och ritar nyproduktion av byggnader samt om- och tillbyggnad. Utformar planer och underlag till planer. Väger samman funktionella, tekniska, ekonomiska, miljötekniska och estetiska krav och önskemål till en fungerande helhetslösning i dialog med uppdragsgivare. Utformar den inre miljön t.ex. privata hem, offentliga lokaler och kontor. Gör materialsammanställningar. Utarbetar förslag i form av modeller, texter och ritningar. Hit hör inte Inredare (3432) Dekoratör (3432)
broader: Arkitekter och lantmätare
related: iggK cuN iSD
related: JQRo XJx YX9
related: T3WL Mto riw
related: g7bY vJ5 XC8
related: W5A6 NGs aM9
related: 2p7n zft 86S
related: 4VUm JpJ LWr
related: ah7i FKc KGU
related: 8YxM PWA RNH
related: eHy7 eMm 1mG
related: CY3S ton bPV
related: Uige jQo uZ4
related: 1CnL 8ZQ tTd
related: 61zA BvK zDd
related: uw7i bUK eex
related: vd1e qAT oPN
related: d4fX YoT QQc
related: 6MJf 3Va KQD
related: S8JM CKj zf9
related: oaiv GsB AFK
related: wAUk C6t v3j
related: oQre F86 kHG
related: K5JR yfk 8oj
related: aP4x oT8 Jph
related: sc9x MMP woB
related: GchS 5vD Zr5
related: G4oH peY AMJ
related: YSVk ZwM xm4
related: yFgG g8k r6r
related: YAdb Wwj b3N
related: M3tL 3Qr oeB
related: DsHp orw 8Xb
related: zRtu fYj XC4
related: u8ZW NcV 2zS
related: SmZd Jaa BeY
related: rUFy uF1 xEZ
related: WXkX o6j FYv
related: E67G PGy fiG
related: 4kGs W7M KPH
related: MsNS 1ea u4p
related: vzLC DTR L4A
related: ofzH ikr 67D
related: YqX1 qhL cBm
related: qWYC L13 rqj
related: f4kd T2t umz
related: woCn NVG HCt
related: DQCy 18d JFa
related: HPrg bZM zh2
related: gYZ2 QV9 HAA
related: fFAM jC1 ur5
related: 76CR p4q sXc
related: UywC oRy tsV
related: otrX HCb Vqx
related: C2MH EZ6 MwR
related: JRvh wrY RmW
related: hW4B SZF Qic
related: ehdK SJC 38W
related: uP2s 9yi BaC
related: wBPu wTW RgG
related: rjz2 sA1 6WT
related: AYst mik wuC
related: cMAq 57S pfD
related: e19A nXQ Hxr
related: S84r Tb5 5EC
related: wZg2 hFD TPv
related: aJkj 92P Hdu
related: 3DEA r7Q YxU
related: bgjg cQD QgM
related: CWfM RL9 V4t
related: Tx1P roR sJy
related: oXnh Ffg j7m
related: gn6h J5L oGf
related: C2161
related: RrWD 6m1 ess
related: X9ta N3H 1is

Yrken med krav på fördjupad högskolekompetens inom utbildning
type: Concept
in scheme: JobTech Taxonomy - Yrke
definition: Yrken med krav på fördjupad högskolekompetens inom utbildning
broader: Yrken med krav på fördjupad högskolekompetens
narrower: Grundskollärare, fritidspedagoger och förskollärare
narrower: Lärare i yrkesämnen
narrower: Universitets- och högskolelärare
narrower: Andra pedagoger med teoretisk specialistkompetens
narrower: Gymnasielärare

Verksamhetschef, hälso- och sjukvård
type: Concept
in scheme: JobTech Taxonomy - Yrke
definition: Verksamhetschef, hälso- och sjukvård
broader: Chefer inom hälso- och sjukvård
related: DX3K M8j cWk
related: Eyf7 emF GdD
related: rxML nRL 1kV
related: NYW6 mP6 vwf
related: XCVr p7k Mb5
related: epLc SkD cbT
related: 2a5L QBV PRJ
related: Ncgy X7y Xez
related: bh3H Y3h 5eD
related: Ha6a WZZ 8Qy
related: gHsz oRm Kc8
related: sf4B WdJ M8K
related: sUfk jph hEf
related: 5Aju 6CW YGY
related: cyt6 oJC ytP
related: Kets Qec 4rp
related: okvK Niy PQQ
broad match: C1342

Forskare, cell- och molekylärbiologi
type: Concept
in scheme: JobTech Taxonomy - Yrke
definition: Forskare, cell- och molekylärbiologi
broader: Cell- och molekylärbiologer m.fl.
related: kJeN wmw 9wX
related: TXx8 Mgv BGZ
broad match: C2131

Trädgårdsmästare odling
type: Concept
in scheme: JobTech Taxonomy - Yrke
definition: Trädgårdsmästare inom odling leder, planerar och utvecklar verksamhet inom trädgårdsodling. Arbetsuppgifterna innefattar odling av bland annat köksväxter, prydnadsväxter och blommor. Odling innefattar till exempel sådd, plantering, omplantering, bevattning, ogräsrensning och växtskyddskontroll. Arbetet kan både ske i utomhusodlingar och i växthus. Yrket liknar odlingsarbetare inom trädgård, med skillnaden att trädgårdsmästaren är mer kvalificerad. Trädgårdsmästare har god växtkännedom för att kunna välja rätt växter till olika miljöer samt ge rådgivning till kunder. Det är inte ovanligt att man som trädgårdsmästare är även är arbetsledare. Källa: Gröna arbetsgivare, Arbetsförmedlingen
broader: Trädgårdsodlare
related: vPT2 MnU osq
related: oE1X UbX 6Sz
related: cMjf wVd KaY
related: VuuL 7CH adj
broad match: C6113

Marinbiolog
type: Concept
in scheme: JobTech Taxonomy - Yrke
definition: En marinbiolog studerar livet i havet och dess ekosystem. Det inkluderar att undersöka marina organismer, deras beteenden, interaktioner med miljön och hur de påverkas av klimatförändringar och föroreningar. De kan också arbeta med bevarande och restaurering av marina livsmiljöer. Källa: Arbetsförmedlingen, Göteborgs universitet
broader: Växt- och djurbiologer
related: kJeN wmw 9wX
related: 7Sa8 6sV uFf
broad match: C2131

Konstruktör, tillverkningsindustri
type: Concept
in scheme: JobTech Taxonomy - Yrke
definition: Konstruktör, tillverkningsindustri
broader: Ingenjörer och tekniker inom maskinteknik
related: 6Hq3 tKo V57
related: 9aEn jPz gJs
related: KWNv oWK 5E2
related: wVa4 No7 Lcd
related: C41S vox 2gE
broad match: C3115

Ljusdesigner
type: Concept
in scheme: JobTech Taxonomy - Yrke
definition: Ljusdesigner planerar och utformar ljussättningar för olika miljöer och evenemang med fokus på funktion, estetik och användarens behov. Vanliga arbetsuppgifter är att utifrån miljö och kundens önskemål, skapa ljusplaner och projektera teknisk utrustning för belysning i inomhus- och utomhusmiljöer. Ljusdesignern samarbetar ofta med arkitekter, elektriker och andra yrkesgrupper för att säkerställa energieffektivitet och hållbarhet i belysningsprojekten. Vid evenemang och scenproduktioner deltar ljusdesignern i planering och riggning av belysning, justerar ljusintensitet och färg för att skapa rätt atmosfär samt följer och anpassar belysningen under produktionens gång. Källa: Arbetsförmedlingen, Ljuskultur, Yrkesnämnden för Film och TV
broader: Ljus-, ljud- och scentekniker
related: 8too bEs 7NU
related: 9puE nYg crq
related: d1Ao 9bY 7Kn
broad match: C3435

ST-läkare, arbets- och miljömedicin
type: Concept
in scheme: JobTech Taxonomy - Yrke
definition: Specialisttjänstgöring, ST, är den vidareutbildning som legitimerade läkare genomför för att uppnå specialistkompetens. ST-läkare arbets- och miljömedicin arbetar under handledning för att fördjupa sina medicinska kunskaper och färdigheter med målet att bli specialistläkare inom sitt område. ST-läkaren arbetar självständigt med patientutredningar, diagnostik och behandling, men alltid med stöd av specialister och enligt ett individuellt utbildningsprogram. Vanliga arbetsuppgifter är att ta medicinskt ansvar för patienter, delta i jourverksamhet, genomföra medicinska undersökningar och behandlingar samt dokumentera och följa upp vårdinsatser. Tjänsten omfattar också kontinuerlig kompetensutveckling, sidotjänstgöring inom närliggande områden och aktivt deltagande i handledning och utbildningsinsatser för kollegor och studenter. Källa: Arbetsförmedlingen, Karolinska Universitetssjukhuset, Sveriges läkarförbund, Region Kronoberg, Region Skåne.
broader: ST-läkare
related: NYW6 mP6 vwf
related: UtCj yMj ubw
broad match: C2211

Forskare, filosofi
type: Concept
in scheme: JobTech Taxonomy - Yrke
definition: Forskare, filosofi
broader: Arkeologer och specialister inom humaniora m.m.
related: smyE xeR U3c
related: X82t awd Qyc
broad match: C2633

Evenemangs- och reseproducenter m.fl.
type: Concept
in scheme: JobTech Taxonomy - Yrke
definition: Producerar och organiserar turist-, affärs-, grupp- och konferensresor. Arrangerar och samordnar konferenser, evenemang, tillställningar, fester och seminarier. Undersöker resmål. Förhandlar om pris och andra villkor samt skriver avtal. Sammanställer resekataloger, tidtabeller och broschyrer. Hit hör inte Resebyråchef (1790) Resesäljare/Reseförsäljare/Resekonsulent (4221)
broader: Förmedlare m.fl.
related: S2pg pcs tXu
related: C3332
related: CrTX qgG frX
related: hb3b fH2 bvK
related: 7tVG 9zf 7mw
related: XoHM u1a yME
related: UH9g R5v MCx
related: SmZd Jaa BeY
related: ATGE 8XW 5oB
related: C3339
related: s2Sw EzL Jf9
related: czR7 FQn xu4
related: Fiq4 siu LXn
related: Gt5f wdi FSJ
related: q7Mx gjU F9q
related: 2KH5 1dw QQF
related: 4fRg DA4 Dj3
related: JrFm mSj r3a
related: ro7t 8qz rAz
related: Hrw8 4Wr hSy
related: Bbj8 8y7 XJ5
narrower: Reseproducent
narrower: Eventansvarig/Eventkoordinator
narrower: Konferensplanerare
broad match: RPTn bxG ExZ

Scripta
type: Concept
in scheme: JobTech Taxonomy - Yrke
definition: Scripta säkerställer kontinuiteten i produktionen av tv-program, filmer eller direktsändningar genom att se till att allt i varje scen är korrekt och sammanhängande. Vanliga arbetsuppgifter är kontroll så skådespelarna har rätt kläder och frisyr, rör sig på rätt plats och att rätt föremål finns med vid varje inspelningstillfälle. Vid inspelning av tv-program eller direktsändningar hanterar scriptan tidsscheman, följer upp inslagens längd och kommunicerar med programledare och producent för att säkerställa att produktionen flyter enligt plan. Källa: Arbetsförmedlingen, Scen & Film
broader: Inspicienter och scriptor m.fl.
related: 8too bEs 7NU
related: 9puE nYg crq
broad match: C3435

Kostymtekniker/Påklädare
type: Concept
in scheme: JobTech Taxonomy - Yrke
definition: Kostymtekniker/Påklädare
alternative label: Kostymtekniker
alternative label: Påklädare
broader: Skräddare och ateljésömmerskor m.fl.
related: 9puE nYg crq
broad match: C7531

Ljus-, ljud- och scentekniker
type: Concept
in scheme: JobTech Taxonomy - Yrke
definition: Installerar och programmerar utrustning för ljus, ljud och scenmaskineri. Svarar för och sköter ljussättning. Ansvarar för sceners byggnad, funktion och tekniska utrustning samt underhåll. Planerar och genomför föreställningar med artister inom scenkonsten. Bygger, skiftar och river dekor.
broader: Bild-, ljud- och ljustekniker m.fl.
related: 27SK YN7 i8o
related: 5ySf wD5 zXz
related: kZaX Qog mPK
related: ZefA esM Z9F
related: vTY5 WmQ vF8
related: j2Nm bxT X8R
related: jYGN rDK tM2
related: 5z4W tEu PMN
related: BZDw 9aj p4S
related: E44v wYZ wjx
related: b37x ceN azW
related: TGZ1 Xb5 77h
related: poUy FfV mr3
related: hY1R jKB zNr
related: 3gX3 7Ha 7np
related: 5And Mn6 F6p
related: QBAx kfV k7Q
related: fJdB viK AaA
related: Gmgc YGn E8Q
related: 5kzq otj mTk
related: jMr4 gFw Ppi
related: assp hgx pSE
related: oaiv GsB AFK
related: SuJz U6P sjm
related: vBXv GSE KL2
related: 66Vu jsy Xuo
related: prQp aMi qfU
related: bzFf qDr Brc
related: KpqX tAL Nq7
related: aHCV VsV LiD
related: ayfb EoM HAD
related: 4Jvy d7p 1fH
related: B83k mVq 771
related: pSb6 EzY ePy
related: C3435
related: Fk1v AKA Xnq
related: xHUG ruV huh
related: 7tvZ Vey JsX
related: kmFW EKW yWf
related: 4z4f Tzu S2s
related: Aj1W rmu niY
related: neNF p4s HJG
related: nvXa KhJ VWE
related: 6UDL QSQ 8Ng
related: yFgG g8k r6r
related: afZ1 jd6 Hmk
related: y1Wx UpU Gi3
related: 1UED QHH JbF
related: vSqz 6Hj Jrg
related: Rzes KdR abx
related: MjGw w7j Vm5
related: HW3B CwN pst
related: x9fo ku1 W1p
related: wJXm pi7 5xW
related: Mg1Y oVm Awu
related: PELm cH9 AE9
related: E2ZW X4f Tub
related: YLjq aQ5 rLK
related: rpFq AaL qV5
related: XCdg UJK w2q
related: qhJ9 N4G BQg
related: Emrj oG2 D7b
related: EK82 anj cWV
related: UQbL dqR PLQ
related: xBMn di4 duY
related: 1vsK SsR 8nK
related: 6DSV q3G vh6
related: 2pEK BNW U6j
related: NLoc CxC teD
related: pLyW JYJ TFq
related: 9nEt vAu z2d
related: DEWT 5Sj yMn
related: 1VVe BBY rpQ
related: 4QgZ EtG Nx2
related: 5Bkd cxC nSj

Maskinoperatörer, blekning, färgning och tvättning
type: Concept
in scheme: JobTech Taxonomy - Yrke
definition: Styr och övervakar maskiner som bleker, färgar, tvättar eller på annat sätt behandlar garner, tyger och textilprodukter. Kemtvättar textil, skinn eller läder.
broader: Maskinoperatörer, textil-, tvätt- och läderindustri m.m.
related: XrKQ xjb vku
related: VPF1 UZM 9Kd
related: C8154
related: UFfC aC2 MiC
related: 2pjc Vto TGH
related: JLX2 ZVk veF
related: qQ61 EQR rcz
related: VTwt 5Fe 6bW
related: wJXm pi7 5xW
related: C9129
related: KDzy Hra iVr
related: 6qzB 6TW D6m
related: sbYJ XwB o8X
related: d3oB oX3 kF8
related: C8157
related: ud63 vCw ooz
related: c9Pm UbT erW
related: 23oc Z6a Gp9
related: iGRX n2H BvE
related: Rbju P7i 12U
related: odqP Cwo Jm8
related: X4EU ZC7 QmK
related: gHJq eho Gnz
related: AiwS Mhv ttk
related: uenm 75h fEh
related: kA7s yHL nJ2
related: MT1a Nyq DGQ
related: rwir xvu 443
related: Q1Hg zst Ybi
related: dWbY gXC Frx
related: mMDu vMB SvK
narrower: Kemtvättare
narrower: Maskinoperatör tvätt och textilbehandling
broad match: wTEr CBC bqh

Ventilationsplåtslagare
type: Concept
in scheme: JobTech Taxonomy - Yrke
definition: Ventilationsplåtslagaren arbetar inomhus med att tillverka och även montera ventilationskanaler, både standardiserade produkter och kundanpassade lösningar. En del ventilationsfirmor har egna verkstäder och tillverkar kanaler och passbitar själva. Många ventilationsplåtslagare har specialiserat sig på att sköta drift och underhåll av större ventilationsanläggningar. Källa: Arbetsförmedlingen
broader: Byggnads- och ventilationsplåtslagare
related: j7Cq ZJe GkT
related: xhm9 RcG RgF
related: 9SRQ Ktd Ktq
related: ja7J P8X YC9
related: JezX oUD TZr
broad match: C7213

Tandhygienister
type: Concept
in scheme: JobTech Taxonomy - Yrke
definition: Behandlar patienter och ger information om förebyggande åtgärder om tandhälsa. Undersöker munhåla samt tar saliv- och bakterieprov. Gör tester, kostutredningar, tar röntgenbilder och utför tandlossningsbehandlingar. Assisterar vid tandreglering. Ger smärtlindring, tar bort tandsten och andra beläggningar på tänderna.
broader: Tandhygienister
related: dncA DPY 5bh
related: nZbw skg yDf
related: MVKv XXk XAi
related: C3251
related: F7nJ k5s L29
related: 9RTm B69 6ec
narrower: Tandhygienist
broad match: NYW6 mP6 vwf

Fastighets- och förvaltningschefer
type: Concept
in scheme: JobTech Taxonomy - Yrke
definition: Formulerar och ansvarar för mål och strategier för fastighetsförvaltning och fastighetsskötsel. Utformar riktlinjer, följer upp och utvärderar verksamheten mot uppsatta mål. Svarar för budget samt fördelar resurserna inom verksamheten. Har personalansvar.
broader: Fastighets- och förvaltningschefer
related: C1219
related: UQod 7GP JXL
related: s5SS 7bW 1Gh
related: ySUN PZC HQW
related: YS7V c8n MrS
related: G7Qq r7L 5Jo
related: UH9g R5v MCx
related: SmZd Jaa BeY
related: 29MP yhF mjx
related: 8tYq EXD Xwm
related: ZzN5 m7B 5CY
related: detQ YNb 9nG
related: 26yR WKq qra
related: Nksx 4oe fEQ
related: eThQ HCv mY6
related: 5PjX 999 uLZ
related: X9Kc p8a 1FB
related: Gt5f wdi FSJ
related: zYxB rdv AyB
related: q7Mx gjU F9q
related: D6ev Zwt x83
related: zXNU zXR hGd
related: w3vG ygN 1Dt
related: stf1 dHR XDT
narrower: Förvaltningschef, region
narrower: Driftchef fastighet
narrower: Fastighetschef/Fastighetsdirektör
narrower: Förhandlingschef
narrower: Förvaltningschef, kommun
broad match: bh3H Y3h 5eD

Larmoperatör
type: Concept
in scheme: JobTech Taxonomy - Yrke
definition: Larmoperatörer övervakar och hanterar larm och nödsamtal. Arbetet innebär i huvudsak att bedöma larm vidta lämpliga åtgärder, såsom att kontakta väktare, räddningstjänst, polis, ambulans eller annan funktion. Man arbetar vanligtvis på en larmcentral och vanliga arbetsgivare är företag som erbjuder larm för övervakning av bostäder eller kommuner som erbjuder larm för äldre i behov av assistans i hemmet. Yrket liknar SOS-operatör. Källa: Arbetsförmedlingen
broader: SOS-operatörer m.fl.
related: SYuq cUo zfe
related: ps3U pVn N9y
related: E7hm BLq fqZ
related: vQYu BZ4 sVX
related: gssV f7t 45D
related: dPGK FaB qEL
related: ybgL rSm H3b
related: o2kn j2J RfC
related: Pxoe 5vx GK6
related: Cg87 nhB SE2
related: afBs rDP 63e
related: 5J7j eQA Rdm
related: t7yt 1kH nBg
broad match: C4223

Skadereglerare
type: Concept
in scheme: JobTech Taxonomy - Yrke
definition: Skadereglerare
broader: Skadereglerare och värderare
related: ReeS G6J zNK
related: emnh ZkD 9WW
related: qvMK fNZ aKS
related: igja epb pZ5
related: JWoF UZd 3bS
related: tKkY c6H ZYj
related: X82t awd Qyc
related: hXCT rpY eBi
related: VbG6 1aw TmK
related: NPYe J6N ej7
related: 9wnW E25 o2X
related: mnHN XkG c3Y
related: tiHV D7o NVc
related: A4sm pXR PaU
related: JfyC kVJ 19h
related: ppWU H2S sEd
related: toZS EwK UbP
related: n6rC vas Z9P
related: LR3z zoR D7y
related: m6eh HAP g6C
related: ajbT fgA pXn
related: Zz8Z upK TZJ
broad match: C3315

Rättstolk
type: Concept
in scheme: JobTech Taxonomy - Yrke
definition: Rättstolk
broader: Översättare, tolkar och lingvister m.fl.
related: cspa Mji BMS
related: 9puE nYg crq
broad match: C2643

Gymnasielärare
type: Concept
in scheme: JobTech Taxonomy - Yrke
definition: Undervisar på gymnasial nivå i teoretiska och praktisk-estetiska ämnen. Planerar, genomför och utvärderar undervisningen i enlighet med läro- och ämnesplaner. Utför bedömning och betygsättning.
broader: Gymnasielärare
related: 7Y6d qDZ Eyt
related: rMAJ LtV Buz
related: tFQp CMY XaS
related: MCW1 mYH 7HG
related: CY51 GFA gj4
related: FfFd Ycj VvG
related: tkRF GjY HxJ
related: YjTj gJp QtG
related: wWkX mBk RTh
related: 8eNP dcg Txi
related: Cg3t mwF yoD
related: 94Fw DVh WB3
related: djrB 81Q kpv
related: tqxw vEf tcR
related: QuZ4 Sg4 aK5
related: RcTd Nmu E8w
related: SpRR JX9 6o6
related: yKnk W7X Zvk
related: 9AMe wHs BU7
related: jLoM Cde Xzu
related: gN4Z uRf LQp
related: CXiG sHf heV
related: yMpX hfE xgc
related: zJZd pDs SDf
related: V5EN xw2 itk
related: 6MbJ 1ZU u79
related: 4Jam Qwj AEo
related: fsKs yge JpD
related: xaJe i6p ZV1
related: y2qp oR2 Dsg
related: bsdC aAW gsF
related: F7Vr 28a Wss
related: oLnc YZn 3bm
related: CmL8 zFo zAm
related: tg1e QpF xdX
related: ELwo Vin g8P
related: ZnJ4 5qu acR
related: kvrB bj8 7rx
related: 6yLc 27Y Eoq
related: SGWu X5V B9V
related: yPqy kCf qVA
related: nLJN byo zWa
related: 7ytF sAd 1He
related: C3Fc BSX rpH
related: epum uTL ZG8
related: kJGe dRZ LB4
related: skDv HzL Vhg
related: KqHK SX3 KHU
related: xQbn aKU 1Nn
related: w7Am VmF 1KD
related: zzHa WZz Gre
related: 3qUu 1Sw T6C
related: SxfZ k7F cJ2
related: fFER Rqw s9F
related: rseM fd3 K7N
related: cS5D iQN PWA
related: dAz5 TeD 2t5
related: F1TT MpK WF5
related: LQer Y4Y hD1
related: Sg51 iG1 ny2
related: bhjq z6a zpP
related: 5xsd oFo RXw
related: C2330
narrower: Ämneslärare, gymnasieskolan
narrower: Modersmålslärare i gymnasieskolan
narrower: Folkhögskolelärare
broad match: MVqp eS8 kDZ

IT-pedagog
type: Concept
in scheme: JobTech Taxonomy - Yrke
definition: IT-pedagoger stödjer lärare, elever och ibland även administrativ personal i att använda digitala verktyg och plattformar i undervisningen. Typiska arbetsuppgifter är handledning kring digitalisering och lärande, teknisk support av digitala system, administrativ hantering av konton och inventarier samt utbildning av kollegor i digitala arbetssätt och verktyg. IT-pedagogen kan dela vissa arbetsuppgifter med yrket Mediepedagog. IT-pedagogen har ofta ett bredare tekniskt ansvar och arbetar mer med teknisk support, plattformshantering och användarsupport i utbildningsmiljön. Källa: Arbetsförmedlingen
broader: Övriga utbildare och instruktörer
related: SWxW DEL F1c
related: CQZK ngU maz
related: 2vRj 2YF unA
related: Hmav 3m6 jMh
related: ar4U kEG rw2
related: RG9d Kw6 tuf
related: Do2r Udf Y2J
related: zRBV aoZ 7r8
related: MVqp eS8 kDZ
related: vWQS rix AKD
broad match: C2356

Stagehand
type: Concept
in scheme: JobTech Taxonomy - Yrke
definition: Assisterar tekniker vid uppbyggnad, nedmontering och drift av scener och utrustning vid musikfestivaler, konserter och liknande evenemang. Arbetet inkluderar att sätta upp miljöljus, staket och att assistera vid uppbyggnad och nedmontering av bland annat ljud-, ljus- och videoteknisk utrustning. Stagehands kör ofta truck och lift (bom och sax). Källa: Musikerförbundet.
broader: Ramppersonal, flyttkarlar och varupåfyllare m.fl.
related: hgGs 3tz X56
related: 9puE nYg crq
related: VT3v mBG Gzs
broad match: C9333

Forskare, filmvetenskap
type: Concept
in scheme: JobTech Taxonomy - Yrke
definition: Forskare, filmvetenskap
broader: Arkeologer och specialister inom humaniora m.m.
related: X82t awd Qyc
broad match: C2632

Organisationschef
type: Concept
in scheme: JobTech Taxonomy - Yrke
definition: Organisationschef
broader: Chefstjänstemän i intresseorganisationer
related: epLc SkD cbT
related: c2ND AEZ yfk
related: bh3H Y3h 5eD
broad match: C1114

Efterbearbetningsredaktör
type: Concept
in scheme: JobTech Taxonomy - Yrke
definition: Efterbearbetningsredaktör bearbetar och kvalitetsgranskar text-, ljud- eller videomaterial efter produktion för att säkerställa korrekthet och anpassning till målgruppen. Vanliga arbetsuppgifter är att redigera och granska innehåll, samarbeta med olika yrkesgrupper som fotografer och grafiska formgivare och använda programvaror för digital publicering. Källa: Arbetsförmedlingen
broader: Journalister m.fl.
related: pYez WWr Ygt
related: 8too bEs 7NU
related: 9puE nYg crq
broad match: C2642

Skattehandläggare
type: Concept
in scheme: JobTech Taxonomy - Yrke
definition: Granskar deklarationer, köpebrev och andra dokument för att bestämma skatter m.m. Kontrollerar inbetalningar av bl.a. mervärdesskatt och arbetsgivaravgifter.
broader: Skatte- och socialförsäkringshandläggare m.fl.
related: bgC3 M9R 1K4
related: hVq9 mTt xkv
related: UCEs UUA qzM
related: hyxS oGs LV2
related: uA7X Pqn n9a
related: UBgX VLG mTK
related: C3352
related: QAaJ QeY Q6P
related: X9Kc p8a 1FB
related: Qcp3 Ptz 73U
related: ZSXe KXh TzJ
narrower: Folkbokföringshandläggare
narrower: Skattehandläggare
broad match: X82t awd Qyc

Park- och trädgårdsarbetare
type: Concept
in scheme: JobTech Taxonomy - Yrke
definition: Park- och trädgårdsarbetare utför underhåll och skötsel av grönytor och offentliga platser såsom parker, lekplatser och idrottsanläggningar. Arbetsuppgifter inkluderar beskärning, gräsklippning, ogräsrensning, renhållning av gångvägar, snöröjning och underhåll av lekplatser och lekplatsutrustning. Yrket liknar Trädgårdanläggare, med skillnaden att trädgårdsanläggare mer arbetar med anläggning av grönytor och parkarbetare mer arbetar med skötsel och underhåll. Källa: Arbetsförmedlingen
broader: Trädgårdsanläggare m.fl.
related: JC6G oqj qF5
related: 4eAh X4W Q6Y
related: MjfF kQk Aeq
related: j7Cq ZJe GkT
related: J4ma Hx6 6Re
related: dEhw Tif eXV
related: hb5o pc6 A3w
related: WoUp zjg RaM
related: KMYm Swy 7Lm
related: 3cpM zES 1t4
related: wUNg amR q2C
related: Cohg An3 D5n
related: VuuL 7CH adj
broad match: C6113

Träarbetare/Snickare
type: Concept
in scheme: JobTech Taxonomy - Yrke
definition: Träarbetare arbetar med nybyggnation, ombyggnation och renovering av bostäder och lokaler. De bygger bland annat formar för betonggjutning och tillverkar träkonstruktioner för stommar eller mellanväggar. De monterar förtillverkade träelement, fönster- och dörrkarmar, väggbeklädnad och inredning. En del träarbetare arbetar också vid anläggningsprojekt, exempelvis med formsättning på brobyggen. Snickaren kan ansöka om sitt yrkesbevis efter teoretisk grundutbildning och lärlingsanställning. Källa: Arbetsförmedlingen, BYN
alternative label: Snickare
alternative label: Träarbetare
broader: Träarbetare, snickare m.fl.
related: ZHfo Q4d A5r
related: DTMn NVu syb
related: qWGN Ntb X9D
related: 99VV cvn vRp
related: N444 AFd g19
related: j7Cq ZJe GkT
related: XUQK 1JN sTZ
related: TajA jzS rR4
related: LskB m1V y87
related: e9ys BFN hhm
related: Ksyu RLT 6UV
related: CeZb zN5 pDd
related: pTjB NqF QQQ
related: g5cz sLh nt3
related: QVMP YTx Yvp
related: rJQ8 RUH MNT
related: TitG psC mUT
related: THDa XCs fCa
related: ja7J P8X YC9
related: cTFk f3k 5gY
related: gnQk N6W Quf
related: 2aHV xTM F6X
related: iab4 dni rKt
related: AeQu UnZ cYm
related: jdxC vyu qT8
related: ViBn vuU w6G
related: kfnW vEt CUS
related: j2Po 6ez owW
related: HgbW f7C aYB
broad match: C7115

Hovmästare
type: Concept
in scheme: JobTech Taxonomy - Yrke
definition: Hovmästare leder och organiserar matsalens dagliga arbete i restaurangverksamhet. Arbetsuppgifterna omfattar schemaläggning, bordsplacering, bokningar, koordinering av serveringspersonal samt att ta emot gäster och säkerställa hög servicegrad under måltiden. Hovmästare hanterar även gästbemötande vid synpunkter eller särskilda önskemål och har ofta tät kontakt med kök och bar. Källa: Arbetsförmedlingen
broader: Hovmästare och servitörer
related: 2uaF Vem y6Y
related: nSAp omW j5Y
related: 1bM3 Fcc dgp
related: Mm9k 8gY zkE
related: 8YiX uKH 6MK
related: Csam F4W TQ4
related: 1Bv4 ohW HJs
related: ScKy FHB 7wT
related: 6Ztk stP hZb
related: E93i JpC uKS
related: j7mW p77 tRU
related: nage eGj cMi
broad match: C5131

Livsmedelstekniker
type: Concept
in scheme: JobTech Taxonomy - Yrke
definition: Livsmedelstekniker
broader: Ingenjörer och tekniker inom kemi och kemiteknik
related: 6Hq3 tKo V57
related: 5tyY GjC AcD
broad match: C3119

Telefonister
type: Concept
in scheme: JobTech Taxonomy - Yrke
definition: Tar emot och kopplar telefonsamtal. Ger upplysningar, tar emot meddelanden och lämnar besked. Sköter växel samt hänvisnings- och personsökningssystem.
broader: Resesäljare, kundtjänstpersonal och receptionister m.fl.
related: C4223
related: ZuYj ADn tk7
related: Yfsb 5XM edc
related: dpPY 3ww 6em
related: 6fA8 Pag kiG
related: 9B1F 3qZ XKQ
related: LYgG qg4 Luj
related: vnsR 9UF m4M
related: eWpk gcE zvZ
related: Mf1y rt5 Vee
related: BbkD 1NJ Hg8
related: wJ4d rCr zdM
related: 2Tey au7 NC8
related: o8X2 cLi NFT
related: bGwc Vsq WTo
related: xHdj p3H 7QM
related: XT5q Tyw fiU
related: 8Xkn zp2 dEM
related: L2K6 Sov V61
related: E4eZ d4Y XYd
related: zrcG eDZ mB7
related: 7LDJ 3qX KKZ
related: fkZr Rq9 SJ7
related: 1Puq WVN uoK
related: vbYK yRG kbd
related: 5uUD NPd BGe
related: ewTK VCD mJ4
narrower: Växeltelefonist
narrower: Taxitelefonist
broad match: X82t awd Qyc

Projekteringsingenjör, el-tele och elektronik
type: Concept
in scheme: JobTech Taxonomy - Yrke
definition: Projekteringsingenjör, el-tele och elektronik
broader: Civilingenjörsyrken inom elektroteknik
related: 6Hq3 tKo V57
related: kDRm Yaa jAB
broad match: C2152

Lingvist
type: Concept
in scheme: JobTech Taxonomy - Yrke
definition: Lingvist
broader: Översättare, tolkar och lingvister m.fl.
related: 9puE nYg crq
broad match: C2643

Slipare m.fl.
type: Concept
in scheme: JobTech Taxonomy - Yrke
definition: Slipar verktyg samt hyvlar och polerar metallytor med hjälp av handverktyg och maskiner.
broader: Smeder och verktygsmakare m.fl.
related: VPF1 UZM 9Kd
related: U2hY M6p sTk
related: H4nC hQ4 Bia
related: PktN Uav zKf
related: jYc4 8xC 1vC
related: 6feF emv eji
related: izgp njB zUd
related: aHCV VsV LiD
related: C7224
related: pGts PKK c8W
related: YVaz 9nR 6NM
related: qQ61 EQR rcz
related: 93TS Pyu tx3
related: VTwt 5Fe 6bW
related: Xo8i dXU Ttr
related: 6Jyz u8a cDk
related: P6AS voF 8EY
related: GMdw jj7 iDB
related: KDzy Hra iVr
related: 4pts SrJ Jtp
related: GPG3 Xxf ETA
related: ZV8P ZC8 QVv
related: pztM n9K czt
related: zVKm f79 DtU
related: Xa6W AB4 Et1
related: qxTz 2gL d1w
related: SECo RtS YpB
related: goJA s5f s1q
related: BdEM JCH d3d
related: ZbaT 6f2 TUn
related: YYTs bTV g4D
related: av6Y uJo JpC
related: hXpe mGC Qsi
related: X4EU ZC7 QmK
related: s14J jjD yWe
related: BKYD AEo maF
related: 8TGJ EdB b7b
related: 54pq yKX MhV
related: uenm 75h fEh
related: wZpC X9a xzG
related: fxtc 9Nh dRm
related: tdhw 3o8 eVR
related: LhvF NZc r6N
related: RZf1 417 y1V
related: wVx5 BNn h5p
narrower: Gradare
narrower: Slipare metall
broad match: wTEr CBC bqh

Produktutvecklingschef
type: Concept
in scheme: JobTech Taxonomy - Yrke
definition: Produktutvecklingschef
broader: Forsknings- och utvecklingschefer
related: 4SDf bdq hgr
related: bh3H Y3h 5eD
related: SKyM PkB XTC
related: gYsa sqK kHH
related: ywYH yp8 cVi
related: wZbQ igj 8KM
related: JjjH eXs Fkd
related: FCzB UTD uHK
broad match: C1223

Djuruppfödare och djurskötare
type: Concept
in scheme: JobTech Taxonomy - Yrke
definition: Djuruppfödare och djurskötare
broader: Lantbruks- och trädgårdsyrken
narrower: Övriga djuruppfödare och djurskötare
narrower: Uppfödare och skötare av lantbrukets husdjur
narrower: Uppfödare och skötare av sällskapsdjur

Processtekniker, tillverkningsindustri
type: Concept
in scheme: JobTech Taxonomy - Yrke
definition: Processtekniker, tillverkningsindustri
broader: Ingenjörer och tekniker inom maskinteknik
related: 6Hq3 tKo V57
related: 9aEn jPz gJs
broad match: C3115

Golvläggare, utan yrkesbevis
type: Concept
in scheme: JobTech Taxonomy - Yrke
definition: Golvläggare arbetar med att installera ytskikt av olika material som trä, plast, textil, linoleum, klinkers och gummi på golv och väggar. De ansvarar för både underarbete, som slipning och spackling, samt det slutliga golvmaterialet, vilket kräver kunskap i olika arbetsmetoder. Ett viktigt arbetsområde är våtrum där golvläggaren installerar vattentäta plastmattor på golv och väggar, vilket kräver särskild hantverksskicklighet för att skapa täta skarvar. Källa: Arbetsförmedlingen
broader: Golvläggare
related: kp5c wm5 hNP
related: j7Cq ZJe GkT
related: ja7J P8X YC9
related: u6AV hMy D5Q
broad match: C7122

Imitatör
type: Concept
in scheme: JobTech Taxonomy - Yrke
definition: Imitatör
broader: Övriga yrken inom kultur och underhållning
related: 8too bEs 7NU
related: 9puE nYg crq
broad match: C2659

Naturvårdare
type: Concept
in scheme: JobTech Taxonomy - Yrke
definition: Naturvårdare arbetar med att sköta och underhålla naturområden, friluftsanläggningar och kulturmiljöer. Man är vanligtvis anställd av eller arbetar på uppdrag av en kommun. Arbetsuppgifterna inkluderar röjning av stigar och leder, skötsel av ängsmarker och beteshagar, samt underhåll av grillplatser, informationsskyltar och andra friluftanläggningar inom naturområden. Naturvårdaren hanterar även renhållning, reparationer och tillsyn av betesdjur. Andra uppgifter kan innefatta bekämpning av invasiva arter, riskbedömning och beskärning av träd samt att informera besökare. Arbetet syftar till att bevara biologisk mångfald och göra naturen tillgänglig och säker för allmänheten. Källa: Arbetsförmedlingen
broader: Skogsarbetare
related: qDxF zFx 5zW
related: Aerg PWC ad9
related: 2qEx hLz 1HE
related: JqKK YVn 24a
related: xAEY CVS H2t
related: 4Swx Kf6 7U3
related: VuuL 7CH adj
related: GHWy A8G wik
broad match: C6210

Miljösamordnare/Miljökoordinator
type: Concept
in scheme: JobTech Taxonomy - Yrke
definition: Miljösamordnare/Miljökoordinator
alternative label: Miljökoordinator
alternative label: Miljösamordnare
broader: Specialister inom miljöskydd och miljöteknik
related: kJeN wmw 9wX
related: AVyd e3d 9Cz
related: VNgB f7j nm6
related: jUVX Pe7 sEZ
related: FfDD gxA Bsr
related: pQPQ mWR BeB
related: fphj GdB wHq
related: MeoD fCN 9Y8
related: dh13 fKS Vz6
related: 4ff1 4gB Dew
related: ajVJ mbB Tza
related: eA62 ay3 C8V
related: 8CVP wmN yJZ
related: qxDM Vho AJf
broad match: C2133

2:e Fartygsingenjör
type: Concept
in scheme: JobTech Taxonomy - Yrke
definition: Andre fartygsingenjör ansvarar för den operativa driften av maskinerna och tillbringar mycket tid både i kontroll- och maskinrummet. Andre fartygsingenjör går vakt, planerar och utför driftsrutiner tillsammans med övrig maskinbesättning. Andre fartygsingenjör ansvarar för och arbetsleder vaktgående motorman. Behörigheter inom sjöfart såsom certifikat och behörighetsbevis som krävs för olika befattningar ombord och som styrs av, typ av fartyg, finns samlade i Transportstyrelsens behörighetsguide Källa: Satsa på sjöfart
broader: Maskinbefäl
related: dRFw Rcu dX7
related: zeu9 EPS rGu
related: cKfM cJv Wma
related: gs65 ynn fcr
related: ASGV zcE bWf
related: XouD cCj HZN
related: rTHs peG ji8
related: isig f6Z rjG
broad match: C3151

Lotsoperatör
type: Concept
in scheme: JobTech Taxonomy - Yrke
definition: En lotsoperatör på Sjöfartsverket är länken mellan skeppsagenter på ena sidan och lotsar och båtmän på andra sidan. Lotsoperatören har kontakt med skeppsagenter och planerar det interna arbetet med lotsar och båtmän utifrån rutter, scheman och avtal och matchar med externa behov. För att arbeta som lotsoperatör måste du ha VHF-certifikat samt ha examen fartygsbefäl klass VIII. Källa: Sjöfartsverket
broader: Fartygsbefäl m.fl.
related: ASGV zcE bWf
related: gthF y5Z j3Z
broad match: C3152

Civilingenjörsyrken
type: Concept
in scheme: JobTech Taxonomy - Yrke
definition: Civilingenjörsyrken
broader: Yrken med krav på fördjupad högskolekompetens inom naturvetenskap och teknik
narrower: Civilingenjörsyrken inom logistik och produktionsplanering
narrower: Civilingenjörsyrken inom kemi och kemiteknik
narrower: Övriga civilingenjörsyrken
narrower: Civilingenjörsyrken inom gruvteknik och metallurgi
narrower: Civilingenjörsyrken inom elektroteknik
narrower: Civilingenjörsyrken inom bygg och anläggning
narrower: Civilingenjörsyrken inom maskinteknik

Silversmed
type: Concept
in scheme: JobTech Taxonomy - Yrke
definition: Silversmeder tillverkar smycken och prydnadsföremål så som ljusstakar, skålar bägare samt fat. Silversmeder arbetar ofta i samarbete med andra hantverksyrken, främst juvelfattare, gravörer och ädelstenslipare. Förutom tillverkning arbetar silversmeder även med reparation av smycken och prydnadsföremål. Det är möjligt att specialisera sig mot CAD som guldsmed och arbeta med prototyptillverkning och produktutveckling. Källa: Arbetsförmedlingen - Hitta yrken, Sveriges Guldsmedsmästares Riksförening
broader: Guld- och silversmeder
related: CfLP 34Z Zso
related: PaxQ o1G wWH
broad match: C7313

Krossoperatör
type: Concept
in scheme: JobTech Taxonomy - Yrke
definition: Krossoperatörer styr och övervaka maskiner som krossar och sorterar sten, grus och andra material för bygg- och anläggningsindustrin. Arbetet sker ofta både från kontrollrum och ute i verksamheten. Via kontrollrum styr och övervakar man processer, så som transportband. Vid arbete ute i verksamhet förekommer kontroll, rensning och rengöring av krossar, transportband och andra viktiga funktioner. Källa: Arbetsförmedlingen
broader: Processoperatörer, stenkross- och malmförädling
related: 5eaf yEL svd
related: 7ovh cGC iem
related: zr1Q aR3 uST
related: jUnL m88 NNE
related: fQ2a CwZ MfB
related: cZd2 kGp ntF
related: JaTw xd8 YWa
related: wTEr CBC bqh
related: zvPP ay1 4V1
related: fMLf G5x tCB
broad match: C8112

Lekterapeut
type: Concept
in scheme: JobTech Taxonomy - Yrke
definition: Lekterapeut arbetar inom vård och habilitering med att stödja barn och ungdomars utveckling, välmående och rehabilitering genom pedagogiskt och terapeutiskt lekinriktat arbete. Vanliga arbetsuppgifter är att förbereda barn inför vårdinsatser, stödja dem att bearbeta sina upplevelser samt att samarbeta med vårdpersonal, föräldrar och andra professionella kring barnets situation. Lekterapeuten ansvarar också för att skapa tillgängliga och stimulerande miljöer och bidra med pedagogisk kompetens i det tvärprofessionella vårdteamet. Arbetsgivare söker ofta personer med pedagogisk utbildning och erfarenhet av arbete med barn i utsatta situationer. Källa: Arbetsförmedlingen, Föreningen Sveriges lekterapeuter, Sveriges Kommuner och Regioner
broader: Förskollärare
related: UJrE Sez A7p
related: MVqp eS8 kDZ
broad match: C2342

Produktionsingenjör, gruv, metallurgi
type: Concept
in scheme: JobTech Taxonomy - Yrke
definition: En produktionsingenjör inom gruva och metallurgi arbetar med att planera, leda, optimera och övervaka produktionsprocesser i gruv- och metallindustrin. Målet är att säkerställa en effektiv, säker och hållbar produktion av metalliska mineraler och metaller. I arbetsuppgifterna ingår bl a att ansvara för teknisk utveckling och implementering av nya metoder och teknologier inom gruvteknik och metallurgi samt samverka med andra ingenjörer, tekniker och produktionspersonal för att driva förbättringsprojekt och utvecklingsarbete. Källa: Arbetsförmedlingen, div jobbannonser
broader: Ingenjörer och tekniker inom gruvteknik och metallurgi
related: 6Hq3 tKo V57
broad match: C3117

Forskare, humaniora
type: Concept
in scheme: JobTech Taxonomy - Yrke
definition: Forskare, humaniora
broader: Arkeologer och specialister inom humaniora m.m.
related: X82t awd Qyc
broad match: C2633

Processoperatörer, pappersmassa
type: Concept
in scheme: JobTech Taxonomy - Yrke
definition: Styr och övervakar anläggningar för tillverkning av pappersmassa och utvinning av biprodukter.
broader: Processoperatörer, trä- och pappersindustri
related: kU89 6jm mSQ
related: C8171
related: VPF1 UZM 9Kd
related: ECs4 p2b JiU
related: 74Mw JUN VKx
related: 2pjc Vto TGH
related: AQtr C7f Dyt
related: pGts PKK c8W
related: aF3J SgE uck
related: HaDE 8sC U7g
related: qQ61 EQR rcz
related: VTwt 5Fe 6bW
related: KDzy Hra iVr
related: 1vX4 pj1 yao
related: VEhs pCc zME
related: GCYi 9tC 1pP
related: Rbju P7i 12U
related: uenm 75h fEh
related: MT1a Nyq DGQ
related: qn22 kbi Mwa
related: 5pEK LCW skF
related: dWbY gXC Frx
related: 1fwa 6JE zw1
related: LhvF NZc r6N
narrower: Processoperatör pappersmassa
broad match: wTEr CBC bqh

Projektledare, bioteknik
type: Concept
in scheme: JobTech Taxonomy - Yrke
definition: Projektledare, bioteknik
broader: Tekniker, bilddiagnostik och medicinteknisk utrustning
related: 6Hq3 tKo V57
related: yXSE wvx EAN
broad match: C3211

Chief Information Security Officer
type: Concept
in scheme: JobTech Taxonomy - Yrke
definition: En Chief Information Security Officer (CISO) har det övergripande ansvaret för att skydda en organisations informationstillgångar mot olika säkerhetshot. Yrket innebär i huvudsak att utveckla, implementera och övervaka strategier och policyer för informationssäkerhet för att säkerställa konfidentialitet, integritet och tillgänglighet av data. Vanliga ansvarsområden är riskhantering, incidenthantering, regelefterlevnad och säkerhetsmedvetenhet. Då detta är en chefsposition ingår ansvar för verksamhet, personal och budget. Källa: Arbetsförmedlingen
broader: IT-chefer
related: 6MTz VKG Eim
related: bh3H Y3h 5eD
related: CA7f Z9y mCq
broad match: C1330

Anestesisjuksköterska
type: Concept
in scheme: JobTech Taxonomy - Yrke
definition: Anestesisjuksköterska ansvarar för att planera, genomföra och övervaka anestesi (narkos och bedövning) för patienter inför, under och efter operation eller andra medicinska ingrepp. Sjuksköterska är en skyddad titel med legitimationskrav. En anestesisjuksköterska med specialistsjuksköterskeexamen får använda benämningen specialistsjuksköterska inom anestesisjukvård. Vanliga arbetsuppgifter är att bedöma patientens hälsotillstånd och förbereda och administrera anestesi, sedering och smärtlindring vid planerade och akuta ingrepp, övervaka patientens andning, cirkulation och vitala funktioner under ingreppet samt snabbt åtgärda förändringar eller komplikationer. De flesta anestesisjuksköterskor ingår i ett operationsteam och arbetet kan omfatta jourtjänstgöring och arbete på obekväma tider. Källa: Arbetsförmedlingen, Karolinska Universitetssjukhuset, Linköpings universitet, Socialstyrelsen, Svensk sjuksköterskeförening
broader: Anestesisjuksköterskor
related: NYW6 mP6 vwf
related: jCqK dxK w65
related: NxX6 Q6V gkj
related: ytRi QuA XLX
related: 1f7B E5K sh3
broad match: C2221

Poliser
type: Concept
in scheme: JobTech Taxonomy - Yrke
definition: Poliser
broader: Yrken med krav på högskolekompetens eller motsvarande inom ekonomi och förvaltning
narrower: Poliser

Hotellvärd
type: Concept
in scheme: JobTech Taxonomy - Yrke
definition: Hotellvärdar välkomnar gäster och ger service vid kontaktpunkter som frukostmatsal, konferenslokal och lobby. Arbetsuppgifter omfattar bland annat frukostservering, påfyllning och avdukning av bufféer, samt enklare städning i allmänna utrymmen. Hotellvärden kan bistå vid konferenser och event, ställa i ordning lokaler och hjälper gäster med teknik och praktiska lösningar. Även arbete i hotellreception kan förekomma, vilket är vanligt på mindre hotell där det är mer vanligt med flexibel arbetsfördelning. Se även yrkena Campingvärd/Stugvärd respektive Hotellreceptionist. Källa: Arbetsförmedlingen
alternative label: Hotellvärdinna
broader: Hotellreceptionister m.fl.
related: UdVa jRr 9DE
related: yJzv aFk RL7
related: 7myH 6Pm uyz
related: GqR9 A2i 6Nc
related: dNmP L3z tFg
related: 8bSy NDN 5Px
related: JYFN yXM pZq
related: ScKy FHB 7wT
related: 3xYy 9Lu 47C
related: EKtK 5mt fum
related: Po7C 6HX YMb
broad match: C4224

Juristassistent/Advokatsekreterare
type: Concept
in scheme: JobTech Taxonomy - Yrke
definition: Juristassistenter och advokatsekreterare ger administrativt stöd till jurister och advokater. Vanliga arbetsplatser är advokatbyråer, domstolar eller företags juridiska avdelningar. Huvudsakliga arbetsuppgifter inkluderar administration och dokumenthantering, upprättande och granskning av juridiska handlingar såsom avtal och protokoll, förbereda underlag till förhandlingar och rättegångar, kontakthantering med klienter, domstolar och myndigheter samt diarieföring och ärendehantering. Källa: Arbetsförmedlingen
broader: Domstols- och juristsekreterare m.fl.
related: tEYY s9H aPk
related: d46K tRT TJb
related: hWGy jLq Hmt
related: X82t awd Qyc
broad match: C3342

Processtekniker, gjuteri
type: Concept
in scheme: JobTech Taxonomy - Yrke
definition: Processtekniker, gjuteri
broader: Ingenjörer och tekniker inom gruvteknik och metallurgi
related: 6Hq3 tKo V57
broad match: C3117

Fasadputsare
type: Concept
in scheme: JobTech Taxonomy - Yrke
definition: Fasadputsare jobbar med att applicera och underhålla puts på byggnaders fasader, vilket både skyddar och förskönar byggnaderna. Mest jobbar en fasadputsare med renovering av putsade fasader på gamla byggnader, där stommen kan vara av betong, tegel eller trä, oftast är det i specialiserade företag. Källa: Arbetsförmedlingen
broader: Övriga byggnads- och anläggningsarbetare
related: hQSi S2W c9D
related: j7Cq ZJe GkT
related: XCUK HsC Va9
related: Kn2E B9V Vxu
related: ja7J P8X YC9
broad match: C7119

Vårdbiträde
type: Concept
in scheme: JobTech Taxonomy - Yrke
definition: Vårdbiträden utför praktiskt omsorgsarbete och hemskötsel inom äldreomsorgen, som stöd till personer med funktionsnedsättning eller inom hälso- och sjukvården. Arbetsuppgifter för vårdbiträden är varierande. Vanligt förekommande uppgifter är att hjälpa till med personlig hygien, påklädning, linda ben, hjälpa brukaren att ta sin medicin, dokumentera och rapportera om förändringar i hälsotillståndet. Källa: Arbetsförmedlingen, Sveriges Kommuner och Regioner
broader: Vårdbiträden
related: iNVT UPG xNY
related: vbth r6Z Q97
related: UdVa jRr 9DE
related: NYW6 mP6 vwf
related: YxVc fg8 5MK
related: ya1f bG5 sP8
related: Pda7 Z6w 9t3
related: 4sh8 UWk V1P
related: qydA igL jQc
broad match: C5321

Planeringsingenjör, elektronik
type: Concept
in scheme: JobTech Taxonomy - Yrke
definition: Planeringsingenjör inom elektronik samordnar och planerar produktionsflöden för elektroniska komponenter och system. Arbetsuppgifterna innefattar resursplanering, kapacitetsanalyser, produktionsschemaläggning samt uppföljning av leveranstider. Planeringsingenjören samarbetar med produktion, inköp och kvalitet för att säkerställa effektiv materialhantering och produktionsprocesser. Planeringsingenjörer inom elektronik har vanligtvis kunskaper inom produktionsplanering, materialflöde, logistik och produktionssystem. Källa: Arbetsförmedlingen
broader: Ingenjörer och tekniker inom elektroteknik
related: 6Hq3 tKo V57
related: s36J uyz b9r
related: SvAW coW dGN
related: 29i3 pkD rSw
related: ibqa c8P izX
broad match: C3114

Mekatronikingenjör
type: Concept
in scheme: JobTech Taxonomy - Yrke
definition: Mekatronikingenjör
broader: Ingenjörer och tekniker inom maskinteknik
related: 6Hq3 tKo V57
related: 9aEn jPz gJs
related: Xa6n SaY 5PN
broad match: C3114

Ventilationsrengörare
type: Concept
in scheme: JobTech Taxonomy - Yrke
definition: Ventilationsrengörare rengör och underhåller ventilationssystem i olika typer av fastigheter. Vanliga arbetsuppgifter är inspektion av ventilationskanaler, borttagning av smuts och avlagringar samt byte av filter. I vissa fall kan arbetet även omfatta enklare serviceuppgifter relaterade till ventilationssystemet. Arbetet utförs ute hos kund, varför B-körkort ofta är ett krav. Källa: Riksförbundet Sveriges ventilationsrengörare, Arbetsförmedlingen
broader: Saneringsarbetare m.fl.
related: whao Q6A ScE
related: pniZ u3T 621
related: PZQe bHN G5L
broad match: C7133

Geodatasamordnare
type: Concept
in scheme: JobTech Taxonomy - Yrke
definition: En geodatasamordnare ansvarar för att hantera, samordna och utveckla organisationens geografiska information och dataflöden, ofta med fokus på kartor, mätdata och GIS-system. Arbetsuppgifternas fokus ligger på samordning, kvalitetssäkring och utveckling, i gränssnittet mellan teknik, verksamhet och datajuridik. Den kan innebära både strategiskt och operativt arbete, beroende på verksamhetens storlek. Källa: Arbetsförmedlingen
broader: GIS- och kartingenjörer
related: 6Hq3 tKo V57
related: XZ3N uRV VYH
related: H9JG vHM 7mx
broad match: C3118

Betongarbetare
type: Concept
in scheme: JobTech Taxonomy - Yrke
definition: Betongarbetarens uppgifter är bland annat att armera, gjuta och bearbeta betong i olika byggprojekt som till exempel husgrunder, golv och broar. Betongarbetare armerar och gjuter husgrunder, väggar och pelare. En betongarbetare arbetar inte bara med husbyggnad utan även vid väg- och brobyggen. Betongarbetare gjuter också betonggolv och efter gjutningen kan det krävas efterbearbetning, såsom vakumsugning och slipning för att höja ytans kvalite. Slipningen görs med hjälp av speciella maskiner. Betongarbetaren kan ansöka om sitt yrkesbevis efter teoretisk grundutbildning och lärlingsanställning. Källa Arbetsförmedlingen
broader: Betongarbetare
related: 3SMt JMH kqf
related: AqSr paR PFS
related: 85fS BpT RsU
related: j7Cq ZJe GkT
related: oi2k yag MNA
related: JThM vbH 9uy
related: rFyS zPg yy9
related: ja7J P8X YC9
related: 3ZRy pJD 9dL
related: tmhP Z1Y LMH
broad match: C7114

Forskare, odontologi
type: Concept
in scheme: JobTech Taxonomy - Yrke
definition: Forskare, odontologi bedriver självständigt forskning och utveckling inom tandvård och munhälsa, ofta med fokus på att förbättra diagnostik, behandling och förebyggande av orala sjukdomar. Vanliga arbetsuppgifter är att planera, genomföra och analysera kliniska eller laboratoriebaserade studier, samarbeta i tvärvetenskapliga forskningsprojekt, söka forskningsmedel samt presentera resultat vid konferenser och i vetenskapliga publikationer. Forskare inom odontologi arbetar ofta nära tandvårdspersonal och kan även delta i utbildning och handledning av framtida tandläkare och specialister. Källa: Arbetsförmedlingen, Karolinska Institutet, Malmö Universitet, Sveriges Tandläkarförbund
broader: Tandläkare
related: NYW6 mP6 vwf
related: YJWb bXT LYb
broad match: C2261

Filmtekniker
type: Concept
in scheme: JobTech Taxonomy - Yrke
definition: Filmtekniker arbetar med teknisk hantering av film- och tv-inspelningar för att skapa rätt bild- och ljudkvalitet enligt produktionens krav. Vanliga arbetsuppgifter är att rigga, justera och sköta kameror, ljussättning och ljudutrustning under inspelning och stå för teknisk support och felsökning. Arbetsuppgifterna kan inkludera förberedelser i studio eller på olika inspelningsplatser och hantering av utrustning som kranar, dollys och mikrofoner. Källa: Arbetsförmedlingen, Yrkesnämnden för Film och TV
broader: Bild- och sändningstekniker
related: 8too bEs 7NU
related: 9puE nYg crq
related: d1Ao 9bY 7Kn
broad match: C3521

Lärling, plattsättare
type: Concept
in scheme: JobTech Taxonomy - Yrke
definition: En lärling är anställd för att slutföra sin kvalificeringstid till plattsättare innan ett yrkesbevis kan utfärdas. Under kvalificeringstiden får du lärlingslön enligt avtal. Kvalificeringstiden tillsammans med teoretisk grundutbildning leder till yrkesbeviset. Ett lärlingsavtal mellan branschorganisation och företag tecknas. Källa: BYN
broader: Murare m.fl.
related: j7Cq ZJe GkT
related: ja7J P8X YC9
broad match: C7112

Kakelugnsmakare
type: Concept
in scheme: JobTech Taxonomy - Yrke
definition: Kakelugnsmakaren arbetar med renovering av gamla eller antika kakelugnar och nytillverkning. I arbetet kan även att bygga upp och renovera skorstenar, öppna spisar, kaminer, rörspisar och bakugnar ingå. Tätning av gamla skorstenar är en vanlig arbetsuppgift. Källa: Arbetsförmedlingen
broader: Murare m.fl.
related: j7Cq ZJe GkT
related: sXCC KD3 uaw
related: Zko3 gps YY9
related: ja7J P8X YC9
broad match: C7112

Konferensvärd
type: Concept
in scheme: JobTech Taxonomy - Yrke
definition: En konferensvärd ansvarar för att planera, förbereda och genomföra konferenser och möten, med fokus på att skapa en positiv och smidig upplevelse för gästerna. Rollen innefattar både service, koordinering och praktiska arbetsuppgifter före, under och efter konferenser, som t ex koordinera med olika avdelningar som reception, restaurang och teknisk support för att säkerställa att allt fungerar. Källa: Arbetsförmedlingen
broader: Hotellreceptionister m.fl.
related: UdVa jRr 9DE
related: DjpC e5r HT6
related: bt47 CXc PWq
related: kvrU RZg u6P
related: B6Jz dx2 veD
related: dNmP L3z tFg
related: X62q 8dE csh
related: Vsrd g6a hgv
related: ScKy FHB 7wT
related: UHKi rdq 415
related: rmmZ BG4 6tH
related: mcKJ cZ8 S7P
broad match: C4224

Distributionschef, logistik och transporter
type: Concept
in scheme: JobTech Taxonomy - Yrke
definition: Distributionschef, logistik och transporter
broader: Inköps-, logistik- och transportchefer
related: 1a6L dcj Lgf
related: epLc SkD cbT
related: ASGV zcE bWf
related: R4vq jmL YzR
related: bh3H Y3h 5eD
related: bGiM GHd s8e
broad match: C1324

Bakteriolog
type: Concept
in scheme: JobTech Taxonomy - Yrke
definition: Bakteriolog
broader: Cell- och molekylärbiologer m.fl.
related: CpFD aoS pkZ
related: kJeN wmw 9wX
related: TXx8 Mgv BGZ
related: fM7t axJ RNN
broad match: C2131

Industrirobotoperatör
type: Concept
in scheme: JobTech Taxonomy - Yrke
definition: Robotoperatör övervakar driften av industrirobotar. Robotoperatörer övervakar driften av industrirobotar och ser till att produktionen följer planerade processer. Arbetsuppgifterna innefattar att starta, stoppa och programmera industrirobotar samt justera inställningar vid behov. Man genomför även rutinmässiga kontroller och enklare underhåll. Se även yrken robotmontör som monterar industrirobotar respektive robottekniker som installerar och underhåller industrirobotar. Källa: Arbetsförmedlingen
broader: Övriga drifttekniker och processövervakare
related: Dpyk HFj Ykt
related: yhCP AqT tns
broad match: C3139

Patentingenjör/Patentkonsult
type: Concept
in scheme: JobTech Taxonomy - Yrke
definition: Patentingenjör/Patentkonsult
alternative label: Patentingenjör
alternative label: Patentkonsult
broader: Övriga civilingenjörsyrken
related: 6Hq3 tKo V57
related: oZdC 1mS cqA
broad match: C2149

Hotell- och konferenschefer
type: Concept
in scheme: JobTech Taxonomy - Yrke
definition: Hotell- och konferenschefer
broader: Chefer inom övrig servicenäring
narrower: Hotell- och konferenschefer

Fartygsplåtslagare
type: Concept
in scheme: JobTech Taxonomy - Yrke
definition: Fartygsplåtslagare tillverkar och reparerar skrov och andra detaljer på fartyg. Arbetsuppgifterna kan innefatta slipning, kapning, bockning och svetsning. Man arbetar främst i stål och aluminium. Arbetet sker utifrån ritning och kan beroende på arbetsplats även inkludera dokumentation och kvalitetskontroll. Förutom fartyg kan man även arbeta med konstruktion av vaggor och slipar för sjösättning och torrsättning av fartyg. Källa: Arbetsförmedlingen, ESCO
broader: Stålkonstruktionsmontörer och grovplåtsslagare
related: dRFw Rcu dX7
related: ez5f bYw pCV
related: wTEr CBC bqh
related: cDo5 EyL ciA
related: JezX oUD TZr
broad match: C7214

Forskare, virologi
type: Concept
in scheme: JobTech Taxonomy - Yrke
definition: Forskare, virologi
broader: Cell- och molekylärbiologer m.fl.
related: kJeN wmw 9wX
related: TXx8 Mgv BGZ
broad match: C2131

Köksmästare och souschefer
type: Concept
in scheme: JobTech Taxonomy - Yrke
definition: Köksmästare och souschefer
broader: Yrken med krav på högskolekompetens eller motsvarande inom kultur, friskvård och socialt arbete m.m.
narrower: Köksmästare och souschefer
narrower: Storhushållsföreståndare

Aktieanalytiker
type: Concept
in scheme: JobTech Taxonomy - Yrke
definition: Aktieanalytiker
broader: Finansanalytiker och investeringsrådgivare m.fl.
related: RbsF qLv jeg
related: t4E8 GkJ hRR
related: X82t awd Qyc
broad match: C2413

Fastighetsvärd
type: Concept
in scheme: JobTech Taxonomy - Yrke
definition: Fastighetsvärdar arbetar i nära kontakt med hyresgäster och fungerar som kontaktperson mellan fastighetsägare, förvaltning och boende. Arbetsuppgifter kan omfatta mottagning av felanmälningar, enklare reparationer och felsökning, besiktningar vid in- och avflyttning, nyckelhantering samt uppföljning av boendemiljö. Fastighetsvärdar har löpande kontakt med entreprenörer, leverantörer och företagets tekniska och ekonomiska förvaltning. I vissa fall ingår budgetuppföljning eller ansvar för ett avgränsat fastighetsområde. Källa: Fastighetsbranschens Utbildningsnämnd, Arbetsförmedlingen
alternative label: Bovärd
alternative label: Husvärd
broader: Fastighetsskötare
related: gxGb Vxg x98
related: yEn1 Mgi N35
related: 6Qmv YDF z1z
related: mDYw xz3 JTo
related: bsH3 Atj y7p
related: BjJm 9cp 5Fs
related: yhCP AqT tns
related: XXmp v4s 9E3
related: 7LxG 5FK cfA
related: bGD7 Vcg oQn
related: CR3P 8Vi 8Gk
broad match: C5153

Imam
type: Concept
in scheme: JobTech Taxonomy - Yrke
definition: Imam
broader: Präster
related: GazW 2TU kJw
broad match: C2636

Statistiker
type: Concept
in scheme: JobTech Taxonomy - Yrke
definition: Statistiker
broader: Statistiker
related: xwHS v6e 67u
related: BEu4 ptn yrA
related: UiXC PZR AuU
related: X82t awd Qyc
related: iLov uak Ev1
related: nzKt mvn 3fE
related: va2n 5jr Fiy
related: S9C4 HSo LpJ
broad match: C2120

Polismästare
type: Concept
in scheme: JobTech Taxonomy - Yrke
definition: Polismästare
broader: Övriga chefer inom samhällsservice
related: E7hm BLq fqZ
related: epLc SkD cbT
related: bh3H Y3h 5eD
broad match: C1349

Tandsköterskor
type: Concept
in scheme: JobTech Taxonomy - Yrke
definition: Assisterar tandläkare vid undersökning, behandling och operation av patient. Putsar och polerar tänder samt tar röntgenbilder. Planerar behandlingstider, för journaler, tar betalt och gör inköp. Rengör instrument och annan utrustning.
broader: Tandsköterskor
related: Msbw VmW pGi
related: Gt2A Snx 4xA
related: 1TcB b2C pjp
related: WkAF LMB ncC
related: C3251
related: F7nJ k5s L29
related: dfM3 SP6 6sg
related: Sacc jcW oKh
related: enLQ GrZ w3S
related: kJRF aBo YL2
related: FjqL Fvy iwc
related: cocQ EPn YiY
narrower: Ortodontiassistent
narrower: Tandsköterska
broad match: NYW6 mP6 vwf

Förskollärare
type: Concept
in scheme: JobTech Taxonomy - Yrke
definition: Undervisar och organiserar aktiviteter i förskola eller i förskoleklass. Planerar och genomför undervisning i enlighet med läroplan.
broader: Grundskollärare, fritidspedagoger och förskollärare
related: 7Y6d qDZ Eyt
related: CGBF fgA qnj
related: yyJQ gFx TKr
related: bCVZ ziY KHC
related: DxeT sRh 6kX
related: yBqM aw8 hWJ
related: Cg3t mwF yoD
related: C2342
related: QuZ4 Sg4 aK5
related: 9AMe wHs BU7
related: juhE YYk eS2
related: iVSa PYJ 19v
related: yMpX hfE xgc
related: MiDb pXE Dso
related: V5EN xw2 itk
related: tcgM 8bo yiv
related: oLnc YZn 3bm
related: NNNL 6SE hok
related: 1kW6 GKK Uxp
related: tg1e QpF xdX
related: C6hB VNA tu7
related: PKq5 HS9 xfk
related: nLJN byo zWa
related: 6Suw 3c1 47a
related: C3Fc BSX rpH
related: G8KJ TwR R1C
related: ys1g r9v QRz
related: 1dHC SwK 1ge
related: 761V 1np yUz
related: 5xsd oFo RXw
related: Gpb3 ty6 e1S
narrower: Förskollärare
narrower: Modersmålslärare, förskola
narrower: Lekterapeut
narrower: Lärare i förskoleklass
broad match: MVqp eS8 kDZ

Köksmontör
type: Concept
in scheme: JobTech Taxonomy - Yrke
definition: Köksmontörer sätter ihop och installerar köksstommar och köksinredning. Köksmontörer sätter ihop och installerar köksstommar och köksinredning hos kunder. Montering av stommar och inredning sker ofta på plats hos kunden och installeras sedan enligt ritning. Man kan även jobba specifikt med att anpassa färdiga stommar och då byta skåpluckar och annan inredning. Källa: Arbetsförmedlingen
broader: Montörer, träprodukter
related: j7Cq ZJe GkT
broad match: C8219

Manusförfattare
type: Concept
in scheme: JobTech Taxonomy - Yrke
definition: Manusförfattare skapar berättelser, dialoger och scenanvisningar för film, TV, teater eller andra medier genom att skriva manus utifrån idéer och research. Vanliga arbetsuppgifter är att ta fram idéer, göra fakta- och ämnesresearch och skriva och bearbeta manus utifrån feedback från producenter och regissörer. Arbetsuppgifterna inkluderar att formulera handlingar, miljöer, karaktärer och dialoger samt delta i manusutvecklingen, ofta i samarbete med andra manusförfattare och produktionspersonal. Källa: Arbetsförmedlingen, Dramatikerförbundet, Stockholms konstnärliga högskola
broader: Författare m.fl.
related: 8too bEs 7NU
related: 9puE nYg crq
related: iVSV AnC MAh
broad match: C2641

Studioman
type: Concept
in scheme: JobTech Taxonomy - Yrke
definition: Studioman
broader: Inspicienter och scriptor m.fl.
related: 9puE nYg crq
broad match: C3435

Fysioterapeutstuderande
type: Concept
in scheme: JobTech Taxonomy - Yrke
definition: Fysioterapeutstuderande är en student som utbildar sig till fysioterapeut. Vanliga arbetsuppgifter är assistera vid patientbedömningar, träning, rehabilitering och dokumentation under handledning. Källa: Arbetsförmedlingen, Sveriges Kommuner och Regioner
broader: Fysioterapeuter och sjukgymnaster
related: NYW6 mP6 vwf
broad match: C2264

Områdeschef, barnomsorg
type: Concept
in scheme: JobTech Taxonomy - Yrke
definition: Områdeschef, barnomsorg
broader: Chefer inom förskoleverksamhet
related: GazW 2TU kJw
related: epLc SkD cbT
related: bh3H Y3h 5eD
broad match: C1341

Illustratör
type: Concept
in scheme: JobTech Taxonomy - Yrke
definition: Illustratör skapar bilder och illustrationer för olika medier och syften, ofta utifrån uppdragsgivares behov och texter. Vanliga arbetsuppgifter är att göra skisser, utveckla koncept och färdigställa illustrationer för böcker, reklam, tidningar, digitala medier, animerade filmer och spel. Illustratören arbetar med både traditionella tekniker och digitala verktyg och program för att producera sina bilder. Ofta ingår kommunikation med kunder för feedback och justeringar innan det färdiga materialet levereras. Källa: Arbetsförmedlingen, Berghs School of Communication, Konstdepartementet
broader: Bildkonstnärer m.fl.
related: xSQ8 vjA NEq
related: NKYV uKz wn5
related: dFiU abk YAp
related: 8too bEs 7NU
related: 9puE nYg crq
related: ePeX QNX jtU
broad match: C2651

Fartygsbefäl, utan behörighetsbevis
type: Concept
in scheme: JobTech Taxonomy - Yrke
definition: Ett Fartygsbefäl har det yttersta ansvaret för besättningen, passagerarna och lasten. Fartygsbefälet har högst ställning på fartyget. Arbetsuppgifterna skiljer sig beroende på vilken sorts befälhavare man är, hur stort fartyget är, hur stor besättningen är och vilken last fartyget har. Som befälhavare har man också många administrativa uppgifter, har möten med andra chefer ombord, delegerar uppgifter och fattar beslut. Källa: Framtid
broader: Fartygsbefäl m.fl.
related: ASGV zcE bWf
related: XouD cCj HZN
broad match: C3152

Lantmätare
type: Concept
in scheme: JobTech Taxonomy - Yrke
definition: En lantmätare arbetar med att mäta och kartlägga mark och fastigheter, samt att hantera juridiska frågor som rör fastighetsgränser och äganderätt. De deltar i samhällsplanering och bidrar till att utveckla och bevara hållbara samhällen. Lantmätare använder avancerad teknologi, som GPS och laserskanning, för att skapa och uppdatera kartor och mäta in geografisk information. De utför förrättningar för att ändra fastighetsgränser, som avstyckningar, sammanläggningar och fastighetsregleringar. Källa: Lantmäteriet
broader: Lantmätare
related: 24Ug Jns JkQ
related: X82t awd Qyc
related: 3vqP awj YnK
related: kzpd qqP fmB
related: 2tyb 3Kf n33
broad match: C2165

Bagare och konditorer
type: Concept
in scheme: JobTech Taxonomy - Yrke
definition: Bakar matbröd och kaffebröd i ett bageri, konditori eller livsmedelsbutik. Tillverkar tårtor, bakelser och kakor samt desserter, handgjord choklad och konfekt. Hit hör inte Maskinoperatör, bageri (8163)
broader: Slaktare, bagare och livsmedelsförädlare m.fl.
related: TBDd BX1 19D
related: Qi3j qCf LAL
related: RTeX GL6 e6h
related: Fvdi Xn6 TB6
related: C7512
related: btqh hCy bRi
related: mRs1 pxu wpz
related: GdFM 7x5 eZc
related: gzxa drN Uud
related: 5uQE Ru6 oqJ
related: GerE Exs HoP
related: hYpk RYx y3V
related: UVj4 qZp iqS
narrower: Bagare/Konditor
broad match: PaxQ o1G wWH

Affärsområdeschef
type: Concept
in scheme: JobTech Taxonomy - Yrke
definition: En affärsområdeschef har det övergripande ansvaret för ett specifikt affärsområde inom ett företag. Rollen innebär att strategiskt planera, leda och utveckla verksamheten för att uppnå uppsatta mål gällande resultat, tillväxt och kvalitet. Affärsområdeschefen är ofta direkt underställd företagets vd och har både personal- och budgetansvar inom sitt område. Källa: Arbetsförmedlingen, Evolvefy
broader: Förvaltnings- och planeringschefer
related: axGX PQH Xry
related: KdBp Qun KSv
related: G7gg zkT YUf
related: epLc SkD cbT
related: ug8t 3Cs A8k
related: rEoF Lae McK
related: nSWf sTb s4o
related: 6H6H fzN Yao
related: bh3H Y3h 5eD
related: iXmM T6H efB
related: Xpi5 mwi XSX
related: KgLo hYQ fR6
related: 9WrY fnH pe5
related: JoEd NcG Zav
related: 1v1J miv zVQ
related: V7vk iUV 8Rr
related: 44fg HCb Y1T
broad match: C1213

Processutvecklare, kemi
type: Concept
in scheme: JobTech Taxonomy - Yrke
definition: Processutvecklare, kemi
broader: Civilingenjörsyrken inom kemi och kemiteknik
related: 6Hq3 tKo V57
related: BTb8 H5U 14o
related: AhmZ pPf X8r
related: JPM3 SMe XX3
related: zigD ewQ 7jH
broad match: C2145

Lärling, beläggningsarbete
type: Concept
in scheme: JobTech Taxonomy - Yrke
definition: En lärling är anställd för att slutföra sin kvalificeringstid till beläggningsarbetare innan ett yrkesbevis kan utfärdas. Under kvalificeringstiden får du lärlingslön enligt avtal. Kvalificeringstiden tillsammans med teoretisk grundutbildning leder till yrkesbeviset. Ett lärlingsavtal mellan branschorganisation och företag tecknas. Källa: BYN
broader: Anläggningsarbetare
related: j7Cq ZJe GkT
related: ammt Jz4 fjx
related: ja7J P8X YC9
broad match: C7119

Informationsarkitekt
type: Concept
in scheme: JobTech Taxonomy - Yrke
definition: Informationsarkitekt
broader: Systemanalytiker och IT-arkitekter m.fl.
related: D6zC nPP 22M
related: yHFY ZRL 72C
related: 7Nqc QtU rwn
related: apaJ 2ja LuF
related: kktg g5u 4jf
related: f2N6 o6X X4C
related: 4xkq 7hV joX
related: 4JRv qgm hQ4
broad match: C2511

Biståndsbedömare m.fl.
type: Concept
in scheme: JobTech Taxonomy - Yrke
definition: Utreder individers behov av hjälp och stöd från kommunen t.ex. hemtjänst, personlig assistans eller särskilt boende m.m.
broader: Socialsekreterare och kuratorer m.fl.
related: MjPH 341 Zmc
related: x289 bKF ihE
related: MrnB onr FxX
related: RAzA HiS pYt
related: Xqn7 nQQ ovW
related: qMfa U8e Lto
related: SfoE zq7 ADN
related: hqYJ jyZ Ks8
related: C7Ni 3MM YQD
related: gtVT cXB d7f
related: 94uF bkH QF5
related: C3412
related: axxm t1P 6WR
related: E3iH XQQ pvE
related: cocQ EPn YiY
narrower: LSS-handläggare
narrower: Biståndsbedömare/Biståndshandläggare
broad match: GazW 2TU kJw

Journalist
type: Concept
in scheme: JobTech Taxonomy - Yrke
definition: Journalister samlar in, granskar och presenterar information i olika medier, såsom tidningar, radio, tv och digitala plattformar. Arbetsuppgifterna omfattar intervjuer, research, nyhetsvärdering, skrivande av artiklar och reportage samt publicering och redigering av material. Journalister arbetar ofta med att bevaka aktuella händelser, analysera samhällsfrågor och förmedla fakta till allmänheten på ett begripligt och objektivt sätt. Arbetet sker både självständigt och i samarbete med redaktioner. Digitala verktyg används regelbundet för informationssökning, produktion och publicering. Källa: Arbetsförmedlingen, Stockholms universitet, Journalistförbundet
alternative label: Reporter
broader: Journalister m.fl.
related: eJb6 8MN MSc
related: Dxfe moo tv9
related: iKDv WXX nwz
related: M5gS VP9 uoq
related: pYez WWr Ygt
related: 1zYy 3oi 2BP
related: yVkt 1Qf eps
related: cwrJ Ux5 YaE
related: V3Hz ssS D8P
related: FQiF BHd Z4p
related: QynC jxC GSq
related: Fq5W zgm T1v
related: jRXz F1y aWC
related: BWkj s9k Sjd
related: xD9m mxB q2s
related: eHy9 Mq7 H9D
related: bbKc hAw snP
related: Z6FQ 6Ar knq
related: HmKE heP pLZ
related: qcs6 9wJ Tig
related: HPPh TBG gCX
related: hYdo agR fVx
related: VKZ9 H1J kwF
related: 54C7 gQJ kjA
related: tQoV HEF CGC
related: wWEk sZK 9VW
related: QwSn pYE 3ZL
related: 8too bEs 7NU
related: gpy6 EET 9rf
related: fxs5 Pdz UZr
related: BCnp MgY VfF
related: 9puE nYg crq
related: 7BHj bgk VA8
related: ZXzM rSP wmv
related: mzNV d2u 5ke
related: STJV xSt STK
related: r3Cz Ho4 EC2
related: TKZG iKh wnn
related: jxDb gKF cLV
related: xuxG n7z Y4S
related: wviq gv4 Lvy
related: 9jTy Qc7 2n9
related: uAk2 89d H5S
related: yxb6 6RR r6o
related: W4nK 4HW WWL
related: t1rD cs3 fTa
related: Kg23 vRg tzY
related: hJfh 8NH LpX
related: RWB4 BVt Bd1
broad match: C2642

Avdelningschef, statlig
type: Concept
in scheme: JobTech Taxonomy - Yrke
definition: Avdelningschef, statlig
broader: Förvaltnings- och planeringschefer
related: m1qx tyf snK
related: igt6 iSd JVB
related: X82t awd Qyc
related: epLc SkD cbT
related: bh3H Y3h 5eD
broad match: C1213

Arbetsledare skogsvård
type: Concept
in scheme: JobTech Taxonomy - Yrke
definition: Arbetsledare inom skogsvård planerar och leder det dagliga arbetet för skogsvårdare. Arbetet innebär i huvudsak planering, uppföljning och kvalitetskontroll av utfört skogsvårdsarbete. Med skogsvårdsarbete avses plantering, röjning, gallring och markberedning. Erfarenhet och utbildning inom skogsvård är ofta meriterande för arbetsledare. Källa: Arbetsförmedlingen
broader: Skogsarbetare
related: Rzsw hhu E47
related: VuuL 7CH adj
broad match: C6210

Växeltelefonist
type: Concept
in scheme: JobTech Taxonomy - Yrke
definition: En växeltelefonist tar emot och kopplar inkommande telefonsamtal till rätt person eller avdelning inom ett företag eller organisation. De kan också ge grundläggande information och hantera besökare. I vissa fall kan de även utföra administrativa uppgifter. Källa: Arbetsförmedlingen
broader: Telefonister
related: UdVa jRr 9DE
related: wNma x98 JSV
related: X82t awd Qyc
related: nNxK WwY b1e
related: jVDd XNh fCE
broad match: C4223

Kommunikationsstrateg
type: Concept
in scheme: JobTech Taxonomy - Yrke
definition: Kommunikationsstrateg
broader: Informatörer, kommunikatörer och PR-specialister
related: NApR VAv 97t
related: fXx4 CNL Gsy
related: X82t awd Qyc
related: GzyH LLy Mok
related: iECV JWE GsW
related: vwxR MbC XjW
related: sSSb 7dJ uxL
broad match: C2432

3D artist
type: Concept
in scheme: JobTech Taxonomy - Yrke
definition: En 3D artist ansvarar för att utveckla spelets 3D-modeller och kompositioner, och att se till att det framställs nödvändig mängd grafik. 3D Artist eller 3D-grafiker är ett relativt brett begrepp som ibland kan användas för en animatör, texturerare och/eller tech artist. 3D artister har en nyckelroll i spelteamet eftersom de sammanflätar det tekniska med det konstnärliga. Uppdraget som 3D-artist blir att modellera och texturera 3D modeller utifrån givna 2D concept. Källa: Dataspelsbranschen
broader: Designer inom spel och digitala medier
related: vwhH HzU R9f
related: VtFW BKs kNp
related: oeHg J1V PEg
related: dwck 5Tf yYy
related: 9puE nYg crq
related: CjUP Jkh gKh
related: Gfw7 WD9 nqk
related: 2a1a 3iu 5nF
related: zXeK 6P9 vQd
broad match: C2166

Forskningsingenjör, metallurgi
type: Concept
in scheme: JobTech Taxonomy - Yrke
definition: Forskningsingenjör, metallurgi
broader: Civilingenjörsyrken inom gruvteknik och metallurgi
related: 6Hq3 tKo V57
related: AZPQ Dz2 LGF
broad match: C2146

Taltjänsttolk
type: Concept
in scheme: JobTech Taxonomy - Yrke
definition: Taltjänsttolk
broader: Översättare, tolkar och lingvister m.fl.
related: cspa Mji BMS
related: 9puE nYg crq
broad match: C2643

Ingenjörsgeolog
type: Concept
in scheme: JobTech Taxonomy - Yrke
definition: Ingenjörsgeolog
broader: Civilingenjörsyrken inom gruvteknik och metallurgi
related: 6Hq3 tKo V57
related: AZPQ Dz2 LGF
broad match: C2146

Matros
type: Concept
in scheme: JobTech Taxonomy - Yrke
definition: En matros arbetar med fartygets underhåll exempelvis målning, smörjning, vakthållning på bryggan, lastning och lossning av fartygets last. För att arbeta som matros krävs Matros behörighet Efter gymnasieutbildning med inriktning sjöfart som är godkänd av Transportstyrelsen. Därutöver behövs minst 12 månaders sjötid som lättmatros eller lättmatrosbehörighet och har genomfört minst 18 månaders sjötid kan ansökan göras hos Transportstyrelsen. Källa: Satsa på sjöfart
broader: Matroser och jungmän m.fl.
related: dRFw Rcu dX7
related: gs65 ynn fcr
related: ASGV zcE bWf
related: XouD cCj HZN
related: QQJR 11D LXL
related: YZCf 7EA Zah
broad match: C8350

Laborant, biologi
type: Concept
in scheme: JobTech Taxonomy - Yrke
definition: Laborant, biologi
broader: Laboratorieingenjörer
related: CpFD aoS pkZ
related: kJeN wmw 9wX
related: m2ZA kNo ZsT
related: 5Swn Cxz hiM
related: TXx8 Mgv BGZ
related: fM7t axJ RNN
broad match: C3111

Naturterapeut
type: Concept
in scheme: JobTech Taxonomy - Yrke
definition: Naturterapeut
broader: Terapeuter inom alternativmedicin
related: NYW6 mP6 vwf
related: Uuf1 GMh Uvw
broad match: C3230

Verksamhetskonsult, IT
type: Concept
in scheme: JobTech Taxonomy - Yrke
definition: Verksamhetskonsult, IT
broader: Systemanalytiker och IT-arkitekter m.fl.
related: apaJ 2ja LuF
related: fyj5 Gek 1tu
related: bvEa 6Cy LZQ
related: 31Ta wDk 4QA
related: qBsw ikL hZ2
broad match: C2511

Lärling, beläggningsmaskinförare
type: Concept
in scheme: JobTech Taxonomy - Yrke
definition: En lärling är anställd för att slutföra sin kvalificeringstid till beläggningsmaskinförare innan ett yrkesbevis kan utfärdas. Under kvalificeringstiden får du lärlingslön enligt avtal. Kvalificeringstiden tillsammans med teoretisk grundutbildning leder till yrkesbeviset. Ett lärlingsavtal mellan branschorganisation och företag tecknas. Källa: BYN
broader: Anläggningsmaskinförare m.fl.
related: j7Cq ZJe GkT
related: ja7J P8X YC9
broad match: C8342

Forskningsassistent, ekonomi
type: Concept
in scheme: JobTech Taxonomy - Yrke
definition: Forskningsassistent, ekonomi
broader: Nationalekonomer och makroanalytiker m.fl.
related: X82t awd Qyc
broad match: C2631

Konstkonsult
type: Concept
in scheme: JobTech Taxonomy - Yrke
definition: Konstkonsult
broader: Museiintendenter m.fl.
related: JxVv btB MTz
related: 9puE nYg crq
broad match: C2621

Miljökemist
type: Concept
in scheme: JobTech Taxonomy - Yrke
definition: Miljökemist
broader: Kemister
related: CpFD aoS pkZ
related: kJeN wmw 9wX
related: Yr11 UKD on1
related: fM7t axJ RNN
broad match: C2113

Telefonkommunikatör på intresseorganisation
type: Concept
in scheme: JobTech Taxonomy - Yrke
definition: Telefonkommunikatörer på intresseorganisationer, även kallat medlemsvärvare, kontaktar privatpersoner och organisationer för att värva medlemmar eller uppmuntra till att ge bidrag. Man arbetar vanligtvis från hemmet och ringer upp potentiella medlemmar eller givare. Arbetet kan ske både på heltid och deltid, där det är vanligt att vara anställd av ett företag som sköter givar- och medlemsvärvning åt olika intresseorganisationer. Källa: Arbetsförmedlingen
broader: Telefonförsäljare m.fl.
related: UdVa jRr 9DE
related: pa5E 8fK WC3
related: wTHM XhM cMk
related: 5Njj nGj a6t
related: UY7a nFy TNG
related: RPTn bxG ExZ
related: pemq K47 wt8
related: ejYs Vwg i4J
related: C9GN Wyh yQG
related: rKJR uVE 9JT
related: MLgd Cj9 Q3y
related: uJxA CWL tKE
related: jnnn n4y PxV
related: QfPp gae snm
related: sivH 6rB Dos
related: jwju Aow xiP
related: 2RUu EkQ GJb
related: vdmX E4t 1jU
broad match: C5244

Husdjursrådgivare/Husdjurskonsulent
type: Concept
in scheme: JobTech Taxonomy - Yrke
definition: Husdjursrådgivare/Husdjurskonsulent
alternative label: Husdjurskonsulent
alternative label: Husdjursrådgivare
broader: Specialister och rådgivare inom lantbruk m.m.
related: 6nbS RdB kzm
related: VuuL 7CH adj
broad match: C2132

Företagssköterskor
type: Concept
in scheme: JobTech Taxonomy - Yrke
definition: Medverkar vid rehabilitering och omhändertagande av arbetsrelaterade sjukdomar inom företagshälsovården. Förebygger sjukdomar och arbetsskador.
broader: Sjuksköterskor (fortsättning)
related: dJa5 Nao mDS
related: MVKv XXk XAi
related: Ektq nPz 4YF
related: vS3s Vyr 8fn
related: rCcR eJq g7Q
related: C2221
related: GYz6 5Jt Wmy
related: jxKr BmN CcQ
narrower: Företagssjuksköterska
broad match: NYW6 mP6 vwf

Budgetsekreterare
type: Concept
in scheme: JobTech Taxonomy - Yrke
definition: Budgetsekreterare
broader: Övriga ekonomer
related: X82t awd Qyc
broad match: C2411

Andra specialister inom hälso- och sjukvård
type: Concept
in scheme: JobTech Taxonomy - Yrke
definition: Andra specialister inom hälso- och sjukvård
broader: Yrken med krav på fördjupad högskolekompetens inom hälso- och sjukvård
narrower: Audionomer och logopeder
narrower: Optiker
narrower: Dietister
narrower: Apotekare
narrower: Övriga specialister inom hälso- och sjukvård

Bergsingenjör
type: Concept
in scheme: JobTech Taxonomy - Yrke
definition: Bergsingenjör
broader: Civilingenjörsyrken inom gruvteknik och metallurgi
related: 6Hq3 tKo V57
related: AZPQ Dz2 LGF
related: v5Ju ABf PMf
related: xgcE Tva 9KD
related: Sz26 18n kx4
broad match: C2146

Kursutvecklare
type: Concept
in scheme: JobTech Taxonomy - Yrke
definition: Kursutvecklare planerar, utformar och kvalitetssäkrar utbildningsmaterial och kurser för olika målgrupper inom företag, utbildningsväsen eller folkbildning. Arbetsuppgifterna omfattar behovsanalys, design och utveckling av kursinnehåll samt utvärdering av utbildningens effektivitet. Kursutvecklare samarbetar ofta med ämnesexperter, pedagoger och tekniska specialister för att skapa relevanta och pedagogiskt genomtänkta utbildningar, ofta med inslag av digitala lärplattformar och moderna pedagogiska metoder. Rollen inkluderar även projektledning, administration och ibland handledning av kursledare eller utbildare. Titeln används brett inom både offentlig och privat sektor. Källor: jobbannonser på Platsbanken
broader: Övriga utbildare och instruktörer
related: JxFd YAx KLE
related: W2ny FSs wCC
related: 1Pqv JJw FQ8
related: 37Tu iA5 RCV
related: 28dU tMF KaM
related: juhd ctG MEn
related: z6Pi xft Dab
related: MVqp eS8 kDZ
related: LMom ZVC uhF
related: J5me 7QD YXA
related: 9VTL 76L ybE
broad match: C2359

Kyl- och värmepumpstekniker
type: Concept
in scheme: JobTech Taxonomy - Yrke
definition: Som kyl- och värmepumpstekniker arbetar du med felsökning, installation, service och driftsättning av kyl- och värmepumpanläggningar, i bl a fastigheter, butiker och industrier. Kylteknik används framförallt i livsmedelsbutiker, men också i luftkonditioneringssystem, i industriprocesser som behöver kylas, inom medicinteknik och vid isbanor. Värmepumpar fungerar precis som kylmaskiner, men då tar man vara på värmen i stället för på kylan. Yrket innehåller både teoretiska och praktiska moment. Källa: Arbetsförmedlingen
broader: Kyl- och värmepumpstekniker m.fl.
related: gqFq bWc 2qq
related: uLqk Bva 9gj
related: jSBu 1Z2 1qU
related: yhCP AqT tns
related: 4Sjf 7XQ T8j
related: ja7J P8X YC9
related: qLXL jCo 5Fp
related: GRCb eu2 Mrf
broad match: C7127

Privatekonomisk rådgivare
type: Concept
in scheme: JobTech Taxonomy - Yrke
definition: Privatekonomisk rådgivare ger vägledning till privatpersoner om deras ekonomiska situation. Arbetsuppgifterna omfattar analys av kundens ekonomi, rådgivning kring sparande, investeringar, skuldförvaltning och budgetplanering. Privatekonomisk rådgivare hjälper till med utformning av individuella ekonomiska strategier, presenterar olika placeringsalternativ och förklarar konsekvenser av ekonomiska beslut. Tjänsten innebär regelbunden kontakt med privatkunder, kontinuerlig uppdatering om finansiella produkter och regelverk samt administrativ dokumentation av rådgivning och kundmöten. Rådgivaren samverkar ofta med andra experter inom bank och finans för helhetslösningar. Källor: Finansförbundet, Soderberg & Partners, jobbannonser på Platsbanken
broader: Banktjänstemän
related: 8TvM 66x Rqq
related: xqgq CRg 5mv
related: Z2ui ugy e73
related: W11S eev nSf
related: NcUm Jyg wVo
related: XS5M Usw PqE
related: X82t awd Qyc
related: ZDLD nuk HCX
related: bJiX 5La bXq
related: iiMc ANK 7Rt
related: LeAZ h7s vN7
related: SqiR isR sHv
related: AjFn 3eP qu9
related: ocBR dLW oH9
related: M8X7 o7W 225
broad match: C3312

Accounting controller
type: Concept
in scheme: JobTech Taxonomy - Yrke
definition: Accounting controller
broader: Controller
related: eQFc 7Vq buj
related: X82t awd Qyc
related: vw7i 55Q xxT
related: 9r1v MqM dD6
broad match: C2411

Marinmeteorolog
type: Concept
in scheme: JobTech Taxonomy - Yrke
definition: Marinmeteorolog
broader: Meteorologer
related: kJeN wmw 9wX
broad match: C2112

Kontrollingenjör
type: Concept
in scheme: JobTech Taxonomy - Yrke
definition: Kontrollingenjör
broader: Övriga civilingenjörsyrken
related: 6Hq3 tKo V57
related: smR7 3U3 erL
related: Unjt wtu vhs
related: YDaz 9FX cVW
related: Qa6E WbM p5G
related: AWvV ESz ZtL
related: uU5E cog HPk
related: Gp35 fVS v3B
related: zvkZ wDP Ep6
broad match: C2149

Politiker, verkställande direktörer och högre ämbetsmän m.fl.
type: Concept
in scheme: JobTech Taxonomy - Yrke
definition: Politiker, verkställande direktörer och högre ämbetsmän m.fl.
broader: Chefsyrken
narrower: Verkställande direktörer m.fl.
narrower: Politiker och högre ämbetsmän

Yogainstruktör
type: Concept
in scheme: JobTech Taxonomy - Yrke
definition: Yogainstruktörer leder och instruerar yogaklasser med fokus på fysisk och mental träning, avslappning samt välmående. Arbetsuppgifter innefattar planering och genomförande av yogapass, introduktion av övningar och tekniker inom olika yogaformer, samt anpassning av aktiviteter utifrån deltagarnas förutsättningar och nivåer. Källa: Arbetsförmedlingen, utbildningar till yogainstruktör
alternative label: Yogalärare
broader: Idrottstränare och instruktörer m.fl.
related: Dv6d oQq k8v
related: p7tC Zfz KnF
related: MVqp eS8 kDZ
broad match: C3422

Sommelier
type: Concept
in scheme: JobTech Taxonomy - Yrke
definition: Sommelierer arbetar med att rekommendera, servera och hantera vin och andra drycker i restaurangmiljö. Arbetsuppgifterna omfattar att bygga upp och underhålla dryckeslistor, föreslå dryck i kombination med mat, genomföra dryckesprovningar, ansvara för inköp och lagerhållning av drycker samt att bistå serveringspersonal med dryckeskunskap. Källa: Svenska Sommelierföreningen, Arbetsförmedlingen
broader: Hovmästare och servitörer
related: YBiG hCd cZa
related: 7o44 gVv s1V
related: ScKy FHB 7wT
related: RScj wGX vDH
related: gdCV x1g 4Mr
related: nage eGj cMi
broad match: C5131

Partikelfysiker
type: Concept
in scheme: JobTech Taxonomy - Yrke
definition: Partikelfysiker
broader: Fysiker och astronomer
related: kJeN wmw 9wX
broad match: C2111

ST-läkare, allmänmedicin
type: Concept
in scheme: JobTech Taxonomy - Yrke
definition: Specialisttjänstgöring, ST, är den vidareutbildning som legitimerade läkare genomför för att uppnå specialistkompetens. ST-läkare allmänmedicin arbetar under handledning för att fördjupa sina medicinska kunskaper och färdigheter med målet att bli specialistläkare inom sitt område. ST-läkaren arbetar självständigt med patientutredningar, diagnostik och behandling, men alltid med stöd av specialister och enligt ett individuellt utbildningsprogram. Vanliga arbetsuppgifter är att ta medicinskt ansvar för patienter, delta i jourverksamhet, genomföra medicinska undersökningar och behandlingar samt dokumentera och följa upp vårdinsatser. Tjänsten omfattar också kontinuerlig kompetensutveckling, sidotjänstgöring inom närliggande områden och aktivt deltagande i handledning och utbildningsinsatser för kollegor och studenter. Källa: Arbetsförmedlingen, Karolinska Universitetssjukhuset, Sveriges läkarförbund, Region Kronoberg, Region Skåne.
broader: ST-läkare
related: NYW6 mP6 vwf
related: UtCj yMj ubw
broad match: C2211

Geograf
type: Concept
in scheme: JobTech Taxonomy - Yrke
definition: Geograf
broader: Arkeologer och specialister inom humaniora m.m.
related: kJeN wmw 9wX
broad match: C2632

Danspedagog
type: Concept
in scheme: JobTech Taxonomy - Yrke
definition: Danspedagog
broader: Övriga pedagoger med teoretisk specialistkompetens
related: pVzY rff Amk
related: hF47 fXP Fmr
related: 2mst 5Qm jma
related: nbs4 q2V BN6
related: TrZu dVa F6h
related: mk7Z eeG ADX
related: MVqp eS8 kDZ
related: RN4c CEW s92
related: JoLB k45 deL
related: s5rM wyU f2Y
related: LqkC 8n4 31x
related: RPRL vXH H5f
related: 8Edv MRH 71f
broad match: C2355

Skatterådgivare
type: Concept
in scheme: JobTech Taxonomy - Yrke
definition: Skatterådgivare
broader: Revisorer m.fl.
related: nBsw pkU VD9
related: RqAo J7n EoQ
related: X82t awd Qyc
related: c1fH Bbk w7x
related: MB6o ySy Amm
broad match: C2411

Arbetsledare, kontorspersonal/Gruppledare, kontorspersonal
type: Concept
in scheme: JobTech Taxonomy - Yrke
definition: Arbetsledare och gruppledare för kontorspersonal leder, planerar och samordnar det dagliga arbetet för administrativ personal på kontor. Rollen innebär i huvudsak fördelning av arbetsuppgifter och hantering av personalfrågor för att säkerställa att kontorsverksamheten fungerar effektivt. Arbetsledaren fungerar som en länk mellan medarbetare och ledning och stöttar medarbetare i deras dagliga arbete. Vanliga arbetsuppgifter inkluderar schemaläggning, personalplanering, kundkontakt samt att säkerställa god kommunikation och information internt och externt. Arbetsledaren kan även ha ansvar för kvalitet, arbetsmiljö samt uppföljning av kostnader och avtal. Källa: Arbetsförmedlingen
alternative label: Arbetsledare, kontorspersonal
alternative label: Gruppledare, kontorspersonal
broader: Gruppledare för kontorspersonal
related: X82t awd Qyc
related: nEd4 fJK nzy
related: ednm QTg U4p
related: UJsk qUf Epa
related: CpLT nT5 bd3
related: NkQ2 Jq5 Z3g
related: 7oHP Msp C6n
broad match: C3341

Redigerare, rörlig bild
type: Concept
in scheme: JobTech Taxonomy - Yrke
definition: Redigerare, rörlig bild
broader: Bild- och sändningstekniker
related: gA9P Zws 8u4
related: W1Gi jy9 QzT
related: 9dAT tCM eq6
related: Fi4f 68Y DfP
related: 8too bEs 7NU
related: 9puE nYg crq
related: d1Ao 9bY 7Kn
related: sgpW Jm8 xuZ
broad match: C3521

Utvecklingsingenjör, gruv
type: Concept
in scheme: JobTech Taxonomy - Yrke
definition: Utvecklingsingenjör, gruv
broader: Civilingenjörsyrken inom gruvteknik och metallurgi
related: 6Hq3 tKo V57
related: AZPQ Dz2 LGF
broad match: C2146

Organisk kemist
type: Concept
in scheme: JobTech Taxonomy - Yrke
definition: Organisk kemist
broader: Kemister
related: CpFD aoS pkZ
related: kJeN wmw 9wX
related: Yr11 UKD on1
related: pg9p 3wJ Gj9
related: 4yM9 5Lb uYM
related: fM7t axJ RNN
broad match: C2113

Underhållsingenjör elkraft
type: Concept
in scheme: JobTech Taxonomy - Yrke
definition: Underhållsingenjör inom elkraft arbetar med fortlöpande kontroll av elanläggningar inom både lokal- och regionnät. Det innefattar att man arbetar med framtagande av underhållsplaner på kort och lång sikt utifrån riskbedömningar av anläggningens funktioner. Underhållsingenjören sammanställer besiktningsunderlag och resultat av utförda besiktningar, som ligger till grund för nya projekt såsom ombyggnationer av befintliga anläggningar, planerat underhåll och akut felavhjälpning. Underhållsingenjör utför arbete utifrån ett kvalitets- och säkerhetsperspektiv. Källa: EBR
broader: Ingenjörer och tekniker inom elektroteknik
related: 6Hq3 tKo V57
related: u6N5 brU TJi
broad match: C3113

Beräkningsingenjör, el-tele
type: Concept
in scheme: JobTech Taxonomy - Yrke
definition: Beräkningsingenjör, el-tele
broader: Civilingenjörsyrken inom elektroteknik
related: 6Hq3 tKo V57
related: kDRm Yaa jAB
broad match: C2153

Konstnärer, musiker och skådespelare m.fl.
type: Concept
in scheme: JobTech Taxonomy - Yrke
definition: Konstnärer, musiker och skådespelare m.fl.
broader: Yrken med krav på fördjupad högskolekompetens inom juridik, kultur och socialt arbete m.m.
narrower: Skådespelare
narrower: Musiker, sångare och kompositörer
narrower: Bildkonstnärer m.fl.
narrower: Regissörer och producenter av film, teater m.m.
narrower: Koreografer och dansare

Åklagare
type: Concept
in scheme: JobTech Taxonomy - Yrke
definition: Utreder brott tillsammans med polis, leder förundersökningar och beslutar om åtal. Beskriver brott, håller förhör och föreslår straff i rätten.
broader: Jurister
related: 4nqQ paq R5L
related: UQC4 Wov HPQ
related: RZLF S7J 25Q
related: mXDp 6r9 zUj
related: 7JTy BCE 1dx
related: YaHy ShR uo4
related: w9kF 5oy ySz
related: DkcA 2io BNv
related: aMrn LR6 Eat
related: UapV Lk5 DZr
related: AqoH owh Lac
related: KZb6 UBs gP9
related: BrdZ oPC Kft
related: QAaJ QeY Q6P
related: 587c D1Q BvT
related: TFCj pyW JR2
related: SNxY WDL G6i
related: 6w2r xfn trP
related: iqT9 zoW Pj5
related: EU8B Vir DXH
related: pLfm Uff BsM
related: XYLK CQw wqY
related: yPmK 7b8 L3H
related: C2611
related: fiLT BSW HCb
related: rXST u2H Ujo
related: qWPT Ygb CKr
related: 4RbW Kwb whi
related: WJa2 cQS naH
related: Urr8 rxC Spw
related: QFsa CfY 1Ly
related: mD1c 2NB pDo
related: VUpS Usc Qdu
related: DNuY aoK i1h
related: Jd1D jKD qaD
related: Tu3a CQh nGG
related: ZSXe KXh TzJ
narrower: Åklagaraspirant
narrower: Åklagare
broad match: X82t awd Qyc

Programsekreterare
type: Concept
in scheme: JobTech Taxonomy - Yrke
definition: Programsekreterare
broader: Inspicienter och scriptor m.fl.
related: X82t awd Qyc
related: 8too bEs 7NU
related: 9puE nYg crq
broad match: C3435

Depåtekniker, prospektering
type: Concept
in scheme: JobTech Taxonomy - Yrke
definition: Depåtekniker, prospektering
broader: Övriga ingenjörer och tekniker
related: 6Hq3 tKo V57
broad match: C3119
broad match: C3117

Geriatriksjuksköterska
type: Concept
in scheme: JobTech Taxonomy - Yrke
definition: Geriatriksjuksköterska bedömer, planerar, genomför och utvärderar avancerad omvårdnad för äldre personer i olika vårdmiljöer. Sjuksköterska är en skyddad titel med legitimationskrav. En geriatriksjuksköterska med specialistsjuksköterskeexamen får använda benämningen specialistsjuksköterska inom vård av äldre. Vanliga arbetsuppgifter är bedöma patienters hälsotillstånd, ordinera och administrera läkemedel, göra individuella vårdplaner, samordna vårdinsatser samt handleda och stödja både patienter, anhöriga och annan personal. Geriatriksjuksköterskan ansvarar också för att identifiera och förebygga åldersrelaterade sjukdomar. Källa: Arbetsförmedlingen, Karolinska Institutet, Luleå tekniska universitet, Socialstyrelsen. Svensk sjuksköterskeförening
broader: Geriatriksjuksköterskor
related: PbH8 rPN GZs
related: UWzi jAZ mCe
related: NYW6 mP6 vwf
related: zgSK nSe jfw
related: BY6B fD7 seo
related: ytRi QuA XLX
related: VPkC 1fj zYD
related: tZ8t tZa 6rz
related: 1f7B E5K sh3
broad match: C2221

Transportchef
type: Concept
in scheme: JobTech Taxonomy - Yrke
definition: Transportchef
broader: Inköps-, logistik- och transportchefer
related: WDvK gLm H2C
related: 7Pxf YEh aLs
related: epLc SkD cbT
related: ASGV zcE bWf
related: bh3H Y3h 5eD
related: MdUy 4AJ 3wi
broad match: C1324

Geriatriksjuksköterskor
type: Concept
in scheme: JobTech Taxonomy - Yrke
definition: Ger omvårdnad till äldre människor för att förebygga och behandla åldersrelaterade sjukdomar.
broader: Sjuksköterskor
related: Cb2a ikG o2t
related: NbjJ WBY FoA
related: TuUX 3Jo wyq
related: 4QAE wtY gJh
related: C1qR L83 nzh
related: 9Fna GUm HWL
related: Mmxs Qrv cpG
related: ryxY Uwr pkw
related: dJa5 Nao mDS
related: Lqnz Zqw nQ9
related: eThQ HCv mY6
related: Phrk 2XZ MWq
related: F7nJ k5s L29
related: Ektq nPz 4YF
related: LMx4 LbA vxB
related: wBPu wTW RgG
related: NpcY f4G L1H
related: BvGm Zuj VLF
related: yL7p NgY yKc
related: 2GuF gtz xfW
related: rF7s hX1 ECH
related: rVUL AgV ZTH
related: C2221
related: GYz6 5Jt Wmy
related: BeJA k3Q DsP
related: AmSg wbt ZzD
related: 5Kym 2ad Pqi
related: jxKr BmN CcQ
related: ZpXZ PG5 B9s
related: pGBH BkG qJa
related: yV9B PxJ TxS
related: 47LN 8Ac dX8
related: cocQ EPn YiY
narrower: Demenssjuksköterska
narrower: Geriatriksjuksköterska
broad match: NYW6 mP6 vwf

Generaldirektör
type: Concept
in scheme: JobTech Taxonomy - Yrke
definition: Generaldirektör
broader: General-, landstings- och kommundirektörer m.fl.
related: epLc SkD cbT
related: bh3H Y3h 5eD
related: jnQy VZB 4KE
related: upvi Fyo zxK
related: 7dtp 8cg gkJ
broad match: C1112

LSS-handläggare
type: Concept
in scheme: JobTech Taxonomy - Yrke
definition: LSS-handläggare utreder och bedömer stödbehov för personer med funktionsnedsättningar enligt Lagen om stöd och service till vissa funktionshindrade (LSS). Arbetsuppgifterna inkluderar mottagning av ansökningar, genomförande av behovsutredningar och beslutsfattande om insatser som personlig assistans, daglig verksamhet, bostad med särskild service och ledsagarservice. LSS-handläggare samarbetar med den enskilde, anhöriga, vårdgivare och andra myndigheter för att anpassa insatser efter individens unika behov och förutsättningar. Dokumentation och uppföljning av beslut och insatser är centrala delar av arbetet. Rollen kräver ofta dialog och medling för att balansera lagstiftningens krav med individens vilja. Källor: Kunskapsguiden, Arbetsförmedlingen, annonser på Platsbanken
broader: Biståndsbedömare m.fl.
related: 9BuX pjW MpE
related: 649k rGQ 8Hx
related: GazW 2TU kJw
related: h58M jRk XhX
related: ZBZG 8CT DjL
broad match: C3412

Geofysiker
type: Concept
in scheme: JobTech Taxonomy - Yrke
definition: Geofysiker
broader: Geologer och geofysiker m.fl.
related: kJeN wmw 9wX
broad match: C2114

Projektledare, maskin
type: Concept
in scheme: JobTech Taxonomy - Yrke
definition: Projektledare, maskin
broader: Ingenjörer och tekniker inom maskinteknik
related: 6Hq3 tKo V57
related: 9aEn jPz gJs
related: yXSE wvx EAN
broad match: C3115

Förskoleassistent
type: Concept
in scheme: JobTech Taxonomy - Yrke
definition: Förskoleassistenter är icke-behöriga personer som arbetar som stödpersonal i förskola. Arbetsuppgifter liknar de för barnskötare, men utan pedagogiskt ansvar. Benämning kan avser personal utan utbildning, personer under utbildning, eller vid kortare anställningar. Källa: Arbetsförmedlingen
broader: Barnskötare
related: MVqp eS8 kDZ
broad match: C5311

Tvättchef
type: Concept
in scheme: JobTech Taxonomy - Yrke
definition: Tvättchef
broader: Övriga administrations- och servicechefer
related: whao Q6A ScE
related: epLc SkD cbT
related: bh3H Y3h 5eD
broad match: C1219

Antikvarie
type: Concept
in scheme: JobTech Taxonomy - Yrke
definition: Antikvarie
broader: Museiintendenter m.fl.
related: gDD9 VNt h4z
related: tvQt wUK T78
related: dDs4 RSq bna
related: bDd5 gvf fwU
related: JxVv btB MTz
related: 9puE nYg crq
related: dWwA N8k zMx
related: 3wQP nqh htn
related: rbjC uTA 5X5
broad match: C2621

Skogstransportförare
type: Concept
in scheme: JobTech Taxonomy - Yrke
definition: Skogstransportförare transporterar avverkat virke. Skogstransportörer, kallas även virkesbilsförare, kör timmerbil, en lastbil med släp och kran för att lasta och transportera avverkat virke. Man planerar hur virke ska transporteras från skogen till virkesmottagningar. Även om föraren inte bestämmer var transporten ska gå, är det en fördel att vara orienterad om olika virkessorter. Arbetet kräver god planeringsförmåga för att optimera körningen. Vanligtvis sker arbetet i tvåskift, men treskift blir allt vanligare. Källa: Transportfackens yrkes- och arbetsmiljönämnd
broader: Lastbilsförare m.fl.
related: iGda Lmc r2u
related: yezn XDu gkb
related: zGjD M5a HCX
related: d68E e74 a59
related: hhb7 1hV t7R
related: ASGV zcE bWf
related: X8S5 eGS 9Ep
related: 483u hVx psa
related: NWdp 2EX ZJg
related: LnhF WZ6 DAk
related: 9wnn PAV q12
related: qvmj Xrw n8T
related: 371B pZd 3Vs
broad match: C8332

Lärling, ställningsbyggare
type: Concept
in scheme: JobTech Taxonomy - Yrke
definition: En lärling är anställd för att slutföra sin kvalificeringstid till ställningsbyggare innan ett yrkesbevis kan utfärdas. Under kvalificeringstiden får du lärlingslön enligt avtal. Kvalificeringstiden tillsammans med teoretisk grundutbildning leder till yrkesbeviset. Ett lärlingsavtal mellan branschorganisation och företag tecknas. Källa: BYN
broader: Ställningsbyggare
related: j7Cq ZJe GkT
related: ja7J P8X YC9
broad match: C7119

Betongvaruarbetare
type: Concept
in scheme: JobTech Taxonomy - Yrke
definition: Betongvaruarbetare tillverkar formgjutna betongprodukter. Huvudsakliga arbetsuppgifter är formsättning, armering och gjutning efter ritning. Vanliga betongprodukter som tillverkas är prefabricerade betongelement för byggsektorn, så som väggar, bjälklag och plattor. Andra förekommande arbetsuppgifter är efterbearbetning av produkterna genom puts, bilning och slipning. Transport av betongprodukterna genom travers och/eller truck samt lastning av betongprodukter är också förekommande. Källa: Arbetsförmedlingen
broader: Maskinoperatörer, cement-, sten- och betongvaror
related: MKjC pUX 2Fi
related: UdVa jRr 9DE
related: JE7J ZkG ifo
related: NCkb uWQ GPL
related: PW7R CcM zTb
related: 7ah6 1Yw yEo
related: wTEr CBC bqh
related: pEmz swy zYw
related: 75Cy 3dP Q9A
broad match: C8114

Städare och hemservicepersonal m.fl.
type: Concept
in scheme: JobTech Taxonomy - Yrke
definition: Städare och hemservicepersonal m.fl.
broader: Städyrken
narrower: Övrig hemservicepersonal m.fl.
narrower: Städare

Planeringsarkitekt
type: Concept
in scheme: JobTech Taxonomy - Yrke
definition: En planeringsarkitekt gör upp fysiska planer för nya stadsdelar, bostadsområden och industriområden. En planeringsarkitekt planerar även för förnyelse och förändring av befintliga områden. En planeringsarkitekt förbereder beslut om användning av mark, vatten och den byggda miljön utifrån att sätta samman funktionella, ekologiska, tekniska, ekonomiska och estetiska krav till en helhet. Källa: Sveriges Arkitekter
broader: Planeringsarkitekter m.fl.
related: Wyre ioD GNE
related: 6Hq3 tKo V57
related: Vgpf nj4 Bmq
related: W5DQ 5vV E49
related: qjJm BDj 8JV
related: fCb7 TbT QVx
related: RH9A aen jnj
related: paYm y4m uxL
related: Wz9R Aov E2q
related: ja7J P8X YC9
related: j8zr wP4 Gzk
related: DSXC Avt fNi
related: AdPD h56 LPN
broad match: C2164

Landskapsingenjör
type: Concept
in scheme: JobTech Taxonomy - Yrke
definition: Landskapsingenjör
broader: Specialister och rådgivare inom lantbruk m.m.
related: 6nbS RdB kzm
related: VuuL 7CH adj
broad match: C3142

Kabinpersonal, tågmästare och guider m.fl.
type: Concept
in scheme: JobTech Taxonomy - Yrke
definition: Kabinpersonal, tågmästare och guider m.fl.
broader: Serviceyrken
narrower: Guider och reseledare
narrower: Tågvärdar och ombordansvariga m.fl.
narrower: Kabinpersonal m.fl.

Fordonsmontör
type: Concept
in scheme: JobTech Taxonomy - Yrke
definition: Fordonsmontören jobbar i en produktionslinje med att montera, övervaka robotiserade moment och att prova slutprodukten. Fordonsmontör monterar olika fordonsdelar som lampor, dörrar, säten och växellådor och kontrollerar deras funktion. Arbetet utförs längs en produktionslinje där man samarbetar med kollegor och övervakar vissa robotiserade moment. Man beställer material, underhåller utrustning och ser till att produktionen flyter smidigt. En viktig del av arbetsuppgifterna är också att kvalitetssäkra monteringen för att uppfylla produktionens standarder. Källa: Arbetsförmedlingen
broader: Fordonsmontörer
related: GL5H izw QMd
related: DT5D gzE dYA
related: HDZp wTW gmd
related: qjTw 7KL sve
related: y3TN ArF 9zd
related: zH4u UWR wpP
related: noPL uis vv7
related: CvC1 fS5 jWx
related: 6onu tfy oCK
related: pWU9 4M4 Pt9
related: ydhy Bkw VuN
related: uHRX 85D AzX
related: rYvb 8an em6
related: YX73 wAr 6Xs
related: 8aQC j1Y FY8
related: 2Ls4 Q4f WL7
related: 5FVR 6bg DPD
related: QPEh JKs fBD
related: wTEr CBC bqh
related: zyPG Lyv Joe
broad match: C8211

Konstinramare/Rammakare
type: Concept
in scheme: JobTech Taxonomy - Yrke
definition: Konstinramare/Rammakare
alternative label: Konstinramare
alternative label: Rammakare
broader: Glastekniker
related: rtnL Kov t4s
related: PaxQ o1G wWH
related: AgCn 3H3 yab
broad match: C7125

Kyrkvaktmästare
type: Concept
in scheme: JobTech Taxonomy - Yrke
definition: Kyrkvaktmästare arbetar med praktiska uppgifter i och kring kyrkobyggnader, kyrkogårdar och församlingslokaler. Arbetsuppgifter omfattar förberedelse och iordningställande inför gudstjänster, dop, vigslar och begravningar. Kyrkvaktmästare sköter ljudanläggningar, städar, låser upp och larmar lokaler samt förbereder altare och andra liturgiska moment. Yrkesrollen innefattar även kontakt med besökare, fastighetsskötsel och deltagande i kyrkans vardagliga verksamhet. Skötsel av kyrkogården eller arbetsuppgifter kopplade till begravningsverksamhet kan även ingå. Källa: Svenska Kyrkan, Arbetsförmedlingen
broader: Fastighetsskötare
related: gxGb Vxg x98
related: gvfF E7K 1Ld
related: GazW 2TU kJw
related: XYzK pyC ZYZ
related: 6w25 8HX xz3
related: yhCP AqT tns
related: pdzu y9D d5K
broad match: C5153

Övriga specialistsjuksköterskor
type: Concept
in scheme: JobTech Taxonomy - Yrke
definition: Utför annat specialistarbete för sjuksköterskor än inom 2221-2235. Till exempel inom ögonvård, onkologi m.m. Planerar och samordnar det praktiska vårdarbetet på kliniknivå och mellan olika huvudmän.
broader: Sjuksköterskor (fortsättning)
related: GkJU 4dd Cit
related: NcPe evu eSP
related: 4QAE wtY gJh
related: 515e Tvy Zgj
related: pDSo DP5 AtK
related: Pe1w N3Z hJ5
related: hCoN BA4 Vie
related: v97o t6r 1oN
related: C1qR L83 nzh
related: 9Fna GUm HWL
related: Mmxs Qrv cpG
related: 1eKe zFj QAa
related: cFw3 Jtf Equ
related: 4tg9 s2B Kyw
related: ryxY Uwr pkw
related: VJ73 mtx Rux
related: dJa5 Nao mDS
related: MVKv XXk XAi
related: mNUF J2A H8c
related: Lqnz Zqw nQ9
related: eThQ HCv mY6
related: F7nJ k5s L29
related: Ektq nPz 4YF
related: LMx4 LbA vxB
related: wBPu wTW RgG
related: aS2X 4ZL 9h7
related: MR4H FFT mTj
related: Sive keu Feg
related: NpcY f4G L1H
related: BvGm Zuj VLF
related: 2GuF gtz xfW
related: rF7s hX1 ECH
related: rVUL AgV ZTH
related: c2YE oK3 f1u
related: 2NA7 QUh 7TH
related: C2221
related: aoVs Qfu U3j
related: GYz6 5Jt Wmy
related: 6z3x TVy dAU
related: 17Uy FAd BRr
related: 5Kym 2ad Pqi
related: jxKr BmN CcQ
related: pGBH BkG qJa
related: TMNd XS8 Vpf
related: yV9B PxJ TxS
related: 47LN 8Ac dX8
related: ezVu GhE b3b
related: Wt25 oqX S1J
related: LwTt 3Ns mGH
narrower: Onkologisjuksköterska
narrower: Neurosjuksköterska
narrower: Hjärtsjuksköterska
narrower: Operationskoordinator
narrower: Ögonsjuksköterska
narrower: Medicinsjuksköterska
narrower: Infektionssjuksköterska
narrower: Specialistsjuksköterska inom palliativ vård
narrower: Diabetessjuksköterska
narrower: Rehabkoordinator
narrower: Ortoptist
narrower: Forskningssjuksköterska
narrower: Kontaktsjuksköterska
narrower: Vårdledare
narrower: Medicinskt ansvarig sjuksköterska
broad match: NYW6 mP6 vwf

Bussförare
type: Concept
in scheme: JobTech Taxonomy - Yrke
definition: Bussförare kör bussar, tar emot betalningar och tar hand om passagerarna. Bussförare kör passagerare på ett säkert och ansvarsfullt sätt. Då man möter människor i arbetet är det viktigt att vara serviceinriktad och sträva efter att ge en trygg och bekväm resa för alla passagerare. Man kan arbeta med olika typer av körningar, till exempel beställningstrafik och kollektivtrafik. Källa: Transportföretagen
broader: Buss- och spårvagnsförare
related: rvAC wSu Y9R
related: ob1k HQZ xZp
related: RTiv 5Tr MnN
related: TiBr nTu pA4
related: ASGV zcE bWf
related: 2K78 hgj c9N
related: FaNu eCu byV
related: Zapt qfe UbU
related: TWXZ j79 rBc
related: 3f1v tsD TLv
broad match: C8331

Fullstack-utvecklare
type: Concept
in scheme: JobTech Taxonomy - Yrke
definition: Fullstack-utvecklare
broader: Mjukvaru- och systemutvecklare m.fl.
related: rns6 VjA pUf
related: KieH 2MJ pkY
related: Tph1 hUG 74p
related: rpnq Yqk sd1
related: apaJ 2ja LuF
related: KT6P hVH LRD
related: MuUG Ygf kyD
related: ZTvW tkE RLk
broad match: C2511

Köksmästare
type: Concept
in scheme: JobTech Taxonomy - Yrke
definition: Köksmästare Köksmästare leder och organiserar arbetet i restaurangkök eller storkök Arbetsuppgifter innefattar bland annat planering av menyer, inköp av råvaror och kvalitetssäkring. Köksmästare har ansvar för personalledning, fördelning av arbetsuppgifter och ansvar för hygien och livsmedelssäkerhet. Köksmästaren hanterar även budget och kostnadskontroll. Beroende på arbetsplats kan rollen även innefatta kreativt utvecklingsarbete med nya rätter och koncept samt samarbeten med leverantörer och övrig verksamhet. Källa: Arbetsförmedlingen
broader: Köksmästare och souschefer
related: wGQ9 RL9 Gtw
related: LLgg tmK pzy
related: epLc SkD cbT
related: 917g hKW 4Ce
related: BZtA RCn 4vZ
related: rDLR WCm tqN
related: ScKy FHB 7wT
broad match: C3434

Tunnplåtslagare
type: Concept
in scheme: JobTech Taxonomy - Yrke
definition: Tunnplåtslagare bearbetar och formar tunnplåt. Det är vanligast att arbeta med tunnplåt av stål, men arbete med aluminium, mässing och koppar kan även förekomma. Beroende på arbetsplats kan arbetsuppgifter skilja sig åt. Inom tillverkning arbetar man främst med tillverka och montera komponenter i tunnplåt, till exempel plåttak, hängrännor eller andra byggnadsdetaljer. Arbetet sker då både hantverksmässigt med manuella verktyg och genom att sköta maskiner för plåtbearbetning. Man kan även arbeta med reparation och underhåll, till exempel av maskiner och tunnplåtskonstruktioner inom industriell tillverkning. Se även yrket Byggnadsplåtslagare. Källa: Arbetsförmedlingen
broader: Tunnplåtslagare
related: er7G zS6 fmG
related: 86zU tWZ DpY
related: HXUW yh4 vkp
related: 7cmS XtG PCG
related: VZpU iUA tLB
related: t2oa Csg 5qG
related: kzsm 3BK m8u
related: baN3 18U aw5
related: wTEr CBC bqh
related: T5E1 AA2 pxY
related: cDo5 EyL ciA
related: JezX oUD TZr
broad match: C7213

Skogsplanläggare
type: Concept
in scheme: JobTech Taxonomy - Yrke
definition: En skogsplanläggare arbetar med att planera och genomföra åtgärder inom skogsbruket, med fokus på hållbarhet och effektivitet. Skogsplanläggaren gör skogsbruksplaner, analyserar skogliga förhållanden och ger råd om skogsvård. Arbetet innefattar både praktiskt arbete i skogen och administrativt arbete på kontor. Källa: Arbetsförmedlingen, statsskuld
broader: Specialister och rådgivare inom skogsbruk
related: kbTY odt 151
related: WGAZ xaM gUE
related: VuuL 7CH adj
related: jEmD s26 6TB
broad match: C2132

Köp- och försäljningsmäklare av fartyg
type: Concept
in scheme: JobTech Taxonomy - Yrke
definition: Köp- och försäljningsmäklare av fartyg, även kallad S&P-mäklare, förmedlar affärer mellan köpare och säljare av fartyg, både nybyggen och begagnade. Arbetet kräver god kunskap inom fartygsteknik, ekonomi, sjöfartsregler, fartygsfinansiering och aktuell fraktmarknad. Mäklaren bistår med marknadsinformation och lönsamhetskalkyler inför affärsbeslut och ansvarar för att förhandlingar, kontrakt och ägarskiften genomförs korrekt och effektivt. I köpeprocessen ingår att upprätta och följa upp dokument som varvskontrakt eller Memorandum of Agreement (MoA) samt att koordinera leverans och betalning, ofta internationellt. Arvodet utgår i form av kommission baserad på köpesumman. Källa: Sveriges Skeppsmäklare
broader: Speditörer och transportmäklare
related: RPTn bxG ExZ
related: ASGV zcE bWf
related: GXPV yNW 7PK
broad match: C3331

Strålskyddstekniker
type: Concept
in scheme: JobTech Taxonomy - Yrke
definition: Strålskyddstekniker övervakar, mäter och hanterar strålningsnivåer inom exempelvis kärnkraftsanläggningar och industrier. Arbetsuppgifter inkluderar praktiskt arbete med mätteknik, materialhantering och stöd vid revisioner samt underhållsprojekt, ofta på fältet i skiftarbete. Rollen kan även innebära att att upprätta och kontrollera skyddszoner, genomföra strålskyddsmätningar, hantera radioaktivt avfall och ge instruktioner kring skyddsarbete till övrig personal. Efterfrågad behörighet innefattar godkänd strålskyddsutbildning inom kategori A, B eller C. Tidigare erfarenhet av strålskyddsarbete och god kunskap i både svenska och engelska är vanligvis efterfrågat. Många arbetsgivare erbjuder interna utbildningar som möjlighet att vidareutvecklas till högre behörighetsnivåer. Källa: Arbetsförmedlingen
broader: Säkerhetsinspektörer m.fl.
related: E7hm BLq fqZ
related: JzrR VnW nQF
related: Go3J Eob hjU
related: kDNx z5C AmY
broad match: C3257

Byggnadsinspektör/Bygglovshandläggare
type: Concept
in scheme: JobTech Taxonomy - Yrke
definition: Bygglovshandläggare/Byggnadsinspektörer handlägger och beslutar om ärenden enligt plan- och bygglagen samt utövar tillsyn på beviljade byggen. Arbetet innebär att granska ansökningar, ritningar och kontrollplaner för att säkerställa att byggprojekt följer lagar, regler och god byggpraxis. Tillsyn och uppföljning görs genom tekniska samråd, arbetsplatsbesök, övervakning av byggande och utfärdande av slutbesked. Rollen innebär samarbeta med alla inblandade aktörer, främst byggherrens kontrollansvarig (KA), för att hjälpa den sökande att uppnå alla tekniska krav som ställs på byggnaden. Rollen kan även innebära att leda samrådsmöten med byggherrar, entreprenörer och övriga intressenter, samt att förbereda beslutsunderlag till byggnadsnämnden. I arbetet ingår ofta att fungera som rådgivare och kontaktperson, ge information och stöd i bygg- och planfrågor samt samarbeta med andra kommunala verksamheter. Källa: Boverket, Arbetsförmedlingen
broader: Brandingenjörer och byggnadsinspektörer m.fl.
related: Zdkc Q82 Zqc
related: vSqx Af3 mFQ
related: TSm7 2eD hHd
related: jDvd FA4 5vF
related: WtrN YYE Lxo
related: GbeJ VZk b6W
related: E7hm BLq fqZ
related: i1No Tya F5S
related: x4qK CWw vmh
related: oc9k FGW KUM
related: 72by HWx 6hu
related: j7Cq ZJe GkT
related: CMZy tPo 99G
related: 4As4 mbC Zcx
related: qYzJ wc8 8aJ
related: BATr Qzm o78
related: bWTj zHD Ak9
related: DrPF ACb nPK
related: 7ThT 34B 46u
related: FbVE xRy tGM
related: ja7J P8X YC9
related: G2BR S3s ihX
related: sGjm q93 4mG
related: 2qtv XCu tzq
related: Gieg UQq Ju6
broad match: C3112

Maskinuthyrare
type: Concept
in scheme: JobTech Taxonomy - Yrke
definition: Maskinuthyrare hyr ut maskiner och verktyg till företag och privatpersoner. Arbetsuppgifter kan innefatta att säkerställa skick på utrustning, hantera kundkontakt, ge råd och information om produkterna, samt administrera uthyrningar och returer. Beroende på arbetsplats kan även enklare tekniskt underhåll och reparationer ingå. Se även yrket Servicetekniker hyrmaskiner. Källa: Arbetsförmedlingen
broader: Uthyrare
related: RPTn bxG ExZ
related: EhAA QS5 oqf
related: wh49 wSG xN7
related: ZiFi yWQ ah1
broad match: C5249

Mudderverkskötare
type: Concept
in scheme: JobTech Taxonomy - Yrke
definition: Mudderverksoperatör manövrerar ett mudderverk för att avlägsna material från botten på sjö, vattendrag, hav och kanaler. Syftet med muddringen kan vara att fördjupa eller bredda hamnar, båtplatser, kanaler eller dylikt. Muddringen kan utföras på två olika sätt antingen sugmuddring eller grävning. Sugmuddring används oftast när det handlar om miljöfarligt avfall. Källa: sjogravning.com
broader: Anläggningsmaskinförare m.fl.
related: j7Cq ZJe GkT
related: Mxyf t2J iLA
broad match: C8342

Civilingenjör, produktion, maskin
type: Concept
in scheme: JobTech Taxonomy - Yrke
definition: Civilingenjör, produktion, maskin
broader: Civilingenjörsyrken inom maskinteknik
related: SuAn oH9 xNc
related: 6Hq3 tKo V57
related: dW2G N5X 1J8
broad match: C2144

Lärling, grävlastare
type: Concept
in scheme: JobTech Taxonomy - Yrke
definition: En lärling är anställd för att slutföra sin kvalificeringstid till grävlastare innan ett yrkesbevis kan utfärdas. Under kvalificeringstiden får du lärlingslön enligt avtal. Kvalificeringstiden tillsammans med teoretisk grundutbildning leder till yrkesbeviset. Ett lärlingsavtal mellan branschorganisation och företag tecknas. Källa: BYN
broader: Anläggningsmaskinförare m.fl.
related: j7Cq ZJe GkT
related: ja7J P8X YC9
broad match: C8342

ST-läkare, socialmedicin
type: Concept
in scheme: JobTech Taxonomy - Yrke
definition: Specialisttjänstgöring, ST, är den vidareutbildning som legitimerade läkare genomför för att uppnå specialistkompetens. ST-läkare socialmedicin arbetar under handledning för att fördjupa sina medicinska kunskaper och färdigheter med målet att bli specialistläkare inom sitt område. ST-läkaren arbetar självständigt med patientutredningar, diagnostik och behandling, men alltid med stöd av specialister och enligt ett individuellt utbildningsprogram. Vanliga arbetsuppgifter är att ta medicinskt ansvar för patienter, delta i jourverksamhet, genomföra medicinska undersökningar och behandlingar samt dokumentera och följa upp vårdinsatser. Tjänsten omfattar också kontinuerlig kompetensutveckling, sidotjänstgöring inom närliggande områden och aktivt deltagande i handledning och utbildningsinsatser för kollegor och studenter. Källa: Arbetsförmedlingen, Karolinska Universitetssjukhuset, Sveriges läkarförbund, Region Kronoberg, Region Skåne.
broader: ST-läkare
related: NYW6 mP6 vwf
related: UtCj yMj ubw
broad match: C2211

Videojournalist/Videoreporter
type: Concept
in scheme: JobTech Taxonomy - Yrke
definition: Videojournalist/Videoreporter planerar, filmar, redigerar och producerar videoinslag för nyhetsprogram, dokumentärer och andra informativa medier. Vanliga arbetsuppgifter är research och planering inför inspelning, intervju och slutlig redigering av videomaterial, ofta i fält och under tidspress. Källa: Arbetsförmedlingen
alternative label: Videojournalist
alternative label: Videoreporter
broader: Journalister m.fl.
related: pYez WWr Ygt
related: 8too bEs 7NU
related: 9puE nYg crq
broad match: C2642

Kabinettsekreterare
type: Concept
in scheme: JobTech Taxonomy - Yrke
definition: Kabinettsekreterare
broader: General-, landstings- och kommundirektörer m.fl.
related: bh3H Y3h 5eD
broad match: C1112

Taxiförare
type: Concept
in scheme: JobTech Taxonomy - Yrke
definition: Taxiförare kör licenserat fordon för transport av passagerare. Taxiförare kör kunder enligt beställning, tar emot betalningar och sköter fordonsunderhåll som att rengöra fordonet. Taximarknaden består av företagsresor och privatresor som tillhandahålls på en öppen marknad. Ett annat stort område är samhällsbetalda resor, såsom sjukresor, färdtjänst, skolskjutsar och kompletteringstrafik som upphandlas av regioner och kommuner. I en taxibil får du köra upp till 7 passagerare, beroende på fordonets registreringsbevis. En taxibil kan alltså vara en mindre personbil, minibuss eller rullstolstaxi som har både säten och rullstolsplatser. Källa: Transportfackens yrkes- och arbetsmiljönämnd
broader: Taxiförare m.fl.
related: n6n3 qZH cLV
related: X3xJ L5G Hms
related: gSsE CrA RA8
related: 5a7W 8S1 PCU
related: sYFW dup ECG
related: ASGV zcE bWf
related: zfFz v8q g8a
related: jcNR xmP UHZ
related: 1f1C A9W yvG
related: HaUi 2yq d81
related: srA5 eeZ 4Hr
related: czj4 ipR eEQ
related: UNLs 21j q5P
related: 5cbL BMX NAX
related: Fm6P tor Thh
broad match: C8322

Fritidsledare i församling
type: Concept
in scheme: JobTech Taxonomy - Yrke
definition: Fritidsledare i församling arbetar med fritidsverksamhet för barn och ungdomar inom kyrkans verksamhet. Arbetet innebär i huvudsak att planera, leda och utveckla olika aktiviteter såsom barngrupper, ungdomsträffar, fritidskvällar, läger och konfirmandverksamhet. Fritidsledare kan även förbereda och genomföra program i samarbete med kollegor som präster, diakoner och pedagoger, samt bidra i gudstjänster och andra samlingar där barn och ungdomar är delaktiga. Ofta ingår samverkan med skolor, föreningar och lokalsamhället. Källa: Arbetsförmedlingen
broader: Fritidsledare m.fl.
related: aZxt oq8 sUC
related: aQJv u5W Eaj
related: SEFy tZb 1p6
related: GazW 2TU kJw
related: Vzpb DPE avh
related: a1pM c6P B2M
broad match: C3423

Båtvärd
type: Concept
in scheme: JobTech Taxonomy - Yrke
definition: Båtvärdar arbetar ombord på passagerarfartyg, färjor och charterbåtar med att ta emot och assistera passagerare under resan. Arbetsuppgifterna inkluderar att välkomna gäster, hjälpa till med ombordstigning och bagage, servera mat och dryck, samt informera om säkerhetsrutiner och destinationer. Båtvärdar kan även genomföra guidningar och underhållning ombord, särskilt på charterturer. Källa: Arbetsförmedlingen
alternative label: Båtvärdinna
broader: Kabinpersonal m.fl.
related: dRFw Rcu dX7
related: ASGV zcE bWf
broad match: C5111

Klinikchef, tandvård/Verksamhetschef, tandvård
type: Concept
in scheme: JobTech Taxonomy - Yrke
definition: Klinikchef, tandvård/Verksamhetschef, tandvård
alternative label: Klinikchef, tandvård
alternative label: Verksamhetschef, tandvård
broader: Chefer inom hälso- och sjukvård
related: 2TAP mEH ywp
related: NYW6 mP6 vwf
related: yMb5 BAc kNx
related: rW9h D6p dtT
related: epLc SkD cbT
related: bh3H Y3h 5eD
broad match: C1342

Hästskötare
type: Concept
in scheme: JobTech Taxonomy - Yrke
definition: Hästskötare arbetar med den dagliga skötseln av hästar på ridskolor, trav- och galoppstall eller stuterier. Arbetsuppgifter omfattar utfodring, vattning, in- och utsläpp av hästar, mockning och rengöring av boxar och stallar samt rykt och övrig daglig omvårdnad. Hästskötare förbereder hästar för ridning eller träning och kan delta i ridning eller motionering av hästar vid behov. Vid stuteriarbete ingår även att assistera vid betäckningar och fölningar. Hästskötare övervakar hästarnas hälsa, utför enklare vårdåtgärder och rapporterar tecken på sjukdom eller skada. Arbetsuppgifter kan även inkludera underhåll av stall och andra byggnader samt kundkontakt vid ridskolor och tävlingar. Källa: Jobba grönt, Arbetsförmedlingen
broader: Uppfödare och skötare av lantbrukets husdjur
related: PxWB afp HLm
related: LN2i wSB s3N
related: V878 4cv r36
related: rYXY FRT Sup
related: 52iz HXR 9Xi
related: tEw3 U65 XNo
related: Dvk2 Pup V5t
related: kMjB Cny dua
related: VuuL 7CH adj
related: 9b7i K7V W1q
related: 3rdS E1H Pyt
related: yCzE ZQW Vks
broad match: C6121

Sjuksköterskestuderande
type: Concept
in scheme: JobTech Taxonomy - Yrke
definition: Sjuksköterskestuderande genomför verksamhetsförlagd utbildning (VFU) inom hälso- och sjukvården för att tillämpa och utveckla sina teoretiska kunskaper i praktiskt omvårdnadsarbete. Under handledning medverkar sjuksköterskestuderande i patientnära vård, utför grundläggande omvårdnadsuppgifter och deltar i teamarbete tillsammans med legitimerad personal. Vanliga arbetsuppgifter är att observera patienter, dokumentera vårdinsatser, assistera vid behandlingar och delta i utvärdering av vårdprocessen. Källa: Arbetsförmedlingen, Röda Korsets Högskola, Svensk sjuksköterskeförening
broader: Grundutbildade sjuksköterskor
related: NYW6 mP6 vwf
related: 8vNJ fhY gbN
broad match: C3221

Modellbyggare
type: Concept
in scheme: JobTech Taxonomy - Yrke
definition: Modellbyggare designar och bygger skalade modeller utifrån ritningar men även visioner från kunder. Man arbetar i olika material, till exempel plast, trä, vax och metaller. Arbetet sker både manuellt och med hjälp av modern teknik som laserskärare och 3D-skrivare. Kunskap i digitala verktyg, främst CAD-program, är också vanligt. Modeller kan vara beställda av fastighetsutvecklare, bostadsbyggare och arkitektbranschen. Andra kunder kan vara företag som utvecklar fordon och till viss mån ingenjörsfirmor som är inblandade i större industri- och infrastrukturprojekt. Arbetsplatser är ofta företag specialiserade på just modelltillverkning. Källa: Arbetsförmedlingen
broader: Fin-, inrednings- och möbelsnickare
related: hYAA Ajt N1F
related: deFQ PxZ smT
related: PaxQ o1G wWH
broad match: C7522

IT-chefer
type: Concept
in scheme: JobTech Taxonomy - Yrke
definition: IT-chefer
broader: Chefer inom IT, logistik, FoU, fastighetsbolag, bygg- och ingenjörsverksamhet samt tillverkning m.m.
narrower: IT-chefer

Lokförare och bangårdspersonal
type: Concept
in scheme: JobTech Taxonomy - Yrke
definition: Lokförare och bangårdspersonal
broader: Transport- och maskinföraryrken
narrower: Bangårdspersonal
narrower: Lokförare

Kameraassistent
type: Concept
in scheme: JobTech Taxonomy - Yrke
definition: Kameraassistent förbereder, underhåller och justerar kamerautrustning för att säkerställa att film- och fotoinslag blir tekniskt perfekta och skarpa. Vanliga arbetsuppgifter är att rigga kameran, byta linser, justera fokus under tagningar, säkerställa att minneskort och batterier är redo samt stödja filmfotografen i att anpassa kamerainställningar efter produktionens behov. Att dokumentera tagningar och hantera utrustningslogistik är också vanligt förekommande. Källa: Arbetsförmedlingen, Yrkesnämnden för Film och TV
broader: Bild- och sändningstekniker
related: 8too bEs 7NU
related: 9puE nYg crq
related: d1Ao 9bY 7Kn
broad match: C3521

Präst, grekisk-ortodox kyrka
type: Concept
in scheme: JobTech Taxonomy - Yrke
definition: Präst, grekisk-ortodox kyrka
broader: Präster
related: GazW 2TU kJw
broad match: C2636

Datorlingvist/Datalingvist
type: Concept
in scheme: JobTech Taxonomy - Yrke
definition: Datorlingvist/Datalingvist
alternative label: Datalingvist
alternative label: Datorlingvist
broader: Övriga IT-specialister
related: apaJ 2ja LuF
related: EDxZ R4u 8U9
broad match: C2519

Barnmorskor
type: Concept
in scheme: JobTech Taxonomy - Yrke
definition: Har vårdansvar vid förlossningar. Vårdar nyblivna mammor och barn på sjukhusens förlossnings- och BB-avdelningar samt mödravårdscentraler. Gör hälsoundersökningar samt svarar för föräldrautbildning. Informerar om sex och samlevnad samt skriver ut preventivmedel.
broader: Sjuksköterskor
related: MAHk Fch S3Y
related: hAZR 5Ho Jdw
related: Mmxs Qrv cpG
related: 73kE uFW vvT
related: o62r LQn 3Nb
related: N7Xw LmJ TYe
related: Hgww z4B Tyg
related: E25i PEi rQh
related: en5D 6eC eCG
related: ZzN5 m7B 5CY
related: Sjz5 8jg NAr
related: dJa5 Nao mDS
related: MVKv XXk XAi
related: HL4X gpT RhT
related: eThQ HCv mY6
related: uqTa YUV uAi
related: Vmfq d4c Fkz
related: Ektq nPz 4YF
related: MR4H FFT mTj
related: BvGm Zuj VLF
related: XFH8 YFw Mzb
related: GYz6 5Jt Wmy
related: AmSg wbt ZzD
related: C2222
related: oRM3 GN7 vuN
narrower: Barnmorskestuderande
narrower: Barnmorska
broad match: NYW6 mP6 vwf

Ombudsman
type: Concept
in scheme: JobTech Taxonomy - Yrke
definition: Ombudsman
broader: Planerare och utredare m.fl.
related: 35B3 gFX nND
related: 7Gvm 7Lh sqH
related: VvWt FBP Hmf
related: oXXQ 2zZ Jej
related: coxZ quh gKC
related: sTWX yUR 2pi
related: X82t awd Qyc
related: r1dG eUG vWq
related: o4Nk vkw Jop
related: ntks 1iP 67H
related: Yb1w sSy Rh9
related: Sshc EHj Ptg
related: R3o3 nVJ buH
related: PVgB Ra8 DE8
related: TZe9 NsN uce
related: E5Qn w48 1sU
related: UxF1 V7Y TJQ
related: hxSR p9R cqk
broad match: C2422

Systemanalytiker/Systemutredare
type: Concept
in scheme: JobTech Taxonomy - Yrke
definition: Systemanalytiker/Systemutredare
alternative label: Systemanalytiker
alternative label: Systemutredare
broader: Systemanalytiker och IT-arkitekter m.fl.
related: nFQP RCr DE6
related: apaJ 2ja LuF
related: uMXE QLN 4LW
related: WyrM pZh Jtz
related: qBsw ikL hZ2
related: 58Zh bZ4 tSY
broad match: C2511

Elkraftingenjör
type: Concept
in scheme: JobTech Taxonomy - Yrke
definition: Elkraftingenjör ofta i rollen som Nätplanerare arbetar med kort- och långtidsplanering samt projektering av ny- och ombyggnationer inom lokal- och regionnät. Arbetsuppgifterna inkluderar beräkningar och simuleringar för att analysera nätets funktion, identifiera svaga punkter och föreslå tekniska och ekonomiska förbättringar. Rollen omfattar kartläggning av terräng och markanvändning samt dimensionering för hög leveranssäkerhet och låga energiförluster. Elkraftingenjör (Nätplanerare) hanterar hela processen från anslutningsförfrågan till projektstart, inklusive offertarbete och nödvändig dokumentation. Arbetet gäller både nyetablering i exploateringsområden och förnyelse av befintliga nät med fokus på kvalitet och säkerhet enligt gällande regler. Källa: EBR, Energijobb.se, Ellevio
broader: Ingenjörer och tekniker inom elektroteknik
related: xEPH waB LFQ
related: 6Hq3 tKo V57
related: 8843 Ups t5F
related: eEXY DKo 5wp
related: 88Nq Zzu yKk
related: MZDs Mah tXz
related: w4dJ KBP 3iU
related: xMbM MiX sTG
related: U8kW sgc Rcp
related: SpSP BkA ZWU
related: fFaV guh kgY
related: sfd1 6LC tfE
related: Medi QzD Hw2
related: RU3u vV6 Q9D
related: FM5i ZH4 Be6
related: yzwh ieq C57
related: 5UZj yMK ft1
related: JNQ2 CW9 f4s
related: 645j n4Z 2T8
related: ChXZ SUM F4q
related: rCT3 pdV zQz
related: PxUH hoq Rjr
related: tgdU gEM o4m
related: Q5JF BXM aHw
related: qdPb 955 djQ
related: u6N5 brU TJi
related: M9D3 Swp W3x
related: FLU5 oKq F8z
related: k3Wb eKw Sbq
related: fcUe 3yT YE8
related: kNgz tQe 5FB
related: pWuj qZL jQE
related: G4KH PD1 QTb
broad match: C3113

Rymdingenjör
type: Concept
in scheme: JobTech Taxonomy - Yrke
definition: Rymdingenjör
broader: Civilingenjörsyrken inom elektroteknik
related: 6Hq3 tKo V57
related: kDRm Yaa jAB
broad match: C2152

Övriga drifttekniker och processövervakare
type: Concept
in scheme: JobTech Taxonomy - Yrke
definition: Utför annat arbete inom drift- och processövervakning än inom 8191-8193. Exempel på arbetsuppgifter: Styr och övervakar industrirobotar.
broader: Drifttekniker och processövervakare
related: FqWP 6FQ Wz5
related: wBLK nWZ 7ek
related: aHCV VsV LiD
related: C3139
related: ZTYm vXS KEZ
related: aF3J SgE uck
related: PELm cH9 AE9
related: brda 5pJ 8cu
related: vXVH 94E pQD
related: s9xE KMp pVg
related: eojD i4f 4f6
related: GCYi 9tC 1pP
related: KfEn V5y npV
related: wZpC X9a xzG
related: MT1a Nyq DGQ
related: Uytu hWi 5nh
related: ZTk2 7eo CUb
related: FhjY 7eH rvd
narrower: Industrirobotoperatör
broad match: yhCP AqT tns

Skogsekonom
type: Concept
in scheme: JobTech Taxonomy - Yrke
definition: Skogsekonom
broader: Fastighetsförvaltare
related: 6Hq3 tKo V57
related: WDoL Rzs 4G1
related: VuuL 7CH adj
broad match: C3334

Manuell ytbehandlare inom trä
type: Concept
in scheme: JobTech Taxonomy - Yrke
definition: Manuella ytbehandlare av trä behandlar träprodukter med bland annat färg, lack, olja och bets. Arbetet innebär till exempel målning, slipning, lagning och finisharbeten. Man använder sprutpistoler och andra handverktyg för att applicera ytbehandlingsmaterial. Beroende på arbetsplats kan även maskinell, datoriserad applicering förekomma. Efter behandling kontrolleras kvalitet på produkten. Beroende på arbetsplats ingår även packning, emballering och förberedelse för leverans till kund. Enklare maskinunderhåll och truckkörning kan även ingå. Källa: Trä- och möbelföretagen, Arbetsförmedlingen
broader: Manuella ytbehandlare, trä
related: PaxQ o1G wWH
related: CFtU ses Grb
broad match: C7521

Skötare
type: Concept
in scheme: JobTech Taxonomy - Yrke
definition: Vårdar, ger stöd och råd samt medverkar i rehabilitering av patienter inom psykiatrisk vård och missbruksvård.
broader: Skötare, vårdare och personliga assistenter m.fl.
related: eoQj YKG fZi
related: gSXr R3d 1uU
related: TuUX 3Jo wyq
related: uj9N 8yo T72
related: UHt4 LX5 T7x
related: C5321
related: ckhF ACN GqU
related: x289 bKF ihE
related: X9N9 QGi 9Ym
related: N9zh vwb Wht
related: LwJS Hz5 yDP
related: wNW9 zPT yY6
related: hqYJ jyZ Ks8
related: zMr8 cTC PCB
related: iwLB oeN B4F
related: aoVs Qfu U3j
related: mnmo V8k dCz
related: enLQ GrZ w3S
related: yRaA b6w MJP
related: cocQ EPn YiY
related: xLxq sQ7 RzR
related: Gtff Yfu Qag
narrower: Brukarspecialist
narrower: Skötare (inom psykiatrisk vård)
narrower: Skötarstuderande
broad match: NYW6 mP6 vwf

Arbetsledare, gruvbrytning och metallproduktion
type: Concept
in scheme: JobTech Taxonomy - Yrke
definition: Arbetsledare inom gruvbrytning planerar, leder och samordnar arbetsprocesser i gruvmiljö. Arbetsuppgifterna innefattar att organisera arbetet i skiftlag, följa produktionsmål och säkerställa att säkerhetsrutiner följs på arbetsplatsen. Arbetsledaren kommunicerar med olika avdelningar och entreprenörer för att effektivisera produktionen och lösa tekniska problem. Rollen innebär att övervaka maskiner, materialflöden och arbetsmiljön i en komplex och ibland krävande arbetsmiljö. Källor: Arbetsförmedlingen, div jobbannonser
broader: Arbetsledare inom bygg, anläggning och gruva
related: j7Cq ZJe GkT
related: Bq49 GkW Ptr
related: UG6C Wi5 qh9
broad match: C3121

Molntekniker/Cloudutvecklare
type: Concept
in scheme: JobTech Taxonomy - Yrke
definition: Molntekniker/Cloudutvecklare arbetar med utveckling, implementering och förvaltning av molnbaserade IT-lösningar. Arbetsuppgifterna inkluderar konfiguration och administration av molntjänster, automatisering av processer, integration mellan molntjänster och befintliga IT-miljöer samt övervakning av prestanda och säkerhet. Molntekniker/Cloudutvecklare samarbetar med utvecklings- och driftteam för att säkerställa funktion och skalbarhet i molnlösningar. Källa: Arbetsförmedlingen
alternative label: Cloudutvecklare
alternative label: Molntekniker
broader: Nätverks- och systemtekniker m.fl.
related: GjEJ aLT g9q
related: apaJ 2ja LuF
related: VDp2 rf1 LcT
related: 9mYB YzT wVQ
related: 5VZU bFa PmN
related: GzoH Qm6 RW3
related: XLSf G4F VLL
related: 5ZR1 7Qd uwv
broad match: C3513

Lärling, bandschaktarförare
type: Concept
in scheme: JobTech Taxonomy - Yrke
definition: En lärling är anställd för att slutföra sin kvalificeringstid till bandschaktförare innan ett yrkesbevis kan utfärdas. Under kvalificeringstiden får du lärlingslön enligt avtal. Kvalificeringstiden tillsammans med teoretisk grundutbildning leder till yrkesbeviset. Ett lärlingsavtal mellan branschorganisation och företag tecknas. Källa: BYN
broader: Anläggningsmaskinförare m.fl.
related: j7Cq ZJe GkT
related: ja7J P8X YC9
broad match: C8342

Städledare och fastighetsskötare m.fl.
type: Concept
in scheme: JobTech Taxonomy - Yrke
definition: Städledare och fastighetsskötare m.fl.
broader: Serviceyrken
narrower: Fastighetsskötare
narrower: Städledare och husfruar

Mjuklödare
type: Concept
in scheme: JobTech Taxonomy - Yrke
definition: Mjuklödare löder samman elektriska komponenter och mindre mekaniska delar med hjälp av smält lödmetall vid relativt låga temperaturer. Arbetsuppgifterna omfattar manuell montering och lödning av komponenter på kretskort, kablage och finmekaniska produkter för serieproduktion och prototyparbete. Mjuklödare bearbetar och applicerar lod med hög precision för att skapa säkra och hållbara elektriska förbindningar samt genomför kvalitetskontroll av utförda lödningar. Yrket omfattar även tolkning av tekniska ritningar och dokumentation av produktionsmoment. Källa: Arbetsförmedlingen
broader: Svetsare och gasskärare
related: UHQf 1Gz aRp
related: shEi 74s cKo
related: zuF2 Qfn Ubq
related: 3eb4 Lu3 2DT
related: wTEr CBC bqh
broad match: C7212

Copywriter
type: Concept
in scheme: JobTech Taxonomy - Yrke
definition: Copywriter
broader: Informatörer, kommunikatörer och PR-specialister
related: BqMA SYb aKJ
related: X82t awd Qyc
related: oQBk kRv ayg
related: mW8Z VMz hZR
related: vwxR MbC XjW
broad match: C2432

Driftchefer inom bygg, anläggning och gruva
type: Concept
in scheme: JobTech Taxonomy - Yrke
definition: Formulerar och ansvarar för mål och strategier för verksamhet inom bygg, anläggning och gruva. Ansvarar för budget, kalkylering, upphandling, inköp, tidsplan samt kontakter med beställare och myndigheter. Utformar riktlinjer, följer upp och utvärderar verksamheten mot uppsatta mål. Har personalansvar. Hit hör inte Arbetsledare inom bygg, anläggning och gruva (3121)
broader: Driftchefer inom bygg, anläggning och gruva
related: HACr 3sZ 4gm
related: C1322
related: MUh1 LJt EBw
related: mP5U LLJ 746
related: tg8L maz wMN
related: s5SS 7bW 1Gh
related: Xpix Jg8 81T
related: YSVk ZwM xm4
related: zRtu fYj XC4
related: UH9g R5v MCx
related: SmZd Jaa BeY
related: 29MP yhF mjx
related: 8tYq EXD Xwm
related: jt4y g5c GXy
related: ggBd CHg xXk
related: ZzN5 m7B 5CY
related: D6xD cSH rZN
related: 9QUy Akh FN5
related: U1JW vPG Dqk
related: 2rqG WLp em4
related: Nksx 4oe fEQ
related: eThQ HCv mY6
related: Wn83 Pyq tDj
related: 5PjX 999 uLZ
related: N1hq MGo wgo
related: g2yR Gdi LUN
related: Gt5f wdi FSJ
related: W4er Syp Wrt
related: q7Mx gjU F9q
related: VfP9 2xd g2h
related: zXNU zXR hGd
related: 4fRg DA4 Dj3
related: RrWD 6m1 ess
related: SmU2 is4 1go
related: 3Sj1 uuL y1A
related: Betk ZCh mY9
related: C1323
related: sGky Wqy QvZ
narrower: Avdelningschef, gruva
narrower: Produktionschef, anläggning
narrower: Platschef, bygg
narrower: Produktionschef, bygg
narrower: Platschef, anläggning
narrower: Sektionschef, gruva
broad match: bh3H Y3h 5eD

Piloter m.fl.
type: Concept
in scheme: JobTech Taxonomy - Yrke
definition: Navigerar och styr flygplan, helikoptrar och andra luftfartyg. Ansvarar för flygning, passagerare och last. Övervakar styr- och navigeringssystem.
broader: Piloter, fartygs- och maskinbefäl m.fl.
related: fzsZ vhg ZYM
related: iaZ8 JUU gik
related: V6Fv iN9 sJL
related: QnvA akR Rd7
related: C3153
related: TaMm YFg aHq
related: ASRp eWE RJE
related: 26E4 m2a 8Cg
related: KvJu 8SF 7Nf
related: X6CX Umm xCu
related: FkaS sAi dZt
related: eMpb oHC 6VE
related: CNcP 3mu Cgs
narrower: Flyginstruktör/Flyglärare
narrower: Drönaroperatör/Drönarpilot
narrower: Helikopterförare/Helikopterpilot
narrower: Ballongpilot
narrower: Chefspilot
narrower: Pilot/Trafikflygare/Flygkapten
narrower: Pilot/Trafikflygare/Flygstyrman
broad match: ASGV zcE bWf

Logistiker
type: Concept
in scheme: JobTech Taxonomy - Yrke
definition: Logistiker
broader: Civilingenjörsyrken inom logistik och produktionsplanering
related: 6Hq3 tKo V57
related: fzZc ZnV Tse
related: Mv8w sJh gio
related: iwds EZE gU5
related: X94f DTL f5U
related: tYBC mGL t94
related: hbmb Boj cXi
related: iaZC 11A S3T
related: zJ1P dtJ hBT
related: wm1u nPU 2wp
related: sXcu D4e KdY
related: 1xx5 NwX bGM
related: C7oH jkP zwe
related: Rtxj 7Hh RKz
related: sQLJ Mxz Nui
related: wYtp w7m bRP
related: wEDm uJF sY1
related: eWai J6V WDr
related: 4aMz gbV UoE
related: MfwH nNm 8tH
related: WvEp MTg EYs
related: TKs4 Yto LcD
broad match: C2141

Forskningsingenjör, maskin
type: Concept
in scheme: JobTech Taxonomy - Yrke
definition: Forskningsingenjör, maskin
broader: Civilingenjörsyrken inom maskinteknik
related: SuAn oH9 xNc
related: 6Hq3 tKo V57
broad match: C2144

Vårdare, boendestödjare
type: Concept
in scheme: JobTech Taxonomy - Yrke
definition: Ger stöd, service och omsorg till barn och vuxna med funktionsnedsättning. Fungerar som stöd för individens självständighet genom att bistå i vardagliga sysslor i hemmet, i grupp- eller serviceboende eller inom daglig verksamhet. Ger stöd även vid hygien och kommunikation samt med fritidsaktiviteter. Hit hör inte Personlig assistent (5343)
broader: Skötare, vårdare och personliga assistenter m.fl.
related: bCVZ ziY KHC
related: 14eq XTy BPB
related: dAq7 Xf8 KZ8
related: 7wbG fbz pon
related: C5321
related: x289 bKF ihE
related: Xqn7 nQQ ovW
related: tg1e QpF xdX
related: qMfa U8e Lto
related: zgd6 6Bj 829
related: 9ShZ oc6 1Jc
related: YU6v SsT UBm
related: zMr8 cTC PCB
related: C5322
related: aoVs Qfu U3j
related: axxm t1P 6WR
related: huu9 Uir rPn
related: E3iH XQQ pvE
related: crVe Rij aaB
related: cocQ EPn YiY
narrower: Boendestödjare
narrower: Stödassistent
broad match: GazW 2TU kJw

Backend-utvecklare
type: Concept
in scheme: JobTech Taxonomy - Yrke
definition: Backend-utvecklare
broader: Mjukvaru- och systemutvecklare m.fl.
related: QoiQ MDU aqT
related: 3X4u LSS 7MS
related: DgCo EWd DpZ
related: Synv 5iC WSS
related: bVZd pkH kgi
related: Ko2P S16 Tey
related: cN5A 3dP LGA
related: eiA1 RjP 5Tc
related: gwqA 1H1 P6j
related: apaJ 2ja LuF
related: GQcS 8Xg acg
related: gdVd uxq 7hN
related: Da8c sbH 2bV
related: cD9x CbL LB6
related: KT6P hVH LRD
related: KkTy oqi fS3
related: F8PV jpm qwT
related: v8qE eS5 aAe
related: cGxS 4dx cDB
related: sSwD fG3 tT1
broad match: C2511

Arkeolog
type: Concept
in scheme: JobTech Taxonomy - Yrke
definition: Arkeolog
broader: Arkeologer och specialister inom humaniora m.m.
related: kJeN wmw 9wX
related: rrFm hbu fVF
related: 5XFw NGC 5fN
related: uuRn cgV 5Tw
broad match: C2632

Manager/Agent inom kultur och underhållning
type: Concept
in scheme: JobTech Taxonomy - Yrke
definition: Manager eller agent inom kultur och underhållning representerar artister, musiker, författare och andra kreatörer. Arbetsuppgifter kan innefattat att förhandla kontrakt, boka uppträdanden och evenemang, hantera PR och marknadsföring, skapa affärsmöjligheter och utveckla långsiktiga relationer inom kultur- och underhållningsbranschen. Rollen kan innefatta flera specialiseringar som fotografagent, artistagent, artistbokare, artistförmedlare, musikagent och litterär agent. Gemensamt för dessa är att yrket kombinerar strategiskt affärstänkande med kreativ förståelse och ett stort kontaktnät. Källa: Arbetsförmedlingen
broader: Övriga förmedlare
related: Xms7 GGJ 8aL
related: MAXL k6t Hqi
related: kP6m UUU 35r
related: RPTn bxG ExZ
related: Wtfe HVX REC
related: 9puE nYg crq
related: wQcU qHq JVi
related: kg9Q gMP 4w4
related: cg57 MZg yer
broad match: C3339

Yogamassör
type: Concept
in scheme: JobTech Taxonomy - Yrke
definition: Yogamassör
broader: Terapeuter inom alternativmedicin
related: NYW6 mP6 vwf
related: Uuf1 GMh Uvw
broad match: C3230

Brunnsborrare m.fl.
type: Concept
in scheme: JobTech Taxonomy - Yrke
definition: Monterar och styr maskiner och aggregat för borrning efter vatten, olja, mineral m.m. Monterar och sköter pumpanläggning.
broader: Malmförädlingsyrken och brunnsborrare m.fl.
related: 8bXe Uzh LAP
related: CZGX PJt cwU
related: q25B p3f 8PD
related: tqRJ 2Ds GJG
related: C8113
related: CXCw BKy 5SE
related: fExN 14j VdF
related: HPfU aG2 m9r
related: HSSe f2H 7uF
related: PELm cH9 AE9
related: Q7eC B7g QiU
related: MrXS BuR kvW
related: ESaA 35A HG6
related: j5VC 1gU pvH
related: 85C2 bUX JUW
related: M7C1 DAy UTK
related: zf1U Xnn g1Z
related: muTx UEy cZe
related: 7Vhk 1MC NAT
related: fhcp fFw Lbj
related: 9SoQ UZb fd1
related: m7xY c8e JrB
related: MpNv 4Kx Vu5
related: tYPZ At9 4ag
related: drj3 CKp Mpp
related: xeoH rao GgZ
related: 1tS5 88V RcA
related: ynW8 Jr4 5tT
related: rcSg BJi UTb
related: pXy8 4zz azx
related: pdnx qvm Px4
related: 9F9g xC4 Gue
related: sqqf Pfv ZAU
related: ztAc cLZ vtf
related: 73Pw nip 4EW
related: etcm Lku vHo
related: gsAo fWh 8kU
related: Hiyy sRE X9b
related: HmXd ehy QT9
related: pX7G KRN 7KE
related: KwWd Ffq 2kE
related: dnXS Zcy Bn1
related: hFN6 Rbb Apq
related: vNtw DTZ iSK
related: WrVH jzF ozJ
related: sGky Wqy QvZ
narrower: Pumpman, oljeborrning
narrower: Kärnborrare
narrower: Borrtekniker/Brunnsborrare
broad match: j7Cq ZJe GkT

Lastpallssnickare
type: Concept
in scheme: JobTech Taxonomy - Yrke
definition: Lastpallssnickare tillverkar och reparerar lastpallar. Som lastpallssnickrare tillverkar och reparerar man lastpallar som används för lagring, transport och hantering av gods. Tillverkning sker oftast med manuella maskiner, så som spikpistol, men även maskinellt. Källa: Arbetsförmedlingen
broader: Övriga servicearbetare
related: a8e5 ogP 75g
related: yhCP AqT tns
broad match: C9629

Bildmixer
type: Concept
in scheme: JobTech Taxonomy - Yrke
definition: Bildmixer hanterar och växlar mellan olika bildkällor under direktsändningar och TV-produktioner. Vanliga arbetsuppgifter är planera och hantera utrustning för redigering och mixning av ljud och bild, operatörsansvar under livesändningar samt att samordna bild- och ljudflöden i realtid. Källa: Arbetsförmedlingen, Sveriges Television
broader: Bild- och sändningstekniker
related: 8too bEs 7NU
related: 9puE nYg crq
related: d1Ao 9bY 7Kn
broad match: C3521

Nätverksarkitekt
type: Concept
in scheme: JobTech Taxonomy - Yrke
definition: Nätverksarkitekter design, planerar och optimerar nätverksarkitektur. Yrket kan ses som en specialisering inom IT-arkitektur, med fokus på såväl hårdvara som virtuella lösningar. Arbetet innebär ofta även teknisk rådgivning och cybersäkerhet. Nätverksarkitekten är involverad i hela leveransprocessen från kravanalys till implementering och driftuppföljning. Boerende på arbetsplats kan även operativt arbete med underhåll ingå i arbetsuppgifterna. Källa: Arbetsförmedlingen
broader: Systemanalytiker och IT-arkitekter m.fl.
related: apaJ 2ja LuF
related: QG7p MQ4 zf2
broad match: C2511

Marknadsundersökare och intervjuare
type: Concept
in scheme: JobTech Taxonomy - Yrke
definition: Intervjuar personer och hanterar svaren för marknads-, samhälls- och opinionsundersökningar.
broader: Resesäljare, kundtjänstpersonal och receptionister m.fl.
related: C4227
related: aMyW hB7 TpU
related: AaqP 1Sj RUP
related: QHxK TyX 5zS
related: 1dVh cZS Exw
related: 2KH5 1dw QQF
related: UyaU 1zF Ktb
related: AwhJ eLD xpG
related: xPrX o6V gSF
related: 9T9i UN7 zim
related: sGky Wqy QvZ
narrower: Marknadsundersökare/Intervjuare
broad match: RPTn bxG ExZ

Mjukvarutestare
type: Concept
in scheme: JobTech Taxonomy - Yrke
definition: Mjukvarutestare
broader: Systemtestare och testledare
related: 4bEp BrE DAu
related: g8wH fi1 ueD
related: hTh3 gYS Amr
related: Uonx ZFt grT
related: frAG 1nF mWH
related: UgRJ zEv SZJ
related: 3UER JEr AK9
related: JipR Cwm C27
related: apaJ 2ja LuF
related: 74yW V7b Bzq
related: yNYR pGF Xuq
broad match: C2519

Installationselektriker
type: Concept
in scheme: JobTech Taxonomy - Yrke
definition: Installationselektrikern arbetar med att dra ledningar och installera elektrisk utrustning i bostäder, affärer, kontor och industrier. Installationselektrikern arbetar med allt från nybyggnation till renoveringar. På byggen arbetar man ofta i lag tillsammans med andra yrkesgrupper med att dra ledningar, montera elcentraler och sätta upp strömbrytare. Installationselektrikern kan också arbeta med ny och energieffektiv teknik, som styrsystem och fastighetsautomation. Källa: Arbetsförmedlingen, Installationsföretagen
broader: Installations- och serviceelektriker
related: vLnt DPy mmT
related: MR2g dkB Bu1
related: Hxhh Wuw 7fx
related: CSf3 WS4 FQG
related: yhCP AqT tns
related: L28C czT 3RM
related: RxVv eWZ jEA
related: ja7J P8X YC9
related: MczL B5q fhu
related: 3BGg DkB 6R9
related: jwJy ytC 9EW
related: AgBe pTv DXL
broad match: C7411

Bandschaktarförare
type: Concept
in scheme: JobTech Taxonomy - Yrke
definition: Att arbeta som bandschaktarförare innebär att man hanterar tunga anläggningsmaskiner för att flytta och jämna ut jordmassor, grus och andra material. Yrket är en del av den bredare kategorin anläggningsmaskinförare som är ett samlingsnamn för alla som arbetar med jordförflyttande maskiner. Som bandschaktarförare arbetar man ofta på byggarbetsplatser, vägarbeten eller i gruvor, där man bidrar till att skapa en säker och effektiv arbetsmiljö. Källa: Arbetsförmedlingen
broader: Anläggningsmaskinförare m.fl.
related: j7Cq ZJe GkT
related: sRa5 6YZ cn9
related: PdXp xkC JzJ
related: ja7J P8X YC9
related: Mxyf t2J iLA
broad match: C8342

Civilingenjör, tillverkningsindustri
type: Concept
in scheme: JobTech Taxonomy - Yrke
definition: Civilingenjör, tillverkningsindustri
broader: Civilingenjörsyrken inom maskinteknik
related: SuAn oH9 xNc
related: 6Hq3 tKo V57
related: rRYx 9U1 ANv
broad match: C2144

Inköpare och upphandlare
type: Concept
in scheme: JobTech Taxonomy - Yrke
definition: Köper in varor och tjänster. Planerar och utreder inköpsbehov och tar in anbud och offerter. Upprätthåller och söker nya kontakter med leverantör. Gör sammanställningar och kalkyler, förhandlar om pris och leveransvillkor samt fattar beslut och skriver kontrakt och sluter avtal.
broader: Försäkringsrådgivare, företagssäljare och inköpare m.fl.
related: M2cJ Jwf ute
related: KG9j WxP ym2
related: 5TwE JEt pWX
related: vVXb pYT E1z
related: DTXS 78v B2p
related: hb3b fH2 bvK
related: ofcY XXh G4k
related: soG2 nq2 bii
related: wbAz fL9 jgx
related: Y4Rx MXD hws
related: 7tVG 9zf 7mw
related: 1xQg maq 3xh
related: 2TTj ZkN aMq
related: Lg8S VBi zQz
related: 5Ne3 Jir 6Ph
related: C3323
related: ot7L iNF Uyg
related: TEvL YN9 8Ky
related: yLGS 738 rt8
related: UH9g R5v MCx
related: SmZd Jaa BeY
related: bPCR BeT Jo2
related: rvxX tBy dHM
related: wpc8 XQz R5C
related: dwhV SiZ Jiy
related: S4vL AVu s6q
related: f4qz 9GW pwH
related: cvBd G8U Wxk
related: xqBL 5Lz 21K
related: L1cE 7rz c6R
related: BQsM qds 7ff
related: tRt4 sjf YTG
related: Ggsh 4Q4 wrQ
related: 15CG P9S 4vS
related: WR7N h6T jG1
related: agGK Zte X2y
related: EL7g UQG QVd
related: SEKb 8gv cAz
related: 7BQm Uvm fcX
related: Ww46 6ja 31m
related: oH6C 9w6 dUY
related: Gt5f wdi FSJ
related: QPQS oPf 9RU
related: q7Mx gjU F9q
related: nfdN dwW 6PE
related: yXmf iKi 7ci
related: MxmZ gDv gMS
related: Bc4A Z6e Pq1
related: eKuz edm kmi
related: QLkp kzy iXV
related: 4fRg DA4 Dj3
related: Lp2x qAv zfe
related: 52KN A45 kXN
related: J91r GLJ qoa
related: N4Gg Uma p7L
related: 9WwD qZe fqm
related: 4Q3Q 3Du XGx
related: DtPx JKf WJY
related: CwqU sXy aGK
related: A9bV kmm 5Dy
related: dhQh Xhd NSF
related: 1mwW ZAX KMj
related: 4hbK PAj 3ni
related: fyJi 1k3 CdV
related: kJrF R2t t6F
related: 6Goq h3R mbw
related: bChF 1Mi Ye3
related: oxTu nYm baU
narrower: Kategorichef/Kategoriansvarig
narrower: Inköpare
narrower: Upphandlare
narrower: Kontraktsansvarig
broad match: RPTn bxG ExZ

Ämneslärare, gymnasieskolan
type: Concept
in scheme: JobTech Taxonomy - Yrke
definition: Ämneslärare. gymnasieskolan arbetar med att planera, genomföra och följa upp undervisning i ett eller flera ämnen för elever i gymnasieskolan eller vuxenutbildningen. Lärare är ett reglerat yrke med legitimationskrav för att kunna bli tillsvidareanställd och sätta betyg. Vanliga arbetsuppgifter är att undervisa i klassrum, handleda elever i grupparbeten och individuella studier samt bedöma och dokumentera elevernas kunskapsutveckling. Ämneslärare samarbetar ofta med kollegor i arbetslag, har kontakt med vårdnadshavare och kan ha särskilt ansvar som mentor eller klassföreståndare. Källa: Arbetsförmedlingen, Göteborgs universitet, Skolverket, Socialstyrelsen
broader: Gymnasielärare
related: xeDf ivV sgK
related: V9LP RvE t2z
related: bsMC JpV 5fo
related: pksL JMC cku
related: 23WJ khQ a5X
related: qZMU V5s q4m
related: Lpn2 6mV swk
related: HGLU HJJ HCK
related: mptm CwK gb2
related: JTvV bLW v7R
related: o6cT Nen 6Cp
related: N8fS PR4 SiB
related: 3FfA c4G gsd
related: UtJY 5hv JhX
related: M5Js pF8 rLg
related: fXuQ Kzg Pno
related: FaMQ EUJ U8Q
related: amMf u1G pFo
related: A5gv 2Zi Fzr
related: pj4W RMt q8y
related: P31D 3Cz zYs
related: jcZD JZZ kHi
related: zdMX TND 6gU
related: 9JXJ RWL 68V
related: 1msE hAW 5fP
related: ppBe 3r9 2si
related: 6xRW zDv d2K
related: pH27 7fi amX
related: o5AT dbU N8U
related: wUit ryo qLN
related: TBF2 hKa 5wY
related: j3Fj q9X fJn
related: MVqp eS8 kDZ
related: f5TL 8qb m6C
related: Y9T4 5LH UUm
related: 7qtV Jw2 JGb
related: gj8x spH FZ7
related: yi4o 8Ek qkH
related: BYt9 XxD xFv
broad match: C2330

Livsmedelsingenjör
type: Concept
in scheme: JobTech Taxonomy - Yrke
definition: Livsmedelsingenjör
broader: Ingenjörer och tekniker inom kemi och kemiteknik
related: 6Hq3 tKo V57
related: 5tyY GjC AcD
broad match: C3119

Växtodlare och djuruppfödare, blandad drift
type: Concept
in scheme: JobTech Taxonomy - Yrke
definition: Växtodlare och djuruppfödare, blandad drift
broader: Lantbruks- och trädgårdsyrken
narrower: Växtodlare och djuruppfödare, blandad drift

Maskinoperatör spannmål
type: Concept
in scheme: JobTech Taxonomy - Yrke
definition: Maskinoperatörer inom spannmålsproduktion sköter och övervakar maskiner som behandlar spannmål och producerar spannmålsprodukter. Tillverkningsprocessen sker ofta via kontrollrum där maskinoperatören styr, övervakar och justerar produktionen. Vanliga arbetsplatser är kvarnar för mjöltillverkning och fabriker för tillverkning av cerealier samt andra spannmålsprodukter så som pasta och djurfoder. Inom livsmedelsindustri finns även krav på att man som medarbetare har utbildning i säker livsmedelshantering. Beroende på arbetsplats är truckkörning, lagerarbete och leveransföreberedelse även förekommande arbetsuppgifter. Källa: Arbetsförmedlingen
broader: Maskinoperatörer, kvarn-, bageri- och konfektyrindustri
related: N9Jv Xpb QpX
related: dXu9 e2k BhG
related: G2ys tS6 2mX
related: JeCJ vde pQB
related: wbTf ar4 zBj
related: VWPe mBi yfr
related: Qspd zHE rYn
related: T3jL o38 kGH
related: G9fv jXY Ks1
related: wTEr CBC bqh
related: 46GF 2wb m66
broad match: C8160

Skadedjurstekniker
type: Concept
in scheme: JobTech Taxonomy - Yrke
definition: Skadedjurstekniker arbetar med att identifiera, förebygga och åtgärda problem relaterade till skadedjur. Arbetet innebär i huvudsak att inspektera fastigheter för att upptäcka tecken på skadedjur, använda lämpliga bekämpningsmetoder och ge rådgivning till kunder om förebyggande åtgärder. Exempel på skadedjur eller ohyra kan vara getingar, myror, råttor och vägglöss. Då yrket innebär kundbesök är B-körkort ofta ett krav. Källa: Arbetsförmedlingen
broader: Saneringsarbetare m.fl.
related: whao Q6A ScE
related: xBNY 4te vjf
related: trGC NfG nMB
related: ibMm FuX WN9
related: DmJB bS6 7kN
related: 5pht BpD h7c
broad match: C7544

Ordersamordnare m.fl.
type: Concept
in scheme: JobTech Taxonomy - Yrke
definition: Samordnar och bevakar order och leveranser genom kontakter med leverantörer, kunder, interna avdelningar, transportföretag, speditörer m.fl.
broader: Försäkringsrådgivare, företagssäljare och inköpare m.fl.
related: S2pg pcs tXu
related: hb3b fH2 bvK
related: LPur bRn 5XD
related: MXGG RL9 ZPB
related: 7tVG 9zf 7mw
related: SmZd Jaa BeY
related: irPd z5v 2o1
related: ATGE 8XW 5oB
related: C3339
related: i7kk zcd MiW
related: Fiq4 siu LXn
related: q7Mx gjU F9q
related: 4fRg DA4 Dj3
related: ZF9w knj 7cW
related: HaJH my4 BRb
narrower: Orderplanerare
narrower: Offertingenjör
narrower: Orderadministratör
broad match: RPTn bxG ExZ

Grafiska formgivare m.fl.
type: Concept
in scheme: JobTech Taxonomy - Yrke
definition: Designar och formger tryckt publikation och media. Fastställer mål och restriktioner för designuppdraget genom samråd med kunder och intressenter. Hit hör inte Informatör (2432)
broader: Designer och formgivare
related: DW4R Ejt Y35
related: e4tA b22 rfY
related: ZefA esM Z9F
related: BMjs Jmm GJj
related: HWTe SaB wiT
related: DHhX uVf y6X
related: yeXm 6v5 w3x
related: jYGN rDK tM2
related: beea hNs XWo
related: E44v wYZ wjx
related: 5GZg Yvo Aty
related: F4nq ZH3 s3u
related: jpcS H9h 7qK
related: 15aN ATt Rb2
related: bzFf qDr Brc
related: K8eq sEz eXV
related: RBFh BjH AsD
related: a2Nd qJ3 S8y
related: buX8 38v YpB
related: 1mFB 7Fh whW
related: iukJ 2v3 MuY
related: B83k mVq 771
related: wXRm Aq3 9D8
related: 6uCy RbZ aDM
related: kmFW EKW yWf
related: bq5g QZW eyR
related: dTK5 R7G p56
related: FQAi Nxv 4VZ
related: z3v2 Z4t CA2
related: nvXa KhJ VWE
related: Ddz9 bNV nbY
related: hjhT 9Ln VTo
related: vdVs wpE JSv
related: zxxJ VTR hpo
related: bCHJ RTc sVi
related: mVXq Xyf Hps
related: LShp t9S Cc6
related: gYpc sKH 3uL
related: ikTr 8Sw jNn
related: WtpN icG D61
related: dYog aJL kok
related: 4RmJ wiU N4k
related: i7AP ut3 TKX
related: KV6K qCH Nkd
related: euH8 yAp hiG
related: dwm2 1V3 MpP
related: vvYA pay Yhj
related: H5KZ roq acH
related: qfkh ZRK w4W
related: 4qp4 uxR 7P9
related: xNyv PTi fSa
related: uLhB Tto EJ2
related: KoMU LJN 94D
related: GCMj xLD mj6
related: 28YD XEz LJV
related: FiV2 Gk2 bG9
related: yQcc fTn JL5
related: zZmK VPd WD8
related: b28z 7oo rKZ
related: iZ4m kWK A5a
related: VVj2 4Uu LL9
related: VBn4 Qqi CHB
related: nVJB JB5 rr5
related: S41p YGq Ndi
related: iMEL yvq cPA
related: XLL7 jMP PDm
related: 2mAa CUX vKr
related: wWte 6Xd fmQ
related: paEM G5u oz6
related: addJ 1sK pDn
related: mpuQ isQ pTU
related: NC4R 5KK MY1
related: Yhyn QdP Q1i
related: s8Te rH8 RMU
related: TTdj xw2 7wB

Inspelningsledare
type: Concept
in scheme: JobTech Taxonomy - Yrke
definition: Inspelningsledare ansvarar för att planera, samordna och leda inspelningsarbetet vid film-, tv- eller ljudproduktioner. Vanliga arbetsuppgifter är att schemalägga inspelningar, samordna teamets arbete på inspelningsplatsen samt hantera logistik som transporter och måltider. Inspelningsledaren ansvarar också för att regelverk följs och arbetsdisciplinen upprätthålls under inspelningen. Källa: Arbetsförmedlingen, Voodoo Film
broader: Inspicienter och scriptor m.fl.
related: 8too bEs 7NU
related: 9puE nYg crq
related: d1Ao 9bY 7Kn
broad match: C3435

Snickare, murare och anläggningsarbetare
type: Concept
in scheme: JobTech Taxonomy - Yrke
definition: Snickare, murare och anläggningsarbetare
broader: Byggnads- och anläggningsyrken
narrower: Anläggningsdykare
narrower: Anläggningsarbetare
narrower: Ställningsbyggare
narrower: Betongarbetare
narrower: Träarbetare, snickare m.fl.
narrower: Övriga byggnads- och anläggningsarbetare
narrower: Murare m.fl.

Fastighetschef/Fastighetsdirektör
type: Concept
in scheme: JobTech Taxonomy - Yrke
definition: Fastighetschef/Fastighetsdirektör
alternative label: Fastighetschef
alternative label: Fastighetsdirektör
broader: Fastighets- och förvaltningschefer
related: mN4r 8e5 4fd
related: 2KMz GHY TQC
related: epLc SkD cbT
related: nFT8 N2H gnW
related: yMdj 2ME An2
related: bh3H Y3h 5eD
related: yhCP AqT tns
related: Dv67 MSg 7ZY
related: s6fF 8pF 5VP
related: b1y5 BPn Sj5
broad match: C1219

Sufflör
type: Concept
in scheme: JobTech Taxonomy - Yrke
definition: Sufflör arbetar på teater eller opera med att följa manus och stötta skådespelare eller sångare genom att snabbt ge repliker eller textbitar vid behov under repetitioner och föreställningar. Vanliga arbetsuppgifter är delta på alla repetitioner, hålla manus uppdaterat med ändringar och tydligt markera instruktioner som entréer, scenbyten och rekvisitaanvändning och ibland viska, ibland mimiskt signalera repliker. Källa: Kungliga Operan, Malmö Stadsteater, Teater Västmanland
broader: Inspicienter och scriptor m.fl.
related: u7zK VKN 8Ht
related: 8too bEs 7NU
related: 9puE nYg crq
broad match: C3435

Plastmaskinoperatör
type: Concept
in scheme: JobTech Taxonomy - Yrke
definition: Plastmaskinoperatörer övervakar maskiner för tillverkning av plastdetaljer. Utöver att köra maskiner ingår vanligtvis kvalitetskontroll och enklare maskinunderhåll enligt föreskriven standard. Man skall även ha god kännedom om vanliga fel som kan uppstå samt kunna starta och stänga av plastmaskinen på ett säkert sätt. Beroende på arbetsplats kan även truckkörning, lagerarbete och leveransförberedelse ingå. Arbetet utförs ofta i samverkan med plastmaskinställare. Källa: Polymercentrum
broader: Maskinoperatörer, plastindustri
related: mi3i 2q3 YRK
related: Tuam jFr 6Xf
related: UJux Uje VDu
related: Fuxp v4v BF3
related: Pa1g 5wH PsB
related: PYJq mza VAo
related: wDHW sZ6 uBQ
related: PGL6 tzF P81
related: wTEr CBC bqh
related: UJeG gYR Pyf
related: dK2i iSr WkL
broad match: C8142

Utbildningschef
type: Concept
in scheme: JobTech Taxonomy - Yrke
definition: Utbildningschef
broader: Chefer inom grund- och gymnasieskola samt vuxenutbildning
related: hyzK fy9 LC6
related: epLc SkD cbT
related: bh3H Y3h 5eD
related: 978L wLR a5d
related: gGK2 xxQ Sxo
related: MVqp eS8 kDZ
related: j1eL Zj6 Ru7
broad match: C1345

Byggstädare
type: Concept
in scheme: JobTech Taxonomy - Yrke
definition: Byggstädare jobbar med grovstädning och finstädning av byggplatser. Grovstädning av byggplatser ställer högre krav på skyddsutrustning än mer allmän lokalvård. Grovstädning av byggplats innebär bland annat rensning av byggavfall, restavfall och byggdamm. Beroende på arbetsplats behöver byggstädare till exempel hjälm, handskar och skor med spikskydd. Grovstädning utförs ofta inför besiktningar av pågående byggen. Vid nybyggnation och ombyggnation genomförs ofta en finstädning inför slutbesiktning av bygget. Byggstädare kan även jobba med grovstädning efter bränder eller vattenskador. Källa: Arbetsförmedlingen
broader: Städare
related: whao Q6A ScE
related: UdVa jRr 9DE
related: j7Cq ZJe GkT
related: 4j4y LCf 3Y2
related: pbpU Cn2 rbP
broad match: C9112

Redovisningsekonom
type: Concept
in scheme: JobTech Taxonomy - Yrke
definition: Redovisningsekonomer arbetar med redovisning av olika aktiviteter såsom ut- och inbetalningar, skatt, moms men även skapande och analys av bokslut och årsredovisning. Källa: FAR, Folkuniversitetet
broader: Redovisningsekonomer
related: TZq4 QoW FC1
related: DJKa beH eBg
related: q24g RGC 6WN
related: WtGb BoC hQa
related: zkhL dJt WNu
related: 1QQy ZZZ zHr
related: kMz9 qaE 6TF
related: Jaia pgr Vtp
related: gX53 uUa b5r
related: yA9D gTW Sev
related: wRLw 4KT g22
related: X82t awd Qyc
related: rAyS mJw tjA
related: vw7i 55Q xxT
related: FJyC X1z ZHy
related: 5rzX Q9k g7i
related: VGhb SG8 eb2
related: fyJd 9cP dCe
related: GYk9 afa Ycd
related: xvCR jj6 1Xn
related: B2nt TqS FoY
related: NjwH AXm dN4
related: H17x 3fw rfD
related: afEB xX6 ZFX
related: SqEa RGk gVY
related: sSuL ZzG Tk6
related: 9qWj NXU bsT
related: BTVa aXL j4p
related: 7SXD jFW JLx
related: 87qZ Z8D 8Pt
related: M867 Xnv MKR
related: 9oE7 sZh N2V
related: nCnX gYg sMU
related: r6fM 2Vu BYc
related: q4hR Dz5 ZAp
related: DgyZ rFG 5TA
related: R1Ct 9xG haA
related: YLVt uDX UUs
related: FcwH 9bj 3oE
related: UvGd sed qbv
related: wq3e s8M t9r
related: tEZt Dck eUM
related: hXVd Ngq qGS
related: poXA jAV j3Z
related: ycCM WVF P84
related: Waev oy5 RAT
related: awiX zng HCr
related: 41ug djg MR7
related: dTmp nYH Shu
related: cSAK ibi g1m
related: jTLK 5YA 6oo
related: qqxy 1U1 yer
related: NCet Ymv ZiG
related: 73tM r9Z tWD
broad match: C3313

Orderplanerare
type: Concept
in scheme: JobTech Taxonomy - Yrke
definition: Orderplanerare samordnar och optimerar flödet av kundorder inom tillverknings- eller logistikintensiva företag. Arbetsuppgifterna inkluderar mottagning och registrering av beställningar, planering av produktion och leveranser samt säkerställande av tillgång på material och resurser i rätt tid. Orderplaneraren samarbetar med inköp, produktion, lager och försäljning för att effektivisera processerna och möta kunders behov. Arbetsmiljön är huvudsakligen kontorsbaserad med nära kontakt med produktionen och andra avdelningar. Källor: Arbetsförmedlingen, Platsbanken
broader: Ordersamordnare m.fl.
related: RPTn bxG ExZ
related: fnfr myF 9wa
broad match: C3339

Chefer inom arkitekt- och ingenjörsverksamhet
type: Concept
in scheme: JobTech Taxonomy - Yrke
definition: Formulerar och ansvarar för mål och strategier för verksamhet inom arkitekt- och ingenjörsföretag. Utformar riktlinjer, följer upp och utvärderar verksamheten mot uppsatta mål för försäljning och utförandekvalitet. Beslutar om marknadsföring och förhandlar med större kunder. Deltar i förhandlingar med leverantörer. Svarar för budget samt fördelar resurserna inom verksamheten. Har personalansvar.
broader: Chefer inom arkitekt- och ingenjörsverksamhet
related: dyQa idE ToC
related: s5SS 7bW 1Gh
related: uw7i bUK eex
related: C1213
related: icvA Gu9 EqB
related: G7Qq r7L 5Jo
related: DVFm Dmy 7Yn
related: UH9g R5v MCx
related: SmZd Jaa BeY
related: 8tYq EXD Xwm
related: ZzN5 m7B 5CY
related: Nksx 4oe fEQ
related: eThQ HCv mY6
related: 5PjX 999 uLZ
related: X9Kc p8a 1FB
related: Gt5f wdi FSJ
related: q7Mx gjU F9q
related: yXmf iKi 7ci
related: D6ev Zwt x83
related: VfP9 2xd g2h
related: 4fRg DA4 Dj3
narrower: Länsarkitekt
narrower: Stadsbyggnadschef/Stadsbyggnadsdirektör
narrower: Gatuchef
narrower: Teknisk chef, kommun
narrower: Lantmäterichef
narrower: Byråchef
broad match: bh3H Y3h 5eD

Överstyrman
type: Concept
in scheme: JobTech Taxonomy - Yrke
definition: En överstyrman är personalansvarig för däcksbesättningen och är ansvarig för underhållet av däckutrustningen och säkerheten ombord, samt lastplaneringen och tillsammans med andrestyrman ansvarar för att fartyget lastas i enlighet med gällande regler. Överstyrman är ansvarig för navigationen på bryggan under sin vakt. Behörigheter inom sjöfart såsom certifikat och behörighetsbevis som krävs för olika befattningar ombord och som styrs av, typ av fartyg, finns samlade i Transportstyrelsens behörighetsguide Källa: Satsa på sjöfart
broader: Fartygsbefäl m.fl.
related: dRFw Rcu dX7
related: fmCS 7n9 DqW
related: gs65 ynn fcr
related: ASGV zcE bWf
related: XouD cCj HZN
related: gthF y5Z j3Z
related: vSAt THv Rvv
broad match: C3152

Kundtjänstmedarbetare
type: Concept
in scheme: JobTech Taxonomy - Yrke
definition: Kundtjänstmedarbetare svarar gentemot kunder för information om produktsortiment, leveransmöjligheter, leveransvillkor, viss rådgivning och information ifråga om produktval. Huvudsakliga arbetsuppgift är att ge företagets kunder service vid frågor gällande bland annat bokningar, betalningar, leveranser och sortiment. Detta sker genom att besvara kundens frågeställningar via reception, telefon, mejl och ibland även via chatt. Handläggning av order, returer samt reklamationer är vanligt förekommande arbetsuppgifter. En kundtjänstmedarbetare hanterar framförallt inkommande ärenden. Merförsäljning samt information om aktuella erbjudanden och kampanjer är förekommande arbetsuppgifter. Källa: Arbetsförmedlingen, Handelsrådet, Unionen
broader: Kundtjänstpersonal
related: mG9e TVV xbU
related: NNKL 8AW DyT
related: PPpW nPz evR
related: nHUT mbg REe
related: vSgT WUD qGH
related: hDJs Ecz 82Q
related: UdVa jRr 9DE
related: yUuS c2v aAN
related: bNBZ gM1 FqD
related: LnDs YTw uYC
related: LdMB EMR 7mc
related: igXL Ls6 Mux
related: qSpG JLr 5Bu
related: kh4B QLq GxH
related: UY7a nFy TNG
related: RPTn bxG ExZ
related: 7jbm hNw UBZ
related: YQPH Awv arN
related: pfak 7NP iaD
related: 9XrQ sWD twF
related: 5gDx rz2 5KK
related: iDh5 3iW DfE
related: WgwT g8K 19h
related: mvDu Fee KkX
related: kJCt 96F 4vp
related: 6AJc 2Ce CGz
related: hHiu XGy YKB
related: HmUp KWd vnJ
related: Y7Zu eb4 jtN
related: bVW2 9dF j4u
related: FECN C8r pQx
related: NEwz 3pm 3i8
related: oBn7 Swd wHK
related: pLeu KfM hHd
related: v7Ea LYD A6o
related: c1AB mAe 1fx
related: p1WW viA iHL
related: s6pZ H7s gir
related: WX4X 62u DFA
related: DME6 8dS FBZ
related: hcen saY 7Fg
related: vfWf K2c hoK
related: nSZd MDD 42p
related: pGYS 7To Lvf
related: PTPH 12P PJC
related: XPBo RNc P1L
related: aE5k gSi xuu
related: 9VJH 8nb r9Y
related: wGgr uWr PYC
related: sZXz FxC juq
related: vHiu jF1 PPu
related: apLR 2HF CM9
related: TWoR gt4 VgQ
related: W38n 4QX sWY
related: ABNA 4BJ 2U3
related: vdmX E4t 1jU
related: Bh76 BeU PqM
related: o4QG t7r ncz
broad match: C4222

Djursjukskötare
type: Concept
in scheme: JobTech Taxonomy - Yrke
definition: Djursjukskötare arbetar med omvårdnad, behandling och rehabilitering av sjuka och skadade djur, främst på djursjukhus och djurkliniker. Djursjukskötare är en skyddad titel med legitimationskrav. Vanliga arbetsuppgifter är att söva djur och övervaka narkos, assistera vid operationer, utföra vaccinationer och enklare behandlingar, ta och analysera prover samt ansvara för journalföring och läkemedelshantering. Djursjukskötare ger också rådgivning till djurägare om eftervård och djuromvårdnad samt ansvarar för hygienrutiner och medicinteknisk utrustning. Källa: Arbetsförmedlingen, Jordbruksverket, Socialstyrelsen, SLU
broader: Djursjukskötare m.fl.
related: NYW6 mP6 vwf
related: Dd16 YZZ Sfm
related: 1qS7 274 CWy
broad match: C3240

Projektledare, kemiteknik
type: Concept
in scheme: JobTech Taxonomy - Yrke
definition: Projektledare, kemiteknik
broader: Ingenjörer och tekniker inom kemi och kemiteknik
related: 6Hq3 tKo V57
related: 5tyY GjC AcD
related: yXSE wvx EAN
broad match: C3116

Forskningsrådgivare
type: Concept
in scheme: JobTech Taxonomy - Yrke
definition: Forskningsrådgivare
broader: Forskarassistenter m.fl.
related: X82t awd Qyc
broad match: C2310

Föreståndare, äldreboende
type: Concept
in scheme: JobTech Taxonomy - Yrke
definition: Föreståndare, äldreboende
broader: Chefer inom äldreomsorg
related: GazW 2TU kJw
related: epLc SkD cbT
related: bh3H Y3h 5eD
related: UeYs zDP eba
broad match: C1343

Mystery shopper
type: Concept
in scheme: JobTech Taxonomy - Yrke
definition: Mystery shoppers besöker butiker, restauranger, hotell eller andra serviceverksamheter för att observera och dokumentera kundupplevelsen. Yrket kan även kallas anonym kund, testkund och kundunderskökare. Arbetsuppgifterna omfattar besök enligt specifika scenarier, interaktion med personal, bedömning av bemötande, miljö och service samt skriftlig rapportering enligt uppdragsgivarens instruktioner. Observationerna används ofta som underlag för kvalitetsutveckling och internutbildning. Källa: Arbetsförmedlingen
alternative label: Anonym konsument
broader: Övrig servicepersonal
related: UdVa jRr 9DE
related: JS2T Uos 1TL
related: RPTn bxG ExZ
related: mSvC sUP sHJ
broad match: C5169

Laborant, fysik
type: Concept
in scheme: JobTech Taxonomy - Yrke
definition: Laborant, fysik
broader: Laboratorieingenjörer
related: 6Hq3 tKo V57
related: EsWG kHG oXZ
broad match: C3111

Mobilkranförare
type: Concept
in scheme: JobTech Taxonomy - Yrke
definition: Mobilkranförare förflyttar tungt material med stor precision i samspel med andra yrkesgrupper, på byggarbetsplatser, inom industrin och i hamnar. Mobilkranförare arbetar vanligtvis med tunga och höga lyft, vilket kan kräva hjälp av en signalman för att manövrera kranen rätt. Föraren har också ett stort ansvar för att den lyftutrustning som används är i gott skick. Mobilkranförare kan ansöka om sitt yrkesbevis efter teoretisk grundutbildning och lärlingsanställning. Källa: Arbetsförmedlingen, TYA
broader: Kranförare m.fl.
related: j7Cq ZJe GkT
related: ja7J P8X YC9
related: vtY3 TC1 Hg6
broad match: C8343

Apotekstekniker
type: Concept
in scheme: JobTech Taxonomy - Yrke
definition: Apotekstekniker arbetar med rådgivning och försäljning av receptfria läkemedel, egenvårdsprodukter samt hygien- och hudvårdsprodukter. Yrket liknar apoteksassistent, med skillnad att apotekstekniker mer arbetar med rådgivning. Apotekstekniker kan, i samarbete med apotekare, vägleda kunder i valet av behandling och bedöma när det är lämpligt med egenvård eller om kunden bör hänvisas vidare till vården. Apoteksteknikern lämnar inte ut receptbelagda läkemedel men kan delta i planering och arbete med recepthantering och har god kunskap om olika läkemedel. Arbetet innefattar även , varuhantering, uppackning, exponering, försäljning och kundservice. Källa: Sveriges Farmaceuter, Arbetsförmedlingen
broader: Apotekstekniker
related: NYW6 mP6 vwf
related: RPTn bxG ExZ
related: CWme HYS chG
broad match: C5329

Montörer, träprodukter
type: Concept
in scheme: JobTech Taxonomy - Yrke
definition: Sätter i seriemässig tillverkning samman komponenter av trä till olika produkter som t.ex. möbler. Hit hör inte Maskinsnickare (7523)
broader: Montörer
related: NeEb Ytz aii
related: VPF1 UZM 9Kd
related: qQ61 EQR rcz
related: VTwt 5Fe 6bW
related: 4qEb GFc ekB
related: KDzy Hra iVr
related: C8219
related: KoK2 ruP YAi
related: qPmT 5pS Th9
related: 9zLg 4k6 bz4
related: X4EU ZC7 QmK
related: 22JT eUQ XPo
related: uenm 75h fEh
related: gEWP Lgj M4X
related: dWbY gXC Frx
related: yZdF d27 Gow
narrower: Möbel- och inredningsmontör
narrower: Köksmontör
narrower: Montör träprodukter
broad match: wTEr CBC bqh

Skogsinspektor
type: Concept
in scheme: JobTech Taxonomy - Yrke
definition: En skogsinspektor ansvarar för köp av virke, avverkning och skogsvård. Skogsinspektorn ser till att skogen håller en god volym och kvalitet och ansvarar för plantering av ny skog, beståndsvård och skötsel av skog i form av röjning och gallring. En viktig del av arbetet är även att förebygga och förhindra skador på skogen, samt att upprätta skogsbruksplaner. Källa: Skogeniskolan
broader: Specialister och rådgivare inom skogsbruk
related: WGAZ xaM gUE
related: ULsu TF2 t1g
related: VuuL 7CH adj
broad match: C3143

Parkförvaltare
type: Concept
in scheme: JobTech Taxonomy - Yrke
definition: Parkförvaltare
broader: Specialister och rådgivare inom lantbruk m.m.
related: 6nbS RdB kzm
related: VuuL 7CH adj
broad match: C3142

Clown
type: Concept
in scheme: JobTech Taxonomy - Yrke
definition: Clown underhåller publik i olika miljöer såsom cirkus, sjukhus och evenemang genom humor, mimik och interaktion. Vanliga arbetsuppgifter är att framföra humoristiska nummer, skådespeleri, fysiska komiska inslag ofta med särskild anpassning till olika målgrupper såsom barn eller patienter på vårdinrättningar. Källa: Arbetsförmedlingen, Cirkus Cirkör
broader: Skådespelare
related: 8too bEs 7NU
related: 9puE nYg crq
related: EUJe GiJ QiZ
broad match: C2655

Shiatsuterapeut
type: Concept
in scheme: JobTech Taxonomy - Yrke
definition: Shiatsuterapeut
broader: Terapeuter inom alternativmedicin
related: NYW6 mP6 vwf
related: Uuf1 GMh Uvw
broad match: C3230

Account manager/AM
type: Concept
in scheme: JobTech Taxonomy - Yrke
definition: Account managers har kontinuerlig kontakt med ett antal företagskunder och ansvarar för att följa upp affärer och utveckla nya affärsmöjligheter. Arbetsuppgifter inkluderar nätverka, boka och genomföra kundmöten och behovsanalys. Ser till att hela flödet fungerar för kunderna, från offert till beställning och leverans. Kan hålla i utbildningar om produktportföljer. Förhandlar om priser och villkor och sluter avtal. Källa: Arbetsförmedlingen - Hitta yrken, Unionen, Handelsrådet
broader: Företagssäljare
related: 3mn4 LmN PL9
related: 12k6 qAM Gr9
related: sJop Vq7 tbx
related: eoP4 3fs 24J
related: 3Csd w5X r72
related: 8miF NVW fTg
related: Ey2T dQm GQK
related: mn6K fFV k7x
related: a1Xy 96u j2m
related: EAX7 Esi AhF
related: i7he UJB fXr
related: rDcj Tao TJJ
related: pFU6 CPU zzN
related: TU8P dSk JuQ
related: 8TWF s1T ZHG
related: 56HX x8w Zxi
related: caic LPS yDN
related: n8GS wrU gfJ
related: RPTn bxG ExZ
related: kPuE 3c6 UNo
related: H8GQ jZB XBk
related: xTRz 487 Bz4
related: NUtR RJQ T4Q
related: tNA2 TgH 81V
related: 3FAV Lcg rYB
related: NN6v qyz ubU
related: tryy cmb Qy9
related: E1dy pfT dW9
related: 6R1t zKp 7VM
related: 9kqR UWu 8Ye
related: dAnV ts4 LLQ
related: mVjx RYV ti9
related: 9Q5d rHa GyR
related: 1GVv csT 9MV
related: NdNZ go4 tZ9
related: BQ8w uM9 A4V
related: QBVH V2X aab
related: cLC2 muD gtE
related: c27v o9u ZT2
related: eAkN rJ9 raw
related: Qau7 6TR VFi
related: 7d9d Rvd DZg
related: ioRL 3hW TXH
related: TjYx Zhb Hko
related: 1z6i hQr SZm
related: Gay5 Nnj QFL
related: aW7b oNZ gaS
related: j9sY Gnd BtH
related: GfLg 1re pAN
related: ifu5 8HJ mBP
related: Dc3s mJg 5pq
related: gXK9 vVn 3kB
related: yGUb PLa K8p
related: bYj1 BHD dbR
related: H83m XAm oZW
broad match: C3322

Lärling, undertaksmontör
type: Concept
in scheme: JobTech Taxonomy - Yrke
definition: En lärling är anställd för att slutföra sin kvalificeringstid till undertaksmontör innan ett yrkesbevis kan utfärdas. Under kvalificeringstiden får du lärlingslön enligt avtal. Kvalificeringstiden tillsammans med teoretisk grundutbildning leder till yrkesbeviset. Ett lärlingsavtal mellan branschorganisation och företag tecknas. Källa: BYN
broader: Takmontörer
related: j7Cq ZJe GkT
related: ja7J P8X YC9
broad match: C7121

Livsmedelskontrollant
type: Concept
in scheme: JobTech Taxonomy - Yrke
definition: Livsmedelskontrollant, eller officiell assistent som det också kallas, bedömer om kött kan godkännas som livsmedel, eller om det behöver kontrolleras ytterligare. Livsmedelsverket ansvarar för kontroller vid slakt och vilthantering. Som livsmedelskontrollant utför man besiktning av djurkroppar efter slakt och har kunskaper i patologi, mikrobiologi och köttbesiktning. Arbeter innebär också en del provtagning. Vanliga arbetsplatser är på ett större slakter, men man kan även arbeta på flera anläggningar och utföra kontroller av livsmedelsproducenter. Källa: Livsmedelsverket
broader: Provsmakare och kvalitetsbedömare
related: jmR9 uUP 4tM
related: wTEr CBC bqh
broad match: C7515

Chefer och ledare inom trossamfund
type: Concept
in scheme: JobTech Taxonomy - Yrke
definition: Chefer och ledare inom trossamfund
broader: Chefer inom hälso- och sjukvård samt annan samhällsservice
narrower: Chefer och ledare inom trossamfund

Djursjukskötare m.fl.
type: Concept
in scheme: JobTech Taxonomy - Yrke
definition: Vårdar och sköter sjuka djur på djursjukhus, djurklinik m.m. Assisterar veterinär vid undersökningar och operationer. Tar prover och röntgenbilder. Informerar och ger råd samt utför enklare behandlingar.
broader: Djursjukskötare och veterinärassistenter
related: 7H4j dRM Vbo
related: NNeS FUZ Z2r
related: C3240
related: 5KHd EHE Pe6
related: ek11 h54 nCK
related: jo6p NKD 8mE
related: 6Xi5 uCw L8D
related: aS2X 4ZL 9h7
related: D7zq sxj A2e
related: ab2V my9 Pvc
related: 8f1v NKU omg
related: vdVX bF1 9Ta
related: bPHw mw8 Mm5
narrower: Djursjukskötare
broad match: NYW6 mP6 vwf

Solcellsinstallatör
type: Concept
in scheme: JobTech Taxonomy - Yrke
definition: Solcellsinstallatör installerar och driftsätter solcellsanläggningar på tak, fasader eller mark åt privatpersoner, företag och fastighetsägare. Arbetsuppgifterna omfattar elinstallation av anläggning samt förläggning av kablar och testning och driftsättning av anläggningen. Solcellsinstallatör utför även dokumentation av installationen och medverkar vid felsökning och service. För att få utföra installation skall solcellsinstallatören vara certifierad. Yrket skall ej förväxlas med Solcellsmontör. Källa: Arbetsförmedlingen
broader: Montörer, elektrisk och elektronisk utrustning
related: PzKE 8MT mSX
related: yhCP AqT tns
broad match: C8212

Utvecklingsingenjör, tillverkningsindustri
type: Concept
in scheme: JobTech Taxonomy - Yrke
definition: Utvecklingsingenjör, tillverkningsindustri
broader: Civilingenjörsyrken inom maskinteknik
related: SuAn oH9 xNc
related: 6Hq3 tKo V57
related: DEmg j8Z W7q
related: 49Q1 fHw QyS
related: aKJk JJF anz
related: LHt3 JmH fVv
broad match: C2144

Exploateringsingenjör
type: Concept
in scheme: JobTech Taxonomy - Yrke
definition: Exploateringsingenjör
broader: Lantmätare
related: kW5L Z2s qtf
related: X82t awd Qyc
related: 4nTm N36 Ld6
related: mnPA xC9 irq
related: qkoL RNp Z39
related: kzpd qqP fmB
related: p3Ko oPp uDA
broad match: C2165

Business controller
type: Concept
in scheme: JobTech Taxonomy - Yrke
definition: Business controller
broader: Controller
related: BLvD pZG YPL
related: rPMn LBA cSD
related: wZm4 aej Znf
related: LKtE hrC M2v
related: un5S rNp 734
related: fhcx Xsg Rt8
related: Pr4n H1f fum
related: PnKY u9y SuQ
related: eQFc 7Vq buj
related: aFyQ jqX rpL
related: X82t awd Qyc
related: zNMq Eup bMx
related: vw7i 55Q xxT
related: cPYv VtE hu3
related: ksnm Ens SFk
related: zbW9 meU ZQ5
related: QPKM Fra mMH
related: zyez 3JW Mso
related: AiQK xfP iCN
broad match: C2411

VVS-ingenjör
type: Concept
in scheme: JobTech Taxonomy - Yrke
definition: En VVS-ingenjör arbetar med att utveckla och implementera energieffektiva och hållbara lösningar inom byggnader som offentliga lokaler, kontor och bostäder. De kan arbeta som konstruktör, konsult eller projektledare och ansvarar för installationer och teknikfrågor. VVS-ingenjören skapar trivsamma och energieffektiva inomhusmiljöer genom att designa och optimera tekniska system. I arbetet utför de beräkningar, kalkyler och använder designprogram för att skapa ritningar och manualer. Källa: Arbetsförmedlingen
broader: Ingenjörer och tekniker inom maskinteknik
related: 88Yp i6K Y7T
related: 6Hq3 tKo V57
related: 7j2q gwU qjj
related: 38SN VtQ 44e
related: kmBw 2uX mq9
related: bgrE Be6 BuM
related: uDrd G7Z zt6
related: 9aEn jPz gJs
related: tT7w QhU V65
related: cmh3 sX4 H1P
related: ZZ9D wDV BpM
related: 6uPR 5y4 Uvi
related: yAo5 VWq PRp
related: wu2A qrP pF9
related: zTkp hCH sHZ
related: yaQZ SkG ydr
related: ja7J P8X YC9
related: gSLK Hsd bDU
related: Xf1u ezo Djk
related: j4Zm YV9 cGw
related: kCVq xy2 xC3
related: gitZ mEP f1f
broad match: C3115

CNC-operatör trä
type: Concept
in scheme: JobTech Taxonomy - Yrke
definition: CNC-operatörer inom trä sköter datorstyrda maskiner för mekanisk bearbetning och tillverkning av detaljer. Som CNC-operatör arbetar man med att sköta datorstyrda maskiner som genom till exempel svarvning, borrning eller fräsning tillverkar detaljer av metall, trä eller plast. CNC-operatörer inriktade mot trä arbetar inom träindustrin, t ex med tillverkning av möbler, inredningsdetaljer och byggelement. Beroende på arbetsplats och kompetens ingår vanligtvis ritningsläsning, riggning och programmering av maskiner. De vanligaste inriktningarna är fräsning, svarvning eller borrning. Enklare underhålls- och reparationsarbeten kan också ingå. Källa: Trä- och möbelföretagen, Arbetsförmedlingen
broader: Maskinsnickare och maskinoperatörer, träindustri
related: jJKm Wzq it8
related: QNCA 9cz JLR
related: wTEr CBC bqh
broad match: C7523

Forskare, beräkningsbiologi
type: Concept
in scheme: JobTech Taxonomy - Yrke
definition: Forskare, beräkningsbiologi
broader: Farmakologer och biomedicinare
related: kJeN wmw 9wX
related: esAo 5sX FPv
broad match: C2131

Klövvårdare
type: Concept
in scheme: JobTech Taxonomy - Yrke
definition: Klövvårdare arbetar med att verka och vårda klövar hos nötkreatur och andra klövdjur inom lantbruket. Arbetsuppgifterna omfattar att bedöma klövarnas skick, utföra verkning för att förebygga och åtgärda klövsjukdomar samt dokumentera utförda åtgärder. Klövvårdare använder olika verktyg och tekniska hjälpmedel för att utföra arbetet på ett säkert och effektivt sätt. I vissa fall samarbetar klövvårdare med veterinär vid behandling av klövsjukdomar. Källa: Jobba grönt, Arbetsförmedlingen
broader: Uppfödare och skötare av lantbrukets husdjur
related: VuuL 7CH adj
broad match: C6121

Kemtvättare
type: Concept
in scheme: JobTech Taxonomy - Yrke
definition: Kemtvättare arbetar med kemtvätt av kläder och andra textilier. Förutom tvätt av kläder är det vanligt att tvättamattor, sängkläder och dukar. Förutom maskinskötsel är vanliga arbetsuppgifter pressning, strykning, ångning och mangling. Beroende på arbetsplats kan även kundkontakt, ordermottagning och leveransplanering ingå. Källa: Arbetsförmedlingen
broader: Maskinoperatörer, blekning, färgning och tvättning
related: whao Q6A ScE
related: o7ra ZeT UEE
related: PFGn p87 2z1
related: xMi9 WCH Hvq
related: 6BPK jGF YnR
related: TK1R W2s RU9
related: jFTr G9a yxF
related: XNEG oF7 rAg
related: wTEr CBC bqh
broad match: C8157

Skatte- och socialförsäkringshandläggare m.fl.
type: Concept
in scheme: JobTech Taxonomy - Yrke
definition: Skatte- och socialförsäkringshandläggare m.fl.
broader: Yrken med krav på högskolekompetens eller motsvarande inom ekonomi och förvaltning
narrower: Brandingenjörer och byggnadsinspektörer m.fl.
narrower: Skattehandläggare
narrower: Övriga handläggare
narrower: Säkerhetsinspektörer m.fl.
narrower: Tull- och kustbevakningstjänstemän
narrower: Socialförsäkringshandläggare

Gravör, ädelmetall
type: Concept
in scheme: JobTech Taxonomy - Yrke
definition: Gravörer inom ädelmetall skapar text eller mönster i smycken. Gravören sticker upp text eller mönster i smycken eller prydnadsföremål. Gravyr är en hantverksteknik och gravyr av ädelmetall kan göras för hand med eller med gravyrmaskin. Grarvyr kan även göras maskinellt med datastyrda gravyrmaskiner. Vanliga arbetsplatser för gravörer inom ädelmetall är i guld- och juvelbutiker. Arbetsuppgifter; gravera i ädelmetall, gravera smycken, gravera prydnadsföremål Källa: Arbetsförmedlingen, Sveriges Guldsmedsmästares Riksförening
broader: Guld- och silversmeder
related: PaxQ o1G wWH
broad match: C7313

Stadsträdgårdsmästare
type: Concept
in scheme: JobTech Taxonomy - Yrke
definition: Stadsträdgårdsmästare
broader: Förvaltare inom skogsbruk och lantbruk m.fl.
related: epLc SkD cbT
related: bh3H Y3h 5eD
related: VuuL 7CH adj
broad match: C1311

Transportledare och transportsamordnare
type: Concept
in scheme: JobTech Taxonomy - Yrke
definition: Samordnar och övervakar person- och godstrafik vid t.ex. lokaltrafikföretag, åkerier, godsterminal, grosshandel och industriföretag. Utarbetar och justerar transportscheman. Ansvarar för tågtrafik inom ett geografiskt område samt dirigerar tågtrafik enligt säkerhetsbestämmelser och tidtabell. Lägger växlar och ställer signaler med hjälp av ställverk. Övervakar trafik på flygplatser samt registrerar starter och landningar. Beräknar ankomsttider och svarar för behandling av gods vid flygterminal. Anvisar kajplats åt fartyg och tillhandahåller utrustning. Hit hör inte Logistiker (2141) Speditör (3331) Trafikinformatör (4222)
broader: Lagerpersonal och transportledare m.fl.
related: SV19 DbM RqE
related: C4323
related: GfBf USX 8Mr
related: VzFf zRa QWe
related: fJdB viK AaA
related: nHCp bZn 2UB
related: GBGz aw6 VET
related: EqRh UqX wFB
related: VhAs CM4 kUr
related: n2h6 u14 dh1
related: g6vZ i7N ZeJ
related: Bb7a V49 Da8
related: sKLW XyF UGt
related: ZzN5 m7B 5CY
related: zqN4 G41 Dsi
related: 5Mnw paX wiL
related: eThQ HCv mY6
related: 8Bcs wbf WJa
related: 6kxY EUm Wt7
related: ZxKX dN4 8DJ
related: Fiq4 siu LXn
related: GVgH Vfn tdW
related: mr2K Mgq r3i
related: vp4x sER 6Mf
related: rRou EUn FsL
related: NRBA qef QyE
related: rfqu h1Z ttu
related: ZCCh DEE 6dc
related: PkRJ QEL xm5
related: EcuE BY7 mc4
related: AbMi oSt xEq
related: mDAA Pe1 Q4E
related: SaQE LYh 7Ds
related: pERs YHa Ssv
related: yXmf iKi 7ci
related: cvUu qGr gDB
related: 9nKT iom uyB
related: 7zNZ YWJ eLd
related: F7Yu ABT 1eb
related: 7B7t rpQ 2NV
related: bZjt jkc hNd
related: m5kQ goP R8A
related: L1fj ack qBX
related: 7rAF 1kw LqA
related: PfQQ R9q SKp
related: Y3zr NbN Syh
related: kJrF R2t t6F
related: Z38Q kQS W8a
narrower: Tågledare
narrower: Fartygsoperatör
narrower: Load master
narrower: Flight Operating Officer
narrower: Transportledare
narrower: Trafikledare
narrower: Bro- och slussvakt
narrower: Tågtrafikledare
narrower: Rampagent
broad match: ASGV zcE bWf

Näringsforskare
type: Concept
in scheme: JobTech Taxonomy - Yrke
definition: Näringsforskare
broader: Cell- och molekylärbiologer m.fl.
related: kJeN wmw 9wX
related: TXx8 Mgv BGZ
broad match: C2265

Servicedesigner/Tjänstedesigner
type: Concept
in scheme: JobTech Taxonomy - Yrke
definition: Servicedesigner/Tjänstedesigner
alternative label: Servicedesigner
alternative label: Tjänstedesigner
broader: Övriga IT-specialister
related: eJMW dn6 5BU
related: qjvP Udi Z6Z
related: dLx6 wj8 7n3
related: aXpj 8KM ech
related: KiWi YQm Tvq
related: apaJ 2ja LuF
related: aTPs St2 Qq2
related: 9puE nYg crq
related: TUUX Tiu qrX
related: pkN9 1Sp yav
related: dioy zD1 k37
related: pvRH 41J VRv
related: iW5c SEM RsE
related: 1NFA tQF Lp3
related: w5nV J9f SjT
broad match: C2519

Syntolk
type: Concept
in scheme: JobTech Taxonomy - Yrke
definition: Syntolk
broader: Översättare, tolkar och lingvister m.fl.
related: cspa Mji BMS
related: 9puE nYg crq
broad match: C2643

Revisionschef
type: Concept
in scheme: JobTech Taxonomy - Yrke
definition: Revisionschef
broader: Ekonomi- och finanschefer
related: X82t awd Qyc
related: epLc SkD cbT
related: bh3H Y3h 5eD
related: AT8x fs6 xFy
broad match: C1211

Civilingenjör, trafik
type: Concept
in scheme: JobTech Taxonomy - Yrke
definition: Civilingenjör, trafik
broader: Civilingenjörsyrken inom bygg och anläggning
related: j7Cq ZJe GkT
related: anYS 5AR JRk
broad match: C2142

Gradare
type: Concept
in scheme: JobTech Taxonomy - Yrke
definition: Gradare bearbetar metall för att avlägsna grader och ojämnheter. Arbetet sker vanligtvis i en mekanisk verkstad. Arbetsuppgifterna omfattar gradning, slipning, bänkarbete och andra verkstadsrelaterade uppgifter. Truckkörning och traverskärning är även vanligt förekommande. Källa: Arbetsförmedlingen
broader: Slipare m.fl.
related: XF24 Nm3 m5Y
related: wTEr CBC bqh
related: pyJ6 yjh DXJ
broad match: C7224

Vaktmästare m.fl.
type: Concept
in scheme: JobTech Taxonomy - Yrke
definition: Samlar in, sorterar och delar ut post och paket m.m. Ansvarar för kontorsmaterial samt underhåller vissa kontorsmaskiner. Hjälper till vid omflyttningar. Utför enklare reparationer. Bär bagage på hotell. Tar emot entrébiljetter och ansvarar för gästers ytterkläder.
broader: Tidningsdistributörer, vaktmästare och övriga servicearbetare
related: xKyJ xRE vxN
related: 2RpU Wtb 59E
related: 1xnP aSg drp
related: H73b dCy CTT
related: C9623
related: C8189
related: C9622
related: PELm cH9 AE9
related: UssR m8J XA6
related: C9621
related: hX5n Stz erz
related: iZeK amh g8w
related: irju S7Y Xbr
related: C9629
related: VNjs Chg 2Gc
related: AEgv 4gP ndv
related: JN6h juH 8FP
related: hYpk RYx y3V
related: Vhek ASS ouZ
related: 5s4q dFX JPq
related: rwir xvu 443
related: wzfZ xQE 6Y1
narrower: Biografmedarbetare
narrower: Garderobiär
narrower: Kontorsvaktmästare
narrower: Sjukhusvaktmästare
broad match: yhCP AqT tns

Folkhälsoutvecklare
type: Concept
in scheme: JobTech Taxonomy - Yrke
definition: Folkhälsoutvecklare driver, utvecklar och samordnar folkhälsofrågor inom kommun, region eller offentlig sektor. Arbetsuppgifter innefattar både strategiska och operativa insatser, såsom planering och genomförande av hälsofrämjande projekt, utvärdering av folkhälsoinsatser och samverkan med olika samhällsaktörer. Folkhälsoutvecklaren kartlägger behov, analyserar riskfaktorer och arbetar processinriktat för att stärka befolkningens hälsa. I rollen ingår ofta projektledning, omvärldsbevakning, utbildning och informationsarbete samt att föra dialog och bygga nätverk i lokalsamhället. Källa: Akademikerförbundet SSR, Arbetsförmedlingen
broader: Planerare och utredare m.fl.
related: Kivp s2z KMe
related: rRSH 8TB t34
related: X82t awd Qyc
related: Lot6 PJ4 gc7
related: Su1n Ndk oQu
related: Abys 5p1 Cnq
related: WEZD Jjq Ftp
related: WUZT QXS GXS
related: TZe9 NsN uce
broad match: C2422

Diakon
type: Concept
in scheme: JobTech Taxonomy - Yrke
definition: Diakon
broader: Diakoner
related: e6Es op6 GWr
related: VpEJ 65s dus
related: GazW 2TU kJw
related: XDHp hcp RXs
related: dkQt CCr HXe
related: 7GrQ Yiq URD
related: UQyJ Gah zti
related: Vth8 rco Dt4
related: GrAE V9V Fdd
broad match: C2635

Korsordsmakare/Korsordskonstruktör
type: Concept
in scheme: JobTech Taxonomy - Yrke
definition: Korsordsmakare/Korsordskonstruktör
alternative label: Korsordskonstruktör
alternative label: Korsordsmakare
broader: Författare m.fl.
related: X82t awd Qyc
related: 9puE nYg crq
related: 7oqg ZKw iSi
broad match: C2641

Elverkschef
type: Concept
in scheme: JobTech Taxonomy - Yrke
definition: Elverkschef
broader: Produktionschefer inom tillverkning
related: DcUS LCE fYZ
related: epLc SkD cbT
related: bh3H Y3h 5eD
broad match: C1321

Läkare
type: Concept
in scheme: JobTech Taxonomy - Yrke
definition: Läkare utreder, diagnostiserar och behandlar patienter med olika sjukdomar och medicinska tillstånd inom hälso- och sjukvården. Läkare är en skyddad titel med legitimationskrav. Vanliga arbetsuppgifter är att undersöka patienter, ställa diagnos, ordinera läkemedel, skriva remisser och utfärda intyg. Läkare ansvarar för att beställa prover och undersökningar, följa upp behandlingsresultat samt dokumentera i patientjournaler. De flesta läkare jobbar i team med annan vårdpersonal och kan omfatta jourtjänstgöring och arbete på obekväma tider. Källa: Arbetsförmedlingen, Karolinska Institutet, Region Uppsala, Socialstyrelsen
broader: Övriga läkare
related: 8G1e HKB shk
related: NYW6 mP6 vwf
related: jbG9 LHT Vdn
related: sqvh gTy 6Sj
related: rkf2 aW2 eoJ
related: eog4 GGm hmj
related: HHe5 d6N sDK
related: CQEp 2fj sQT
related: XQzw aK7 q5Q
related: h4ti xdr Qqa
related: VT6T EVg HmM
related: CfKS KET ze7
related: 5xnL sL5 LFJ
related: iuiu Wwc H8X
related: F9Fu Mo4 B6Z
related: gPmC MYi f7r
related: iFXU Cpf wVW
related: Xxv5 SD2 w6C
related: cBPk Qxa cnj
related: NKkq U17 Y1o
related: JSyC hQN wkh
related: 96jh Rfn brg
broad match: C2211

Idrottstränare
type: Concept
in scheme: JobTech Taxonomy - Yrke
definition: Idrottstränare planerar, leder och instruerar individer eller grupper i olika idrotter och fysiska aktiviteter. De fokuserar på att utveckla teknik, taktik och fysisk prestationsförmåga, samt främja en hälsosam livsstil. Deras arbete kan inkludera allt från att planera träningspass och tävlingar till att ge individuell feedback och motivation. Idrottstränare kan arbeta både med barn, ungdomar och vuxna och är ofta specialiserade inom en viss idrott. Behörighet för att arbeta med olika åldersgrupper kan ges genom olika tränarutbildningar, beroende på idrott och arbetsgivare. Källa: Arbetsförmedlingen
broader: Idrottstränare och instruktörer m.fl.
related: G6zD eD9 vkd
related: JTcw Mm7 ZmK
related: k29d i8x M6K
related: bNwE wmM FJK
related: sJdm Mbx qz4
related: QwLF U2G TnD
related: vqcU JAd kDr
related: bdke SjS TaM
related: 6WME 9L5 tLy
related: QN8j SNY MLt
related: Kknv KRF BXU
related: cd91 GP7 vGz
related: vWcW 6vW pDR
related: EVYc 8CQ hzp
related: 3kiC EDD EW1
related: ixNZ Nf8 oxK
related: uz5T Dtw 6pL
related: XRVP pX1 bMJ
related: 9cfH auo 5S1
related: 2CiB Uth gnm
related: 5xCF vAX ser
related: LrKb w1Q ajR
related: Zjk7 w5j K7n
related: GRQP 8Tf Yrc
related: 4pWg EjY FKn
related: Qtr1 xAE aMX
related: RA76 xNN Unk
related: ZsLx H4s ZYx
related: Ru2C zqr J15
related: 4akK tZm jyw
related: aKKA fJW 8Jx
related: 9T4D Pos Mah
related: Cp6m BfC zZ4
related: HY3V N6E 5wf
related: jnfH Cbb d6w
related: ivvS GSr kHP
related: KNuv HwA ABj
related: RUp4 etg 59f
related: utjR 32w Fck
related: 6eWf px1 RqR
related: rUVy nVv GZW
related: fC6W dRm mro
related: 77S6 2Gd xK4
related: 9YoS wyB zjw
related: nT29 mTK Dph
related: SctY uAk 73A
related: kiPQ c2Y aL3
related: sYqd 1kr VnM
related: 6pWb roZ QYK
related: XH6K sEx UNi
related: MVqp eS8 kDZ
related: Ub9v 8wp a1r
related: Abys 5p1 Cnq
related: YQZ6 HCt SXP
related: LGDE bSf Lax
related: Y9T4 5LH UUm
related: mvtC 8Xh V1f
related: ZMB2 GHJ fVD
related: RGCn xBo 7JA
related: iJAn AjD wxm
related: 18mj 8LR mDN
related: W25b RJY 5mb
related: dRAV oKi Cv7
related: nATm AZN Hri
related: CBD9 n6o Dr4
related: HGgT xUb hyN
related: fPFA o6X hKt
related: sP2Q W35 yLJ
related: 7cCt GjW a5j
related: hCiU Ejc YhV
related: agYi MHh oBE
related: bKWd NLG RoS
related: tGx2 XLE ahL
related: oEc4 aZA 7vE
related: 3YFh w9P HEs

Spårsvetsare
type: Concept
in scheme: JobTech Taxonomy - Yrke
definition: Spårsvetsare bygger, reparerar och underhåller järnvägsspår med järnvägstekniska svetsmetoder. Arbetet innefattar användning av olika svetsmetoder, vanligtvis termitsvetsning, för att sammanfoga spårskarvar på tunnelbana, spårväg och järnväg. Särskilt fokus ligger på arbete med spårväxlar. I arbetet ingår även byten av växlar, räls och slipers. Man arbetar även med akuta reparationer vid rälsbrott och hantering av solkurvor under sommaren. Arbetet planeras ofta utifrån när spårtrafik kan stängas av, vilket kan innebära nattarbete och arbete under tidspress. Källa: Järnvägsjobb, Arbetsförmedlingen
broader: Svetsare och gasskärare
related: mQEC 1Gv NV3
related: L26v pFN 82P
related: rxyH xn7 oL1
related: 3eb4 Lu3 2DT
related: wTEr CBC bqh
broad match: C7212

Affärsanalytiker/Business analyst
type: Concept
in scheme: JobTech Taxonomy - Yrke
definition: Affärsanalytiker/Business analyst
broader: Lednings- och organisationsutvecklare
related: ayEJ t6B Fte
related: sXfH wMW bAz
related: MVkE pEv Vw3
related: vrbe cKa gim
related: X82t awd Qyc
related: YsRh 4kG iBt
related: Wo8D xys Lew
related: xjTy PyD nks
related: z93r k9A u77
related: QJt1 skc Hzo
related: voJR J3z r9h
related: jBMV UHp QBc
related: LVJE fkR SUB
related: qofp UZy J4o
related: H6wU zEP bwx
broad match: C2421

Fastighetsförmedlare
type: Concept
in scheme: JobTech Taxonomy - Yrke
definition: Fastighetsförmedlare
broader: Fastighetsförvaltare
related: 6Hq3 tKo V57
related: WDoL Rzs 4G1
related: u58g zvx iSX
broad match: C3334

Kvalitetssamordnare/Kvalitetskoordinator
type: Concept
in scheme: JobTech Taxonomy - Yrke
definition: Kvalitetssamordnare/Kvalitetskoordinator
alternative label: Kvalitetskoordinator
alternative label: Kvalitetssamordnare
broader: Lednings- och organisationsutvecklare
related: FfDD gxA Bsr
related: X82t awd Qyc
related: d4tK VK1 198
related: Wo8D xys Lew
related: L6CV Ng1 ttH
related: BZ67 yYL GdY
related: rSmc dRR 3WM
broad match: C2421

Chefer inom bank, finans och försäkring
type: Concept
in scheme: JobTech Taxonomy - Yrke
definition: Ansvarar samt formulerar mål och strategier för verksamhet inom bank, finansiella institut och försäkringsbolag. Utformar riktlinjer, följer upp och utvärderar verksamheten mot uppsatta mål. Svarar för budget samt fördelar resurserna inom verksamheten. Har personalansvar.
broader: Chefer inom bank, finans och försäkring
related: aSt1 LXQ MCx
related: UQod 7GP JXL
related: QKMc eKX sUE
related: s5SS 7bW 1Gh
related: UH9g R5v MCx
related: SmZd Jaa BeY
related: Napu LsC c2C
related: 8tYq EXD Xwm
related: ZzN5 m7B 5CY
related: nF6J MNc ZxS
related: zzSp k6L WgN
related: Nksx 4oe fEQ
related: eThQ HCv mY6
related: 8m5V 7k8 wJ3
related: 9fky 4rQ 1LA
related: Gt5f wdi FSJ
related: q7Mx gjU F9q
related: VfP9 2xd g2h
related: zXNU zXR hGd
related: bHQT Bhn w3S
related: g2NT MEv e91
related: qv7V 5WG iRp
related: 4fRg DA4 Dj3
related: DWsz s47 DrL
related: EhH5 quw XQK
narrower: Chef för valuta och fixed income
narrower: Fondchef, statlig
narrower: Chef inom bank
narrower: Chef, Corporate Finance
narrower: Aktiechef
narrower: Regionchef, försäkring
broad match: C1346
broad match: bh3H Y3h 5eD

Lärling, grävmaskinförare
type: Concept
in scheme: JobTech Taxonomy - Yrke
definition: En lärling är anställd för att slutföra sin kvalificeringstid till grävmaskinförare innan ett yrkesbevis kan utfärdas. Under kvalificeringstiden får du lärlingslön enligt avtal. Kvalificeringstiden tillsammans med teoretisk grundutbildning leder till yrkesbeviset. Ett lärlingsavtal mellan branschorganisation och företag tecknas. Källa: BYN
broader: Anläggningsmaskinförare m.fl.
related: j7Cq ZJe GkT
related: ja7J P8X YC9
broad match: C8342

Sprängingenjör
type: Concept
in scheme: JobTech Taxonomy - Yrke
definition: Sprängingenjör
broader: Ingenjörer och tekniker inom gruvteknik och metallurgi
related: 6Hq3 tKo V57
broad match: C3117

Förvaltare inom skogsbruk och lantbruk m.fl.
type: Concept
in scheme: JobTech Taxonomy - Yrke
definition: Formulerar och ansvarar för mål och strategier för verksamhet inom skogsbruk eller på större lantbruk. Utformar riktlinjer och följer upp och utvärderar verksamheten mot uppsatta mål. Svarar för budget samt fördelar resurserna inom verksamheten. Har personalansvar. Hit hör inte Driftchef, jordbruk (6111) Driftchef, trädgård (6112)
broader: Förvaltare inom skogsbruk och lantbruk m.fl.
related: bbrX YjR caP
related: WStg Eag 4oi
related: 9t6n 99j BMU
related: HYth uQt hAk
related: jcJj Ek8 D6Q
related: r2MT yTq xZu
related: s5SS 7bW 1Gh
related: qGzK fjg N6W
related: c17z 2sm TQF
related: RU6V bcD cG7
related: GdN1 ziG X5m
related: b3cK YFd y5S
related: jpcR F1P 8Wr
related: 74uH 39f D58
related: 1ZEw qMv JHU
related: LR78 eaw bMu
related: 2d8m SG1 duS
related: UH9g R5v MCx
related: SmZd Jaa BeY
related: Vig6 18E ZVA
related: 8tYq EXD Xwm
related: FGuh iVi jCA
related: J5iL sjS QxW
related: GvD8 zoZ 3fb
related: ZzN5 m7B 5CY
related: b3we MUE xYW
related: 5xK6 cAh jT1
related: L135 ib8 b83
related: GAcK GKJ SJn
related: qsp8 UcL bB9
related: eThQ HCv mY6
related: zve2 ooW xhy
related: yxkr TyE GgG
related: Gt5f wdi FSJ
related: UXUJ ftK Dr1
related: SHZC XTY y62
related: q7Mx gjU F9q
related: VfP9 2xd g2h
related: zXNU zXR hGd
related: pXEi DEw QmR
related: pWHA yeq VjT
related: C6111
related: CWfM RL9 V4t
related: 4fRg DA4 Dj3
related: C1311
related: WKz6 1tc tHk
related: Dzc3 JXb rxC
related: pTEz GD2 J9b
related: 5FXr YFu UCK
narrower: Driftledare, skogsbruk
narrower: Biobränslechef
narrower: Områdeschef, skogsbruk
narrower: Driftchef lantbruk
narrower: Distriktschef, skogsbruk
narrower: Biobränsleansvarig
narrower: Stadsträdgårdsmästare
narrower: Virkeschef
narrower: Skogsvårdschef
narrower: Driftchef, skogsbruk
narrower: Regionchef, skogsbruk
narrower: Skogsförvaltare
narrower: Virkesområdeschef
broad match: bh3H Y3h 5eD

Generalkonsul
type: Concept
in scheme: JobTech Taxonomy - Yrke
definition: Generalkonsul
broader: General-, landstings- och kommundirektörer m.fl.
related: bh3H Y3h 5eD
broad match: C1112

Dataingenjör
type: Concept
in scheme: JobTech Taxonomy - Yrke
definition: Dataingenjör utvecklar, bygger och underhåller datorsystem, programvara och IT-infrastruktur för tekniska och administrativa ändamål. Arbetsuppgifterna omfattar programmering, systemutveckling, konstruktion av hård- och mjukvara, samt installation och drift av IT-system. Dataingenjör designar databaser, dataströmmar och datalager, samt utvecklar algoritmer och modeller för att samla in, bearbeta och analysera data. Arbetet kan även inkludera testning, felsökning, optimering och underhåll av befintliga system. Dataingenjör samarbetar ofta med andra specialister för att skapa effektiva och säkra IT-lösningar, samt bidrar till utveckling och anpassning av digitala produkter och tjänster inom olika branscher. Källor: Tekniksprånget, Framtid.se, Wise IT, The Work-Life, Chalmers tekniska högskola, Högskolan i Halmstad, Lunds universitet
broader: Ingenjörer och tekniker inom elektroteknik
related: 6Hq3 tKo V57
related: SvAW coW dGN
related: VYHY Yvt W88
related: b5ST BLR k21
broad match: C3114

Bilinspektör
type: Concept
in scheme: JobTech Taxonomy - Yrke
definition: Bilinspektörer är civilanställda inom Polismyndigheten som utför tekniska kontroller, så kallade flygande inspektioner, av fordon ute på vägarna. Den flygande inspektionen innebär att kontrollera fordonens trafiksäkerhet, bland annat genom att undersöka bromsar, däck, belysning och andra viktiga funktioner. Bilinspektören kan också kontrollera lastsäkring, kör- och vilotider för yrkesförare samt göra tekniska undersökningar av fordon efter olyckor eller misstanke om brott. Vid upptäckta brister kan befogenheter innebära att fordon ges körförbud eller tvingas till efterkontroll. Det finns tre behörighetsnivåer för bilinspektörer, som avgör vilket slags fordon och vilken typ av kontroll de får utföra. För att bli bilinspektör efterfrågas ofta gymnasieutbildning med inriktning mot fordon och teknik, körkort med flera behörigheter samt erfarenhet av fordonsrelaterat arbete. Meriterande är certifiering som besiktningstekniker enligt Transportstyrelsen. Källa: Transportstyrelsen, Arbetsförmedlingen
broader: Säkerhetsinspektörer m.fl.
related: WopN HEV HCs
related: E7hm BLq fqZ
related: yhCP AqT tns
related: kDNx z5C AmY
broad match: C3115

Valideringsingenjör
type: Concept
in scheme: JobTech Taxonomy - Yrke
definition: Valideringsingenjör
broader: Ingenjörer och tekniker inom kemi och kemiteknik
related: 6Hq3 tKo V57
related: x4x6 S5H ugE
related: 9uqd aXf 3xb
related: MajU XDE 6z8
related: 5tyY GjC AcD
related: HdDq VZe 4us
related: 6Tsi y2v PY3
related: nNng Cng rfi
related: S39i 6Br q1U
related: yGKT fSb WGV
related: za1g Jfk ivx
related: R15L tgT Ayv
broad match: C3119

Vindkrafttekniker
type: Concept
in scheme: JobTech Taxonomy - Yrke
definition: Vindkrafttekniker arbetar med drift-, service- och underhållsarbete i en eller flera vindkraftparker. Arbetet innebär planerat underhåll då man utför regelbundna servicearbeten på vindkraftverken. Vindkraftteknikern gör även akuta utryckningar vid driftstopp och liknande då man gör felsökningar och åtgärdar fel. I arbetet ingår att göra tester och prova olika funktioner/komponenter i anläggningarna. Arbetet innehåller en blandning av mekaniska och elektroniska moment. Vindkrafttekniker arbetar i företag som sköter drift och underhåll av vindkraftverk. Det kan vara hos turbinleverantörer med serviceavtal eller hos vindkraftsägare som sköter driften själva. Det finns flest vindkraftverk på land, men det finns även vindkraftverk till havs. Källa: Arbetsförmedlingen
broader: Underhållsmekaniker och maskinreparatörer
related: 2Ep6 2bR Wcf
related: ynFn k8s Em6
related: yhCP AqT tns
related: oz7E Lit FNL
broad match: C7233

Kvalitetschef
type: Concept
in scheme: JobTech Taxonomy - Yrke
definition: Kvalitetschef
broader: Övriga administrations- och servicechefer
related: Yad1 u3E xzm
related: ccGu iqZ TiC
related: epLc SkD cbT
related: bh3H Y3h 5eD
related: Kn1S 3HC KN8
related: R61V k22 zDF
related: z1U7 bG3 uRr
related: Kjj1 GqX qSo
related: PECp omE eYw
related: 2M5b LxE J9i
related: cpQd w6N ARy
related: J7LG WTn Wn1
related: gzF5 TJt VUx
broad match: C1219

Fartygsstädare
type: Concept
in scheme: JobTech Taxonomy - Yrke
definition: En fartygsstädare ansvarar för att hålla fartyg rena, fräscha och väl underhållna. Arbetet innebär att städa passagerarutrymmen, besättningsutrymmen, toaletter, gemensamma ytor och ibland tekniska delar av fartyget. Bland arbetsuppgiftern ingår bl a att fartygsstädaren byter sängkläder och handdukar i hytter samt rengör och desinficerar sanitetsutrymmen såsom toaletter och duschar. Källa: Arbetsförmedlingen
broader: Städare
related: whao Q6A ScE
related: dRFw Rcu dX7
related: UdVa jRr 9DE
related: 4j4y LCf 3Y2
related: AqZa mQg 4Lv
related: MCA4 jeg CM4
broad match: C9112

Pizzabagare
type: Concept
in scheme: JobTech Taxonomy - Yrke
definition: Pizzabagare tillagar pizzor på restauranger och snabbmatställen. Som pizzabagare arbetar man med att tillaga pizzor efter beställning. Mycket av arbetet går ut på att förbereda råvarorna som används. Vanliga arbetsuppgifter i restaurangkök förekommer också, så som städning och diskning. Beroende på arbetsplats tillagar man även annan mat, oftast snabbmat så som hamburgare och andra enklare grillrätter. Källa: Arbetsförmedlingen
broader: Pizzabagare m.fl.
related: UdVa jRr 9DE
related: ScKy FHB 7wT
related: vmku EoL d5b
related: t1XV yWi dp6
broad match: C9411

Statist
type: Concept
in scheme: JobTech Taxonomy - Yrke
definition: Statist
broader: Övriga yrken inom kultur och underhållning
related: 9puE nYg crq
broad match: C2659

Försäkringssäljare och försäkringsrådgivare
type: Concept
in scheme: JobTech Taxonomy - Yrke
definition: Marknadsför och säljer försäkringar samt analyserar och ger råd om försäkringsbehov. Utreder risker för att kunna kontrollera och fastställa premier och försäkringsvillkor. Köper och säljer delar av försäkringar till andra försäkringsbolag.
broader: Försäkringsrådgivare, företagssäljare och inköpare m.fl.
related: iYpV 3He XWD
related: muUz Uu5 aWu
related: FyG2 mGL FmW
related: aMyW hB7 TpU
related: C3321
related: k7hW d87 3xW
related: 1pLs Lfr UUZ
related: 3vyB YMf qJm
related: BjLc iC7 WH5
related: QAaJ QeY Q6P
related: itDT 5bK hjR
related: AzJi 3Dp Sm9
related: HmyP VEb wQz
related: 2vap pKM fbH
related: kScG gEc uwe
related: q7Mx gjU F9q
related: nfdN dwW 6PE
related: 1quq y8e 2xA
related: 7TbA Gh9 yKX
related: AwhJ eLD xpG
narrower: Försäkringstjänsteman
narrower: Försäkringshandläggare
narrower: Försäkringsspecialist
narrower: Försäkringsförmedlare
narrower: Riskbedömare
narrower: Kundtjänsteman, försäkring
narrower: Försäkringsrådgivare
narrower: Underwriter
narrower: Riskingenjör, försäkring
broad match: X82t awd Qyc

Driftchef, energi
type: Concept
in scheme: JobTech Taxonomy - Yrke
definition: Driftchef, energi
broader: Produktionschefer inom tillverkning
related: epLc SkD cbT
related: C9SD Thi wZh
related: bh3H Y3h 5eD
related: nWVY bWS 9N4
related: sXGe rUj 4k4
broad match: C1321

Valutaförsäljare
type: Concept
in scheme: JobTech Taxonomy - Yrke
definition: Valutaförsäljare köper och säljer valutor på banker, växlingskontor eller resebyråer. Arbetet innebär att hantera kontanter och digitala transaktioner samt ge kunder information om valutakurser. Valutaförsäljare behöver särskilt beakta lagar och regler kring penningtvätt och identitetskontroller vid hantering av större summor. Källa: Arbetsförmedlingen
broader: Kassapersonal m.fl.
related: UdVa jRr 9DE
related: rDcj Tao TJJ
related: RPTn bxG ExZ
related: xMdY H8b TJ7
related: vQ8d QFb K1a
broad match: C4211

Tandtekniker
type: Concept
in scheme: JobTech Taxonomy - Yrke
definition: Person som till tandvården tillverkar individuellt anpassade ersättningar för förlorade eller skadade tänder (t.ex. kronor, broar och helproteser) samt tandställningar för att reglera felställda tänder. Källa: SKR
broader: Tandtekniker och ortopedingenjörer m.fl.
related: 6Hq3 tKo V57
related: UvSh mJ7 aTd
related: vJkj eNz jur
related: NgG1 5qR MDs
related: FWLf jXP SL6
related: kETG bVb bhV
related: NrPD Bwq Hwe
broad match: C3214

Processoperatör betong
type: Concept
in scheme: JobTech Taxonomy - Yrke
definition: Processoperatör inom betongtillverkning sköter och övervakar driften av anläggningar där man tillverkar betong. Arbetet sker främst genom processövervakning i kontrollrum. Utöver produktion kan även kvalitetskontroll, provtagning och ordermottagning ingå. Ordermottagning, återkoppling till kund och planering av leveranser är även förekommande. Beroende på arbetsplats är maskinunderhåll även en vanlig arbetsuppgift. Källa: Arbetsförmedlingen
broader: Maskinoperatörer, cement-, sten- och betongvaror
related: E4sD 3Bw aYu
related: JE7J ZkG ifo
related: VVB8 GLC 7UQ
related: gugi cQX 2o5
related: Tjin DnX qjn
related: 5A5r qws TPn
related: iUMv 9f8 uzp
related: NWfV KZQ WPN
related: TQmd LAp Eqn
related: 7iVR ZAe JvP
related: wTEr CBC bqh
related: pEmz swy zYw
related: GbiQ 3ie 41g
broad match: C8114

CNC-operatör
type: Concept
in scheme: JobTech Taxonomy - Yrke
definition: CNC-operatörer sköter datorstyrda maskiner för mekanisk bearbetning och tillverkning av detaljer. Genom svarvning, borrning eller fräsning tillverkar man detaljer av metall, trä eller plast. Beroende på arbetsplats och kompetens ingår vanligtvis ritningsläsning, riggning och programmering av maskiner. De vanligaste inriktningarna är fräsning, svarvning eller borrning. Enklare underhålls- och reparationsarbeten kan också ingå. Källa: Arbetsförmedlingen
broader: Maskinställare och maskinoperatörer, metallarbete
related: gyLb 7Kk FG1
related: jz2H 3a5 pmn
related: zHcv XHC Q2H
related: 9hQw Gb2 iiq
related: Pu1K FgC Vcc
related: BTXY GAu Trm
related: f9aD vwP 7za
related: xo4m TZJ Uqo
related: BrkY NXg yX8
related: ULAJ hRX ycq
related: zpNH xUq 7TV
related: XPAA pNQ pgT
related: xn3v EnT m1k
related: cu4r XZJ cvD
related: FeAv WV7 ipR
related: vyfY XL8 aEe
related: urY9 ZYq hS9
related: 7fkM E7H vhh
related: Tyzp p1M 5QQ
related: vuFs pfy 8HT
related: hvkN P2h M2s
related: dbos 4g9 r8j
related: wTEr CBC bqh
related: ZPdA Uer f4J
related: M7wY Xi6 Ert
related: 8z2M DPX h5h
broad match: C7223

Systemdesigner
type: Concept
in scheme: JobTech Taxonomy - Yrke
definition: Systemdesigner
broader: Mjukvaru- och systemutvecklare m.fl.
related: apaJ 2ja LuF
related: G49B Qu8 R49
related: KT6P hVH LRD
broad match: C2511

Universitets- och högskolelektor
type: Concept
in scheme: JobTech Taxonomy - Yrke
definition: Universitets- och högskolelektor
broader: Universitets- och högskolelektorer
related: Pm1g u63 47C
related: MVqp eS8 kDZ
related: QHNg diu Tez
related: EfmM Q3i YcW
broad match: C2310

Försäljnings- och marknadschefer
type: Concept
in scheme: JobTech Taxonomy - Yrke
definition: Försäljnings- och marknadschefer
broader: Chefer inom ekonomi, HR, marknadsföring och försäljning samt annan administration m.m.
narrower: Försäljnings- och marknadschefer

Träarbetare, snickare m.fl.
type: Concept
in scheme: JobTech Taxonomy - Yrke
definition: Bygger och uppför träkonstruktioner inom husbyggnad, anläggning eller gruva. Bygger formar inför betonggjutning. Hit hör inte Inredningsskickare (7522) Maskinsnickare (7523) Ställningsbyggare (7116)
broader: Snickare, murare och anläggningsarbetare
related: zZpU nc8 tDf
related: v3d9 u2H pnf
related: sKfH MGG 3CS
related: NeEb Ytz aii
related: VdRu b8H vb8
related: yc3o fvU E6V
related: 9Eav UpV YGX
related: PktN Uav zKf
related: tQr7 pSR XWn
related: oFVp cHz GGb
related: Q6ez byQ HQj
related: 3xxK yks 8RB
related: nuRM zb9 2wV
related: 5S7x 3uD Us8
related: Ytcy v8N P2w
related: odzy zMC D8e
related: aHCV VsV LiD
related: Tv4S faX pzi
related: 1zUh Hb7 ozh
related: ax2t Yyg 2Sy
related: NLiw MkJ y4e
related: Ljpj VA3 ife
related: 1YZS 1ch vDZ
related: J6fN Yyo 3a6
related: q4Gv JP1 MSp
related: PELm cH9 AE9
related: Q7eC B7g QiU
related: BZUR w5p XJJ
related: ad5t 3Go CeS
related: bnMZ Nt5 o48
related: M7C1 DAy UTK
related: LHxN QMZ WXy
related: ZphL V8k Bqe
related: EwT4 Jtg AQf
related: fhcp fFw Lbj
related: 6VeN XR4 Zuj
related: LBFi a32 iRK
related: 7jFS 6oq ZGv
related: nkhA jPz pcE
related: U1ud XV7 Z8o
related: ynWd oCo o61
related: C7111
related: xeoH rao GgZ
related: 5dUU XLt C1Y
related: fhu6 H74 uuN
related: 3Zeh 4RX kA4
related: 6BpN oXk 7SL
related: yKgh gy7 e4M
related: Bumt 8bQ nx8
related: KgEX Xpt xLq
related: eGvq 3pu WJT
related: n5sy 8pT crR
related: gdTC 3Eh PMv
related: WLAi BDr 5fW
related: QM4g Xik 4gR
related: KfEn V5y npV
related: i19v EqY 2x4
related: 5Av7 qB2 msb
related: C7115
related: Je6r Y6g 8fj
related: 9zLg 4k6 bz4
related: 2vrR rF1 rfe
related: t4Tj dXH GNZ
related: HmXd ehy QT9
related: qXBs ALp yFY
related: 22JT eUQ XPo
related: 4y7C Lsh EPM
related: i9yF Mwz mVz
related: bNRS e6U i9r
related: rwir xvu 443
related: nM1r bSd 6rQ
narrower: Lärling, träarbetare
narrower: Träarbetare, utan yrkesbevis/Snickare, utan yrkesbevis
narrower: Träarbetare, gruva
narrower: Träarbetare/Snickare

Bingovärd
type: Concept
in scheme: JobTech Taxonomy - Yrke
definition: En bingovärd arbetar i bingohallar och är ansvarig för att leda och organisera bingospel samt skapa en positiv och välkomnande atmosfär för besökarna. Rollen kombinerar service, spelledning och försäljning, och innebär mycket kontakt med både stamgäster och nya spelare. Källa: Arbetsförmedlingen, Idrottensbingo
broader: Croupierer och oddssättare m.fl.
related: UdVa jRr 9DE
related: RPTn bxG ExZ
related: tuTS qpy wyz
related: ScKy FHB 7wT
related: qXJG zo6 vNm
broad match: C4212

Prognosmeteorolog
type: Concept
in scheme: JobTech Taxonomy - Yrke
definition: Prognosmeteorolog
broader: Meteorologer
related: kJeN wmw 9wX
related: naCA 6Nz cva
broad match: C2112

Enhetschef, hemtjänst
type: Concept
in scheme: JobTech Taxonomy - Yrke
definition: Enhetschef, hemtjänst
broader: Chefer inom äldreomsorg
related: GazW 2TU kJw
related: epLc SkD cbT
related: ocz5 gen FL9
related: xTeX iW8 7xm
related: bh3H Y3h 5eD
related: 1tF5 Kfi UCH
broad match: C1343

Maskinmontör industrimaskiner
type: Concept
in scheme: JobTech Taxonomy - Yrke
definition: Maskinmontör inom industrimaskiner monterar maskiner och utrustning som används inom industri. Arbetet innebär huvudsakligen att montera ihop mekaniska, elektriska och hydrauliska komponenter enligt ritning och specifikationer. Beroende på arbetsplats och typ av maskin görs montering i fabrik eller på plats hos kund. Maskinmontören arbetar vanligtvis inte med installation och underhåll av maskiner. För installation se yrket Installationstekniker industrimaskiner, för underhåll se yrket Underhållsmekaniker. Källa: Arbetsförmedlingen
broader: Underhållsmekaniker och maskinreparatörer
related: n9xu vVk caS
related: eoJD WXZ Hmm
related: prfF ohe dJf
related: ynFn k8s Em6
related: 2TLb yAq 21n
related: yhCP AqT tns
related: wvi8 6Fr yyV
related: ZB1f Upu 7CF
broad match: C7233

Teleskoptruckförare, anläggning
type: Concept
in scheme: JobTech Taxonomy - Yrke
definition: Teleskoptruckförare inom anläggning kör teleskoptruck som räknas som jordförlyttande maskin och används främst vid vägbyggnad och grundläggning, där stora schaktmassor skall förflyttas. I arbetet ingår att sköta underhåll och enklare reparationer av maskinens kringutrustning. Teleskoptruckföraren är en anläggningsmaskinförare och har yrkesbevis i ett eller flera maskinslag. Anläggningsmaskinföraren kan ansöka om sitt yrkesbevis efter teoretisk grundutbildning och lärlingsanställning. Källa: Arbetsförmedlingen
broader: Anläggningsmaskinförare m.fl.
related: j7Cq ZJe GkT
related: 412p mjz dWV
related: ja7J P8X YC9
related: yHcA gaN Ux2
related: Mxyf t2J iLA
broad match: C8342

Stickare
type: Concept
in scheme: JobTech Taxonomy - Yrke
definition: Stickare tillverkar och reparerar textilier och kläder genom stickning. Stickare är ett hantverksyrke där stickning kan utföras för hand eller med stickmaskin. Arbetet innefattar att skapa mönster, flerfärgsstickning, flätstickning och spetsstickning. Stickaren kan också producera prototyper och beskrivningar, samt sy ihop stickade delar för hand eller med symaskin. Att reparera stickade textilier kan även förekomma. Källa: Hantverksakademin, ESCO, Arbetsförmedlingen
broader: Musikinstrumentmakare och övriga konsthantverkare
related: PaxQ o1G wWH
related: odDU Yuc rgH
broad match: C7318

IT-säkerhetstekniker
type: Concept
in scheme: JobTech Taxonomy - Yrke
definition: IT-säkerhetstekniker
broader: IT-säkerhetsspecialister
related: vcbj Uuv NWi
related: JxHZ xUB 5Bc
related: 6MEA uVc J1C
related: TRPL 5av hN9
related: 9UQ5 1QB mDS
related: u2Vf NBY rAC
related: KdfW a7Q QKd
related: apaJ 2ja LuF
related: f4pK 5q9 ksF
related: CESp 7C4 r6U
related: fjbt mHq MZ8
related: VRsY DMz sLe
related: XNY7 9ip B7v
broad match: C2529

Regionchef, försäkring
type: Concept
in scheme: JobTech Taxonomy - Yrke
definition: Regionchef, försäkring
broader: Chefer inom bank, finans och försäkring
related: X82t awd Qyc
related: epLc SkD cbT
related: bh3H Y3h 5eD
broad match: C1346

Veterinärstudent
type: Concept
in scheme: JobTech Taxonomy - Yrke
definition: Veterinärstudent är en student som utbildar sig till veterinär. Vanliga arbetsuppgifter är assistera vid undersökningar och behandlingar av djur, förbereda och hantera medicinsk utrustning samt delta i journalföring och enklare provtagning under handledning. Källa: Arbetsförmedlingen, Jordbruksverket, Sveriges Lantbruksuniversitet
broader: Veterinärer
related: NYW6 mP6 vwf
broad match: C2250

Tivoliarbetare/Nöjesparksarbetare
type: Concept
in scheme: JobTech Taxonomy - Yrke
definition: Tivoliarbetare/Nöjesparksarbetare styr och övervakar attraktioner samt hjälper besökare. Som Tivoliarbetare/Nöjesparksarbetare kan man ha många olika arbetsuppgifter. Vanligt förekommande är att styra och övervaka attraktioner. Beroende på arbetsplats kan även montering, nedmontering och underhåll av attraktioner ingå. Övriga vanliga arbetsuppgifter är allmän service till besökare, t ex försäljning, renhållning och att besvara frågor. Källa: Arbetsförmedlingen
alternative label: Nöjesparksarbetare
alternative label: Tivoliarbetare
broader: Övriga servicearbetare
related: bWFb Wfq Vgm
related: 3Smr 3r9 Uru
related: UdVa jRr 9DE
related: x7GG Uvo Xum
related: yhCP AqT tns
related: sC8Y Tmk C4H
broad match: C8189

Geokemist
type: Concept
in scheme: JobTech Taxonomy - Yrke
definition: Geokemist
broader: Geologer och geofysiker m.fl.
related: kJeN wmw 9wX
broad match: C2114

Övrig servicepersonal
type: Concept
in scheme: JobTech Taxonomy - Yrke
definition: Övrig servicepersonal
broader: Serviceyrken
narrower: Begravnings- och krematoriepersonal
narrower: Övrig servicepersonal

Arbetsledare, anläggning
type: Concept
in scheme: JobTech Taxonomy - Yrke
definition: Arbetsledaren inom anläggning är den ingenjör som leder bygget ute på arbetsplatsen vid byggnation och underhåll av vägar, broar, tunnlar och hamnar. Arbetsledaren bevakar att maskiner och material finns på plats och samordnar arbetet med de underentreprenörer. Arbetsledaren har ansvaret för att arbetet utförs enligt gällande ritningar och anvisningar och för att säkerhetsföreskrifterna följs. På de större byggena finns fler arbetsledare som ansvarar för var sin del. Källa: Arbetsförmedlingen
broader: Arbetsledare inom bygg, anläggning och gruva
related: j7Cq ZJe GkT
related: h15i zsk CAZ
related: KPwm yeQ WVi
related: uh1s Cvd Tr6
related: j3fp dvu 2T2
related: Wh59 EQg PHK
related: Bzmt pr2 yMH
related: ja7J P8X YC9
related: YQZ2 raT nn9
broad match: C3123

Guider och reseledare
type: Concept
in scheme: JobTech Taxonomy - Yrke
definition: Leder utflykter, sightseeingturer och andra arrangemang, både för enskilda besökare och turister eller i grupp. Informerar om sevärdheter m.m. Representerar reseföretag på plats.
broader: Kabinpersonal, tågmästare och guider m.fl.
related: iRXQ 289 ynR
related: zFop CGz JuL
related: qo65 Rvp 32c
related: moSc 5RL aYx
related: bu7L 4AA DCX
related: g6vZ i7N ZeJ
related: 6c4M 5oP 7oC
related: txoi 7sC a4H
related: tDcq CyG KbH
related: myz9 nz9 hTL
related: C5113
related: TuaE 6Xm Nck
related: rTwn 42r KpS
related: zR8a F23 17p
related: pLiT eTw RVH
related: b14m WsQ Dv7
related: HGiF rai coh
related: 8e82 21c 7xM
related: fQbV Y3v KRm
related: k3XC o64 wbn
related: ro7t 8qz rAz
related: Qxey hU2 VSV
related: fHkX ejK XYG
related: ZZ3K X56 6BC
related: uGER 61x BzL
related: EDQD 51c yTB
related: 4TVi 9Le Uyt
related: XgDM YpZ 2AV
related: KHc2 WQu ua5
related: Njjp yXP 1QV
related: ksDx Xcu AHL
related: s7KJ eKd Xy6
related: sGky Wqy QvZ
related: vf55 dgi ENh
related: g4Bf 1p7 HNd
narrower: Platschef reseföretag
narrower: Turistvärd
narrower: Reseledare
narrower: Guide
narrower: Naturguide
broad match: RPTn bxG ExZ

Maskinoperatör fotografiska produkter
type: Concept
in scheme: JobTech Taxonomy - Yrke
definition: Maskinoperatörer inom fotografiska produkter sköter maskiner för framtagning av fotografier. Det mesta arbetet sker med digitala bilder som kopieras maskinellt, ofta i större skala. Det förekommer även arbete med analog film, vilket innebär framkallning av film. Vanliga arbetsplatser är företag som förutom fotografier även erbjuder att digitala bilder trycks på till exempel muggar, canvastavlor och kläder. Källa: Arbetsförmedlingen
broader: Maskinoperatörer, kemisktekniska och fotografiska produkter
related: UdVa jRr 9DE
related: JVLD 46y Mpc
related: GYwf dPJ Wjd
related: qQZb N5W 2gz
related: 6TwG wXm H5M
related: W5b9 Nrm Uv1
related: YpvM YUW P26
related: wTEr CBC bqh
broad match: C8132

Utbildningsledare på trafikskola
type: Concept
in scheme: JobTech Taxonomy - Yrke
definition: Utbildningsledare på trafikskola har det övergripande ansvaret för att planera, leda och utveckla utbildningen av blivande förare enligt gällande lagar och regler. Varje trafikskola ska ha, minst en, godkänd utbildningsledare som ansvarar för utbildningen. Arbetsuppgifter innefattar att upprätta undervisningsplaner, anvisa övningsområden och handleda trafikskolans trafiklärare i pedagogiskt och trafiksäkerhetsmässigt arbete. Utbildningsledaren ansvarar för att säkerställa kvaliteten och effektiviteten i utbildningen samt för kontakter med myndigheter. Godkännande som utbildningsledare på trafikskola utfärdas av Transportstyrelsen. Källa: Transportstyrelsen, Sveriges Trafikutbildares Riksförbund, Arbetsförmedlingen
broader: Trafiklärare
related: 5rHh gdZ av3
related: MVqp eS8 kDZ
broad match: C5165

Lärling, bergarbetare, bygg och anläggning
type: Concept
in scheme: JobTech Taxonomy - Yrke
definition: En lärling är anställd för att slutföra sin kvalificeringstid till bergarbetare innan ett yrkesbevis kan utfärdas. Under kvalificeringstiden får du lärlingslön enligt avtal. Kvalificeringstiden tillsammans med teoretisk grundutbildning leder till yrkesbeviset. Ett lärlingsavtal mellan branschorganisation och företag tecknas. Källa: BYN
broader: Gruv- och stenbrottsarbetare
related: j7Cq ZJe GkT
related: ja7J P8X YC9
broad match: C8111

Övriga byggnads- och anläggningsarbetare
type: Concept
in scheme: JobTech Taxonomy - Yrke
definition: Utför annat bygg- och anläggningsarbete än inom 7111-7116. Exempel på arbetsuppgifter: Lägger ner och sammanfogar rör av betong, metall eller plast. Utför olika arbetsuppgifter i samband med husbyggen och byggreparationer, t.ex. byggnadsträ- och betongarbete. Monterar fabrikstillverkade betongelement. Hit hör inte Anläggningsarbetare (7114) Träarbetare/Snickare (7111)
broader: Snickare, murare och anläggningsarbetare
related: 7RjY L5n xmi
related: EPc1 cdD 2fP
related: yc3o fvU E6V
related: Q6ez byQ HQj
related: nuRM zb9 2wV
related: DKfP skK MFK
related: 5S7x 3uD Us8
related: Ytcy v8N P2w
related: aHCV VsV LiD
related: ax2t Yyg 2Sy
related: yGy3 MAG 5hQ
related: Ljpj VA3 ife
related: Q7eC B7g QiU
related: 34hP 27C pMv
related: EZb7 wBA okA
related: bnMZ Nt5 o48
related: C7119
related: M7C1 DAy UTK
related: D6xD cSH rZN
related: f8Sz Xaf TEU
related: ur5t WrD DXL
related: fhcp fFw Lbj
related: 6VeN XR4 Zuj
related: 9PuU gLx U7V
related: nkhA jPz pcE
related: U1ud XV7 Z8o
related: 3EQ5 ob5 pjT
related: ynWd oCo o61
related: C7111
related: xeoH rao GgZ
related: WAjq Yeb hx3
related: fhu6 H74 uuN
related: 6BpN oXk 7SL
related: WLAi BDr 5fW
related: KfEn V5y npV
related: i19v EqY 2x4
related: 5Av7 qB2 msb
related: HmXd ehy QT9
related: UPx7 WPj h9V
related: hKq6 UBP rw7
related: rwir xvu 443
related: PeRs wm9 6kk
related: 7xYo gc8 9Bm
narrower: Fasadputsare
narrower: Demonteringsarbetare/Rivningsarbetare
narrower: Betongelementmontör
narrower: Fogarbetare, hus och anläggning
narrower: Brandskyddsmontör
narrower: Golvbeläggningsarbetare, industrigolv
narrower: Fasadmontör
narrower: Husmontör
broad match: j7Cq ZJe GkT

Brandskyddsmålare
type: Concept
in scheme: JobTech Taxonomy - Yrke
definition: Brandskyddsmålare
broader: Lackerare och industrimålare
related: srMW hR5 UxY
related: jzJz Ffy KuM
related: wTEr CBC bqh
broad match: C7132

IT-tekniker
type: Concept
in scheme: JobTech Taxonomy - Yrke
definition: En IT Tekniker underhåller IT-infrastrukturen och som löser tekniska problem, installerar och konfigurerar hårdvara och mjukvara, och ser till att användarna har tillgång till de digitala verktyg de behöver för att utföra sina arbetsuppgifter. I arbetsuppgifterna ingår att tillhandahålla support till användare genom att diagnostisera och lösa IT-relaterade problem över telefon, via fjärrsupport eller personligen. Installera, konfigurera och underhålla datorer, servrar, skrivare och andra tekniska enheter. Övervaka och underhålla nätverksinfrastrukturen för att säkerställa en stabil och säker anslutning. Källa: Wise IT
alternative label: Datatekniker
broader: Drifttekniker, IT
related: RVFa 9C7 Zme
related: 36Dy T1u 8hu
related: zjhf jCS 1pR
related: JDcJ Bv1 gd7
related: PBXn yVp TFh
related: W9FN xdR jJB
related: ACyV t1U uYb
related: ZNbC Rth 7Ht
related: 6czZ 1R2 vTa
related: vpXT FCA wqr
related: X7KU cd2 z2Z
related: apaJ 2ja LuF
related: G87A xWZ tP6
related: ihcJ eBb hPX
related: Pnsm NGy vSM
related: dzrn j7Q EKt
related: uUpF NUY JGi
related: Rveu zRG 4Y2
related: AqWe 47b Z9u
related: fL4w xkD 4qn
related: EzD8 gW1 mHE
broad match: C3511

Speditionschef
type: Concept
in scheme: JobTech Taxonomy - Yrke
definition: En speditionschef leder och samordnar arbetet på en speditionsavdelning, med ansvar för att organisera, boka och optimera transporter av gods – nationellt och internationellt – åt företagets kunder. Rollen innebär både operativt och strategiskt ansvar, inklusive personalledning, kundrelationer och ekonomiskt resultat. Källa: Arbetsförmedlingen
broader: Inköps-, logistik- och transportchefer
related: epLc SkD cbT
related: ASGV zcE bWf
related: bh3H Y3h 5eD
related: pwqK oLx 1qd
broad match: C1324

Ögonsjuksköterska
type: Concept
in scheme: JobTech Taxonomy - Yrke
definition: Ögonsjuksköterska undersöker, behandlar och vårdar patienter med ögonsjukdomar eller ögonrelaterade symtom, ofta inom mottagning, operation eller vårdavdelning. Sjuksköterska är en skyddad titel med legitimationskrav. En ögonsjuksköterska med specialistsjuksköterskeexamen får använda benämningen specialistsjuksköterska inom ögonsjukvård. Vanliga arbetsuppgifter är genomföra synskärpetester, mäta ögontryck, utföra synfältsundersökningar och fotografera ögonbotten. Ögonsjuksköterskan ansvarar för råd om medicinsk behandling och egenvård, administrera läkemedel som ögondroppar samt assistera vid och instrumentera för ögonkirurgiska ingrepp. Källa: Arbetsförmedlingen, Socialstyrelsen, Svensk sjuksköterskeförening, S:t Eriks Ögonsjukhus
broader: Övriga specialistsjuksköterskor
related: NYW6 mP6 vwf
related: gjvb FeR c8N
related: ytRi QuA XLX
related: W8ap MeC PQL
related: 1f7B E5K sh3
broad match: C2221

Skötare, vårdare och personliga assistenter m.fl.
type: Concept
in scheme: JobTech Taxonomy - Yrke
definition: Skötare, vårdare och personliga assistenter m.fl.
broader: Omsorgsyrken
narrower: Personliga assistenter
narrower: Skötare
narrower: Vårdare, boendestödjare
narrower: Övrig vård- och omsorgspersonal

Elmontör
type: Concept
in scheme: JobTech Taxonomy - Yrke
definition: Elmontörer arbetar framför allt med att montera, underhålla och reparera elektriska anläggningar och maskiner. En Elmontör installerar elektriska komponenter, inklusive styr- och kraftkablage på maskiner, samt även att bygga stora och små elskåp. Arbetet utförs efter ritning. Elmontörer är en stor yrkesgrupp som återfinns i flera branscher och arbetar med olika arbetsuppgifter. Källa: Arbetsförmedlingen, Framtid.se
broader: Montörer, elektrisk och elektronisk utrustning
related: eEY6 oBt ceh
related: fi9A inH 1s4
related: 74dB 524 g4y
related: FWUX iLa Tm4
related: PzKE 8MT mSX
related: MCv8 hNT 9SD
related: oH33 Y1G Qyp
related: rpEx ird md9
related: 7T1n vfT pav
related: tNS4 dBr Ysg
related: wTEr CBC bqh
broad match: C8212

Third assistant director/TAD
type: Concept
in scheme: JobTech Taxonomy - Yrke
definition: Third assistant director/TAD arbetar operativt med att koordinera logistik och statister under film- eller tv-produktion och stödjer första och andra regiassistenten för att arbetslaget ska följa tidplan och upprätthålla ordning på inspelningsplatsen. Vanliga arbetsuppgifter är att organisera och dirigera statister och statistscener, föra inspelningslogg, hantera tidsscheman och kommunikation mellan teammedlemmar samt se till att rätt personer och utrustning finns på plats. Källa: Arbetsförmedlingen, Yrkesnämnden för Film och TV
alternative label: TAD
alternative label: Third assistant director
broader: Inspicienter och scriptor m.fl.
related: U7Dy 8g9 z3D
related: DreQ GbE 46m
related: 8too bEs 7NU
related: 9puE nYg crq
broad match: C3435

Kabinpersonal
type: Concept
in scheme: JobTech Taxonomy - Yrke
definition: Kabinpersonal ger service, serverar passagerare och ansvarar för säkerhet ombord på passagerarflygplan. Arbetsuppgifter innefattar bland annat att genomföra säkerhetsgenomgångar, kontrollera säkerhetsutrustning och bistå vid ombordstigning.Under flygningarna serverar kabinpersonal mat och dryck, svarar på frågor från passagerare och assisterar vid särskilda behov, till exempel vid sjukdom eller funktionsnedsättning. I händelse av en nödsituation agerar kabinpersonal enligt förutbestämda säkerhetsrutiner, exempelvis vid evakuering, brand eller tryckfall. Kabinpersonal arbetar ofta i team och arbetsmiljön präglas av rörliga arbetstider och internationella resor. Se även yrket Purser, vilket innebär arbetsledning av kabinbesättningen under flygning. Källa: Flygtorget, Arbetsförmedlingen
alternative label: Flygsteward
alternative label: Flygvärd
alternative label: Flygvärdinna
broader: Kabinpersonal m.fl.
related: Ltqy Xbc amf
related: 6Sof 1Bt wDr
related: ewj4 ZZ9 tjD
related: ASGV zcE bWf
related: ad25 cfq TMy
related: 4U6x Sxo V88
related: VLft qga SdH
broad match: C5111

Trafikassistent flygplats
type: Concept
in scheme: JobTech Taxonomy - Yrke
definition: Trafikassistenter arbetar med passagerarservice på flygplatser. Arbetsuppgifter inkluderar incheckning av passagerare och bagage, boardingprocess vid gaten samt hantering av ankommande passagerare. I rollen ingår även att assistera passagerare med särskilda behov, hantera ombokningar och försäljning av biljetter samt upprätta rapporter för förlorat eller skadat bagage. Se även yrkena Trafikvärd, Tågvärd och Rampagent. Källa: Flygtorget, Arbetsförmedlingen
broader: Resesäljare och trafikassistenter m.fl.
related: B2to 4Pb fkq
related: rJbx nuy qzR
related: ASGV zcE bWf
related: j4rS 32M TK1
related: Vi1c LjP qqp
related: Hv9x v52 DrQ
related: nizp js3 tdA
broad match: C4221

IT-samordnare
type: Concept
in scheme: JobTech Taxonomy - Yrke
definition: IT-samordnare
broader: Systemförvaltare m.fl.
related: 1bKH ERy fJi
related: CsBH Mbc xup
related: kstZ tqk YDj
related: tnwS pmU YxC
related: 7dfb KFM doE
related: V59Q e8m Fn1
related: YJnZ ms3 2sE
related: xG1Y 3hw zJj
related: PbNr nW6 Hyq
related: apaJ 2ja LuF
related: XyYi HjM pnR
related: z3L4 14i K6R
related: bF2c 53p 2NN
related: VqSR 7Vs kcR
related: 9hov ZH2 KAk
related: La4X 7UD Y39
broad match: C2522

Optikerassistenter
type: Concept
in scheme: JobTech Taxonomy - Yrke
definition: Biträder optiker med kundkontakter och allmän rådgivning om glasögon och kontaktlinser. Genomför efter optikerns ordination teknisk anpassning av glasögon. Lämnar ut och justerar iordningställda glasögon och kontaktlinser samt ger instruktioner om hantering av linserna.
broader: Butikspersonal
related: DimQ Lfo ndJ
related: C3254
related: Td4F YtH u6S
related: hYpk RYx y3V
narrower: Optikerassistent
broad match: RPTn bxG ExZ

Dekan/Dekanus
type: Concept
in scheme: JobTech Taxonomy - Yrke
definition: Dekan/Dekanus
alternative label: Dekan
alternative label: Dekanus
broader: Förvaltnings- och planeringschefer
related: gGK2 xxQ Sxo
related: MVqp eS8 kDZ
related: jz2G gxy 1JS
broad match: C1213

Braskaminmontör
type: Concept
in scheme: JobTech Taxonomy - Yrke
definition: Braskaminmontör installerar braskaminer. Braskaminmontörer installerar och monterar braskaminer i byggnader, inklusive att ansluta rökkanaler. Funktionstestning och justering ingår i installationsarbetet. Andra arbetsuppgifter är att rådgöra kunder om val av kamin och underhåll samt skötsel. Källa: Arbetsförmedlingen
broader: Övriga montörer
related: PYbh Xfb u2M
related: LAUq Q3y cbF
related: Exie YZ3 hQz
related: 872A jBi AkA
related: wTEr CBC bqh
broad match: C8219

Forskningsingenjör, kemi
type: Concept
in scheme: JobTech Taxonomy - Yrke
definition: Forskningsingenjör, kemi
broader: Civilingenjörsyrken inom kemi och kemiteknik
related: CpFD aoS pkZ
related: 6Hq3 tKo V57
related: fM7t axJ RNN
related: Y3kc JnL Nzo
broad match: C2145

Montör papp- och textilprodukter
type: Concept
in scheme: JobTech Taxonomy - Yrke
definition: Montörer av papp- och textilprodukter sätter samman komponenter till färdiga produkter. Montering sker enligt anvisning och/eller ritning, antingen manuellt eller med hjälp av olika verktyg och maskiner. Man kan till exempel arbeta vid produktionslinjer inom tillverkningsindustri. Beroende på arbetsplats kan man arbeta med montering av mindre eller större komponenter, från små detaljer till större produkter. Felsökning, kvalitetskontroll, truckkörning och leveransförberedelser kan även förekomma. Källa: Arbetsförmedlingen
broader: Övriga montörer
related: 5rfL Fo2 P5a
related: tmdZ ix9 QGR
related: wTEr CBC bqh
broad match: C8219

Maskinoperatörer inom ytbehandling, trä
type: Concept
in scheme: JobTech Taxonomy - Yrke
definition: Applicerar i maskinell process färg och lack på trä eller träbaserat skivmaterial.
broader: Processoperatörer, trä- och pappersindustri
related: VPF1 UZM 9Kd
related: BS77 TnW HWC
related: 2pjc Vto TGH
related: qQ61 EQR rcz
related: VTwt 5Fe 6bW
related: SxZy 3gn xFg
related: KDzy Hra iVr
related: sbYJ XwB o8X
related: Rbju P7i 12U
related: AiwS Mhv ttk
related: BGie HPa fNA
related: 22JT eUQ XPo
related: UPx7 WPj h9V
related: uenm 75h fEh
related: wZpC X9a xzG
related: MT1a Nyq DGQ
related: C7521
related: dWbY gXC Frx
narrower: Maskinoperatör ytbehandling av trä
broad match: wTEr CBC bqh

Kriminolog
type: Concept
in scheme: JobTech Taxonomy - Yrke
definition: Kriminolog
broader: Arkeologer och specialister inom humaniora m.m.
related: X82t awd Qyc
broad match: C2632

Musiker, sångare och kompositörer
type: Concept
in scheme: JobTech Taxonomy - Yrke
definition: Framför klassisk musik, populär- eller kyrkomusik som sångare eller instrumentmusiker. Komponerar musikaliska verk, leder och instruerar orkestrar, körer m.m.
broader: Konstnärer, musiker och skådespelare m.fl.
related: xXHm aE3 rHT
related: LLmw d92 q1f
related: anUV 1tT RfU
related: Fbv6 xjq dRH
related: GkUK ZGp qe4
related: GHHd mjw Ams
related: P9xk SUh Frv
related: EnBZ QZ8 xiH
related: nbSj txW Jr1
related: phaQ iCz Pq2
related: TwAr Mcc 7aE
related: JLpD iFY Jc3
related: ChrQ gsH Gq8
related: iBLp sGc o6o
related: NV9p iyk L8e
related: d3YM woR ovq
related: XEPe cD6 LkA
related: qzWD sJz 8PP
related: cuEZ GoM 4pF
related: Wu6d we6 jWp
related: aNPQ XE8 SyR
related: SrDK dDn MRr
related: jxtM Tne pr9
related: 8gbt Xjp B4s
related: 7PE1 aqE vw2
related: DWgh AvF T7z
related: aP9G 9on FXn
related: x1T9 ToQ rXh
related: uwc8 9QF oyz
related: qyJB BpF Hyi
related: sBHD Hwq LDY
related: KEig EyK 9P8
related: SvZC dMB FxE
related: Qf3c HUW oX3
related: zwGC jkQ Fm3
related: LoLr uQx eKL
related: 3VHg 7vo HQL
related: rHhM euM x2s
related: bmsJ w5y zoe
related: gBAn q4Y X9s
related: ScCu 95b v2h
related: FTPA sDR wrH
related: LorG maV Sxx
related: vTXA KQL KHk
related: 81p1 zRw 6ST
related: nbJB WPd Y6b
related: rENE REV SyE
related: ezCJ HJX Y1v
related: xwHw pHM DYY
related: 2pSW 2hU sJm
related: S37s ht5 Qma
related: rftJ MnF teZ
related: sepw b7U Dx4
related: hq47 c3e nxg
related: SpGt HbX Aps
related: 4tmN 1ED oBF
related: eFcb jCG dt9
related: JjMe 9jW 8J4
related: eVFn 7tB Ss3
related: BhVV Bfb oSv
related: VBR7 sHh C3j
related: BCyg QZR AEi
related: gqq1 LZu ct5
related: 3BBF WhK VfE
related: oh4k jrH MeW
related: iRCc AVN Ag9
related: T2oG 9c3 CB5
related: xZKC CF2 VXm
related: gi9t q8k YS4
related: 51MB jvY TSz
related: CPG7 WWi zJM
related: Equ1 GUU PBP
related: DPzE wgS obF
related: pVK3 ubj HW4
related: QUpw ao6 wsA

Plastbåtbyggare
type: Concept
in scheme: JobTech Taxonomy - Yrke
definition: Plastbåtbyggare arbetar med tillverkning, reparation och underhåll av båtar i plast. Man arbetar ofta med material som glasfiber och kompositer. Arbetsuppgifterna inkluderar laminering, vakuuminjicering och formsprutning för att skapa båtskrov och komponenter enligt ritning. Vid reparation diagnostiserar och åtgärdar man skador, använder rätt verktyg och tekniker samt säkerställer att arbetet uppfyller kvalitetsstandarder. Finisharbete, underhåll av formar och reparation av gelcoatskador är vanligt förekommande. Källa: Arbetsförmedlingen
broader: Maskinoperatörer, plastindustri
related: FqgP 1wN ePx
related: UJux Uje VDu
related: E5HS wZQ jvX
related: wTEr CBC bqh
broad match: C8142

Miljöekonom
type: Concept
in scheme: JobTech Taxonomy - Yrke
definition: Miljöekonom
broader: Nationalekonomer och makroanalytiker m.fl.
related: X82t awd Qyc
broad match: C2631

Valutahandlare
type: Concept
in scheme: JobTech Taxonomy - Yrke
definition: Valutahandlare köper och säljer valutor på de globala finansmarknaderna för att skapa vinst åt banker, företag eller institutionella kunder. Arbetsuppgifterna inkluderar att analysera marknadstrender, följa ekonomiska nyheter, fatta snabba beslut om valutatransaktioner och hantera risker. Valutahandlare arbetar ofta i högt tempo med avancerade handelsplattformar och har tät kontakt med internationella marknadsaktörer. Arbetet sker vanligtvis i kontorsmiljöer såsom trading floors och kräver nära samarbete inom team och med kunder. Källor: Arbetsförmedlingen, jobbannonser på Platsbanken
broader: Mäklare inom finans
related: RbsF qLv jeg
related: RPTn bxG ExZ
related: X82t awd Qyc
related: EbP3 UtL 2zi
broad match: C3311

Läkare
type: Concept
in scheme: JobTech Taxonomy - Yrke
definition: Läkare
broader: Yrken med krav på fördjupad högskolekompetens inom hälso- och sjukvård
narrower: Specialistläkare
narrower: AT-läkare
narrower: ST-läkare
narrower: Övriga läkare

Forskningssjuksköterska
type: Concept
in scheme: JobTech Taxonomy - Yrke
definition: Forskningssjuksköterska planerar, samordnar och genomför kliniska forskningsstudier samt säkerställer att dessa följer etiska riktlinjer och kvalitetskrav. Sjuksköterska är en skyddad titel med legitimationskrav. Vanliga arbetsuppgifter är att informera och stödja forskningsdeltagare, koordinera och dokumentera patientbesök, samla in och hantera forskningsdata samt administrera provtagning och läkemedel. Forskningssjuksköterskan samarbetar med forskare, läkare och andra yrkesgrupper. Källa: Arbetsförmedlingen, Socialstyrelsen
broader: Övriga specialistsjuksköterskor
related: kJeN wmw 9wX
related: NYW6 mP6 vwf
related: 6nm5 5Ev rri
broad match: C2221

Låssmed
type: Concept
in scheme: JobTech Taxonomy - Yrke
definition: Låssmed, kallas även låstekniker, installerar mekaniska och elektromekaniska lås- och säkerhetssystem. Låssmeden jobbar med installation och service av lås och säkerhetssystem. Kunderna är både privatpersoner och företag. Det är ett rörligt arbete där man kan jobba både mekaniskt och med IT, elektromekanik och olika säkerhetslösningar. Arbetet kan vara mer eller mindre avancerat, allt från enklare mekaniska arbeten till helt mjukvarustyrda arbetsuppgifter. Låssmedsyrket växer alltmer ihop med yrket larmtekniker. Källa: Arbetsförmedlingen
broader: Finmekaniker
related: kkPL bnr scv
related: fWEe qVy rNT
related: PaxQ o1G wWH
related: 4vug rCR BtD
broad match: C7222

Produktionsdesigner: kultur, media, film, dataspel
type: Concept
in scheme: JobTech Taxonomy - Yrke
definition: Produktionsdesigner: kultur, media, film, dataspel
broader: Inredare, dekoratörer och scenografer m.fl.
related: HnzF i37 7Fb
related: 8too bEs 7NU
related: 9puE nYg crq
broad match: C3432

Solenergiprojektör/Solcellsprojektör
type: Concept
in scheme: JobTech Taxonomy - Yrke
definition: Solenergiprojektör/Solcellsprojektör
alternative label: Solcellsprojektör
alternative label: Solenergiprojektör
broader: Civilingenjörsyrken inom maskinteknik
related: SuAn oH9 xNc
related: 6Hq3 tKo V57
broad match: C2144

Koncerncontroller
type: Concept
in scheme: JobTech Taxonomy - Yrke
definition: Koncerncontroller
broader: Controller
related: eQFc 7Vq buj
related: X82t awd Qyc
related: vw7i 55Q xxT
broad match: C2411

Svarvare
type: Concept
in scheme: JobTech Taxonomy - Yrke
definition: Svarvare sköter manuella och automatiska svarvar för att bearbeta metallstycken. Arbetet innebär att hantera och ställa in svarvar, så som trycksvarv och karusellsvarv. Beroende på arbetsplats och produkt som tillverkas kan man specialisera sig på att sköta en viss typ av svarv. Andra förekommande arbetsuppgifer är maskinunderhåll och truck- samt traverskörning. Yrket skiljer sig från maskinställare och maskinoperatör i det att man är specialiserad på just svarvning som bearbetningsteknik. Svarvning utförs även med CNC-maskiner och yrket kallas då CNC-operatör. Arbetsuppgifer: sköta manuella svaravar, ställa in automatiska svarvar, övervaka tillverkningsprocess, utföra maskinunderhåll Källa: Arbetsförmedlingen
broader: Maskinställare och maskinoperatörer, metallarbete
related: 9Mev MGB RQd
related: uR2j sKx 1x1
related: Lugc q4Y Hkv
related: 9t9Q MwA wAm
related: VW62 cEJ jDL
related: ekRJ U2N VUJ
related: XH1T aou PiW
related: FeAv WV7 ipR
related: RaFr GwX geD
related: wTEr CBC bqh
broad match: C7223

Hälsovårdsinspektör
type: Concept
in scheme: JobTech Taxonomy - Yrke
definition: Hälsovårdsinspektör
broader: Miljö- och hälsoskyddsinspektörer
related: kJeN wmw 9wX
related: 4eJL Zun nUv
broad match: C3257

ST-läkare, infektionssjukdomar
type: Concept
in scheme: JobTech Taxonomy - Yrke
definition: Specialisttjänstgöring, ST, är den vidareutbildning som legitimerade läkare genomför för att uppnå specialistkompetens. ST-läkare ínfektionssjukdomar arbetar under handledning för att fördjupa sina medicinska kunskaper och färdigheter med målet att bli specialistläkare inom sitt område. ST-läkaren arbetar självständigt med patientutredningar, diagnostik och behandling, men alltid med stöd av specialister och enligt ett individuellt utbildningsprogram. Vanliga arbetsuppgifter är att ta medicinskt ansvar för patienter, delta i jourverksamhet, genomföra medicinska undersökningar och behandlingar samt dokumentera och följa upp vårdinsatser. Tjänsten omfattar också kontinuerlig kompetensutveckling, sidotjänstgöring inom närliggande områden och aktivt deltagande i handledning och utbildningsinsatser för kollegor och studenter. Källa: Arbetsförmedlingen, Karolinska Universitetssjukhuset, Sveriges läkarförbund, Region Kronoberg, Region Skåne.
broader: ST-läkare
related: NYW6 mP6 vwf
related: UtCj yMj ubw
broad match: C2211

Speditörer och transportmäklare
type: Concept
in scheme: JobTech Taxonomy - Yrke
definition: Organiserar för kunders räkning godstransporter och förhandlar om fraktavtal. Upprättar handlingar samt tecknar försäkringar. Beräknar utförselavgifter, tull- och införselavgifter, skatter m.m. Förmedlar lastutrymme i fartyg och andra transportmedel. Utreder reklamations- och skadeärenden. Hit hör inte Logistiker (2141) Speditionsassistent (4323) Transportledare (4323)
broader: Förmedlare m.fl.
related: SV19 DbM RqE
related: tx8m dhy jwZ
related: Y4D7 rHL wDL
related: VzFf zRa QWe
related: zBWb UEF vHK
related: VhAs CM4 kUr
related: Bb7a V49 Da8
related: G7Qq r7L 5Jo
related: UH9g R5v MCx
related: irPd z5v 2o1
related: sKLW XyF UGt
related: q3FE vsZ sd8
related: WVJF FXY Sqk
related: DSED 2Bk Ajw
related: BE3s D4k E1k
related: zFHj MT3 baD
related: ePzH pgt BsZ
related: ePwi BWJ RUG
related: C3331
related: GVgH Vfn tdW
related: mr2K Mgq r3i
related: vp4x sER 6Mf
related: rfqu h1Z ttu
related: 1eAS Kob pow
related: Gt5f wdi FSJ
related: PkRJ QEL xm5
related: C3324
related: pERs YHa Ssv
related: q7Mx gjU F9q
related: yXmf iKi 7ci
related: WfHR 2ph 2dz
related: 4fRg DA4 Dj3
related: ZF9w knj 7cW
related: gUpe NN9 qNy
related: 7B7t rpQ 2NV
related: 3TSx fJE Z26
related: L1fj ack qBX
related: kJrF R2t t6F
related: Musz 6dL pDx
narrower: Tullhandläggare
narrower: Fartygsagent
narrower: Projektledare logistik
narrower: Super cargo
narrower: Köp- och försäljningsmäklare av fartyg
narrower: Speditör
narrower: Befraktningsmäklare
narrower: Flygmäklare
narrower: Linjeagent
broad match: RPTn bxG ExZ

Takmontörer, golvläggare och VVS-montörer m.fl.
type: Concept
in scheme: JobTech Taxonomy - Yrke
definition: Takmontörer, golvläggare och VVS-montörer m.fl.
broader: Byggnads- och anläggningsyrken
narrower: Golvläggare
narrower: Glastekniker
narrower: Takmontörer
narrower: VVS-montörer m.fl.
narrower: Kyl- och värmepumpstekniker m.fl.
narrower: Isoleringsmontörer

Professionella idrottsutövare
type: Concept
in scheme: JobTech Taxonomy - Yrke
definition: Tränar och tävlar inom olika idrottsgrenar och idrottsevenemang, som medlemmar i lag eller individuellt.
broader: Idrottsutövare och fritidsledare m.fl.
related: e18k 813 76y
related: KvFC BVA j9c
related: VEtJ coY 3Yw
related: cHMe vPG rSA
related: tUhg LNZ Lv4
related: VLDD QD1 HoN
related: HfMQ zpY 7Q1
related: 9UMK DYd p5s
related: ugPq DqQ QmB
related: FN64 WBW zPp
related: sVqA fEm aCY
related: FwPf qn9 GMu
related: rXJg kya ktB
related: o3Ar rvj EZH
related: NKXD QQn Eot
related: fwEe mcK vWk
related: AQ8h 9m8 rFu
related: McQQ 5E2 RdY
related: K2zW Ppb p1u
related: C3421
related: w1U1 ndu F8W
narrower: Tävlingsryttare
narrower: Professionell idrottsutövare
narrower: Jockey
narrower: Travkusk
broad match: MVqp eS8 kDZ

Produktionsingenjör, gjuteri
type: Concept
in scheme: JobTech Taxonomy - Yrke
definition: Produktionsingenjör, gjuteri
broader: Civilingenjörsyrken inom gruvteknik och metallurgi
related: 6Hq3 tKo V57
related: AZPQ Dz2 LGF
broad match: C2146

Miljöstatistiker
type: Concept
in scheme: JobTech Taxonomy - Yrke
definition: Miljöstatistiker
broader: Statistiker
related: X82t awd Qyc
broad match: C2120

Godsmottagare
type: Concept
in scheme: JobTech Taxonomy - Yrke
definition: Godsmottagare tar emot, registrerar och kontrollerar inkommande gods vid lager, terminaler eller produktionsanläggningar. Arbetsuppgifterna omfattar avstämning mot följesedlar, inspektion av gods för skador, märkning och lagerläggning samt registrering av ankommande leveranser i affärs- eller lagersystem. Godsmottagare utför även truckkörning, lossning och lastning, interntransport av material, påfyllning till produktionsavdelningar och stöttar ibland utleveransprocessen. Källor: Arbetsförmedlingen, jobbannonser på Platsbanken
broader: Lager- och terminalpersonal
related: J5gJ 6vV egQ
related: xQTP wUs pFL
related: Jig1 qt3 me7
related: 7JkC hou Lxo
related: e6b7 r1n ZPc
related: AVTW 18P E4U
related: 3U1Q PR9 UiJ
related: ASGV zcE bWf
related: CitH MEj 5jn
related: oZfb NWk h5y
related: 9UcB 3xi AEL
broad match: C4321

Byggnadskonsult
type: Concept
in scheme: JobTech Taxonomy - Yrke
definition: En byggnadskonsult är vanligtvis en byggingenjör med spetskompetens inom ett område som i ett eget företag eller i en konsultfirma erbjuder sina tjänster. Vanligaste områden där byggkonsulter verkar är kontrollansvarig, besiktning, energi och projektering. Källa: Arbetsförmedlingen
broader: Ingenjörer och tekniker inom bygg och anläggning
related: dLMF ro4 SCe
related: j7Cq ZJe GkT
related: UP97 VYw 5T7
related: ja7J P8X YC9
related: ZjCw 9JF b8s
broad match: C3112

Synkonsulent
type: Concept
in scheme: JobTech Taxonomy - Yrke
definition: Synkonsulent
broader: Planerare och utredare m.fl.
related: X82t awd Qyc
related: TZe9 NsN uce
broad match: C2422

Åklagaraspirant
type: Concept
in scheme: JobTech Taxonomy - Yrke
definition: Åklagaraspirant är första anställningen mot att bli åklagare. För att kunna söka en tjänst som Åklagaraspirant krävs svenskt medborgarskap, nordisk juristexamen och svensk notariemeritering vid tings- eller förvaltningsrätt vanligtvis 2 år. Under aspiranttjänstgöringen (9–12 månader) består utbildningen av praktisk träning och utbildning på den lokala arbetsplatsen under ledning av en erfaren handledare. Efter att aspiranttjänstgöringen övergått till en tillsvidareanställning som assistentåklagare, påbörjas en grundutbildning som är arbetsintegrerad. Grundutbildningen är utspridd över två år. Kammaråklagare blir du efter 730 dagars tjänstgöring som assistentåklagare och godkännande av kammarchef. Källa: Åklagarmyndigheten
broader: Åklagare
related: X82t awd Qyc
related: x4Wi NWW ogB
related: md9w uw8 P77
broad match: C2611

Avverkningsledare, skogsbruk
type: Concept
in scheme: JobTech Taxonomy - Yrke
definition: Avverkningsledare, skogsbruk
broader: Specialister och rådgivare inom skogsbruk
related: 9ijp rpJ ZHd
related: WGAZ xaM gUE
related: 151J aNG q7e
related: VuuL 7CH adj
broad match: C3143

Pianostämmare
type: Concept
in scheme: JobTech Taxonomy - Yrke
definition: Pianostämmare arbetar med att stämma, reparera och underhålla pianon och flyglar. Yrket kan även kallas pianotekniker. Arbetsuppgifter inkluderar stämning, justering av mekanik, reparation av strängar och klaviatur samt restaurering av äldre instrument. Pianotekniker kan arbeta som frilansare, i musikaffärer, konsertlokaler, utbildningsinstitutioner eller för pianotillverkare. Källa: Kungliga musikhögskolan, Arbetsförmedlingen
broader: Musikinstrumentmakare och övriga konsthantverkare
related: FJHZ qkW vnm
related: aYCV WPX 9sn
related: PaxQ o1G wWH
related: SSrU PyM T7X
broad match: C7312

IT-säkerhetsspecialister
type: Concept
in scheme: JobTech Taxonomy - Yrke
definition: Ansvarar för IT-säkerheten i företag och organisationer. Gör risk- och sårbarhetsanalyser. Utformar säkerhetslösningar och IT-säkerhetssystem utifrån verksamhetens behov.
broader: IT-arkitekter, systemutvecklare och testledare m.fl.
related: eTW8 AY5 tpe
related: DW4R Ejt Y35
related: e4tA b22 rfY
related: sq2c q5d zXN
related: pWTc PxX xX6
related: tkH5 VYd Y58
related: wynY a5Q F6t
related: s867 Bcw ebU
related: JfDs FE6 EKy
related: NnaR bCQ hK1
related: hb1q 7u6 bqH
related: XVip VKv Ac4
related: igAK 9XZ E2a
related: DHhX uVf y6X
related: Gk4E H9x ssE
related: oRCp wLd dWd
related: VQs1 A6F bvi
related: LeES iac 1Qx
related: wE24 qV6 pJV
related: wqXe tsX y7s
related: Fyzv 4ku Cse
related: pwNB ces 8hN
related: TUg4 3hv 1iJ
related: xPii MYq v9r
related: UGqj u6c Tog
related: qVjQ w6H dns
related: QM6y kLC a3q
related: VF4q TKv 2h1
related: Bjvt 4Ji iHn
related: N8Tu Tsn 2VD
related: aB7G VwT AfU
related: ZxHj Wvj 39H
related: C69V W4p i5E
related: o8wR 57f jv9
related: zxNe iWG wqf
related: Zd17 7XH myf
related: P6U8 Qpe TeQ
related: CZvX 1WD eFo
related: KAVh Qyx GPu
related: bJ3T CwH a2j
related: K8eq sEz eXV
related: V9z3 YfY Tob
related: voRm aoU cKB
related: buX8 38v YpB
related: fdR4 ECC San
related: wkT5 VLV Uad
related: Lrrv HyL PzJ
related: Vc24 oqo Qgr
related: Qdhn Fcs qyH
related: bdQe ReZ Bs4
related: ifWk o4W Gir
related: FWBQ FA7 mXJ
related: 7d2G KP4 eFb
related: eGP4 984 S1u
related: C7dn fgD zTU
related: oisM 5jo EVb
related: gWt1 3JZ 56u
related: HZXh RqL hT7
related: rjP6 pCK AMw
related: 3nRt vck Jrv
related: bq5g QZW eyR
related: UuhP Skh QrH
related: K343 BJR mAR
related: bCPt NW1 v2o
related: jChL nQX Pvr
related: s9Ys tMu iKM
related: XhUm Yti Kr3
related: Fxoe tZY k2r
related: 4fWV khE jfp
related: NQmD sAK eFA
related: L4sY nSE UsH
related: RVMG 69z VoE
related: bKM3 9g1 WWC
related: BPMn 5Fu z9m
related: T4Fs ix5 kkv

Strålningsfysiker
type: Concept
in scheme: JobTech Taxonomy - Yrke
definition: Strålningsfysiker
broader: Fysiker och astronomer
related: kJeN wmw 9wX
related: 55Fe CuW PX6
related: Wqic ooc mKq
related: QsWU d3E ai4
broad match: C2111

Biträdande butikschef
type: Concept
in scheme: JobTech Taxonomy - Yrke
definition: Biträdande butikschefer arbetar tillsammans med butikschefen och deltar både i försäljning samt ledning av personal och verksamhet. Arbetsuppgifterna inkluderar schemaläggning, coachning av personal, orderläggning, uppföljning av nyckeltal samt försäljning i butik. Källa: Arbetsförmedlingen
broader: Säljande butikschefer och avdelningschefer i butik
related: xEcE R8s THd
related: nmPG gSS rBm
related: ohmt 9vw kxD
related: a3MT RWd uo9
related: uXcv phq DXg
related: M88e hXM TFp
related: s311 wJm 1XD
related: RPTn bxG ExZ
related: osy6 Aot 2tc
related: abT6 mwf smS
related: epLc SkD cbT
related: iRVa dB6 qAy
related: 8Bd2 ot5 dTZ
related: giMu f9S c1N
related: rn8K q4i DCP
related: PVta 9Ee xDz
related: yxXU zg4 Cv8
related: A3c9 wTK 4Uy
related: Javr D57 bdq
related: bh3H Y3h 5eD
related: j7H4 k8K EsD
related: hL4Y iTB PX8
related: mhZT dns mff
related: 7Mdg Ld5 QvT
related: 2Ax6 SB8 d2i
broad match: C5222

Kapellvaktmästare
type: Concept
in scheme: JobTech Taxonomy - Yrke
definition: Kapellvaktmästare arbetar vid kapell, ofta i anslutning till krematorier eller begravningsplatser, och medverkar vid begravningsceremonier samt praktiska moment före och efter akten. Arbetsuppgifter omfattar att ta emot kistor, förbereda ceremonilokalen, hantera ljudanläggning, ljus och musik, samt i vissa fall möta anhöriga och samarbeta med begravningsentreprenörer. Kapellvaktmästare ser även till att kapellet är i ordnat skick genom städning och enklare skötsel. Yrket liknar Kyrkvaktmästare. Källa: Svenska Kyrkan, Arbetsförmedlingen
broader: Fastighetsskötare
related: gxGb Vxg x98
related: yhCP AqT tns
related: pdzu y9D d5K
broad match: C5153

Ekonomiassistent
type: Concept
in scheme: JobTech Taxonomy - Yrke
definition: Ekonomiassistenter arbetar med administrativa uppgifter inom företagsekonomi. Vanliga arbetsuppgifter inkluderar hantering av leverantörs- och kundreskontra, fakturahantering, avstämningar mellan bokföring och bankkonton samt registrering av ekonomiska transaktioner. Ekonomiassistenter sammanställer ekonomiska rapporter, bistår vid bokslut och hanterar underlag för löner, skatter och reseräkningar. Rollen innebär ofta kontakt med kunder, leverantörer och interna avdelningar för att ge information om betalningar och ekonomiska frågor. Arbetsuppgifterna kan variera beroende på företagets storlek och bransch, där ekonomiassistenten i mindre företag ofta hanterar flera områden, medan arbetsuppgifterna i större företag kan vara mer specialiserade Källa: Arbetsförmedlingen, Unionen
broader: Ekonomiassistenter m.fl.
related: Ax3W p48 Mru
related: 3Uqc 4TR 9xR
related: NiVz 6BD N5r
related: 1rfx vsN mGz
related: nwxV Bsn epX
related: HUG1 crg 84N
related: utAo Nfn uAm
related: KXoA b3f 75x
related: MKau xK4 nW7
related: n9x5 gU2 xod
related: cZsE Rhx 3i3
related: pAVi M49 BdA
related: hYuQ UbL yQv
related: jDko SB6 MdK
related: Rnxk xPd gPY
related: vNo1 Yu1 ehz
related: gdqD jJL 68R
related: uDoN gAR 915
related: HkKk VPc ScJ
related: 26t9 Y9C 6Rg
related: 5ufb CJZ F4a
related: MuRd nXr oe5
related: YZo5 hkD ZP3
related: dW8g y4B TAd
related: SmAF Ete bA6
related: X82t awd Qyc
related: dnkZ cYu iCq
related: Ki9N mgd XDQ
related: FwV6 tQm mVr
related: kPSX 8c9 rL4
related: TGcL N57 hhj
related: qLw2 WfF fom
related: Usa6 oe6 pPL
related: hH32 hrU ZMJ
related: rTrC K1B Czp
related: h5uN MM7 tdB
related: rKL4 bvg ch3
related: Me6o MmF q5j
related: GuU7 juk U4w
related: orC3 aYm iHC
related: yitD K3o FXY
related: V5Bn QSU Zdj
related: b9ux owN 4XB
related: 4GRn t3C QZT
related: aaKC Anu yMH
related: CUik xwX tnj
related: 7WtA AL4 Jaj
related: Mvwp rVk ZBe
related: tGzD WMJ uBT
related: nroQ YAR qhA
related: RLh5 WBv rU5
related: xyNs DBE ZEg
related: ETaC gzV Ncu
related: zQEq Dv4 N4Y
related: fXJi hJa g2R
related: DWFc nZh 1rf
related: Etjj BQB m91
related: wDpG 4Rw 4E1
related: Ho5j pwG fbL
related: TNWk uED 5rq
related: jX8L HxX zCo
related: eJfo FfT DDm
related: Mfrq eUN 1Rt
related: DaZi Was 3zM
related: DLqm qmu uJx
related: bNNP 3QC KVd
related: mts1 5kS Wnj
related: Bx9v bRR nv1
related: KBis bEi CY4
related: tiaC T7d wJb
related: xPaf n2b 9Xv
related: M7Ct 5wd ySZ
broad match: C4311

Fiskerikonsulent
type: Concept
in scheme: JobTech Taxonomy - Yrke
definition: En fiskerikonsulent arbetar med rådgivning, stöd och utveckling inom fiskerinäringen samt med hållbar förvaltning av fiskresurser och vattenmiljöer. Rollen är bred och kan omfatta både arbete med yrkesfiske, fritidsfiske och fiskevård. Fiskerikonsulenten planerar och genomför projekt inom fiskevård, exempelvis restaurering av vattendrag, utsättning av fisk eller biotopvård. Det ingår att delta i informations- och utbildningsinsatser för att sprida kunskap om hållbart fiske och miljöfrågor. Källa: Arbetsförmedlingen
broader: Specialister och rådgivare inom lantbruk m.m.
related: 95vH oiD 8zh
related: 6nbS RdB kzm
related: VuuL 7CH adj
broad match: C2132

Brand- och säkerhetsvakt
type: Concept
in scheme: JobTech Taxonomy - Yrke
definition: Brand- och säkerhetsvakter kontrollerar arbetsmiljö på arbetsplatser, framför allt där heta arbeten utförs. Arbetsuppgifter inkluderar att se till att skyddsutrustning finns på plats och används korrekt, bevakning vid heta arbeten, gasvaktsarbete, flaggning och kontroll av åtkomst till slutna utrymmen. Beroende på arbetsgivare kan även riskanalyser och säkerhetsrekommendationer ingå som arbetsuppgifter. Arbetet innebär även att agera vid olyckor eller nödsituationer, så som att tillkalla polis eller vårdpersonal.
broader: Övrig bevaknings- och säkerhetspersonal
related: kbxp rT2 xPk
related: E7hm BLq fqZ
related: 8gsz ELw pd8
broad match: C5419

Colorist
type: Concept
in scheme: JobTech Taxonomy - Yrke
definition: Colorist korrigerar färg i film- och videomaterial för att skapa ett enhetligt och konstnärligt uttryck som stödjer berättelsen. Vanliga arbetsuppgifter är justera färger och ljusstyrka, matcha bildmaterial mellan olika tagningar samt arbeta nära fotografer, regissörer och postproduktionsansvariga för att säkerställa rätt visuell riktning. Källa: Arbetsförmedlingen, Voodoo Film, Yrkesnämnden för Film och TV
broader: Bild- och sändningstekniker
related: 8too bEs 7NU
related: 9puE nYg crq
related: d1Ao 9bY 7Kn
broad match: C3521

Fysiolog
type: Concept
in scheme: JobTech Taxonomy - Yrke
definition: Fysiolog
broader: Växt- och djurbiologer
related: kJeN wmw 9wX
broad match: C2131

Fjärrbilsförare
type: Concept
in scheme: JobTech Taxonomy - Yrke
definition: Fjärrbilsföraren transporterar större godsenheter över längre sträckor. Fjärrbilsförare transporterar tunga godsenheter över långa avstånd, ofta mer än 20 mil. Föraren kan även fungera som fjärrbilslots och hantera lastning och lossning vid godsterminaler eller lagercentraler. Arbetet innebär att frakta varierat gods, som pallar eller tunga föremål, och ställer stora krav på lastsäkring. För att köra fjärrbil behöver föraren kunna hantera farligt gods, köra med släp och hantera en truck vid lastning och lossning. Utlandsförare arbetar liknande som fjärrbilsförare, men kör oftast en dragbil med trailer på uppdrag av en speditionsfirma och följer ofta en återkommande rutt. Eftersom föraren är borta under längre perioder krävs det goda språkkunskaper för att kunna hantera olika situationer på resan. Källa: Transportfackens yrkes- och arbetsmiljönämnd
broader: Lastbilsförare m.fl.
related: j4oE mFS bZ9
related: nEPs Npc 8W1
related: 1BXH qiP PXA
related: d68E e74 a59
related: MVsT wqw KkM
related: hhb7 1hV t7R
related: ASGV zcE bWf
related: 5xNK SKd RvM
related: yLzJ fcv FNY
related: 483u hVx psa
related: 9wnn PAV q12
related: Bc91 Tyo 3ce
related: 4VuT d9Y w3f
related: kiWN 2T4 gYE
related: chUw dzv dnX
related: tQn7 gWQ 7RL
broad match: C8332

Skolsekreterare
type: Concept
in scheme: JobTech Taxonomy - Yrke
definition: Skolsekreterare
broader: Planerare och utredare m.fl.
related: ze89 ZAb qZu
related: X82t awd Qyc
related: TZe9 NsN uce
broad match: C2422

Kockar och kallskänkor
type: Concept
in scheme: JobTech Taxonomy - Yrke
definition: Lagar, lägger upp och garnerar mat inom hotell- och restaurangnäringen, inom storkök, provkök, på ett fartyg eller i en butik.
broader: Kockar och kallskänkor
related: s5nN ufD 8ay
related: i3k9 q6n 5ht
related: JYAn p1X 6sb
related: ib92 FER 3Dd
related: 5s8U dkk bkQ
related: HfAs ZWA Jvv
related: BwLA RkV Q5J
related: GQ9R 2Za Awt
related: fJdB viK AaA
related: UFfC aC2 MiC
related: hCht Dye LMZ
related: JYKn PRX tif
related: mX5L FXv xti
related: fEwM m56 4sW
related: aD7r W4j RAN
related: 3Z9i jNu wnT
related: Qta3 z3S qtV
related: LDpW xuo jZp
related: XDok jQC Q7x
related: zMmn 1mh 6D5
related: Eksc iXV Z1S
related: DzNZ 4nW KbU
related: FmHS DMU bcA
related: Dywf BPg usG
related: kdSa Bi6 q6E
related: 5B8u HJf V1E
related: T38R QfY piB
related: yBeL 8Xj ztc
related: Bb4Q Vou pbq
related: ZzN5 m7B 5CY
related: 83VF fdF VXp
related: Uuda 4Yj rq2
related: MuoH pDL nFJ
related: PRQR oGE 7re
related: d6J5 FPH ARs
related: tPYe p8C v4Z
related: i9kS G7J FLh
related: S44W QvJ r4m
related: zJFj sZ8 z4E
related: hpHC KHL su1
related: 5AC4 y1Q qLq
related: wQvv ucw Ez5
related: STwz WtJ W4p
related: 9an8 yuj j7U
related: Dxqv 2WA TYt
related: e64v kVH 6pY
related: M4ei Uvu Ks7
related: UTLe 4xJ KEG
related: 3tZd NwT XNt
related: gzxa drN Uud
related: bEAC Fwn pr2
related: YqQY fmi nXU
related: EeYs uSG BUb
related: HtgZ Ukp YEX
related: zYzY NTD VoE
related: Nxfw cTk qUk
related: XHQa Eyb RFX
related: eKuz edm kmi
related: C5120
related: 1Zwa X6Q Dyk
related: o55U zgY GQF
related: 1abT LRk fg2
related: any1 hmV U8e
related: 9XDD LDF VvK
related: SJaZ pXy 771
related: 9uHp GKQ 4qR
related: EvAm oco RcM
related: JJiW W7Z kgc
related: zjQb VwQ eaC
related: aAtJ q2r J5n
related: pT39 hq7 jAW
related: ZMdB i8G L77
related: P6te TBF 8fh
related: 7kNn jPk Cm3
related: S7LZ tzK qSg

Kronofogde
type: Concept
in scheme: JobTech Taxonomy - Yrke
definition: En kronofogde arbetar inom ett eller flera av Kronofogdens verksamhets­områden summarisk process, verkställighet, skuld­sanering och tillsyn i kon­kurs/rekonstruktion. De ansvarar för den rättsliga kvaliteten i ärendehand­läggningen och arbetet spänner över ett flertal rättsområden, främst insolvensrätt, exekutionsrätt och sakrätt. Kronofogdarna ger dagligt juridiskt stöd till övriga medarbetare, håller i utbildningar, gör rättsutredningar, fattar beslut, svarar på remisser och skriver yttranden till domstolar. I rollen ingår även att företräda myndigheten i olika sammanhang samt svara på frågor från allmänheten och parter. För att bli antagen som kronofogdeaspirant måste man ha juristexamen Källa: Kronofogden
broader: Övriga jurister
related: X82t awd Qyc
related: x4Wi NWW ogB
related: Abcb QtH isZ
related: teR8 jto mcZ
broad match: C2619

Sprinklermontör
type: Concept
in scheme: JobTech Taxonomy - Yrke
definition: En sprinklermontör installerar och underhåller sprinklersystemen i industrilokaler, affärer och köpcentrum till sjukhus, hotell och servicehem. En sprinklermontör är med när byggnader byggs eller renoveras och installerar rör och alla komponenterna som ska finnas i sprinklersystemet samt sprinklercentralerna, som är sprinklersystemets ”hjärta” därifrån allt sköts. En sprinklermontör kan även jobba med service och åker runt och kontrollerar att sprinklersystem som redan är installerade fungerar som de ska, t ex system som larmat att något är fel, utför service på sprinklercentralen och byter delar som behöver förnyas. Sprinklermontören får sitt certifikat efter ett branschprov som avslutar lärlingsanställningen och den teoretiska grundutbildning Källa: VVSYN
broader: VVS-montörer m.fl.
related: j7Cq ZJe GkT
related: VJRF 8yo Fz5
related: FMgE NfP 2cg
related: ja7J P8X YC9
related: anqH Jqa 8pA
broad match: C7126

Socialchef/Socialdirektör
type: Concept
in scheme: JobTech Taxonomy - Yrke
definition: Socialchef/Socialdirektör
alternative label: Socialchef
alternative label: Socialdirektör
broader: Förvaltnings- och planeringschefer
related: GazW 2TU kJw
related: epLc SkD cbT
related: bh3H Y3h 5eD
broad match: C1213

Behandlingsassistenter och socialpedagoger m.fl.
type: Concept
in scheme: JobTech Taxonomy - Yrke
definition: Behandlar och rehabiliterar klienter och patienter inom psykiatrisk vård, missbruksvård och kriminalvård. Arbetar med insatser till stöd för flyktingar.
broader: Behandlingsassistenter och pastorer
related: bCVZ ziY KHC
related: kb9z LG1 CZE
related: 61rX uPX YwJ
related: xv3A 9j6 pzJ
related: 7wbG fbz pon
related: E7QH Hnd BAC
related: jqZ2 JnS pZs
related: Hh2K Seb wZQ
related: YaHy ShR uo4
related: MjPH 341 Zmc
related: KEuh v8d chE
related: eGY1 wD2 YAf
related: E6oS PVz qr5
related: a8dY 8nt E87
related: gPrk b7K vXy
related: FJgD TNa SE6
related: faek i1g AwE
related: Xqn7 nQQ ovW
related: tg1e QpF xdX
related: oJiB gms Rm7
related: qMfa U8e Lto
related: xG3w m6i fbp
related: LwJS Hz5 yDP
related: SfoE zq7 ADN
related: wNW9 zPT yY6
related: hqYJ jyZ Ks8
related: 9ShZ oc6 1Jc
related: 2jpJ qwQ 7Kd
related: 3Y9v Urp QGn
related: oQm8 Ucv eSp
related: QoMt T8x WTS
related: H7Xf ifW SX4
related: gtVT cXB d7f
related: 94uF bkH QF5
related: w8pK KSV geR
related: DRdR HTS giu
related: ZjBN Pwc L61
related: aoVs Qfu U3j
related: C3412
related: axxm t1P 6WR
related: vzoU stw Utd
related: FgNd J6B cB2
related: huu9 Uir rPn
related: E3iH XQQ pvE
related: crVe Rij aaB
related: cocQ EPn YiY
related: xLxq sQ7 RzR
narrower: Projektledare, social inriktning
narrower: Stödpedagog
narrower: Behandlingsassistent/Socialpedagog
narrower: Beroendeterapeut
narrower: Kvinnojoursarbetare
narrower: Anhörigkonsulent
narrower: Hantverkspedagog
broad match: GazW 2TU kJw

Fritidskonsulent
type: Concept
in scheme: JobTech Taxonomy - Yrke
definition: Fritidskonsulenter arbetar operativt med att skapa förutsättningar för förenings- och fritidsliv, främst inom kommuner. Arbetsuppgifter innefattar bland annat rådgivning och praktiskt stöd för att utveckla och förnyar olika fritidsverksamheter. Fritidskonsulenten kan även vara inriktad på att arbeta för olika målgrupper, så som personer med funktionsnedsättning. Källa: Arbetsförmedlingen, Sveriges kommuner och regioner
broader: Fritidsledare m.fl.
related: GazW 2TU kJw
related: SKst FiK 4Gv
related: ZfzW DVU cwn
broad match: C3423

Specialistläkare, invärtesmedicin
type: Concept
in scheme: JobTech Taxonomy - Yrke
definition: Specialistläkare, invärtesmedicin är en specialiserad legitimerad läkare med en djupare kunskap och kompetens inom sitt område. Specialistläkare är en skyddad titel och bara den som har bevis om specialistkompetens får kalla sig specialist i sin specialitet. Specialistläkare ansvarar för att diagnostisera, behandla och förebygga sjukdomar inom sin specialitet. Vanliga arbetsuppgifter är mottagningsarbete med patientbesök, rondarbete på avdelning, handledning av yngre läkare samt konsultationer till andra yrkesgrupper och specialiteter. Specialistläkare ansvarar även för att följa och leda utvecklingen inom sitt medicinska område och utför omfattande medicinsk dokumentation och administration. Källa: Arbetsförmedlingen, Karolinska Institutet, Socialstyrelsen, Sveriges Kommuner och Regioner, Sveriges läkarförbund
broader: Specialistläkare
related: NYW6 mP6 vwf
related: Pq4V e45 VCG
related: qSbw XHD Ycd
related: TChC u37 rt2
related: y3oW BVq EnC
related: EBX9 7gC eLt
related: vFjb AHi a54
related: jFHU uSj 4ke
related: D91M WGm 3HU
related: KALC VvK 17U
related: QSeQ MpU wpW
related: 89LR AwA UqR
broad match: C2212

Campingvärd/Stugvärd
type: Concept
in scheme: JobTech Taxonomy - Yrke
definition: Camping- och stugvärdar tar emot och välkomnar gäster vid boendeanläggningar som campingplatser, stugbyar och fjällstugor, samt sköter den dagliga servicen på anläggningen. Arbetet innefattar bland annat att hantera bokningar, in- och utcheckning, ge information om anläggningens faciliteter och områdets sevärdheter. Vidare ingår försäljning och beroende på arbetsplats även enklare matlagning och servering. Arbetsuppgifterna innefattar också ofta städning, tillsyn och enklare underhåll av anläggningen. Arbetet är ofta säsongsbetonat, med större efterfrågan beroende på arbetsplats. Källa: Arbetsförmedlingen
broader: Hotellreceptionister m.fl.
related: SNcr bEK Txg
related: BF9h gPc BxA
related: 2usv ir9 3pS
related: UdVa jRr 9DE
related: XrMa Z8K K2N
related: aDey yqz LQP
related: SqiK ZS6 A61
related: WvBC NyE P2d
related: kTkC 5bi oun
related: yt8h JbA SyD
related: ScKy FHB 7wT
related: 55Ee zwy GME
related: sFh1 8KT Mgc
related: HMco PPP Lbu
broad match: C4224

Badvakt
type: Concept
in scheme: JobTech Taxonomy - Yrke
definition: Badvakter övervakar säkerhet i och omkring badplatser, simhallar och poolområden. Yrket kan även kallas badbevakare, badmästare eller badvärd. Arbetsuppgifter innefattar att hålla uppsikt över badgäster, ingripa vid nödsituationer genom att utföra livräddning och första hjälpen, samt informera besökare. Beroende på arbetsplats ingår även andra arbetsuppgifter som städning, underhåll och kassaförsäljning. Det är vanligt att badvakter även undervisar i simning eller leder vattengymnastik. Källa: Svenska Badmästareförbundet, Arbetsförmedlingen
broader: Övrig bevaknings- och säkerhetspersonal
related: pV9i y4D YzM
related: VkNA TXa A5D
related: Wrxr AS2 FbG
related: zK37 aqd URB
related: uNpV imm 4Ww
related: 2uV9 kPY sB2
related: E7hm BLq fqZ
related: k2MT TCX KdC
related: gQe4 gSi zti
related: AoJ9 a96 Ab9
related: Uhom 2mu v3x
related: Cvxu Ees nCc
related: PfD7 k9c FGM
related: ggqv EYZ Ej5
broad match: C5419

Skolassistent
type: Concept
in scheme: JobTech Taxonomy - Yrke
definition: Skolassistenter arbetar med administrativa och serviceinriktade uppgifter inom skolans verksamhet. Administrativa arbetsuppgifter inkluderar bland annat hantering av elevregister, registrering av ansökningar, prov- och betygsadministration samt arbete i olika administrativa system. Skolassistenten har ofta en servicefunktion genom att besvara frågor från elever, lärare och vårdnadshavare samt kommunicera information inom skolan och externa kontakter, så som till kommunen. Skolassistenten arbetar nära skolledning, lärare, studie- och yrkesvägledare samt övrig administration. Källa: Arbetsförmedlingen
broader: Skolassistenter m.fl.
related: wbza Ukb JuU
related: 6mo1 6RR fRR
related: X82t awd Qyc
related: 1TgX iQq WzQ
related: j8Fp KWR qBQ
related: 23rS jY8 fz1
related: BTaV FpG NPC
related: yCH5 f5F UiZ
related: FnFs X5M 3FE
related: 9fkf PPe ZBS
related: AS2Z pPm T6z
related: wUk6 3aQ pZD
broad match: C4110

Traders och fondförvaltare
type: Concept
in scheme: JobTech Taxonomy - Yrke
definition: Förvaltar, köper samt säljer aktier, obligationer och andra värdepapper. Sätter upp finansiella mål och utvecklar strategier för att nå dem. Förvaltar fonder. Övervakar resultat från investeringar, granskar och reviderar investeringsplaner utifrån behov och förändringar på marknaden. Hit hör inte Mäklare inom finans (3311)
broader: Revisorer, finansanalytiker och fondförvaltare m.fl.
related: eox4 5Lc W7C
related: gPan jwg TFf
related: C2412
related: vD77 b9G AEe
related: h6B2 Egm LWp
related: y73c ikH 5Yg
related: pAcX ugi X4j
related: zfcy UAZ FGp
related: 3vyB YMf qJm
related: PFWV Si2 w7i
related: Napu LsC c2C
related: R58v 7Db Z6h
related: iAvB Z7P qyX
related: 5t9z 7Sc 1bz
related: W7Qf aRY FEo
related: BsBK j8o Guh
related: Stvo uAB 2WZ
related: 8m5V 7k8 wJ3
related: nYdJ xCp xMd
related: PFoL Uzt 2Fu
related: q7Mx gjU F9q
related: nfdN dwW 6PE
related: VfP9 2xd g2h
related: g2NT MEv e91
related: qv7V 5WG iRp
related: Leez v3g kU1
related: G7jP 6Kv GrG
related: DWsz s47 DrL
related: Y4Fw JZQ AcA
narrower: Fondförvaltare/Portföljförvaltare
narrower: Trader
broad match: X82t awd Qyc

Revisorsassistent
type: Concept
in scheme: JobTech Taxonomy - Yrke
definition: En revisorsassistent arbetar nära en revisor och bistår med granskning av ekonomiska rapporter och bokföring. Arbetsuppgifterna inkluderar att samla in och analysera underlag, förbereda revisionsdokumentation och delta i kundmöten. Källa: Arbetsförmedlingen
broader: Redovisningsekonomer
related: Hkic pg5 wFF
related: w86g yuu u5v
related: X82t awd Qyc
related: 7SXD jFW JLx
related: XYVr xJt Mb4
related: QsMz bX5 gHj
broad match: C3313
broad match: C4311

F&B Manager/Food and beverage manager
type: Concept
in scheme: JobTech Taxonomy - Yrke
definition: F&B Manager/Food and beverage manager
alternative label: F&B Manager
alternative label: Food and beverage manager
broader: Restaurang- och kökschefer
related: bh3H Y3h 5eD
related: ScKy FHB 7wT
related: 99PM w1u 1Wu
related: aX6S RaG oZ3
related: PBEP YsX ot4
broad match: C1412

Läkepedagog
type: Concept
in scheme: JobTech Taxonomy - Yrke
definition: Läkepedagog
broader: Speciallärare och specialpedagoger m.fl.
related: 3pyE aAA TFD
related: MVqp eS8 kDZ
broad match: C2352

Entomolog
type: Concept
in scheme: JobTech Taxonomy - Yrke
definition: Entomolog
broader: Växt- och djurbiologer
related: kJeN wmw 9wX
broad match: C2131

Metodanalytiker, IT
type: Concept
in scheme: JobTech Taxonomy - Yrke
definition: Metodanalytiker, IT
broader: Systemanalytiker och IT-arkitekter m.fl.
related: apaJ 2ja LuF
related: qBsw ikL hZ2
broad match: C2511

Studiovärdinna
type: Concept
in scheme: JobTech Taxonomy - Yrke
definition: Som studiovärd/studiovärdinna välkomnar man gäster och publik vid TV- och radioinspelningar. Arbetsuppgifterna innefattar att ta emot och skapa trivsel för gäster före och efter framträdanden, koordinera med produktionspersonal kring scheman och behov samt introducera program eller segment. Under live-sändningar kan det ingå att engagera publik för att bidra till önskad stämning i studion. Erfarenhet av arbete inom media, kommunikation eller kundtjänst kan vara fördelaktigt, men fokus ligger på kommunikation och att hantera situationer lösningsorienterat. Källa: Stagepool, Arbetsförmedlingen
broader: Kontorsreceptionister
related: UdVa jRr 9DE
related: rDc8 TTx fxj
related: X82t awd Qyc
broad match: C4226

Departementsråd
type: Concept
in scheme: JobTech Taxonomy - Yrke
definition: Departementsråd
broader: General-, landstings- och kommundirektörer m.fl.
related: bh3H Y3h 5eD
broad match: C1112

Logoped
type: Concept
in scheme: JobTech Taxonomy - Yrke
definition: Logoped utreder och behandlar personer i alla åldrar med olika typer av tal- och språkstörningar, röstproblem och stamning. Logoped är en skyddad titel med legitimationskrav. Vanliga arbetsuppgifter är att genomföra språkliga och kommunikativa utredningar, ställa diagnoser, utforma och genomföra individuella behandlingsplaner samt arbeta med alternativa kommunikationssätt och hjälpmedel. Logopeden arbetar också med personer som har ät- och sväljsvårigheter. Logopeder arbetar ofta i team tillsammans med exempelvis läkare, psykologer och arbetsterapeuter och kan vara verksamma inom hälso- och sjukvård, habilitering, rehabilitering, skola eller som konsulter. Källa: Arbetsförmedlingen, Logopedförbundet, Region Stockholm
broader: Audionomer och logopeder
related: M2B3 cSQ bC7
related: NYW6 mP6 vwf
related: sqvh gTy 6Sj
related: yt9L Cbg wKr
broad match: C2266

Miljöingenjör/Miljövårdsingenjör
type: Concept
in scheme: JobTech Taxonomy - Yrke
definition: Miljöingenjör/Miljövårdsingenjör
alternative label: Miljöingenjör
alternative label: Miljövårdsingenjör
broader: Specialister inom miljöskydd och miljöteknik
related: kJeN wmw 9wX
related: VNgB f7j nm6
related: pNct 3WL BPh
related: AoH2 7Gd aCY
related: C8Dw w6T q8W
related: n7s8 FNw egt
related: 435w EAH LNC
related: oNJZ eqg 5Mx
related: GKtu DuK ejq
related: 4ff1 4gB Dew
related: 39Mr 1a2 pjG
related: ajVJ mbB Tza
related: VNzg 6xU 1xU
related: 8CVP wmN yJZ
broad match: C2143

Lästmodellör
type: Concept
in scheme: JobTech Taxonomy - Yrke
definition: Lästmodellör
broader: Övriga designer och formgivare
related: 9puE nYg crq
broad match: C2163

Säljkonsulent
type: Concept
in scheme: JobTech Taxonomy - Yrke
definition: Säljkonsulent
broader: Företagssäljare
related: rDcj Tao TJJ
related: RPTn bxG ExZ
related: 4N8U KUN hA3
related: EQPs 7Py q85
related: jXVk 43p FCT
related: Dc3s mJg 5pq
broad match: C3322

Liftdumper- och lastväxlarförare
type: Concept
in scheme: JobTech Taxonomy - Yrke
definition: Liftdumper- och lastväxlarförare transporterar containrar och större gods. Lastväxlare används för en mängd olika transporter, som att frakta maskiner, grus eller vattentankar, och kunder kan vara företag inom maskinuthyrning eller miljöbranschen. En lastväxlare har en krok för att dra upp containrar, medan en liftdumper lyfter containern på bilen och används för att transportera behållare till trånga utrymmen. Liftdumpers kan inte bära lika tunga containrar som lastväxlare med krok, men är mer lämpade för känsligare underlag. Arbetet kräver kunskaper om farligt gods och gärna behörighet för att köra fordon med släp. Källa: Transportfackens yrkes- och arbetsmiljönämnd
broader: Lastbilsförare m.fl.
related: zGjD M5a HCX
related: d68E e74 a59
related: hhb7 1hV t7R
related: ASGV zcE bWf
related: 483u hVx psa
related: LNuq odD Qn8
related: 9wnn PAV q12
related: HSJg FCt 4Lt
broad match: C8332

Prissättare fordon
type: Concept
in scheme: JobTech Taxonomy - Yrke
definition: Prissättare inom fordonsbransch värderar fordon för inköp och försäljning samt fastställer priser på reservdelar och verkstadstjänster. Arbetsuppgifter innefattar bland annat att att analysera fordons- och skadeinformation samt samt att ta fram prisförslag mot kund, försäkringsbolag eller vid garantiärenden. Rollen innebär också att ha regelbunden kontakt med kunder, svara på frågor om pris, tidsåtgång och lösningar. Arbetsuppgifter varierar beroende på arbetsplats. Arbete vid företag som främst sysslar med inköp, import och/eller export av fordon krävs kunskap om lagkrav och exportbestämmelser. Som anställd hos en bilhandlare kan prissättaren även ha visst beläggningsansvar och tätt samarbete med försäljningsavdelning. Källa: Arbetsförmedlingen
broader: Övriga förmedlare
related: RPTn bxG ExZ
broad match: C3339

Kontorsreceptionister
type: Concept
in scheme: JobTech Taxonomy - Yrke
definition: Tar emot besökande. Informerar och hänvisar till plats, lokal eller person. Hanterar in- och utpassering.
broader: Resesäljare, kundtjänstpersonal och receptionister m.fl.
related: ZuYj ADn tk7
related: Yfsb 5XM edc
related: 7H4j dRM Vbo
related: dpPY 3ww 6em
related: 6fA8 Pag kiG
related: 9B1F 3qZ XKQ
related: dDxe fWR Q5Y
related: LYgG qg4 Luj
related: vnsR 9UF m4M
related: eWpk gcE zvZ
related: Mf1y rt5 Vee
related: BbkD 1NJ Hg8
related: wJ4d rCr zdM
related: 2Tey au7 NC8
related: o8X2 cLi NFT
related: bGwc Vsq WTo
related: xHdj p3H 7QM
related: C4226
related: XT5q Tyw fiU
related: 8Xkn zp2 dEM
related: L2K6 Sov V61
related: E4eZ d4Y XYd
related: zrcG eDZ mB7
related: 7LDJ 3qX KKZ
related: fkZr Rq9 SJ7
related: vbYK yRG kbd
related: ewTK VCD mJ4
narrower: Receptionist
narrower: Studiovärdinna
broad match: X82t awd Qyc

Skolsköterskor
type: Concept
in scheme: JobTech Taxonomy - Yrke
definition: Arbetar med förebyggande hälsovård inom skola. Följer elevernas hälsoutveckling genom regelbundna hälsokontroller.
broader: Sjuksköterskor (fortsättning)
related: dJa5 Nao mDS
related: MVKv XXk XAi
related: Ektq nPz 4YF
related: C2221
related: GYz6 5Jt Wmy
related: jxKr BmN CcQ
related: qkyH MC1 YKU
narrower: Skolsköterska
broad match: NYW6 mP6 vwf

Dietist
type: Concept
in scheme: JobTech Taxonomy - Yrke
definition: Dietist arbetar med att förebygga, utreda och behandla kost- och näringsrelaterade tillstånd hos individer i alla åldrar inom hälso- och sjukvård, kommunal verksamhet eller andra organisationer. Dietist är en skyddad titel med legitimationskrav. Vanliga arbetsuppgifter är att bedöma och analysera individers näringsbehov, ge kostrådgivning och skapa och följa upp individuella kostplaner. Dietisten informerar om hur sjukdomar påverkar näringsintaget, undervisar om näringslära och deltar i utveckling och kvalitetssäkring av nutritionsrutiner och måltider inom exempelvis vård, skola och omsorg. Källa: Arbetsförmedlingen, Dietisternas Riksförbund, Socialstyrelsen
broader: Dietister
related: 8MAB YDb f7h
related: NYW6 mP6 vwf
related: sqvh gTy 6Sj
related: Pyt1 thZ cQm
related: XtU5 pTJ Vup
related: Abys 5p1 Cnq
related: m3nq S8J teD
broad match: C2265

Programledare
type: Concept
in scheme: JobTech Taxonomy - Yrke
definition: Programledare
broader: Övriga yrken inom kultur och underhållning
related: 8too bEs 7NU
related: 9puE nYg crq
broad match: C2656

Lärling, väg- och anläggningsarbetare
type: Concept
in scheme: JobTech Taxonomy - Yrke
definition: En lärling är anställd för att slutföra sin kvalificeringstid till Väg- och anläggningsarbetare innan ett yrkesbevis kan utfärdas. Under kvalificeringstiden får du lärlingslön enligt avtal. Ett lärlingsavtal mellan branschorganisation och företag tecknas. Källa: BYN
broader: Anläggningsarbetare
related: j7Cq ZJe GkT
related: ja7J P8X YC9
broad match: C7119

Lärling, murare
type: Concept
in scheme: JobTech Taxonomy - Yrke
definition: En lärling är anställd för att slutföra sin kvalificeringstid till murare innan ett yrkesbevis kan utfärdas. Under kvalificeringstiden får du lärlingslön enligt avtal. Kvalificeringstiden tillsammans med teoretisk grundutbildning leder till yrkesbeviset. Ett lärlingsavtal mellan branschorganisation och företag tecknas. Källa: BYN
broader: Murare m.fl.
related: j7Cq ZJe GkT
related: ja7J P8X YC9
broad match: C7112

Producent: kultur, media, film, dataspel
type: Concept
in scheme: JobTech Taxonomy - Yrke
definition: En producent inom kultur, media, film eller dataspel är en nyckelperson som leder, organiserar och ansvarar för hela eller delar av en produktion – från idé till färdig produkt. Rollen innebär att samordna kreativa, tekniska och administrativa processer för att säkerställa att projektet genomförs enligt plan, budget och tidsramar. Det ingår att planera, koordinera och övervaka produktionens olika faser, från förproduktion till postproduktion samt besluta om t ex inspelningsplatser, teknik, marknadsföringsstrategier och distribution. Källa: Arbetsförmedlingen
broader: Regissörer och producenter av film, teater m.m.
related: 9XQf Yxe uca
related: 79VU UFo JyX
related: ogpz LgY 3bf
related: 6PDQ AMr hoj
related: d2Rr fJc 6gJ
related: 8szA Koc A8B
related: b62a ESe qqs
related: nroN zYc 2Fv
related: Pzo3 vRw zXJ
related: zefd p3k gDF
related: pVbH TEE Mjq
related: DrdA BjW tkB
related: WuBK JtP Ngu
related: Xuvb jE6 74r
related: PdHi t2a f5Y
related: 7ivg 41E bd7
related: 8too bEs 7NU
related: 9puE nYg crq
related: gayE 5DS nRQ
related: fm9L iY8 DFo
related: GZy6 N5x 8Bx
related: m39s r4v 183
related: owzR yfL BgB
related: gpvG 13o fDe
related: nhrn 5j1 14F
related: TxY7 JmZ 3tQ
related: iHNt gxD CsD
related: Cesw d3v ioU
related: w6GJ Tud Kvx
related: HShw nLs GGV
related: 3c6g jJr Z4g
related: HFUM Gmf K9V
related: JtTp np8 cRh
related: Aa2X 3En 78C
related: mHpA 1Zm 7TP
broad match: C2654

Förbundsjurist
type: Concept
in scheme: JobTech Taxonomy - Yrke
definition: Förbundsjurist
broader: Förvaltnings- och organisationsjurister
related: X82t awd Qyc
related: x4Wi NWW ogB
related: Abcb QtH isZ
broad match: C2619

Maskinoperatör stenvaror
type: Concept
in scheme: JobTech Taxonomy - Yrke
definition: Maskinoperatörer inom stenvaror sköter och övervakar tillverkning av produkter av olika typer av sten, främst bänkskivor, hällar och plattor. Arbetet innebär i huvudsak att förbereda råmaterial och övervaka maskinell klippning, slipning och sågning av sten. Det förekommer både manuell maskinhantering och CNC-programmering. Transport och lastning av färdiga produkter är även vanligt, varför truckkörning och övrig leveransförberedelse förekommer. Källa: Sveriges stenindustriförbund, Arbetsförmedlingen
broader: Maskinoperatörer, cement-, sten- och betongvaror
related: Vsjw V1z w6L
related: u9AJ tci paD
related: 7FwG Nn8 6PB
related: 8mZh gPU 3SV
related: wTEr CBC bqh
broad match: C8114

Automationstekniker, tillverkningsindustri
type: Concept
in scheme: JobTech Taxonomy - Yrke
definition: Automationstekniker, tillverkningsindustri
broader: Ingenjörer och tekniker inom maskinteknik
related: 6Hq3 tKo V57
related: Qj2j bny qqn
related: 9aEn jPz gJs
broad match: C3115

Fritidspedagoger
type: Concept
in scheme: JobTech Taxonomy - Yrke
definition: Planerar och organiserar fritidsaktiviteter för skolelever 6-12 år i fritidshem eller öppen fritidsverksamhet. Medverkar i pedagogisk verksamhet i skolklasser.
broader: Grundskollärare, fritidspedagoger och förskollärare
related: C2342
related: yKnk W7X Zvk
related: TsH1 ePz fpf
related: ooLP cHi X9L
related: DCTh VVW CaS
related: zJZd pDs SDf
related: NNNL 6SE hok
related: tUBn 3nq 2E1
related: kJGe dRZ LB4
related: aD6t MtR 9dH
related: fn8p FAM jgb
related: 36BN mHY VQH
narrower: Fritidspedagog
narrower: Grundlärare, fritidshem
broad match: MVqp eS8 kDZ

Antagningssekreterare, utbildning
type: Concept
in scheme: JobTech Taxonomy - Yrke
definition: Antagningssekreterare, utbildning
broader: Planerare och utredare m.fl.
related: X82t awd Qyc
related: MmdS pjB Y4d
related: zdGb gRw FpF
related: TZe9 NsN uce
broad match: C2422

Tank- och bulkbilsförare
type: Concept
in scheme: JobTech Taxonomy - Yrke
definition: Tank- och bulkbilsförare hanterar ofta farligt gods och transporterar varor som såsom bensin, oljor, cement och foder. Tank- och bulkbilsförare transporterar en rad olika varor, såsom bensin, oljor, cement och foder, och hanterar ofta farligt gods som kemikalier eller bitumen. Föraren bär ett stort ansvar, både för säker lastning och lossning samt för att bedöma miljörisker vid spill eller läckage. Behörighet att köra med släp är en fördel för yrket. Källa: Transportfackens yrkes- och arbetsmiljönämnd
broader: Lastbilsförare m.fl.
related: zGjD M5a HCX
related: 2h3m myS pxP
related: 1nWs Bqj T8A
related: d68E e74 a59
related: hhb7 1hV t7R
related: ASGV zcE bWf
related: Mk4Q QhY FQL
related: wUwm SEH efk
related: 483u hVx psa
related: 9wnn PAV q12
broad match: C8332

Båtförsäljare
type: Concept
in scheme: JobTech Taxonomy - Yrke
definition: Båtförsäljare arbetar med försäljning av nya och begagnade fritidsbåtar samt båttillbehör. Arbetsuppgifterna innefattar kundmöten, behovsanalys, produktpresentation, offertskrivning och försäljningsavslut. Även provkörningar, inbyten och visning av båtar både på land och i vatten förekommer. Båtförsäljare har vanligtvis goda kunskaper om båtteknik och sjösäkerhet. Källa: Arbetsförmedlingen
broader: Butikssäljare, fackhandel
related: UM5z 1bx 5rf
related: rDcj Tao TJJ
related: RPTn bxG ExZ
related: kp1G 3mr FtA
related: E5g3 zLb m3s
broad match: C5223

Verksjurist
type: Concept
in scheme: JobTech Taxonomy - Yrke
definition: Verksjurist
broader: Förvaltnings- och organisationsjurister
related: pfMV gTH m29
related: X82t awd Qyc
related: x4Wi NWW ogB
related: Abcb QtH isZ
broad match: C2619

Barnsjuksköterska
type: Concept
in scheme: JobTech Taxonomy - Yrke
definition: Barnsjuksköterska förebygger, vårdar och behandlar svårt sjuka barn och ungdomar omfattande akut, intensiv, kurativ, preventiv, palliativ och rehabiliterande vård. Sjuksköterska är en skyddad titel med legitimationskrav. En barnsjuksköterska med specialistsjuksköterskeexamen får använda benämningen specialistsjuksköterska inom hälso- och sjukvård för barn och ungdomar. Vanliga arbetsuppgifter är att planera, genomföra och utvärdera vårdinsatser, ge medicinsk och pedagogisk information till barn och föräldrar, utföra behandlingar, provtagning och vaccinationer samt samordna vårdinsatser vid både planerade och akuta besök. En barnsjuksköterska kan arbeta inom till exempel akutmottagning, barnhälsovård, elevhälsa, neonatalvård eller vårdavdelningar. Källa: Arbetsförmedlingen, Socialstyrelsen, Svensk sjuksköterskeförening
broader: Barnsjuksköterskor
related: NYW6 mP6 vwf
related: 5eZ3 dHM 4C7
related: 4S6X CAt fzx
related: ytRi QuA XLX
related: wHs1 g5G fYi
related: kpFN Qsb ZSJ
related: u76R nDS rcH
related: arrc ak6 PEa
related: Z1hB Abo SjU
related: 1f7B E5K sh3
broad match: C2221

El- och avioniktekniker
type: Concept
in scheme: JobTech Taxonomy - Yrke
definition: El- och avioniktekniker installerar och underhåller el och avionik i flygfarkoster. Arbetet innebär både enklare reparationer och installationer till mer komplicerade uppgifter. Arbetet sker ofta i trånga utrymmen som hjulbrunnar och maskinutrymmen. Man arbetar ofta i nära samarbete med flygtekniker. Vanligt förekommande arbetsuppgifter är felsökning, underhåll av kablage, installation av elsystem och arbete med flyginstrument. Källa: Transportfackens Yrkes- och Arbetsmiljönämnd
broader: Flygtekniker
related: 6Hq3 tKo V57
related: 6jyK VFn 7FR
related: EHAX jH5 tnB
related: mzEY s8P NVx
related: JiEg myP jJX
broad match: C3155

Fastighetsinspektör
type: Concept
in scheme: JobTech Taxonomy - Yrke
definition: Fastighetsinspektör
broader: Fastighetsförvaltare
related: 6Hq3 tKo V57
related: WDoL Rzs 4G1
related: 4BK5 oxH 3jn
broad match: C3334

Civilingenjör, systemutveckling
type: Concept
in scheme: JobTech Taxonomy - Yrke
definition: Civilingenjör, systemutveckling
broader: Mjukvaru- och systemutvecklare m.fl.
related: nts5 zVf yLG
related: rJKB CuN MfJ
related: qMmA Ci9 aXa
related: Zn2Z 1VS SGk
related: apaJ 2ja LuF
related: KT6P hVH LRD
related: shEi H8w A6C
broad match: C2511

Värderingsman
type: Concept
in scheme: JobTech Taxonomy - Yrke
definition: Värderingsman
broader: Skadereglerare och värderare
related: nnBH dRL nNp
related: X82t awd Qyc
related: UTaJ MWY ULj
related: 7PhV f6f 17E
broad match: C3315

Inredare, dekoratörer och scenografer m.fl.
type: Concept
in scheme: JobTech Taxonomy - Yrke
definition: Inreder, väljer möbler och dekorerar t.ex. affärer, kaféer, restauranger, kontor och hem. Ställer i ordning scendekorer, skyltfönster m.m. Hit hör inte Inredningsarkitekt (2161)
broader: Fotografer, dekoratörer och underhållningsartister m.fl.
related: T3WL Mto riw
related: yeXm 6v5 w3x
related: dPFp HDH 7Ee
related: 9k7p k3k jsy
related: b37x ceN azW
related: Eqx1 Q87 nV5
related: vd1e qAT oPN
related: S8JM CKj zf9
related: oaiv GsB AFK
related: ZXkM jpm p2r
related: aHCV VsV LiD
related: K5JR yfk 8oj
related: aP4x oT8 Jph
related: B7gb YaX ixH
related: yFgG g8k r6r
related: HW3B CwN pst
related: p9um Jnx 5ds
related: i9fn XPE R1K
related: 58as ujv 4dp
related: XCdg UJK w2q
related: qhJ9 N4G BQg
related: kMR7 idH Jwq
related: nc3s Hbk kuS
related: C3432
related: vzLC DTR L4A
related: Krbu VkM PdQ
related: DQCy 18d JFa
related: mz5y hoY H7C
related: 8Uwq vru VT9
related: R7w1 Xgu XPR
related: MiDr iJa gPn
related: VBn4 Qqi CHB
related: t9A6 jvd 6h5
related: dr25 Evg 7qx
related: 9ZPm H1K tPW
related: KbQK N7h YNG
related: KHTv qqM psR
related: 39X5 RRC HLD
related: af2G bUf zNz
related: r4yc XKM z8c
related: Xtxq ZU3 1b6
related: WfAZ bJH rUo
related: VDxU Sqs fb2
related: nazp hfT zjJ
related: eVFF obx bKN
related: HiXi 555 yZJ
related: G2Hv 5XN 6gC
related: Pk1y cpM ZhC
related: FiUa Fh1 LLc
narrower: Inredningsdesigner
narrower: Dekormålare
narrower: Butikskommunikatör/Visual merchandiser
narrower: Produktionsdesigner: kultur, media, film, dataspel
narrower: Köksarkitekt
narrower: Dekorationsmålare, skyltning
narrower: Dekorationsmålare, bygg
narrower: Scenografiassistent
narrower: Scenograf
broad match: 9puE nYg crq

Hårdvarutestare
type: Concept
in scheme: JobTech Taxonomy - Yrke
definition: Hårdvarutestare
broader: Systemtestare och testledare
related: nu7z uGg Bh2
related: g8wH fi1 ueD
related: aRrC 9aV Kkf
related: apaJ 2ja LuF
broad match: C2519

Krukmakare
type: Concept
in scheme: JobTech Taxonomy - Yrke
definition: Krukmakaren tillverkar krukor och andra föremål av lera. Krukmakare är en keramiker och konsthantverkare som specialiserar sig på att skapa runda föremål som skålar, vaser, muggar, tallrikar och krukor. Den vanligaste tekniken som används är drejning, där leran formas på en drejskiva. Utöver drejning kan krukmakaren även arbeta med gjutning och ugnssättning av keramik. I arbetet används olika verktyg och utrustning, såsom drejskivor, brännugnar och handverktyg. Källa: Hantverksakademin, Arbetsförmedlingen
broader: Musikinstrumentmakare och övriga konsthantverkare
related: PaxQ o1G wWH
broad match: C7314

Applikationsutvecklare
type: Concept
in scheme: JobTech Taxonomy - Yrke
definition: En applikationsutvecklare (eller apputvecklare) skapar, utvecklar och underhåller program och applikationer för olika plattformar, såsom mobiltelefoner, surfplattor och datorer. Applikationsutvecklaren designar, programmerar och testar applikationer utifrån användarnas eller kundens behov, samt analyserar och förbättrar befintliga system och appar för att optimera funktionalitet, prestanda och användarupplevelse. Källa: Ranstad, Bluell, indeed
broader: Mjukvaru- och systemutvecklare m.fl.
related: apaJ 2ja LuF
related: wyYa iR8 fuq
related: KT6P hVH LRD
related: wfmy Agi tnN
related: ovLk gz7 FAe
related: 5Bfr BJ8 nYB
broad match: C2514

Specialisttandläkare inom parodontologi
type: Concept
in scheme: JobTech Taxonomy - Yrke
definition: Specialisttandläkare inom parodontologi är en specialiserad legitimerad tandläkare med en djupare kunskap och kompetens inom sitt område. Specialisttandläkare är en skyddad titel och bara den som har bevis om specialistkompetens får kalla sig specialist i sin specialitet. Vanliga arbetsuppgifter är att utreda, diagnostisera och behandla komplexa fall inom exempelvis oral kirurgi, ortodonti, pedodonti, parodontologi, oral protetik, bettfysiologi, endodonti eller odontologisk radiologi. Specialisttandläkare samarbetar ofta i team, tar emot remisser från allmäntandläkare och bidrar med expertkunskap till både patienter och kollegor. Arbetsuppgifterna kan även omfatta konsultationer, handledning och ibland ansvar för verksamhet eller personal inom sitt specialistområde. Källa: Arbetsförmedlingen, Sveriges Kommuner och Regioner, Socialstyrelsen
broader: Tandläkare
related: NYW6 mP6 vwf
related: proQ odJ 3A7
related: aJcn 1NK KaJ
related: NgG1 5qR MDs
related: SRs7 HCS tVp
related: bvS2 Vmd o8t
related: 2B4i UAL 5kg
broad match: C2261

Svetsoperatör
type: Concept
in scheme: JobTech Taxonomy - Yrke
definition: Svetsoperatörer programmerar och övervakar automatiska svetsar och svetsrobotar. Som svetsoperatör, även kallat robotsvetsare, sköter man automatiska svetsmaskiner. Programmering och övervakning av robotsvets är en huvudsaklig arbetsuppgift, där även efterkontroll ingår. Beroende på arbetsplats ingår även visst maskinunderhåll. Se även yrke Robottekniker, vilket avser installation och underhåll av industrirobotar. Källa: Arbetsförmedlingen
broader: Maskinställare och maskinoperatörer, metallarbete
related: bdK2 rBA sMY
related: 6P2G LBM cBe
related: miTw ztW Nxb
related: kJG7 vCT iNu
related: j3rP 6qv b18
related: jjT4 ZYS DJh
related: wTEr CBC bqh
broad match: C7223

Matroser och jungmän m.fl.
type: Concept
in scheme: JobTech Taxonomy - Yrke
definition: Håller utkik samt manövrerar och styr fartyg enligt instruktioner. Sköter däcksutrustning, rengör och målar däck och skrov.
broader: Matroser och jungmän m.fl.
related: 7qAg AP3 WwV
related: JYAn p1X 6sb
related: 2KP2 Zfe 5Cf
related: XNLN wwW x6h
related: tLaY yVU 9uF
related: fJdB viK AaA
related: C83k v82 BcM
related: J3V6 33A iqs
related: 1gdf dsH cFZ
related: 3j4u Apm 7WU
related: b9Kr C83 dG1
related: iFai q8e KNo
related: Jpeq i4k mda
related: LDpW xuo jZp
related: zMmn 1mh 6D5
related: FmHS DMU bcA
related: Q7eC B7g QiU
related: MgS1 3u1 PdT
related: duar rCi 33K
related: tKd2 9Ei PTQ
related: dNA9 T9K JXF
related: xGUW kW5 Sek
related: kSYg iMb xDo
related: 5p3r SgW n54
related: PRQR oGE 7re
related: fhcp fFw Lbj
related: dkg2 8Qz rzx
related: tPYe p8C v4Z
related: 2XXJ ofn VAD
related: S44W QvJ r4m
related: 8Bcs wbf WJa
related: M4ei Uvu Ks7
related: C8350
related: 6Pzb STS Bp1
related: CiMi 7ax tXs
related: zYzY NTD VoE
related: Nxfw cTk qUk
related: y77a Hix Pk3
related: 2pft 3Ry e4L
related: t6jQ DTS zMr
related: JJiW W7Z kgc
related: aAtJ q2r J5n
related: P6te TBF 8fh
related: S7LZ tzK qSg
related: U3Hr T4M R8D
related: rdtv EuD NfB
related: FFdL quR G6i
narrower: Lättmatros
narrower: Matros, inre fart
narrower: Jungman
narrower: Matros
narrower: Båtsman/Bås
broad match: ASGV zcE bWf

Butikspersonal
type: Concept
in scheme: JobTech Taxonomy - Yrke
definition: Butikspersonal
broader: Försäljningsyrken inom detaljhandeln m.m.
narrower: Bensinstationspersonal
narrower: Säljande butikschefer och avdelningschefer i butik
narrower: Butikssäljare, fackhandel
narrower: Butikssäljare, dagligvaror
narrower: Apotekstekniker
narrower: Uthyrare
narrower: Optikerassistenter

Skidpatrullör
type: Concept
in scheme: JobTech Taxonomy - Yrke
definition: Skidpatrullörer övervakar säkerhet inom skidområden vid skidanläggningar. Arbetet innebär i huvudsak att förebygga och hantera olyckstillbud. I detta ingår kontroll av nedfarter och underhåll och uppsättning av skyddsutrustning såsom nät, skyltar och skyddsmadrasser. Vid olyckor är skidpatrullören ofta först på plats för att ge första hjälpen och organisera vidare omhändertagande. Arbetet sker både på skidor och med skoter. Källa: Svenska skidanläggningars organisation, Arbetsförmedlingen
broader: Övrig bevaknings- och säkerhetspersonal
related: 9ynT VcE sr6
related: GGd9 mah wm4
related: E7hm BLq fqZ
related: iTHc anX uCu
related: KHuc Uko BNB
broad match: C5419

Transportledare
type: Concept
in scheme: JobTech Taxonomy - Yrke
definition: Transportledare planerar, leder och följer upp transportflöden för godsleveranser. Arbetsuppgifter omfattar schemaläggning, ruttoptimering, kontakt med förare, kunder och transportföretag samt hantering av leveransavvikelser i realtid. Transportledare följer upp transportutfall och säkerställer att leveranser sker enligt avtalade krav. I distributionsverksamhet används benämningen Transportledare med fokus på färdiga leveranser, medan rollen inom tillverkningsindustri ofta kallas Transportplanerare och omfattar bokning och planering av råmaterial och produkter mellan anläggningar och lager. Arbetet sker ofta i digitala transportsystem (TMS) och kan inkludera fordonsoptimering, kostnadsuppföljning och stöd till speditörer och externa åkerier. Källa: Arbetsförmedlingen
broader: Transportledare och transportsamordnare
related: 4CoL toM JER
related: fAv2 N6f soV
related: wUTP X96 2mo
related: Liut Rjr N3h
related: srFM D7p Nkg
related: NtRq Xpg g4p
related: 7CCe YKU ddd
related: rA12 bKu fTb
related: ASGV zcE bWf
related: 9Mq1 6dK HGC
related: hGEd HTT yn5
related: gb2i 97G Gby
related: F1rx K7m RBk
related: DVCw SCi PDQ
related: VPfA R2J 5Mk
related: M7XH 3Kn zwP
related: MBCe 88t j4U
related: 3srx 2nh gsN
related: SxFg 5t1 VDT
related: a6qL asT rps
related: 4CDT dvj oB2
related: HHiR j7g PkU
related: xb8P PsT u1y
related: f6Gu QeT myB
related: HHYu sxB D5E
related: fqbK Kyg JzA
related: gJKL ZVd Vba
related: V7bG SFH 4tf
broad match: C4323

Redovisningskonsult
type: Concept
in scheme: JobTech Taxonomy - Yrke
definition: Redovisningskonsult är vanligtvis en redovisningsekonom med spetskompetens inom ett område som i ett eget företag eller i en konsultfirma erbjuder sina tjänster. Källa: Arbetsförmedlingen
broader: Redovisningsekonomer
related: DJKa beH eBg
related: Yhx8 XUf WLo
related: X82t awd Qyc
related: H17x 3fw rfD
related: SqEa RGk gVY
related: 7SXD jFW JLx
related: erSB Krc VVr
related: q4hR Dz5 ZAp
broad match: C3313

Fransstylist
type: Concept
in scheme: JobTech Taxonomy - Yrke
definition: Fransstylister arbetar med att forma, färga och förlänga ögonfransar och ögonbryn. Arbetsuppgifterna inkluderar fransförlängning med singel- eller volymteknik, lash lift, brow lift, färgning, formning med pincett eller vax samt kundrådgivning inför och efter behandling. Källa: Arbetsförmedlingen
alternative label: Frans- och brynstylist
broader: Övriga skönhets- och kroppsterapeuter
related: kV34 t8Q Vex
related: Uuf1 GMh Uvw
related: 9puE nYg crq
related: rge4 Qq4 mpW
related: LMkp s73 4N7
related: 3Pyb brs xY2
related: wLeg TK7 cWe
broad match: C5142

Apoteksassistent
type: Concept
in scheme: JobTech Taxonomy - Yrke
definition: Apoteksassistenter hanterar läkemedel och egenvårdsprodukter på apotek. På apotek innefattar arbetet att ta emot varuleveranser, hantera lager, exponera produkter i butiken, arbeta i kassa och hjälpa kunder med enklare frågor. Erfarenhet av butiksarbete eller studerande till farmaceut kan vara meriterande. Inom sjukhusens läkemedelsförsörjning deltar apoteksassistenter i tekniskt och logistiskt arbete kopplat till distribution av läkemedel. Det kan innefatta packning av vätskevagnar, hantering av läkemedel i slutenvårdsdos, och teknikeruppgifter i renrum, inklusive varuhantering och packning av beredningar. Städning i sterilmiljö förekommer. För denna inriktning är studerande till farmaceut eller annan vårdrelaterad bakgrund meriterande. Källa: Arbetsförmedlingen
broader: Apotekstekniker
related: RPTn bxG ExZ
related: eUN7 Dm5 Q5b
related: ASGV zcE bWf
related: 4YmH AFj u6T
related: K5Dp 6mn DKR
broad match: C5329

Trafikvakt
type: Concept
in scheme: JobTech Taxonomy - Yrke
definition: Trafikvakter dirigerar och lotsar trafik vid vägarbeten. Arbetsuppgifterna inkluderar trafikreglering, kommunikation med förare, skyltning och etablering av arbetsområden. TMA-körning och arbete på varierande tider och platser kan ingå. Källa: Arbetsförmedlingen
broader: Övrig bevaknings- och säkerhetspersonal
related: UdVa jRr 9DE
related: 5wYJ eSs ByX
related: E7hm BLq fqZ
related: eHPT xY6 2J4
related: qhCf su8 Wb9
related: CjMk gBM GE7
related: pDWr mNe EWt
broad match: C5419

Bild- och sändningstekniker
type: Concept
in scheme: JobTech Taxonomy - Yrke
definition: Ansvarar för teknik och leder arbete vid sändning av TV-program från studio eller inspelningsbuss. Planerar och hanterar utrustning för redigering och mixning av ljud- och bildinspelningar. Gör mixbearbetning av inspelningar samt överför ljud till och från olika media.
broader: Bild-, ljud- och ljustekniker m.fl.
related: 27SK YN7 i8o
related: kZaX Qog mPK
related: 6RVe ZFT p8o
related: ZefA esM Z9F
related: j2Nm bxT X8R
related: jYGN rDK tM2
related: mfxk qAC E8y
related: 5z4W tEu PMN
related: BZDw 9aj p4S
related: poUy FfV mr3
related: 3gX3 7Ha 7np
related: 5And Mn6 F6p
related: fJdB viK AaA
related: 5kzq otj mTk
related: jMr4 gFw Ppi
related: assp hgx pSE
related: vBXv GSE KL2
related: 66Vu jsy Xuo
related: bzFf qDr Brc
related: KpqX tAL Nq7
related: ayfb EoM HAD
related: 4Jvy d7p 1fH
related: B83k mVq 771
related: pSb6 EzY ePy
related: 1xnP aSg drp
related: 7tvZ Vey JsX
related: kmFW EKW yWf
related: 4z4f Tzu S2s
related: Aj1W rmu niY
related: nvXa KhJ VWE
related: afZ1 jd6 Hmk
related: y1Wx UpU Gi3
related: vSqz 6Hj Jrg
related: 2JEv m3q khc
related: Rzes KdR abx
related: MjGw w7j Vm5
related: x9fo ku1 W1p
related: Mg1Y oVm Awu
related: YLjq aQ5 rLK
related: p9um Jnx 5ds
related: E8uW GK1 AQi
related: EK82 anj cWV
related: 1vsK SsR 8nK
related: 2pEK BNW U6j
related: NLoc CxC teD
related: Fpn1 bAJ rJw
related: pLyW JYJ TFq
related: 9nEt vAu z2d
related: DEWT 5Sj yMn
related: 4QgZ EtG Nx2
related: nXUc H3H Ct5
related: 5Bkd cxC nSj
related: vvYA pay Yhj
related: Krbu VkM PdQ
related: 6HyA u8s Fo4
related: K8Za Smm Ltb
related: GCMj xLD mj6
related: tSaL nLg uDL
related: MYC5 J8J c8n
related: SXPT Lq1 7xE
related: hc8Q AKP pMA
related: VVj2 4Uu LL9
related: CR2o UpP 3sZ
related: rjGr Usv AHy
related: iMEL yvq cPA
related: QFai uhH U4K
related: DeWG yQm d5V
related: p8Mj xN3 rVd
related: xwA9 cGB unB
related: qPMJ D7M au8
related: qJFE yzh yiM
related: QnBu hMG Huc
related: Yhyn QdP Q1i
related: 3wuo aBe m2e
related: aCtq uxu pPu

Biträdande rektor
type: Concept
in scheme: JobTech Taxonomy - Yrke
definition: Biträdande rektor
broader: Chefer inom grund- och gymnasieskola samt vuxenutbildning
related: bwcF 6L7 NVy
related: epLc SkD cbT
related: bh3H Y3h 5eD
related: MVqp eS8 kDZ
broad match: C1345

Astronom
type: Concept
in scheme: JobTech Taxonomy - Yrke
definition: Astronom
broader: Fysiker och astronomer
related: kJeN wmw 9wX
broad match: C2111

Enhetschef inom socialtjänst
type: Concept
in scheme: JobTech Taxonomy - Yrke
definition: Enhetschef inom socialtjänst
broader: Chefer inom socialt och kurativt arbete
related: GazW 2TU kJw
related: epLc SkD cbT
related: bh3H Y3h 5eD
related: 7sBY w8H nVP
broad match: C1344

Forskare, trädgårdsvetenskap
type: Concept
in scheme: JobTech Taxonomy - Yrke
definition: Forskare, trädgårdsvetenskap
broader: Specialister och rådgivare inom lantbruk m.m.
related: a8Jt Ytr BMd
related: 6nbS RdB kzm
related: VuuL 7CH adj
broad match: C2132

Drifttekniker vid värme- och vattenverk
type: Concept
in scheme: JobTech Taxonomy - Yrke
definition: Styr och övervakar anläggningar och maskiner som framställer och distribuerar elektricitet, ånga och hetvatten. Styr anläggningar för förbränning av avfall samt för upptagning, rening och distribution av vatten. Styr kyl- och ventilationsmaskineri.
broader: Drifttekniker och processövervakare
related: wBLK nWZ 7ek
related: GxW1 hAb 5ZS
related: tqRJ 2Ds GJG
related: 1nHb MQ9 W7d
related: BroT juN Spe
related: CzZc 7tx B9C
related: E7Hg 452 2i1
related: gaCj QVT Uf1
related: 1VVe BBY rpQ
related: fjoN ZHr XG4
related: 8CXX RES Zhi
related: iGx7 Gh3 Pg9
related: C3132
related: dhdg gSh nFu
related: joxa P7K AUa
related: GCYi 9tC 1pP
related: Z62p 8do ctd
related: hiuX PuH hbQ
related: nkor VBn U64
related: j3WM Z14 jh2
related: c14d Mgx MFA
related: DR9r t4m 4r2
related: oRGT Qo6 XjR
related: BGJc YEv aPK
related: MF21 TEs icT
related: C8182
related: 8Uxx oT4 Sf2
related: m3Gb uJ1 Cxr
related: C3131
related: L6jF b6N jV9
related: BkCz fjg Am7
related: Wsum y9W nZS
related: YcJ6 Hua AEM
related: 3FMJ axw bJV
related: hjRw Rfu n8g
related: FhjY 7eH rvd
narrower: Drifttekniker elkraft
narrower: Drifttekniker värmeverk
narrower: Drifttekniker reningsverk VA
narrower: Drifttekniker vattenverk VA
broad match: yhCP AqT tns

Medicinsjuksköterska
type: Concept
in scheme: JobTech Taxonomy - Yrke
definition: Medicinsjuksköterska arbetar med omvårdnad vid akuta och kroniska medicinska tillstånd, ofta i slutenvård eller specialiserad öppenvård. Sjuksköterska är en skyddad titel med legitimationskrav. En medicinsjuksköterska med specialistsjuksköterskeexamen får använda specialistsjuksköterska inom medicinsk vård. Vanliga arbetsuppgifter är att bedöma och åtgärda patienters omvårdnadsbehov, samordna och utvärdera vårdinsatser samt driva kvalitets- och förbättringsarbete. Medicinsjuksköterskan kan leda, planera och utveckla omvårdad för patienter med komplexa tillstånd och ansvarar ofta för att handleda kollegor och bidra till en patientsäker vårdmiljö. Källa: Arbetsförmedlingen, Karolinska Institutet, Region Västmanland, Socialstyrelsen
broader: Övriga specialistsjuksköterskor
related: NYW6 mP6 vwf
related: hUBN H76 irY
related: SPtV q9d rTR
related: ytRi QuA XLX
related: 1f7B E5K sh3
broad match: C2221

Skolkonsulent
type: Concept
in scheme: JobTech Taxonomy - Yrke
definition: Skolkonsulent
broader: Speciallärare och specialpedagoger m.fl.
related: 3pyE aAA TFD
related: MVqp eS8 kDZ
related: amTe 9QJ hdC
broad match: C2351

Annonsproducent
type: Concept
in scheme: JobTech Taxonomy - Yrke
definition: Annonsproducent
broader: Informatörer, kommunikatörer och PR-specialister
related: SaDz 8Bv Aya
related: BNNn JK4 CjC
related: CYps 4Hs 2TD
related: QMyR z82 927
related: 8CXR 1SB 7LN
related: X82t awd Qyc
related: TKuV xpd 7Fg
related: rE2J LVC pfX
related: vwxR MbC XjW
related: c7do ohc pFy
related: tEZA dns wRd
broad match: C2432

Länsarkitekt
type: Concept
in scheme: JobTech Taxonomy - Yrke
definition: Länsarkitekt
broader: Chefer inom arkitekt- och ingenjörsverksamhet
related: 6Hq3 tKo V57
related: epLc SkD cbT
related: bh3H Y3h 5eD
broad match: C1213

Verkstadschef/Servicechef fordon
type: Concept
in scheme: JobTech Taxonomy - Yrke
definition: Verkstadschef/Servicechef inom fordon ansvarar för driften av verkstäder för olika typer av fordon. Som chef innebär rollen vanligtvis ansvar för verksamhet, budget och personal. Arbetsuppgifter innefattar att planera och fördela arbetsuppgifter, kvalitetssäkring av reparationer och service samt arbetsmilj- och skyddsfrågor. Rollen innebär ofta tätt samarbete med kundmottagning, försäljning och reservdelsavdelning. Källa: Arbetsförmedlingen
broader: Övriga chefer inom övrig servicenäring
related: bh3H Y3h 5eD
related: RBGx z2m RjE
broad match: C1439

Ritare, maskin
type: Concept
in scheme: JobTech Taxonomy - Yrke
definition: Ritare, maskin
broader: Ingenjörer och tekniker inom maskinteknik
related: 6Hq3 tKo V57
related: 9aEn jPz gJs
related: KWNv oWK 5E2
related: C41S vox 2gE
broad match: C3115

Recensent
type: Concept
in scheme: JobTech Taxonomy - Yrke
definition: Recensent
broader: Journalister m.fl.
related: pYez WWr Ygt
related: ozgW SAB vQk
related: 8too bEs 7NU
related: 9puE nYg crq
broad match: C2642

Informationssäkerhetssamordnare
type: Concept
in scheme: JobTech Taxonomy - Yrke
definition: Informationssäkerhetssamordnare
broader: Planerare och utredare m.fl.
related: X82t awd Qyc
related: 9UQ5 1QB mDS
related: XCWM XQQ hVm
broad match: C2422

Lärling byggnadsplåtslagare
type: Concept
in scheme: JobTech Taxonomy - Yrke
definition: En lärling är anställd på företag för att göra sin färdigutbildningstid till byggnadsplåtslagare. Lärlingsanställningen görs efter skolutbildning eller tillsammans med teoretiskt kurspaket. Under färdigutbildningstiden på företaget lär sig lärlingen yrket mer praktiskt och skall nå sina kunskapsmål för yrkesbevis. Yrkesbevis erhålls efter ett teoretiskt och praktiskt branschprov. Källa: Arbetsförmedlingen
broader: Byggnads- och ventilationsplåtslagare
related: j7Cq ZJe GkT
related: ja7J P8X YC9
related: JezX oUD TZr
broad match: C7213

Eurytmist
type: Concept
in scheme: JobTech Taxonomy - Yrke
definition: Eurytmist
broader: Övriga pedagoger med teoretisk specialistkompetens
related: pVzY rff Amk
related: vR6R XP9 M74
related: MVqp eS8 kDZ
broad match: C2355

Systemtestare och testledare
type: Concept
in scheme: JobTech Taxonomy - Yrke
definition: Planerar, utvecklar, dokumenterar och genomför tester på olika nivåer, från enskilda programvaror till hela system. Verifierar att program och system fungerar enligt användarkrav, fastställda riktlinjer och regelverk.
broader: IT-arkitekter, systemutvecklare och testledare m.fl.
related: eTW8 AY5 tpe
related: DW4R Ejt Y35
related: CtvK s26 dNs
related: e4tA b22 rfY
related: sq2c q5d zXN
related: pWTc PxX xX6
related: tkH5 VYd Y58
related: wynY a5Q F6t
related: JfDs FE6 EKy
related: wbj8 LR2 aZ8
related: BMjs Jmm GJj
related: NnaR bCQ hK1
related: XVip VKv Ac4
related: juME 7Ek CBR
related: igAK 9XZ E2a
related: DHhX uVf y6X
related: Gk4E H9x ssE
related: PNvt F2Y xrr
related: oRCp wLd dWd
related: W4Ud Do3 B6S
related: VQs1 A6F bvi
related: LeES iac 1Qx
related: wE24 qV6 pJV
related: Fyzv 4ku Cse
related: pwNB ces 8hN
related: 7pQ1 pc6 qRD
related: 5GZg Yvo Aty
related: xPii MYq v9r
related: i6kH axQ nH8
related: iUew moc BRk
related: UGqj u6c Tog
related: 19PK uxU Wzy
related: qVjQ w6H dns
related: pz6a ZgP ePX
related: uR9q DNx eWm
related: Bjvt 4Ji iHn
related: N8Tu Tsn 2VD
related: cPEP iGw fPy
related: ZxHj Wvj 39H
related: jTYU TTp 4iW
related: C69V W4p i5E
related: o8wR 57f jv9
related: z3Ln 9aJ DqN
related: zxNe iWG wqf
related: ANZn 5H8 JAu
related: Zd17 7XH myf
related: P6U8 Qpe TeQ
related: zqiz PQv xLD
related: AWnv mhJ 8uc
related: b8Yk S7p Nc7
related: ofcY XXh G4k
related: KAVh Qyx GPu
related: K8eq sEz eXV
related: V9z3 YfY Tob
related: a2Nd qJ3 S8y
related: voRm aoU cKB
related: buX8 38v YpB
related: fdR4 ECC San
related: Xyi3 dCQ 7pa
related: iukJ 2v3 MuY
related: wkT5 VLV Uad
related: 2kEw jWL 6Zz
related: GWWi rwD F8B
related: Lrrv HyL PzJ
related: Vc24 oqo Qgr
related: Qdhn Fcs qyH
related: bdQe ReZ Bs4
related: ifWk o4W Gir
related: FWBQ FA7 mXJ
related: 7d2G KP4 eFb
related: UvgZ AFo 8Ua
related: eGP4 984 S1u
related: C7dn fgD zTU
related: yXg3 YoW xeC
related: oisM 5jo EVb

Plastsvetsare
type: Concept
in scheme: JobTech Taxonomy - Yrke
definition: Plastsvetsare sammanfogar plastmaterial, så som rörsystem, i olika miljöer. Arbetsuppgifterna även att tillverka plastprodukter enligt ritningar och produktionsunderlag, med noggrannhet och fokus på detaljer. Vanligt förekommande är att arbeta med plaströrsystem, där det ritningsläsning och kvalitetskontroll är viktigt. Beroende på arbetsplats kan arbetet omfatta både avancerade svetsmoment och enklare uppgifter som renklippning och hantering av material. Källa: Arbetsförmedlingen
broader: Maskinoperatörer, plastindustri
related: UJux Uje VDu
related: wTEr CBC bqh
broad match: C8142

Radiofysiker
type: Concept
in scheme: JobTech Taxonomy - Yrke
definition: Radiofysiker
broader: Fysiker och astronomer
related: kJeN wmw 9wX
broad match: C2111

Publikchef
type: Concept
in scheme: JobTech Taxonomy - Yrke
definition: Publikchef
broader: Förvaltnings- och planeringschefer
related: bh3H Y3h 5eD
broad match: C1213

Beredare, elkraft
type: Concept
in scheme: JobTech Taxonomy - Yrke
definition: Beredare fungerar som teknisk projektledare och förbereder tekniska underlag inför ny- och ombyggnationer av elnät inom spänningsområdet 0,4–24 kV. Arbetsuppgifterna inkluderar elutredningar, fältmätningar, framtagning av materiallistor, kostnadskalkyler och byggunderlag. Beredare arbetar både på kontor och ute i fält och samarbetar med beställare, leverantörer, myndigheter samt interna projektledare och montörer. Arbetet omfattar projekt inom luftledning, jordkabel, stationsanläggningar och vägbelysning, med fokus på kvalitet och säkerhet enligt gällande regler. Rollen innefattar även planering, kvalitetskontroll, uppföljning och kundkontakt. Källa: EBR, One Nordic
broader: Ingenjörer och tekniker inom elektroteknik
related: 6Hq3 tKo V57
related: u6N5 brU TJi
broad match: C3113

Barnmorska
type: Concept
in scheme: JobTech Taxonomy - Yrke
definition: Barnmorska är specialistutbildad sjuksköterska som arbetar med förlossningsvård eller sex- och samlevnad, preventivmedel och sexuellt överförbara infektioner. Barnmorska är en skyddad titel med legitimationskrav. Vanliga arbetsuppgifter är att genomföra medicinska undersökningar under graviditet, ansvara för vård och stöd vid förlossning, ge smärtlindring och instruera om amning samt hålla föräldrautbildningar och ge rådgivning om sexuell och reproduktiv hälsa. Barnmorskan arbetar även med att skriva ut preventivmedel, utföra gynekologiska kontroller och ge stöd vid abort. Källa: Arbetsförmedlingen, Saco, Socialstyrelsen, Svenska Barnmorskeförbundet
broader: Barnmorskor
related: NYW6 mP6 vwf
related: sqvh gTy 6Sj
related: bSpX kDm BrP
related: PoCG ykJ xzH
related: MB8K ZGE nWu
related: 6Y53 FRt Y8z
related: Cswd dbQ UG9
broad match: C2222

Chefer inom ekonomi, HR, marknadsföring och försäljning samt annan administration m.m.
type: Concept
in scheme: JobTech Taxonomy - Yrke
definition: Chefer inom ekonomi, HR, marknadsföring och försäljning samt annan administration m.m.
broader: Chefsyrken
narrower: Förvaltnings- och planeringschefer
narrower: Ekonomi- och finanschefer
narrower: Försäljnings- och marknadschefer
narrower: Övriga administrations- och servicechefer
narrower: Informations-, kommunikations- och PR-chefer
narrower: Personal- och HR-chefer

Personalansvarig
type: Concept
in scheme: JobTech Taxonomy - Yrke
definition: Personalansvarig
broader: Personal- och HR-specialister
related: wa4j f4A qkS
related: cMt6 bLp A13
related: YWft bBn Jyt
related: F7Vg 36t roE
related: X82t awd Qyc
related: AE8y 69p Fcj
related: n4qG K3A kB5
related: 6So5 T8E CVA
related: hbWF ATt 2yg
related: pyNJ Xcf xzg
related: 6Pri rjM AGq
broad match: C2423

Mjukvaru- och systemutvecklare m.fl.
type: Concept
in scheme: JobTech Taxonomy - Yrke
definition: Analyserar, designar och utvecklar IT-system eller delar av system. Utformar och utvecklar lösningar för programvara, applikationer, system och databaser.
broader: IT-arkitekter, systemutvecklare och testledare m.fl.
related: eTW8 AY5 tpe
related: abgV e4C gwj
related: DW4R Ejt Y35
related: N7xh Dms MuG
related: CtvK s26 dNs
related: e4tA b22 rfY
related: sq2c q5d zXN
related: pWTc PxX xX6
related: tkH5 VYd Y58
related: wynY a5Q F6t
related: JfDs FE6 EKy
related: wbj8 LR2 aZ8
related: X4Xd GYT Yn6
related: NnaR bCQ hK1
related: C2513
related: XVip VKv Ac4
related: juME 7Ek CBR
related: igAK 9XZ E2a
related: ebrf 1Fe ksC
related: DHhX uVf y6X
related: Gk4E H9x ssE
related: A5HJ aMw BQt
related: PNvt F2Y xrr
related: oRCp wLd dWd
related: HKgZ SWa vn8
related: VQs1 A6F bvi
related: LeES iac 1Qx
related: wE24 qV6 pJV
related: Fyzv 4ku Cse
related: pwNB ces 8hN
related: vzMh qW9 hHg
related: 1QYQ Xka TQ5
related: 7pQ1 pc6 qRD
related: TUg4 3hv 1iJ
related: xPii MYq v9r
related: QP1q fXF b6H
related: 67V1 6cE VAt
related: iUew moc BRk
related: UGqj u6c Tog
related: 19PK uxU Wzy
related: qVjQ w6H dns
related: pz6a ZgP ePX
related: 4f1v w91 qVM
related: uR9q DNx eWm
related: Bjvt 4Ji iHn
related: kjAi 8yN pgg
related: U5pM 1wB 8nc
related: N8Tu Tsn 2VD
related: cPEP iGw fPy
related: ZxHj Wvj 39H
related: jTYU TTp 4iW
related: Bw3F U6s ZeC
related: C69V W4p i5E
related: wTxT qvv sDA
related: o8wR 57f jv9
related: z3Ln 9aJ DqN
related: zxNe iWG wqf
related: ANZn 5H8 JAu
related: Zd17 7XH myf
related: P6U8 Qpe TeQ
related: zqiz PQv xLD
related: 49fH K3e Fbm
related: AfJ4 Pvv YBa
related: b8Yk S7p Nc7
related: ofcY XXh G4k
related: KAVh Qyx GPu
related: bT7R xGv GnZ
related: zepK dRd cwN
related: K8eq sEz eXV
related: V9z3 YfY Tob
related: voRm aoU cKB
related: buX8 38v YpB
related: fdR4 ECC San
related: Xyi3 dCQ 7pa
related: iukJ 2v3 MuY

Veterinärer
type: Concept
in scheme: JobTech Taxonomy - Yrke
definition: Veterinärer
broader: Yrken med krav på fördjupad högskolekompetens inom hälso- och sjukvård
narrower: Veterinärer

Lagerarbetare/Terminalarbetare
type: Concept
in scheme: JobTech Taxonomy - Yrke
definition: Lagerarbetare och terminalarbetare tar emot, hanterar och skicka vidare varor och gods. Varor och gods kan vara allt från livsmedel till reservdelar. Vanliga arbetsuppgifter inkluderar mottagning av leveranser, kontroll av produkt och antal, placering av varor på rätt plats i lagret med hjälp av datoriserade system och truckar, plockning och packning samt utleverans. Lagerarbetare använder ofta hjälpmedel som truck, travers (kran), automatiserade transportsystem och ibland Pick-by-Voice-system för effektiv orderhantering. Beroende på arbetsplats kan arbetsuppgifterna variera. Mer administrativa arbetsuppgifter kan ingå, som inventering, reklamationshantering och beställning av kontorsmaterial eller lagerutrustning. På större arbetsplatser kan det vara vanligt att rotera mellan olika stationer och avdelningar. Källa: Arbetsförmedlingen
broader: Lager- och terminalpersonal
related: sSu6 qMg nYu
related: 9sGx XAf SBR
related: 9xvN qnW dMb
related: zW1f X6S 3RY
related: YDRp KiD xrv
related: QnSq 4ZM 4UH
related: J5gJ 6vV egQ
related: gMh9 Ku9 s7r
related: xQTP wUs pFL
related: tir7 BLM P6G
related: Jig1 qt3 me7
related: e5Dn C5S eUn
related: Mf6n usq kJH
related: 4tus dfE pp1
related: VsWQ HKQ qBe
related: AVTW 18P E4U
related: jJkG iR9 T7V
related: onD9 uiB XBi
related: v6Sw niJ 55D
related: GX2j fTS BRs
related: yjtb VHE CE9
related: ASGV zcE bWf
related: dUfT Bmi JcF
related: LEL2 d8z YXV
related: mzVp Nxt Xqc
related: NXjG hxD y3o
related: 2E8D v9y iN6
related: McPo uhA g4U
related: FxzD RWY mUE
related: oZfb NWk h5y
related: HDvi GUn MrD
related: WKQb 15L VED
related: EXGv j3P Aqf
related: 1Yq2 Hje B66
related: UWmA 6Tb NRb
related: pfR3 gSH goC
related: ZbJX g3g uck
related: N64p Ezq QeS
related: RtD5 TfK VTM
broad match: C4321

OB-tekniker
type: Concept
in scheme: JobTech Taxonomy - Yrke
definition: OB-tekniker
broader: Bild- och sändningstekniker
related: 9puE nYg crq
related: d1Ao 9bY 7Kn
broad match: C3521

Dockspelare
type: Concept
in scheme: JobTech Taxonomy - Yrke
definition: Dockspelare ger röst åt och styr dockor eller marionetter för att gestalta karaktärer och berättelser, ofta inom barnteater men även för vuxenpublik. Vanliga arbetsuppgifter är att tillsammans med regi och andra inom teaterproduktion öva och framföra föreställningar genom dockspel, vilket kan inkludera turnéer och liveframträdanden. Dockspelare samarbetar ofta i team och arbetar med manus, röst- och rörelseövningar för att förmedla berättelsen till publiken. Källa: Arbetsförmedlingen, Platsannonser
broader: Skådespelare
related: 8too bEs 7NU
related: 9puE nYg crq
broad match: C2655

Organist
type: Concept
in scheme: JobTech Taxonomy - Yrke
definition: Organist
broader: Musiker, sångare och kompositörer
related: 9puE nYg crq
related: G84v bYJ Ftk
related: j5h6 KSc 9nR
broad match: C2652

Anläggningsdykare
type: Concept
in scheme: JobTech Taxonomy - Yrke
definition: Arbetar under vatten med anläggningsbyggnader och reparationer av t.ex. broar, hamnar, farleder och kraftverk. Borrar, spränger, bygger formar, armerar, gjuter och utför andra anläggningsarbeten under vatten. Söker och bärgar vrakgods m.m. Inspekterar och gör mindre reparationer på fartyg. Hit hör inte Dykinstruktör (3422) Räddningsdykare (5411)
broader: Snickare, murare och anläggningsarbetare
related: 8Mzn T5U m6J
related: nyUV W89 oSP
related: tQr7 pSR XWn
related: aHCV VsV LiD
related: myMG ygC kDW
related: mka8 bQG mxA
related: Fux3 rLq 2MA
related: bu7L 4AA DCX
related: 4yKc o5T BGG
related: Vpaw yX7 BNY
related: Q7eC B7g QiU
related: K4o3 eay CqA
related: R9ib tBo Agr
related: M7C1 DAy UTK
related: D6xD cSH rZN
related: fhcp fFw Lbj
related: C7541
related: xdzW UEg gHd
related: nkhA jPz pcE
related: ynWd oCo o61
related: MGkz 1cD zcb
related: 1pk9 mGK oVq
related: Q1D1 Pdc rnT
related: xeoH rao GgZ
related: TmdZ qNQ yDs
related: KpEJ LoK 915
related: BU7P 3px aA5
related: fhu6 H74 uuN
related: pLiT eTw RVH
related: TVDZ JRf Knw
related: WLAi BDr 5fW
related: NrUV 97h WRN
related: KfEn V5y npV
related: 2eK6 Jf6 tQX
related: vskJ ZVJ swC
related: AEgv 4gP ndv
related: HmXd ehy QT9
related: GnKk qZt CJv
related: gbzb PCz q9Y
related: YeF8 fQF Wds
related: ksDx Xcu AHL
narrower: Anläggningsdykare
narrower: Yrkesdykare
narrower: Lärling, anläggningsdykare
narrower: Inspektionsdykare
broad match: j7Cq ZJe GkT

Övrig servicepersonal
type: Concept
in scheme: JobTech Taxonomy - Yrke
definition: Utför andra servicetjänster. Hit hör inte Hemservicepersonal (9119)
broader: Övrig servicepersonal
related: knpH jqV M24
related: rbkq yud 7iJ
related: ZvbR g69 jGv
related: C5162
related: C5169
narrower: Mystery shopper
broad match: GazW 2TU kJw

Gruppchef, teknik
type: Concept
in scheme: JobTech Taxonomy - Yrke
definition: Gruppchef, teknik
broader: Produktionschefer inom tillverkning
related: 6Hq3 tKo V57
related: epLc SkD cbT
related: bh3H Y3h 5eD
related: jnCw jdv jYw
broad match: C1321

Museiintendent
type: Concept
in scheme: JobTech Taxonomy - Yrke
definition: Museiintendent
broader: Museiintendenter m.fl.
related: X82t awd Qyc
related: JxVv btB MTz
related: 9puE nYg crq
broad match: C2621

Universitetsrektor
type: Concept
in scheme: JobTech Taxonomy - Yrke
definition: Universitetsrektor
broader: Verkställande direktörer m.fl.
related: epLc SkD cbT
related: bh3H Y3h 5eD
related: MVqp eS8 kDZ
broad match: C1120

Säkerhetssamordnare
type: Concept
in scheme: JobTech Taxonomy - Yrke
definition: Säkerhetssamordnare arbetar strategiskt med systematiskt säkerhetsarbete inom olika organisationer. Arbetet innebär bland annat samordning av krisberedskap, civilt försvar och säkerhetsskydd. Säkerhetsskydd kan omfatta fysisk säkerhet som fastigheter och anläggningar såväl som personalsäkerhet för enskilda medarbetare. Rollen innebär till exempel att stödja verksamheter i risk- och sårbarhetsanalyser, kontinuitetsplanering samt framtagande, implementering och uppföljning av styrdokument och rutiner. Säkerhetssamordnarens ansvar kan även inkludera att planera och genomföra utbildningar och övningar inom säkerhetsområdet. Rollen varierar beroende på arbetsgivare, till exempel i mindre kommuner kan även informationssäkerhet ingå i ansvaret. Säkerhetssamordnaren rapporterar vanligtvis till en säkerhetschef inom sin organisation. Källa: Arbetsförmedlingen
broader: Säkerhetsinspektörer m.fl.
related: c1zd pUk RrH
related: E7hm BLq fqZ
related: r51y eyE FK8
related: XoZ9 PSN XQy
related: SYyp vnK 6WG
related: qSuA rGy kv9
related: xxiP 2Nq zYv
related: boF7 KG2 HJS
broad match: C3257

Kanslichef
type: Concept
in scheme: JobTech Taxonomy - Yrke
definition: En kanslichef är en chefsposition inom en organisation, ofta inom offentlig förvaltning eller ideella föreningar, som ansvarar för den administrativa och operativa verksamheten vid ett kansli. Kanslichefen leder och samordnar kansliets arbete, vilket inkluderar personalansvar, budgethantering, strategisk planering och att säkerställa att verksamheten följer givna riktlinjer. Kanslichefen informerar medlemmar eller berörda parter om kansliets verksamhet och beslut. Källa: Arbetsförmedlingen, Folkuniversitetet
broader: Förvaltnings- och planeringschefer
related: 1pnq bzi iJc
related: X82t awd Qyc
related: epLc SkD cbT
related: bh3H Y3h 5eD
related: TBDd s1p 9UB
broad match: C1213

Affärs- och företagsjurister
type: Concept
in scheme: JobTech Taxonomy - Yrke
definition: Tolkar lagar samt formulerar och granskar avtal och andra juridiska handlingar. Ser till att avtal och kontrakt är juridiskt bindande och följer de lagar och bestämmelser som finns på området. Företräder klienter i juridiska frågor och vid förhandlingar. Förbereder processer och företräder klient inför domstol. Utformar försäkringsvillkor.
broader: Jurister
related: xSLo P6B 2AF
related: DJgq zBj bKt
related: nZMQ bGf Xou
related: RZLF S7J 25Q
related: mXDp 6r9 zUj
related: 7JTy BCE 1dx
related: aUr6 Rjg ja2
related: C2619
related: 3HjW 1BP k3S
related: hqDp WRd i9s
related: YaHy ShR uo4
related: 1U6i pFi GcN
related: w9kF 5oy ySz
related: 3vYj Rhf Voh
related: DkcA 2io BNv
related: Uv9y v2g efa
related: Tmps QPE g3V
related: aMrn LR6 Eat
related: UapV Lk5 DZr
related: AqoH owh Lac
related: KZb6 UBs gP9
related: BrdZ oPC Kft
related: SmZd Jaa BeY
related: t4Ek voQ zD3
related: QAaJ QeY Q6P
related: NUC3 y1C Scg
related: TFCj pyW JR2
related: cw2M p2W SuJ
related: SNxY WDL G6i
related: nF6J MNc ZxS
related: STa2 hti QFw
related: iqT9 zoW Pj5
related: EU8B Vir DXH
related: pLfm Uff BsM
related: Jjgt 4oU 3Ba
related: dYqT JBz NZE
related: 5wab aFK gdL
related: yPmK 7b8 L3H
related: AW8R baL eV1
related: fiLT BSW HCb
related: PVnT yGT SMb
related: qtHa AsU Cfo
related: Nig2 2pU GT8
related: rXST u2H Ujo
related: qWPT Ygb CKr
related: 312J k9G TJK
related: 4RbW Kwb whi
related: LmAP e75 pc6
related: crJp F6t Ho7
related: q7Mx gjU F9q
related: 7scD 9YP iwV
related: NYbU buD WVZ
related: jcpA Zfs nSz
related: Juia j2p bAj
related: R5ce 7aY mEs
related: RB7E jE5 MZ3
related: 4fRg DA4 Dj3
related: DNuY aoK i1h
related: Jd1D jKD qaD
related: 2ZFC 6de YSB
related: Tu3a CQh nGG
related: ZSXe KXh TzJ
related: B1rc wCc vne
related: JB36 JaY mB2
related: w8bU wHe omF
related: 73gL 4uv p9J
related: qD53 dVu cnU
related: iLDD cky Lir
related: 8u7A ze1 bvd
related: 6Ei3 fZV YKM
narrower: Bolagsjurist
narrower: Skattejurist
narrower: Immaterialrättsjurist
narrower: Företagsjurist
narrower: Upphovsrättsjurist

Standardiseringsingenjör
type: Concept
in scheme: JobTech Taxonomy - Yrke
definition: Standardiseringsingenjör
broader: Övriga civilingenjörsyrken
related: 6Hq3 tKo V57
related: mTKn VR5 58X
related: 73U6 FNQ jGM
broad match: C2149

Golvbeläggningsarbetare, industrigolv
type: Concept
in scheme: JobTech Taxonomy - Yrke
definition: Golvbeläggningsarbetare installerar fogfria industrigolv för butiker, lager, fabriker och andra lokaler som behöver golv som klara stora påfrestningar, allt ifrån tunga maskiner, mekanisk påverkan till olje-, fett- och kemikalieangrepp. Golvbeläggning kan även läggas utomhus på parkeringsdäck, balkonger och loftgångar. Källa: Arbetsförmedlingen
broader: Övriga byggnads- och anläggningsarbetare
related: j7Cq ZJe GkT
related: ja7J P8X YC9
related: 1ZHk jFd WjZ
broad match: C7119

Finmekaniker
type: Concept
in scheme: JobTech Taxonomy - Yrke
definition: Finmekaniker tillverkar och reparerar små produkter med stor noggrannhet och problemlösningsförmåga. Som finmekaniker tillverkar och lagar du alltifrån medicinska instrument och hjälpmedel till kameradetaljer, mekaniska, elektroniska apparater och vapen. Gemensamma faktorn är att de ska tåla stor påfrestning. Man arbetar med de flesta maskiner och verktyg som finns på en mekanisk verkstad, inklusive CNC-maskiner. CAM-programmering är bra att kunna. Det kan också ingå i arbetet att ställa in och använda mätinstrument och göra elektriska installationer. Källa: Arbetsförmedlingen - Hitta yrken
broader: Finmekaniker
related: pq8y uwm gLk
related: 4WpY 52Y MBE
related: PaxQ o1G wWH
related: vbBE KER NgR
related: AANS doX sij
related: wTEr CBC bqh
broad match: C7311

Värmeverkschef
type: Concept
in scheme: JobTech Taxonomy - Yrke
definition: Värmeverkschef
broader: Produktionschefer inom tillverkning
related: vKFD 8JY t5o
related: epLc SkD cbT
related: bh3H Y3h 5eD
related: LTQK pSV 5ZQ
related: dUao inf aea
broad match: C1321

Cityledare
type: Concept
in scheme: JobTech Taxonomy - Yrke
definition: Cityledare
broader: Försäljnings- och marknadschefer
related: RPTn bxG ExZ
related: epLc SkD cbT
related: bh3H Y3h 5eD
broad match: C1221

Skolchef/Skoldirektör/Skolledare
type: Concept
in scheme: JobTech Taxonomy - Yrke
definition: Skolchef/Skoldirektör/Skolledare
alternative label: Skolchef
alternative label: Skoldirektör
alternative label: Skolledare
broader: Chefer inom grund- och gymnasieskola samt vuxenutbildning
related: J6tw wdY uTF
related: Ny6c 9Q2 1Kb
related: 2GTN zqM EUR
related: NL7E frK wXV
related: RHJV ekf HxD
related: epLc SkD cbT
related: 6USb Do3 9gV
related: sW8U VkJ jzX
related: bh3H Y3h 5eD
related: MVqp eS8 kDZ
related: 94xF ff6 yZh
related: tmew n81 Tvf
broad match: C1345

Etolog
type: Concept
in scheme: JobTech Taxonomy - Yrke
definition: Etolog
broader: Växt- och djurbiologer
related: kJeN wmw 9wX
broad match: C2131

Ingenjörer och tekniker
type: Concept
in scheme: JobTech Taxonomy - Yrke
definition: Ingenjörer och tekniker
broader: Yrken med krav på högskolekompetens eller motsvarande inom teknik
narrower: Övriga ingenjörer och tekniker
narrower: Ingenjörer och tekniker inom kemi och kemiteknik
narrower: Ingenjörer och tekniker inom gruvteknik och metallurgi
narrower: Ingenjörer och tekniker inom bygg och anläggning
narrower: Ingenjörer och tekniker inom maskinteknik
narrower: Ingenjörer och tekniker inom elektroteknik
narrower: Ingenjörer och tekniker inom industri, logistik och produktionsplanering
narrower: GIS- och kartingenjörer

Ärftlighetsforskare
type: Concept
in scheme: JobTech Taxonomy - Yrke
definition: Ärftlighetsforskare
broader: Växt- och djurbiologer
related: kJeN wmw 9wX
broad match: C2131

Demenssjuksköterska
type: Concept
in scheme: JobTech Taxonomy - Yrke
definition: Demenssjuksköterska leder, utvecklar och säkerställer omvårdnad för personer med demenssjukdom inom vård och omsorg. Sjuksköterska är en skyddad titel med legitimationskrav. En demenssjuksköterska med specialistsjuksköterskeexamen får använda benämningen specialistsjuksköterska inom demensvård. Vanliga arbetsuppgifter är att ansvara för omvårdnadsprocessen, identifiera och tolka symtom på demens, initiera och delta i utredningar, samt handleda och utbilda vårdpersonal och anhöriga. Demenssjuksköterskan fungerar ofta som sakkunnig och konsult inom demensfrågor och samverkar med olika aktörer inom vård och omsorg. Källa: Arbetsförmedlingen, Hedemora kommun, Socialstyrelsen, Stiftelsen Äldrecentrum, Svenskt Demenscentrum, Svensk sjuksköterskeförening
broader: Geriatriksjuksköterskor
related: NYW6 mP6 vwf
related: ytRi QuA XLX
related: 3F7S Ppt t1M
related: Emzd dn4 fFT
related: 1f7B E5K sh3
broad match: C2221

Medåkare renhållningsbil
type: Concept
in scheme: JobTech Taxonomy - Yrke
definition: Medåkare renhållningsbil arbetar tillsammans med renhållningsförare med insamling av material för återvinning. Som medåkare i renhållningbil arbetar man tillsammans med renhållningsförare. Det är renhållningsföraren som kör renhållningsbilen och medåkaren hjälper till med insamling för vidare transport till återvinningsanläggning. Som medåkare har man bland annat kunskaper om insamling, hantering och sortering av olika sorters avfalll. Källa: Sobona
broader: Renhållnings- och återvinningsarbetare
related: whao Q6A ScE
related: F4tz HcT in8
broad match: C9611

Leveransbevakare
type: Concept
in scheme: JobTech Taxonomy - Yrke
definition: Leveransbevakare övervakar och följer upp leveranser för att säkerställa att varor och gods anländer enligt avtalade tider och specifikationer. Arbetsuppgifterna omfattar kontinuerlig kontakt med leverantörer och transportföretag, hantering av leveransavvikelser, registrering av leveransstatus i affärssystem och uppdatering av interna mottagare om eventuella förseningar eller problem. Leveransbevakare kontrollerar dokumentation som följesedlar och fraktsedlar, koordinerar logistikflöden och kan delta i förbättringsarbete av processer för ökad leveranssäkerhet. Källa: Arbetsförmedlingen, div jobbannonser
broader: Lager- och terminalpersonal
related: J5gJ 6vV egQ
related: X82t awd Qyc
related: ASGV zcE bWf
related: oZfb NWk h5y
broad match: C4322

Bohags- och flyttbilsförare
type: Concept
in scheme: JobTech Taxonomy - Yrke
definition: Bohags- och flyttbilsförare transporterar bohag och inredning. Arbetsuppgifter för bohags- och flyttbilsförare kan inkludera att köra lastbil med släp, stuva gods på ett säkert sätt och ibland leda ett arbetslag vid större flyttar. Föraren rör sig ofta i kundernas hemmiljöer och måste därför vara bra på att kommunicera och samarbeta med olika människor. Vid specialiserade uppdrag, som datorflyttningar, ingår även installation av teknisk utrustning som datorer och kopiatorer. Internationella flyttar kan även förekomma. Källa: Transportfackens yrkes- och arbetsmiljönämnd
broader: Lastbilsförare m.fl.
related: zGjD M5a HCX
related: d68E e74 a59
related: h5Vv MFR Pzt
related: hhb7 1hV t7R
related: ASGV zcE bWf
related: QR1f W7z oF9
related: 483u hVx psa
related: 9wnn PAV q12
related: Bc91 Tyo 3ce
related: 59tX 8yv jgn
related: 4VuT d9Y w3f
broad match: C8332

Ljudtekniker
type: Concept
in scheme: JobTech Taxonomy - Yrke
definition: En ljudtekniker hanterar och kontrollerar ljudutrustning för att säkerställa hög ljudkvalitet under inspelningar, liveframträdanden och andra produktioner. Ljudteknikerns arbete innefattar oftast drift av utrustning som ljudbord, mikrofoner, förstärkare och monitorer, och rollen är ofta mer praktiskt inriktad på själva genomförandet av ljudarbetet snarare än skapande. Yrkesrollen återfinns inom liveevenemang, teater, tv- och radioproduktioner samt musikindustrin. Deras arbete är avgörande för att ljudet under en konsert, föreställning eller inspelning når publiken klart och utan tekniska problem. Källa: Stagepool
broader: Ljus-, ljud- och scentekniker
related: KD35 r15 tct
related: 3VqX sX9 eYF
related: u7zK VKN 8Ht
related: 8too bEs 7NU
related: 9puE nYg crq
related: f6vb 3qj Wb7
related: yhCP AqT tns
related: d1Ao 9bY 7Kn
related: Dt3o 8gC NAB
related: 4rnU zFm cRT
related: 9HBE 8ka 9kD
broad match: C3521

Skyddsvakt
type: Concept
in scheme: JobTech Taxonomy - Yrke
definition: Skyddsvakter bevakar skyddsobjekt som flygplatser, kärnkraftverk och militär anläggningar. Arbetet innebär i huvudsak att bevaka och skydda skyddsobjekt mot sabotage, spioneri, terroristbrott och grovt rån. Skyddsvakter skyddsvakt har särskilda befogenheter jämfört med grundutbildade väktare, innefattande att undersöka fordon, utföra kroppsvisitationer, ta föremål i beslag och avvisa samt omhänderta personer som befinner sig vid ett skyddsobjekt. Skyddsvakter får också använda våld för att oskadliggöra obemannade farkoster (drönare). Skyddsvakter får utrustas med skjutvapen och OC-spray (pepparspray). Källa: Bevakningsbranschens Yrkes- och Arbetsmiljönämnd
broader: Väktare och ordningsvakter
related: dVbW QJc xZi
related: E7hm BLq fqZ
broad match: C5414

Bilglasmontör
type: Concept
in scheme: JobTech Taxonomy - Yrke
definition: Bilglasmontör
broader: Glastekniker
related: PaxQ o1G wWH
related: nTHT bze 3Wg
related: N3ME jbM foh
related: vTeQ dCQ dGs
broad match: C7125

Industridesigner
type: Concept
in scheme: JobTech Taxonomy - Yrke
definition: Utreder, analyserar, designar och utvecklar produkter för tillverkning. Fastställer mål och restriktioner för designuppdraget i samråd med kunder och intressenter. Samordnar tekniska, ekonomiska och estetiska förutsättningar. Förbereder design och specifikationer för tillverkning.
broader: Designer och formgivare
related: 1CnL 8ZQ tTd
related: s8Ui Ew6 74j
related: oQre F86 kHG
related: oxYi vfW UWx
related: dTK5 R7G p56
related: 2dAT mTz Meb
related: vH2w kqg Usb
related: rQyf 4UR djn
related: x7wh 363 PGk
related: XCdg UJK w2q
related: 8Av5 i4R 2do
related: C2163
related: x35Q k3W xxR
related: ZgMd qRp Uz4
related: jnLy 6Ns KpH
related: haMy QRx 7vg
related: jHPZ f6N Kjg
related: YxWC 7gN MNP
related: XN9D c7f vF1
narrower: Formgivare
narrower: Industridesigner
broad match: 9puE nYg crq

Fastighetsingenjör
type: Concept
in scheme: JobTech Taxonomy - Yrke
definition: Fastighetsingenjör
broader: Ingenjörer och tekniker inom bygg och anläggning
related: jczs quS jSd
related: Bttp J6E wbR
related: j7Cq ZJe GkT
related: fRp2 KgS v3B
related: SGKN BFt a15
related: VvjW EQk z4V
related: ZjCw 9JF b8s
broad match: C3112

Civilingenjör, teknisk fysik
type: Concept
in scheme: JobTech Taxonomy - Yrke
definition: Civilingenjör, teknisk fysik
broader: Övriga civilingenjörsyrken
related: 6Hq3 tKo V57
broad match: C2149

Klimatanpassningssamordnare
type: Concept
in scheme: JobTech Taxonomy - Yrke
definition: Klimatanpassningssamordnare
broader: Planerare och utredare m.fl.
related: L4Yc ZZe R91
related: X82t awd Qyc
related: TZe9 NsN uce
broad match: C2422

Barnskötare och elevassistenter m.fl.
type: Concept
in scheme: JobTech Taxonomy - Yrke
definition: Barnskötare och elevassistenter m.fl.
broader: Omsorgsyrken
narrower: Barnskötare
narrower: Elevassistenter m.fl.

Handpaketerare och andra fabriksarbetare
type: Concept
in scheme: JobTech Taxonomy - Yrke
definition: Fyller och tillsluter förpackningar för hand. Etiketterar, packar, emballerar och väger gods manuellt samt sorterar produkter. Hanterar och rengör material och produkter i samband med tillverkning.
broader: Handpaketerare och andra fabriksarbetare
related: MSnA zCK KGB
related: ZVqJ ZME bn4
related: yCFS 2MA ab5
related: C9321
related: pGts PKK c8W
related: C9329
related: 4hcs Goq H55
related: YLhy 8ru gZw
related: 6Wa3 c6D NSR
related: mRyD DRC 5tT
related: hjRh WgY oJo
related: ndTs hs5 z5f
related: XQet 5J6 HGj
related: rwir xvu 443
related: yG4w NKx VMf
narrower: Packare
broad match: wTEr CBC bqh

Lösullsinstallatör
type: Concept
in scheme: JobTech Taxonomy - Yrke
definition: Lösullsinstallatör installerar lösull i golv, väggar och tak vid nyproduktion och tilläggsisolering av hus. Lösull tillverkas av sten, återvunnet glas eller papper. Lösullen sprutas t ex på ett vindsbjälklag och ullen når in i vrår och vinklar som skulle vara svåra att komma åt. Det blir en skarvfri isolering. Källa: Arbetsförmedlingen
broader: Isoleringsmontörer
related: tKLN S32 RP3
related: j7Cq ZJe GkT
related: 3dBV Tig YAp
related: ja7J P8X YC9
related: bw6Z b6G 2Y4
broad match: C7124

Designassistent
type: Concept
in scheme: JobTech Taxonomy - Yrke
definition: Designassistent
broader: Övriga designer och formgivare
related: 9puE nYg crq
broad match: C2163

Art Director/AD
type: Concept
in scheme: JobTech Taxonomy - Yrke
definition: Art Director leder och utvecklar det visuella uttrycket för produkter, varumärken eller kampanjer inom reklam, media och kommunikation. Vanliga arbetsuppgifter är att ta fram och presentera visuella koncept, leda formgivare, fotografer och illustratörer och säkerställa att det visuella uttrycket motsvarar krav. Det ingår också projektledning, budgetansvar och kvalitetskontroll av visuella element. Källa: Arbetsförmedlingen, Berghs School of Communication, Sveriges Kommunikatörer
alternative label: AD
alternative label: Art Director
broader: Grafiska formgivare m.fl.
related: t4bN 3Qo i8b
related: 8too bEs 7NU
related: 9puE nYg crq
related: WjCH PZv eAC
related: 59YE ctD 47c
broad match: C2166

Aktiemäklare
type: Concept
in scheme: JobTech Taxonomy - Yrke
definition: Aktiemäklare förmedlar köp och försäljning av aktier och andra värdepapper på uppdrag av privatpersoner, företag och institutioner. Arbetsuppgifterna omfattar kundkontakt, orderläggning, marknadsbevakning och rådgivning om placeringar baserat på aktuella marknadsförhållanden. Aktiemäklare utför analyser av företag och värdepappersmarknaden och presenterar investeringsmöjligheter för kunder. Yrket omfattar ofta kontinuerlig uppföljning av affärer och daglig kontakt med andra aktörer på finansmarknaden. Aktiemäklare arbetar vanligen via banker, värdepappersbolag eller fondkommissionärer och använder digitala handelsplattformar. Källa: Källor: Arbetsförmedlingen, Saco, div jobbannonser
broader: Mäklare inom finans
related: Hak9 woY D3b
related: FmgE vrh 6Xg
related: RbsF qLv jeg
related: 69oE fDJ 5ck
related: qqp3 ect Pp9
related: RPTn bxG ExZ
related: X82t awd Qyc
related: tDjU 5th huY
related: M1Z1 Fjr ZYm
related: tG2B zVc E1D
broad match: C3311

Arbetsmiljöinspektör
type: Concept
in scheme: JobTech Taxonomy - Yrke
definition: Arbetsmiljöinspektör
broader: Arbetsmiljöingenjörer, yrkes- och miljöhygieniker
related: mWrk 4gH YiV
related: 6nhf Wwu bUe
related: E7hm BLq fqZ
related: HeUg pQD wN8
related: hmjo 7Ye 49v
related: WpxN xqC G7B
broad match: C2263

Biträdande förskolerektor
type: Concept
in scheme: JobTech Taxonomy - Yrke
definition: Biträdande förskolerektor
broader: Chefer inom förskoleverksamhet
related: epLc SkD cbT
related: bh3H Y3h 5eD
related: MVqp eS8 kDZ
related: 6Gtp egA W6P
broad match: C1341

Kontaktledningstekniker
type: Concept
in scheme: JobTech Taxonomy - Yrke
definition: En Kontaktledningstekniker utför elinstallationer på järnvägs-, spårvägs- och tunnelbane-anläggningar, både när det gäller underhåll av befintliga och byggnation av nya anläggningar. En Kontaktledningstekniker arbetar med växelvärme, belysning, kraftmätning till signalanläggningarna samt kontaktledning och hjälpkraft längs med spåren. När man arbetar på kontaktledningsanläggningar sker jobbet via arbetsplattformar på spårgående arbetsfordon. Arbetet genomförs utifrån när trafiken på spåren kan stängas av vilket ofta innebär nattarbete. Källa: Infranord, Trafikverket
broader: Distributionselektriker
related: RqDA 3Pq Bz3
related: 2CeN uwX AXR
related: yhCP AqT tns
related: Z6DE nBW nwm
broad match: C7413

Serviceingenjör, kemiteknik
type: Concept
in scheme: JobTech Taxonomy - Yrke
definition: Serviceingenjör, kemiteknik
broader: Ingenjörer och tekniker inom kemi och kemiteknik
related: 6Hq3 tKo V57
related: 5tyY GjC AcD
broad match: C3116

Arkivarie
type: Concept
in scheme: JobTech Taxonomy - Yrke
definition: Arkivarie
broader: Bibliotekarier och arkivarier
related: MVNa 7Sm i5B
related: 1TdJ vsM Pcc
related: zwsW GHM Qr9
related: DRy7 Ajp eS6
related: Qgui NrT 5Nd
related: C6jF U6x x32
related: MJfD vf8 rGc
related: 6LU5 Dow KvQ
related: gMPX D7n SRa
related: Y2LQ 7t2 FzY
related: tVFs N5R hgY
related: X82t awd Qyc
related: 3LQp gzp tiR
related: nUYb fZQ mTL
related: c43k jiQ ovT
related: XaM7 85a xiR
related: 7Vne Ptb Jqi
related: hrBq gJd 7gJ
related: gRTJ JGz Hkz
related: cxRS jcQ 8cj
related: wZUC R83 V8j
related: 9puE nYg crq
related: 79AR jHf 451
related: 7PGC e1E 533
related: yGiq fC4 4UK
related: H6Wf YHY 36y
related: LQGZ tpb hNN
related: K1NY aXm Gdj
related: sU2Q 2c8 zk9
related: Dagj yiq Zde
related: KnYe op9 fbh
related: pbvx 8dP xyr
related: Kwkk bUo cGg
related: QsZe kCH mii
related: WWNS xai v4V
broad match: C2621

Processövervakare, metallproduktion
type: Concept
in scheme: JobTech Taxonomy - Yrke
definition: Styr och övervakar processtyrda ugnar m.m. för smältning, omvandling och raffinering av malm och metall. Hit hör inte Processoperatör, värmebehandling (8129)
broader: Drifttekniker och processövervakare
related: VPF1 UZM 9Kd
related: iuqD 2gc yd9
related: ws2R MBQ svX
related: EdSD Q31 Tsf
related: pGts PKK c8W
related: aF3J SgE uck
related: Uynk tQh JiH
related: Q7eC B7g QiU
related: xFBT 6W3 ciB
related: YSMf UrF L4E
related: rjqd j8s N8y
related: MMfW 4Tt uDu
related: fhcp fFw Lbj
related: oQD7 SMq 4bz
related: pYmd ofz PuE
related: HNWi rbd nPS
related: 2bVU N49 sM7
related: MT1a Nyq DGQ
related: qn22 kbi Mwa
related: hTdh Avm d1Q
related: dWbY gXC Frx
related: C3135
related: ZTk2 7eo CUb
related: LhvF NZc r6N
related: yMkW AVq UC7
narrower: Ugnsoperatör
narrower: Processövervakare metallproduktion
narrower: Processoperatör smältverk
broad match: yhCP AqT tns

Idrottstränare och instruktörer m.fl.
type: Concept
in scheme: JobTech Taxonomy - Yrke
definition: Tränar och instruerar professionella idrottsutövare, amatörer och motionärer. Arrangerar, leder eller övervakar tävlingar och olika idrottsevenemang. Sätter poäng, kontrollerar utrustning och tävlingsplatser m.m.
broader: Idrottsutövare och fritidsledare m.fl.
related: pni3 zFs Gzi
related: zE9j gh9 5gr
related: 8Mzn T5U m6J
related: sUeE CXb hzj
related: CtNc qTL QHg
related: Megd gvf MZK
related: zFop CGz JuL
related: kb9z LG1 CZE
related: Ljct 12E LiJ
related: xqBY b9F wuB
related: hsnu VgP fcj
related: ucwX rMS 9dx
related: qzW3 tEL asu
related: MwzZ mNj omr
related: 5yJW q3p CKr
related: 2W3o Uap yZo
related: xhjf d2X a4a
related: g4v9 sLJ NfW
related: 1gdf dsH cFZ
related: mka8 bQG mxA
related: r6hH BYe nSx
related: x5rt 5HF xVn
related: iknU zh1 EzK
related: 5Vtf RUW FJ3
related: bu7L 4AA DCX
related: PKu8 rPy C7A
related: 4yKc o5T BGG
related: yVj6 5Ey Gku
related: gvCi BfR U6V
related: py2D khv urN
related: 74kK amu wvd
related: 7SxL ca3 SZX
related: FP3w 6C4 kHx
related: QRma 3oj UkE
related: cff9 N6N c4o
related: 7htG eVe ExU
related: yGzy 4Fh sK5
related: YBts fiN q18
related: 1x3L UNL auH
related: cNtb hfE b1p
related: BLfJ rMg Suy
related: ujrb y6V Jso
related: LznR wFc MLQ
related: tDcq CyG KbH
related: YrPb Rbj bQT
related: GwMR Rzy yiu
related: ahfZ AE3 Jhh
related: Qecp WbB vyj
related: TaLU anp 4YC
related: 9CCR Hpz qE2
related: t9vF pPR zfz
related: iuhv 8AD XQ7
related: 8j4P S8v 9jy
related: EZ5z KMQ yNE
related: hpkC wfZ 7Mx
related: kvk4 aeL Jvv
related: knc6 cxi bvx
related: hvCT b9e Nss
related: iLtv YM8 L89
related: rYMX m5z Xaq
related: AccE XPM GDD
related: C3422
related: TmdZ qNQ yDs
related: 4Hjq xnZ TTd
related: auC1 LyU JV1
related: NpgK VPX JNP
related: QQnR VjZ G9S
related: etPj 5Pq ZPq
related: tzQv YHB TrS
related: arCR wuY 5dX
related: 8f5C ZFz MnE
related: tF2o oZj kqE
related: Ye5Z AHT 3Ps
related: tJ3X tPB 9C4
related: pLiT eTw RVH

Medicinsk sekreterare
type: Concept
in scheme: JobTech Taxonomy - Yrke
definition: Medicinsk sekreterare hanterar administration och dokumentation inom hälso- och sjukvården. Arbetsuppgifterna inkluderar att skriva och korrekturläsa patientjournaler utifrån diktat från läkare, hantera remisser, tidsbokningar och fakturering samt föra statistik och kvalitetsregister. Medicinska sekreterare arbetar ofta med kassa- och receptionsarbete samt kommunicerar med patienter och vårdpersonal. Rollen omfattar också systemansvar och utbildning i vårdadministrativa system samt stöd i budget-, personal- och avvikelsehantering. Medicinsk sekreterare bidrar till att vårdflöden fungerar effektivt och följer gällande riktlinjer och lagstiftning. Källor: Arbetsförmedlingen, Medicinsksekreterare.se, Region Stockholm
broader: Medicinska sekreterare, vårdadministratörer m.fl.
related: 8KDu aak rmF
related: b5xZ dq1 Sxm
related: ExxW 2oy 9Db
related: JMcu QGM g6Z
related: PfMG who Cww
related: 6Nt8 1JD JqY
related: ZfUt P7p r1H
related: X82t awd Qyc
related: r2SL cNc qff
related: mX4x TDh gYz
related: sRzs ysF p1X
related: C6Td j3H TXb
related: HYGU WVU 8YQ
related: icwr c3H iZS
related: wM4L MaR V3y
related: c8HZ 4r6 oMz
related: q2Kd WoU Ss8
related: qGND tZp HTC
related: tpaz b7y CFa
broad match: C3344

Cargo surveyor
type: Concept
in scheme: JobTech Taxonomy - Yrke
definition: Cargo surveyor
broader: Skadereglerare och värderare
related: RPTn bxG ExZ
related: ASGV zcE bWf
broad match: C3315

Trafiksäkerhetsledare
type: Concept
in scheme: JobTech Taxonomy - Yrke
definition: Trafiksäkerhetsledare planerar, leder och följer upp säkerhetsarbete vid anläggnings- och underhållsprojekt i trafikmiljöer, såsom vägar och järnvägar. Arbetsuppgifter kan innefatta utformning och tillämpning av trafikanordningsplaner (TA-planer), koordinering av trafikavstängningar och skyddsanordningar, samt övervakning av att arbetet utförs enligt gällande säkerhetsföreskrifter. Källa: Arbetsförmedlingen, Trafikverket
broader: Säkerhetsinspektörer m.fl.
related: tiNH 43h 4rZ
related: ZGf9 5tU ZUu
related: ASGV zcE bWf
related: 6vCk BMg awd
related: LYAu p7j u6U
related: fR8y iuG 1pv
broad match: C3257

Kvalitetsingenjör, maskin/Kvalitetstekniker, maskin
type: Concept
in scheme: JobTech Taxonomy - Yrke
definition: Kvalitetsingenjör, maskin/Kvalitetstekniker, maskin
alternative label: Kvalitetsingenjör, maskin
alternative label: Kvalitetstekniker, maskin
broader: Ingenjörer och tekniker inom maskinteknik
related: 6Hq3 tKo V57
related: sE53 9Bs 9MF
related: 8zB1 pKE 7oM
related: 3jD8 rbi N79
related: 9aEn jPz gJs
related: 2Q1h giB XjM
related: gUzg q1k PsH
broad match: C3115

Utvecklingsingenjör, metallurgi
type: Concept
in scheme: JobTech Taxonomy - Yrke
definition: Utvecklingsingenjör, metallurgi
broader: Civilingenjörsyrken inom gruvteknik och metallurgi
related: 6Hq3 tKo V57
related: AZPQ Dz2 LGF
related: vt8g ipf msz
broad match: C2146

Chefer inom bank, finans och försäkring
type: Concept
in scheme: JobTech Taxonomy - Yrke
definition: Chefer inom bank, finans och försäkring
broader: Chefer inom bank, finans och försäkring
narrower: Chefer inom bank, finans och försäkring

Redigerare
type: Concept
in scheme: JobTech Taxonomy - Yrke
definition: En redigerare på en tidning är en journalist som ansvarar för att gå igenom och bearbeta texter, välja och placera bilder, skriva rubriker samt sammanställa och layouta tidningssidor. Redigeraren samarbetar ofta med nyhetschef och nattchef för att avgöra vad som ska lyftas fram på sidorna och säkerställer att materialet är klart för publicering. Redigeraren ser till att texterna följer tidningens stil och riktlinjer, och att helheten blir läsvänlig och visuellt tilltalande. Källa: Mediekompass, Blaskan.nu
broader: Författare m.fl.
related: PdNn Kzu wof
related: H8Tv vkm 5HN
related: TUA7 EFe mpt
related: 9KHq As3 Zh4
related: 9BZB sHK 1Ue
related: 8too bEs 7NU
related: 9puE nYg crq
related: UaTx tzC aXm
broad match: C2641

Elkonstruktör
type: Concept
in scheme: JobTech Taxonomy - Yrke
definition: Elkonstruktör arbetar med att utforma och projektera elektriska system och anläggningar inom exempelvis byggnader, industrier och energinät. Arbetsuppgifterna omfattar framtagning av tekniska ritningar, dimensionering av installationer samt val och specifikation av komponenter såsom kablage, apparatskåp och belysningssystem. Arbetet sker ofta i CAD-program som AutoCAD, EPLAN eller Elprocad. Inom energibranschen arbetar elkonstruktör med luftlednings-, kabel- och stationsprojekt för lokal- och regionnät. Arbetsuppgifterna kan även omfatta vägbelysningsprojekt samt nyuppbyggnad och ombyggnation av ledningsnät och anläggningar. Elkonstruktör arbetar med jordkabel- och luftledningsteknik samt med nät- och fördelningsstationer. Källa: Arbetsförmedlingen, EBR
broader: Ingenjörer och tekniker inom elektroteknik
related: Hpkn kKY KcS
related: 6Hq3 tKo V57
related: FQ8K Fzw DTy
related: 3MP7 bXe e1x
related: PHWt Yy6 xMD
related: nK5U SoE obj
related: rXuu 9k4 Ch7
related: qNFN D2s 8tX
related: KWNv oWK 5E2
related: HnZm Zyi hgB
related: QT2w uwQ fYR
related: mGQb cyc QUc
related: JEiY Nc7 ByN
related: Ehjv ALb R1i
related: u6N5 brU TJi
related: yBNo xE6 D6Z
related: C41S vox 2gE
related: JKhF Zu4 FXd
broad match: C3113

Grävmaskinförare
type: Concept
in scheme: JobTech Taxonomy - Yrke
definition: En Grävmaskinsförare gräver och schaktar för hus, anläggningar och vägar, gräver för att lägga vatten- och avloppsledningar. Grävmaskinen är det vanligaste maskinslaget för en anläggningsmaskinförare Anläggningsmaskinföraren har yrkesbevis i ett eller flera maskinslag. I arbetet ingår att sköta underhåll och enklare reparationer av maskinens kringutrustning. Ibland hjälper anläggningsmaskinföraren också till med markarbeten utanför maskinen. Anläggningsmaskinföraren kan ansöka om sitt yrkesbevis efter teoretisk grundutbildning och lärlingsanställning. Källa: Arbetsförmedlingen
broader: Anläggningsmaskinförare m.fl.
related: Dqg7 B1Y zuV
related: j7Cq ZJe GkT
related: DSLn 2id eKP
related: sRa5 6YZ cn9
related: hLRr XN4 hVp
related: Ee7W dUJ 4qn
related: eFJg 7zS pMt
related: Px5X Uvv ejk
related: YvFH BbA rPv
related: ja7J P8X YC9
related: Mxyf t2J iLA
related: Yyeh kvC SdB
broad match: C8342

Hotellchef
type: Concept
in scheme: JobTech Taxonomy - Yrke
definition: Hotellchef
broader: Hotell- och konferenschefer
related: BAY9 owv 4LG
related: f6MX 8wy XW7
related: cVzh 4Ev ny8
related: epLc SkD cbT
related: bh3H Y3h 5eD
related: JomK cXJ Wsz
related: ScKy FHB 7wT
related: WcHJ 8Fr cGf
related: XLRK hQP 9vq
related: TZ8K MNR fxL
related: uc75 iiG N9M
related: KbwH SMC Swc
broad match: C1411

Creative director/CD
type: Concept
in scheme: JobTech Taxonomy - Yrke
definition: Creative director ansvarar för att leda och styra den kreativa processen inom en organisation eller byrå. Vanliga arbetsuppgifter är planera, leda och coacha kreativa team, ta fram och presenterar koncept och kampanjer för olika medier, utveckla och underhålla varumärkesidentiteter genom grafiska element som logotyper, färger och typografi. Det ingår ansvar för att följa upp budget och tidsplaner för att säkerställa att projekt levereras inom givna ramar. Källa: Arbetsförmedlingen
alternative label: CD
alternative label: Creative director
broader: Övriga designer och formgivare
related: PmT6 Ska voq
related: 2Moj 5QN aQa
related: nX75 Dkc 36p
related: gwPJ cpF yHJ
related: 8too bEs 7NU
related: 9puE nYg crq
related: aoAE iHz uD3
related: soPU hoh SyN
broad match: C2163

Skötare (inom psykiatrisk vård)
type: Concept
in scheme: JobTech Taxonomy - Yrke
definition: Person som vårdar, ger stöd och råd samt medverkar i rehabilitering av patienter inom psykiatrisk öppen och sluten vård. Källa: SKR
broader: Skötare
related: pZpZ EZj fnh
related: NYW6 mP6 vwf
related: De86 a1q V69
related: 6Li8 q7n nxi
related: GR5p Vyz 581
broad match: C5321

Folierare
type: Concept
in scheme: JobTech Taxonomy - Yrke
definition: Folierare monterar dekorativa eller skyddande folier på olika ytor, främst fordon. Arbetet innebär förberedelse för och applicering samt efterbearbetning av folie. Förberedelse genom rengöring, avfettning och eventuell slipning. Applicering genom noggrann montering för att undvika bubblor och veck. Efterbearbetning innebär justering och beskärning av folien. Utöver detta kan arbetsuppgifterna även inkludera montering av dekor och skyltar, såsom text, logotyper och annan grafik på olika ytor. Källa: Arbetsförmedlingen
broader: Lackerare och industrimålare
related: gqdS mKi CUh
related: Vh91 62H er1
related: 4a7z Me5 Yqe
related: wTEr CBC bqh
broad match: C7132

Maskinoperatörer, gummiindustri
type: Concept
in scheme: JobTech Taxonomy - Yrke
definition: Styr och övervakar maskiner som blandar och valsar gummi eller som tillverkar olika produkter och detaljer av naturligt och syntetiskt gummi. Bygger upp eller regummerar gummidäck. Hit hör inte Däckmontör/Däck- och hjulmekaniker (8213)
broader: Maskinoperatörer, gummi-, plast- och pappersvaruindustri
related: VPF1 UZM 9Kd
related: ErKU 5HB NRT
related: 74Mw JUN VKx
related: 2pjc Vto TGH
related: pGts PKK c8W
related: 72ZN fJD y6D
related: aF3J SgE uck
related: GHGw Yj4 yFB
related: qQ61 EQR rcz
related: VTwt 5Fe 6bW
related: FQ61 8ic xvi
related: KDzy Hra iVr
related: Rtef oWE Ed9
related: sbYJ XwB o8X
related: d3oB oX3 kF8
related: PuQP aBK nqJ
related: Rbju P7i 12U
related: 1bzs Fim nYG
related: X4EU ZC7 QmK
related: AiwS Mhv ttk
related: C8141
related: uenm 75h fEh
related: MT1a Nyq DGQ
related: qn22 kbi Mwa
related: KyvQ kWy oLn
related: wgzc YWB GRr
related: dWbY gXC Frx
related: feDt 8f5 KRS
related: Q98i eRu Fsn
related: LhvF NZc r6N
narrower: Maskinoperatör gummiindustri
broad match: wTEr CBC bqh

Fastighetsförvaltare
type: Concept
in scheme: JobTech Taxonomy - Yrke
definition: Fastighetsförvaltare
broader: Fastighetsförvaltare
related: hRtE jMb MkY
related: MZec oAF gXd
related: pFem uzG bNh
related: 6Hq3 tKo V57
related: T9xZ MJh fM5
related: 6rUp 9pg ziU
related: QZdX 1cY 2wx
related: tvPL iF9 5PT
related: g8Wh DWY Qg8
related: WDoL Rzs 4G1
related: e9X5 BhL C3E
related: CmBN EEy GFV
related: 81r4 svz 28T
related: 9swe uQX ho6
related: bosc gu5 1PK
related: EQVu YEE R1F
related: RwDk 4qL JH5
related: fDVS N8B N2j
related: yhCP AqT tns
related: nNQe FQH 9WB
related: 4XGh b1j KS4
related: h8uA ZiR iUA
related: guU3 nTr G64
related: N9Wu iMC kYq
related: Rmkm pyE YnZ
related: VCy5 VSh UHy
related: KhYb pwQ FQN
related: D93Q wCo iJw
related: hFPG da3 CN2
related: eukb M4S xh9
related: MgXR yx5 rmz
related: YTYi NLW CRf
related: Z52Y i5m mHZ
related: LPb8 zS7 FK8
related: BpHG i9o stS
related: 91mA Ctt Xdj
related: 7MRE K8h Fh8
broad match: C3334

Chef för valuta och fixed income
type: Concept
in scheme: JobTech Taxonomy - Yrke
definition: Chef för valuta och fixed income
broader: Chefer inom bank, finans och försäkring
related: X82t awd Qyc
related: epLc SkD cbT
related: bh3H Y3h 5eD
broad match: C1346

Fysioterapeut
type: Concept
in scheme: JobTech Taxonomy - Yrke
definition: Fysioterapeut arbetar med rehabilitering, träning och anpassad fysisk aktivitet samt med att främja hälsa genom att förebygga sjukdom och skada genom hela livet. Fysioterapeut är en skyddad titel med legitimationskrav. Fysioterapeuten ansvarar för att utreda patientens fysiska tillstånd och utforma individuellt anpassade rehabiliterings- och träningsprogram. Vanliga arbetsuppgifter är bedöma, behandla och förebygga rörelse- och funktionsnedsättningar hos människor i alla åldrar. Detta inkluderar medicinsk träning, manuell behandling, handledd rehabilitering samt rådgivning för att förebygga sjukdom och skada. Källa: Arbetsförmedlingen, Karolinska Institutet, Socialstyrelsen, Sveriges Fysioterapeuter
broader: Fysioterapeuter och sjukgymnaster
related: EJsJ ZpE ryW
related: NYW6 mP6 vwf
related: sqvh gTy 6Sj
related: jYRh hQy DzW
related: xghL ZH7 pGS
related: b7hd bPJ jiK
related: KP72 TyV oVQ
related: 8JWA Y74 fme
broad match: C2264

Landskapsarkitekter
type: Concept
in scheme: JobTech Taxonomy - Yrke
definition: Utformar och projekterar yttre miljö t.ex. torg, gator, bostadsområden, parker, lekplatser och trädgårdar. Väger samman naturresursbevarande aspekter med funktionella, tekniska, ekonomiska och estetiska krav och önskemål till en fungerande helhetslösning i dialog med uppdragsgivare. Gör växt- och materialsammanställningar. Utarbetar förslag i form av modeller, texter och ritningar.
broader: Arkitekter och lantmätare
related: JQRo XJx YX9
related: g7bY vJ5 XC8
related: W5A6 NGs aM9
related: 4VUm JpJ LWr
related: ah7i FKc KGU
related: 8YxM PWA RNH
related: eHy7 eMm 1mG
related: Uige jQo uZ4
related: 1CnL 8ZQ tTd
related: 61zA BvK zDd
related: uw7i bUK eex
related: d4fX YoT QQc
related: 6MJf 3Va KQD
related: eXv8 c8M 9Ef
related: 9Pxd 4ub Kkt
related: oQre F86 kHG
related: K5JR yfk 8oj
related: gnTF vSG 2Eq
related: sc9x MMP woB
related: yFgG g8k r6r
related: faUp zHK 2Kn
related: YAdb Wwj b3N
related: M3tL 3Qr oeB
related: DsHp orw 8Xb
related: 9TAd zee 2Mc
related: zRtu fYj XC4
related: SmZd Jaa BeY
related: rUFy uF1 xEZ
related: WXkX o6j FYv
related: E67G PGy fiG
related: MsNS 1ea u4p
related: ofzH ikr 67D
related: YqX1 qhL cBm
related: woCn NVG HCt
related: HPrg bZM zh2
related: fFAM jC1 ur5
related: 76CR p4q sXc
related: EuQB NY1 ua2
related: UywC oRy tsV
related: C2162
related: C2MH EZ6 MwR
related: JRvh wrY RmW
related: hW4B SZF Qic
related: ehdK SJC 38W
related: uP2s 9yi BaC
related: 7sFk ixH faW
related: AYst mik wuC
related: wZg2 hFD TPv
related: aJkj 92P Hdu
related: AMNM t38 qWe
related: 3DEA r7Q YxU
related: bgjg cQD QgM
related: CWfM RL9 V4t
related: Tx1P roR sJy
related: oXnh Ffg j7m
related: gn6h J5L oGf
related: tWpg 7rw R97
related: E8pL Y52 K2z
related: jHPZ f6N Kjg
related: nDqs 2d5 jqu
related: szyV pTY uXK
related: 3suA kDu QDY
related: XN9D c7f vF1
related: Pk1y cpM ZhC
related: Bbj8 8y7 XJ5
related: YAN9 MQ4 NiT
narrower: Landskapsarkitekt
broad match: 6Hq3 tKo V57

Riksarkivarie
type: Concept
in scheme: JobTech Taxonomy - Yrke
definition: Riksarkivarie
broader: General-, landstings- och kommundirektörer m.fl.
related: epLc SkD cbT
related: bh3H Y3h 5eD
broad match: C1112

Yrkesjägare
type: Concept
in scheme: JobTech Taxonomy - Yrke
definition: Yrkesjägare
broader: Specialister och rådgivare inom skogsbruk
related: 8DkR Yu3 naM
related: WGAZ xaM gUE
related: qhGu KLd qYS
related: VuuL 7CH adj
broad match: C6224

Möbelsnickare
type: Concept
in scheme: JobTech Taxonomy - Yrke
definition: Möbelsnickare arbetar med att tillverka möbler efter specialbeställningar, egen design eller i mindre serier. Möbelsnickaren tillverkar nya möbler, exempelvis bord, stolar och vitrinskåp med unika egenskaper. Yrket liknar inredningssnickare i det att man ofta arbetar med hela processen från idé och ritning till färdig produkt. Möbelsnickare har djupa kunskaper om material och olika typer av bearbetning. Man arbetar både manuellt med handverktyg och maskinellt med både manuella och automatisk maskiner. Vanliga arbetsplatser är möbelsnickerier eller i andra roller, t ex, produktutvecklare och designer. Källa: Arbetsförmedlingen - Hitta yrken, Trä- och möbelföretagen
broader: Fin-, inrednings- och möbelsnickare
related: hYAA Ajt N1F
related: PaxQ o1G wWH
related: 8eBE sxx Wmo
related: 6C82 SQD 5M7
broad match: C7522

Biobränslechef
type: Concept
in scheme: JobTech Taxonomy - Yrke
definition: Biobränslechef
broader: Förvaltare inom skogsbruk och lantbruk m.fl.
related: bh3H Y3h 5eD
broad match: C1311

Konstsmed
type: Concept
in scheme: JobTech Taxonomy - Yrke
definition: Konstsmed arbetar med att formge och tillverka konstnärliga och funktionella föremål i metall, som grindar, skulpturer och inredningsdetaljer. Vanliga arbetsuppgifter är att designa, forma och sammanfoga metallstycken med hjälp av verktyg som hammare, städ och svetsar. Arbetet sker ofta i smedjor och inkluderar både konstnärligt skapande och tekniskt hantverk. Källa: Arbetsförmedlingen
broader: Bildkonstnärer m.fl.
related: 8too bEs 7NU
related: 9puE nYg crq
related: PaxQ o1G wWH
broad match: C2651

Lärling, målare
type: Concept
in scheme: JobTech Taxonomy - Yrke
definition: En lärling är anställd på företag för att göra sin färdigutbildningstid till målare. Lärlingsanställningen görs efter skolutbildning eller tillsammans med teoretiskt kurspaket. Under färdigutbildningstiden på företaget lär sig lärlingen yrket mer praktiskt och skall nå sina kunskapsmål för gesällbrev. Gesällbrevet erhålls efter ett teoretiskt och praktiskt branschprov. Källa: Arbetsförmedlingen
broader: Målare
related: j7Cq ZJe GkT
related: ja7J P8X YC9
broad match: C7131

Civilingenjör, järnväg
type: Concept
in scheme: JobTech Taxonomy - Yrke
definition: En civilingenjör inom järnväg arbetar inom olika funktioner med att planera, bygga, utveckla och förvalta järnvägen. Arbetsplatsen finns inom privat såväl som offentlig sektor, allt från mindre konsultfirmor till stora entreprenadföretag. Källa: Arbetsförmedlingen
broader: Civilingenjörsyrken inom bygg och anläggning
related: Hd6B L93 3rx
related: j7Cq ZJe GkT
related: anYS 5AR JRk
related: ja7J P8X YC9
broad match: C2142

Lärling, motorschaktvagnförare
type: Concept
in scheme: JobTech Taxonomy - Yrke
definition: En lärling är anställd för att slutföra sin kvalificeringstid till motorschaktvagnsförare innan ett yrkesbevis kan utfärdas. Under kvalificeringstiden får du lärlingslön enligt avtal. Kvalificeringstiden tillsammans med teoretisk grundutbildning leder till yrkesbeviset. Ett lärlingsavtal mellan branschorganisation och företag tecknas. Källa: BYN
broader: Anläggningsmaskinförare m.fl.
related: j7Cq ZJe GkT
related: ja7J P8X YC9
broad match: C8342

Måltidsbiträde
type: Concept
in scheme: JobTech Taxonomy - Yrke
definition: Måltidsbiträden tillagar och serverar måltider inom offentlig verksamhet, så som skolor, äldreboenden och sjukhus och restauranger. Yrket kallas även ekonomibiträde. Man arbetar med att tillaga och servera måltider inom offentlig verksamhet, så som skolor, förskolor, äldreboenden och sjukhus. Måltidsbiträdet kan även bistå kockar vid tillagning av mat. I arbetet ingår även att städa kök och beroende på arbetsplats även serveringsrum, så som restaurangmatsalar på skolor. Beroende på arbetsplats kan tillagning av mat ske på annan plats, till exempel kommuner har ofta ett centralt kök där mat sedan körs ut. Måltidsbiträdet förberedar då allt utom själva tillagningen av maten. Arbetar man vid ett centralt kök kan, förutom tillagning, även utkörning av mat ingå. Källa: Arbetsförmedlingen
broader: Restaurang- och köksbiträden m.fl.
related: tbaZ KQR iQZ
related: UdVa jRr 9DE
related: 3Ewa HUy p55
related: cmMd LBp Vgm
related: eB5p rGu VCc
related: Anbk 5Ug yHB
related: b1KC o2H YsM
related: TQL6 XjA W8b
related: WqD8 UrJ ZMp
related: rkZa kEf R7p
related: ScKy FHB 7wT
related: QSfa 6x5 9y7
related: A8ey 42f Esq
related: r2TU XX4 zJ8
related: H16B gDA xZg
related: R6eq vcx MJa
related: uMZo nC7 854
related: SxPQ cEG xnJ
broad match: C9412

Inköpschef
type: Concept
in scheme: JobTech Taxonomy - Yrke
definition: Inköpschef
broader: Inköps-, logistik- och transportchefer
related: W3h2 MDS MnM
related: 76uR HWG KdH
related: NYJ7 qby ADB
related: RPTn bxG ExZ
related: epLc SkD cbT
related: B1zj Hm2 CMt
related: cYPD sDJ 4yt
related: mJhY LuH he6
related: bh3H Y3h 5eD
related: mtDT dAc eRu
related: BCv4 Riz CNd
related: PHRy Vfk cMs
related: HUhU VRV X2x
broad match: C1324

Fritidssamordnare
type: Concept
in scheme: JobTech Taxonomy - Yrke
definition: Fritidssamordnare
broader: Planerare och utredare m.fl.
related: 3PKZ r4K 5gf
related: X82t awd Qyc
related: pmGh Bjw jg3
related: G7Ab o38 2Yk
broad match: C2422

Marintekniker
type: Concept
in scheme: JobTech Taxonomy - Yrke
definition: Marintekniker reparera och utför service på båtmotorer. Arbetet innebär arbete med både el- och förbränningsmotorer. Vanliga arbetsuppgifter är felsökning, justering och reparation av båtars motorer och tillhörande system. Mycket av arbetet sker ute på fält hos kunder. Då moderna båtar innehåller elektroniska system är det även viktigt med kunskaper i fordonselektronik. Källa: Yrkeshögskoleutbildningar för marintekniker, Arbetsförmedlingen
broader: Motorfordonsmekaniker och fordonsreparatörer
related: XL7b iSV 1K3
related: 1HTa 58c 2du
related: 963L 6cJ PiF
related: 5Xob 9SE 6zB
related: JiFQ fbG 6CW
related: H5Bc md9 wtg
related: J7Sn yFd 4i8
related: yhCP AqT tns
related: pxwK AHZ Rmh
related: z7qp RLA AjZ
related: EtAZ kR1 RAd
related: EtAH iLd jZW
related: w87j TVE Ku2
related: o9zZ 4Ln ZkE
related: j6gv foG x26
broad match: C7231

Sjukvårdsbiträde
type: Concept
in scheme: JobTech Taxonomy - Yrke
definition: Sjukvårdsbiträden arbetar främst inom sjukvården, oftast på sjukhus eller vårdcentraler, och stödjer sjuksköterskor och undersköterskor i patientnära arbete. Yrket kan även kallas servicevärd inom vården. Arbetsuppgifterna kan inkludera att bädda sängar, dela ut mat, transportera patienter och hantera enklare städning och förrådshantering. Till skillnad från vårdbiträden arbetar de oftare i en sjukhusmiljö. Källa: Arbetsförmedlingen
broader: Vårdbiträden
related: UdVa jRr 9DE
related: NYW6 mP6 vwf
related: jdY9 JGb GZC
related: Z7J4 5rf KwQ
related: Pda7 Z6w 9t3
related: knNs E19 sEs
related: w9aw w8H PRS
broad match: C5321

Näringslivssekreterare/Näringslivsutvecklare
type: Concept
in scheme: JobTech Taxonomy - Yrke
definition: Näringslivssekreterare/Näringslivsutvecklare
alternative label: Näringslivssekreterare
alternative label: Näringslivsutvecklare
broader: Planerare och utredare m.fl.
related: Wr8w uhx V27
related: x4WK rnM ZyL
related: X82t awd Qyc
related: yc3b 8HA Wn8
related: HotB bkS VA8
related: Cnx4 71s H3o
related: He3Q WaH LFe
related: TZe9 NsN uce
related: 2ciM 1xs i7Q
broad match: C2422

Marknadsanalytiker
type: Concept
in scheme: JobTech Taxonomy - Yrke
definition: Marknadsanalytiker
broader: Marknadsanalytiker och marknadsförare m.fl.
related: zMzL 7Cm H73
related: cun1 a4v Mgh
related: By4X XxF H9e
related: 4je5 yTY Evj
related: RPTn bxG ExZ
related: M3jj dDD Ko7
related: TKyv AGT ju4
related: tVLT DLJ b76
related: Yb1w sSy Rh9
related: 39uu afP RCQ
related: 5VfL cHm HKU
related: BS6x fZM vCN
related: TFQr j3h zan
related: QEJk GHd i3Q
related: 81cW 7AD 6tK
related: 3KEm x7r XAC
related: 4XyY MCb svG
related: zFqH KY1 4zp
related: WvwW hwS Sa4
related: 5bta bnm Yqe
related: Sqvu Asr zqX
related: EGe3 fBA m7G
related: N1uQ t4q yVw
related: Axmh JPX s7N
broad match: C2431

Tunnelbaneförare
type: Concept
in scheme: JobTech Taxonomy - Yrke
definition: Tunnelbaneförare kör tunneltåg för passagerartrafik. Tunnelbaneförare kör tunneltåg på tunnnelbana. Arbetet innebär ansvar över tåg och resenärer med fokus på säkerhet och punktlighet. Arbetet är till stor del självständigt och ett ensamarbete. Kontakt med passagerare och ge information via högtalarsystem är en viktig arbetsuppgift. Källa: Järnvägsjobb
broader: Lokförare
related: ASGV zcE bWf
related: NnDe pdc yfT
related: 5CAR 2j3 oMD
broad match: C8311

Processoperatör cementtillverkning
type: Concept
in scheme: JobTech Taxonomy - Yrke
definition: Processoperatör inom cementtillverkning sköter och övervakar driften av anläggningar där man tillverkar cement. Arbetet sker främst genom processövervakning i kontrollrum. Utöver produktion kan även kvalitetskontroll och provtagning ingå. Ordermottagning, återkoppling till kund och planering av leveranser är även förekommande. Beroende på arbetsplats är maskinunderhåll även en vanlig arbetsuppgift. Källa: Arbetsförmedlingen
broader: Maskinoperatörer, cement-, sten- och betongvaror
related: wTEr CBC bqh
broad match: C8114

OB-assistent
type: Concept
in scheme: JobTech Taxonomy - Yrke
definition: OB-assistent
broader: Bild- och sändningstekniker
related: 9puE nYg crq
related: d1Ao 9bY 7Kn
broad match: C3521

Terapeuter inom alternativmedicin
type: Concept
in scheme: JobTech Taxonomy - Yrke
definition: Terapeuter inom alternativmedicin
broader: Yrken med krav på högskolekompetens eller motsvarande inom hälso- och sjukvård samt laboratorium
narrower: Terapeuter inom alternativmedicin

Specialistofficer
type: Concept
in scheme: JobTech Taxonomy - Yrke
definition: Specialistofficer
broader: Specialistofficerare
related: jmU8 CXU rRC
related: pbSa diN RV1
related: Hqo4 91c tuD
related: bH5L uXD ZAX
related: mkYk nyn u7d
related: uB8J 6wX P2z
related: VRkm eGg 5XZ
related: eXcW mch eYx
related: J2rL HgD fkT
related: faed 5q6 cFH
related: opyx YPx aQn
related: rYPg Doy vU7
related: GiYR n9s 3xL
related: wAyF 24K NBL
related: K72G hNe Fzm
related: XBZA Sys yzJ
related: ZJZ1 EXp maV
related: gTT6 FjD sw7
related: tFXY ct8 FnN
related: DwGx oR9 N4t
related: WpFj BoW Whh
related: 4Z3M 6jg 7ea
related: oWdw yQS GNQ
related: PCif 4j6 AwR
broad match: C0210

Bolagsjurist
type: Concept
in scheme: JobTech Taxonomy - Yrke
definition: Bolagsjurist
broader: Affärs- och företagsjurister
related: X82t awd Qyc
related: x4Wi NWW ogB
related: Abcb QtH isZ
broad match: C2619

Florist
type: Concept
in scheme: JobTech Taxonomy - Yrke
definition: Florister skapar och säljer blomsterarrangemang, buketter och dekorationer för olika tillfällen och evenemang. Arbetsuppgifterna omfattar att ta emot beställningar, ge råd om växtskötsel, hantera leveranser samt exponera och sköta växter i butik. Daglig varuhantering och kassaarbete ingår också. Florister har goda kunskaper om växtarter och deras skötsel. Källa: Floristernas yrkesråd, Arbetsförmedlingen
broader: Butikssäljare, fackhandel
related: NFct KJx 6yY
related: Ur4P 5Fc Hcm
related: RPTn bxG ExZ
related: nqxY Gvc C44
related: ceZi X5S j1w
related: PaxQ o1G wWH
related: nJGJ MhF Rii
related: wUGv TmF QWm
broad match: C7549

Ventilationstekniker
type: Concept
in scheme: JobTech Taxonomy - Yrke
definition: En ventilationstekniker arbetar med att utforma ventilationssystem för en god inomhusmiljö och bidrar till en energieffektiv ventilation i både bostäder, kontor, skolor, idrottshallar och andra lokaler. Det innebär bland annat injustering och service på en ventilationsanläggning. En ventilationstekniker arbetar för stora eller små ventilationsföretag, privata eller offentliga fastighetsbolag. Källa: Arbetsförmedlingen
broader: VVS-montörer m.fl.
related: 6hxj DNz Bmg
related: RxuY faQ gFD
related: j7Cq ZJe GkT
related: eJQD prs DCE
related: FKCX mHV tio
related: ja7J P8X YC9
related: anqH Jqa 8pA
broad match: C7126

Cykelmekaniker
type: Concept
in scheme: JobTech Taxonomy - Yrke
definition: Cykelmekaniker arbetar med reparation och underhåll av olika typer av cyklar. Arbetet innebär i huvudsak att reparera och serva olika typer av cyklar, så som stadscyklar, landsvägscyklar mountainbikes. Beroende på arbetsplats kan även montering av cyklar och tillbehör ingå. Elcyklar är alltmer vanligt, varför kunskaper i elektronik och digitala verktyg är viktigt. Det är också vanligt med kundkontakt, så som inlämning och utlämning av servade cyklar, inklusive att ta betalt för utfört arbete. Tillhörande administration förekommer också, så som lagerhållning av reservdelar. Källa: Arbetsförmedlingen
broader: Motorfordonsmekaniker och fordonsreparatörer
related: ASGV zcE bWf
related: yhCP AqT tns
related: GxYR 8FA RPZ
related: hdfA UJo 1gW
related: YU4C w75 ku8
broad match: C7231

Avdelningschef butik
type: Concept
in scheme: JobTech Taxonomy - Yrke
definition: Avdelningschefer i butik leder det dagliga arbetet inom en specifik avdelning, exempelvis livsmedel, mode eller hemelektronik. Arbetsuppgifterna omfattar planering av sortiment och kampanjer, uppföljning av försäljningssiffror, varubeställning samt organisering av personalens arbetsuppgifter. Avdelningschef har vanligtvis god kännedom om butikens produkter och systemstöd för lager och försäljning. Källa: Arbetsförmedlingen
broader: Säljande butikschefer och avdelningschefer i butik
related: UaVp nsH tbT
related: bNgt ccR ekR
related: vpD5 jjR RSK
related: taPM JwU Q2p
related: AJnF JeM e56
related: r2YH 55S QTS
related: RPTn bxG ExZ
related: epLc SkD cbT
related: fUyU 8EB gSe
related: bh3H Y3h 5eD
related: S71y Xoe KdM
related: pdKp 6Z1 wba
related: yaH5 9vP NrZ
related: xcXF vhm Wo9
related: sMRM E2j Pq9
related: osqp umP rRQ
related: 7Mdg Ld5 QvT
broad match: C5222

Terapeuter inom alternativmedicin
type: Concept
in scheme: JobTech Taxonomy - Yrke
definition: Behandlar obalanser, spänningar och blockeringar i kroppen. Hit hör inte Massör/ Massageterapeut (5143) Fotterapeut/Fotvårdsspecialist (5144)
broader: Terapeuter inom alternativmedicin
related: mZFD c4z evm
related: 4QAE wtY gJh
related: kRQP wE3 jkZ
related: CSxj 642 BkA
related: aPCY q6B W17
related: jbG1 Nhp f5Z
related: xuZD yBH aZD
related: bde5 38D zDK
related: BZxx rQH abZ
related: VYES PSB Dh8
related: DeRa xWC EH3
related: avhR bp1 DMZ
related: Qecp WbB vyj
related: Tenf fGQ nL3
related: 15CG P9S 4vS
related: RbAC iio PDs
related: vHaL 11u eEi
related: JMCm btd 1yP
related: XZbe Z7P jiL
related: m4ij Bjw 6ik
related: GcR1 srM khU
related: H7Xf ifW SX4
related: C3255
related: aoVs Qfu U3j
related: qF6h 5qQ Fv8
related: C3230
related: XThw qKD UzJ
related: Pk1y cpM ZhC
related: 6R9q JPV 9Nw
narrower: Homeopat
narrower: Akupunktör
narrower: Aromaterapeut
narrower: Ayurvedamassör/Ayurvedaterapeut
narrower: Yogamassör
narrower: Fytoterapeut/Örtterapeut
narrower: Rosenterapeut
narrower: Zonterapeut
narrower: Näringsterapeut
narrower: Naturterapeut
narrower: Taktilterapeut
narrower: Läkeeurytmist
narrower: Akupressör
narrower: Kinesiolog
narrower: Shiatsuterapeut
broad match: NYW6 mP6 vwf

VTS-operatör
type: Concept
in scheme: JobTech Taxonomy - Yrke
definition: En VTS-operatör arbetar med modern teknik för att övervaka och ge information till fartyg om bl.a. trafikbilden, eventuella fel i farledsutmärkningen, sikt samt övriga hinder i farleden. I vissa tjänster ingår även att rapportera navigationsvarningar samt väder- och isinformation till sjöfarten. VTS-operatör är därmed en viktig kugge i arbetet för att minska risken för sjö- och miljöolyckor och tillbud inom området. En VTS-operatör är utbildad till Sjökapten samt har en giltig radiobehörighet, lägst ROC. Källa: Sjöfartsverket
broader: Fartygsbefäl m.fl.
related: ASGV zcE bWf
related: 4tnU rbd WAv
related: gthF y5Z j3Z
broad match: C3152

Fraktchef
type: Concept
in scheme: JobTech Taxonomy - Yrke
definition: Fraktchef
broader: Inköps-, logistik- och transportchefer
related: JEPi XaW Buw
related: xPMZ VsT Zxb
related: epLc SkD cbT
related: yVcc jaP Cks
related: ASGV zcE bWf
related: bh3H Y3h 5eD
broad match: C1324

Hamnvärd
type: Concept
in scheme: JobTech Taxonomy - Yrke
definition: Hamnvärdar assisterar båtgäster vid gästhamnar. Arbetet innefattar att hjälpa till med förtöjning och anvisning av båtplatser. Övriga arbetsuppgifter kan vara att ta emot betalningar för hamnavgifter, städning och sophantering samt sköta grönområden. Beroende på arbetsplats kan det även ingå uthyrning av utrustning, såsom kajaker, och försäljning i hamnkontorets butik. Källa: Arbetsförmedlingen
broader: Övriga servicearbetare
related: CGUy rhx K7r
related: yhCP AqT tns
related: RLmJ sBo FQR
broad match: C9629

Pilot/Trafikflygare/Flygstyrman
type: Concept
in scheme: JobTech Taxonomy - Yrke
definition: Pilot/Trafikflygare/Flygstyrman
alternative label: Flygstyrman
alternative label: Pilot
alternative label: Trafikflygare
broader: Piloter m.fl.
related: ASGV zcE bWf
broad match: C3153

Gitarrtekniker
type: Concept
in scheme: JobTech Taxonomy - Yrke
definition: Gitarrtekniker servar, reparerar och justerar gitarrer och basar. Arbetet innebär i huvudsak att justera gitarrer och basar för att optimera spelbarhet och ljudkvalitet. Arbetsuppgifterna inkluderar justering av hals, stränghöjd och intonation, byte av delar som stall och mekanik, reparation av elektronik, samt rengöring och underhåll. Vanliga arbetsplatser är musikaffärer, hos gitarrtillverkare eller som tekniker vid liveframträdanden. Källa: Arbetsförmedlingen
broader: Musikinstrumentmakare och övriga konsthantverkare
related: PaxQ o1G wWH
broad match: C7312

Trädgårdsingenjör/Trädgårdstekniker
type: Concept
in scheme: JobTech Taxonomy - Yrke
definition: Trädgårdsingenjör/Trädgårdstekniker
alternative label: Trädgårdsingenjör
alternative label: Trädgårdstekniker
broader: Specialister och rådgivare inom lantbruk m.m.
related: 6nbS RdB kzm
related: VuuL 7CH adj
broad match: C3142

Riskbedömare
type: Concept
in scheme: JobTech Taxonomy - Yrke
definition: Riskbedömare
broader: Försäkringssäljare och försäkringsrådgivare
related: X82t awd Qyc
broad match: C3321

Teamledare
type: Concept
in scheme: JobTech Taxonomy - Yrke
definition: Teamledare
broader: Försäljnings- och marknadschefer
related: BNX3 1mQ wXb
related: GaQ8 5JH DFB
related: HsQC Pkt 4Wd
related: S1VH aK5 j4w
related: bh3H Y3h 5eD
related: jAEb naE b1n
related: v4t6 Ta4 JjE
related: Bb7E 5Me 8yV
related: JaZd Ji6 vKZ
related: dL7q tx7 WjG
related: Wotm zBV 8wZ
related: rBos a5W 9rK
related: Pd9d JQc yBe
related: 2VcZ Yrd F6z
related: kXk8 LVL tih
broad match: C1221

Drifttekniker vattenverk VA
type: Concept
in scheme: JobTech Taxonomy - Yrke
definition: En drifttekniker inom vattenverk (VA) ansvarar för den dagliga driften, skötseln och underhållet av vattenverk för att säkerställa tillgången till rent och säkert dricksvatten. Driftteknikern övervakar driften av vattenverket, ofta från ett kontrollrum via datasystem, men även genom regelbundna kontrollronder ute i anläggningen. Identifierar och åtgärdar fel och störningar i driften, vilket kan innebära att justera inställningar i kontrollrummet eller utföra manuella reparationer. Genomför förebyggande underhåll för att förhindra driftstörningar och säkerställa att anläggningen fungerar optimalt. Källa: Arbetsförmedlingen, Sobona
broader: Drifttekniker vid värme- och vattenverk
related: NEcG nCf 9A3
related: EDt5 aBW 9g1
related: yhko hN8 1tq
related: SEdt W9B Tgw
related: gDCr ynW 1P9
related: yhCP AqT tns
related: g1pi mUq cTd
related: feJx JfF 6VA
related: 5hEn oVW d3s
broad match: C3132

Travkusk
type: Concept
in scheme: JobTech Taxonomy - Yrke
definition: Travkusk
broader: Professionella idrottsutövare
related: 9puE nYg crq
related: 18mj 8LR mDN
broad match: C3421

Hjullastarförare, anläggning
type: Concept
in scheme: JobTech Taxonomy - Yrke
definition: Hjullastarförare inom anläggning kör hjullastare som räknas som jordförlyttande maskin och används främst vid vägbyggnad och grundläggning, där stora schaktmassor skall förflyttas. I arbetet ingår att sköta underhåll och enklare reparationer av maskinens kringutrustning. Hjullastarföraren är en anläggningsmaskinförare och har yrkesbevis i ett eller flera maskinslag. Anläggningsmaskinföraren kan ansöka om sitt yrkesbevis efter teoretisk grundutbildning och lärlingsanställning. Källa; Arbetsförmedlingen
broader: Anläggningsmaskinförare m.fl.
related: j7Cq ZJe GkT
related: ja7J P8X YC9
related: KLfo nwj UCQ
broad match: C8342

IT-säkerhetsanalytiker
type: Concept
in scheme: JobTech Taxonomy - Yrke
definition: IT-säkerhetsanalytiker
alternative label: Säkerhetsanalytiker, IT
broader: IT-säkerhetsspecialister
related: nCKb LeA 4FN
related: vqy8 VVZ 1kg
related: np96 EiH nYU
related: TRPL 5av hN9
related: SRq5 7Re LUi
related: vWkC Wsb jq9
related: apaJ 2ja LuF
related: wbys aM2 8ZY
related: 5RuF 7W3 7oU
related: ipjx dWQ ui4
related: 9YiW ATJ 8Cq
related: iGQH hCg FqJ
broad match: C2529

Tull- och kustbevakningstjänstemän
type: Concept
in scheme: JobTech Taxonomy - Yrke
definition: Övervakar person- och godstrafik vid rikets gränser och kontrollerar att tullbestämmelser efterlevs. Bevakar att tull, mervärdesskatt och andra avgifter betalas vid import. Övervakar sjötrafik samt säkerheten och miljöskyddet till sjöss. Kontrollerar att fiskeregler följs.
broader: Skatte- och socialförsäkringshandläggare m.fl.
related: Tbmr JxZ xFU
related: Y4FW gi5 Gy5
related: bgC3 M9R 1K4
related: nyUV W89 oSP
related: VS9s v5Q X4t
related: hq8s qZB mgv
related: bu7L 4AA DCX
related: sSwR AxY K4n
related: 2XXJ ofn VAD
related: gkuK N5j vYy
related: xe4p dFx Y96
related: opVw 2zx 875
related: 8Bcs wbf WJa
related: TmdZ qNQ yDs
related: pLiT eTw RVH
related: QDbj Hqp hSJ
related: iv7v nyX ZKt
related: C3351
related: Gg8S ej1 Fdt
related: ksDx Xcu AHL
narrower: Tulltjänsteman
narrower: Befälhavare, Kustbevakningen
narrower: Kustbevakningstjänsteman
broad match: E7hm BLq fqZ

Glasbruksarbetare
type: Concept
in scheme: JobTech Taxonomy - Yrke
definition: Glasbruksarbetare tillverkar glasprodukter vid glasbruk, även kallat glashyttor. Vid glasbruk tillverkas glasprodukter som konstglas och bruksföremål, dock inte planglas eller industriellt glas. Arbetsuppgifterna kan omfatta hela eller delar av tillverkningsprocessen, såsom att smälta råmaterial, forma glas genom blåsning eller pressning, slipning, polering och dekoration av färdiga produkter. Beroende på arbetsplats kan man vara specialiseriad inom delar av tillverkningsprocessen, såsom blåsning, gravyr eller ytbehandling. Vid tillverkning används både traditionella hantverkstekniker och moderna maskiner. Se även hantverksyrkena glasblåsare och glasslipare. Källa: Arbetsförmedlingen
broader: Musikinstrumentmakare och övriga konsthantverkare
related: 3oAf g6N Rsf
related: 6a9t 2cP Xh4
related: rvRE tRx p5C
related: 2NF1 1hm nU6
related: y5KN k1r GAM
related: LZYT JDv ZSd
related: PaxQ o1G wWH
related: 1pjv xD1 ZuY
related: dRc7 fgN WhA
related: ymQe n7k woK
broad match: C7315

Nagelterapeut
type: Concept
in scheme: JobTech Taxonomy - Yrke
definition: Nagelterapeuter bygger, förstärker och dekorerar naglar med olika material som gelé, akryl eller polygel. Arbetsuppgifterna inkluderar förlängning med mall eller tippar, filning, formning, färgapplicering samt konstnärlig dekoration. Många nagelterapeuter utför även klassisk manikyr. Källor: Svenska Estetikers yrkesförbund, Arbetsförmedlingen
alternative label: Nagelteknolog
broader: Övriga skönhets- och kroppsterapeuter
related: Sog1 VHP SP5
related: Uuf1 GMh Uvw
related: gdtQ wWM ypC
broad match: C5142

Biologer, farmakologer och specialister inom lant- och skogsbruk m.fl.
type: Concept
in scheme: JobTech Taxonomy - Yrke
definition: Biologer, farmakologer och specialister inom lant- och skogsbruk m.fl.
broader: Yrken med krav på fördjupad högskolekompetens inom naturvetenskap och teknik
narrower: Specialister och rådgivare inom lantbruk m.m.
narrower: Cell- och molekylärbiologer m.fl.
narrower: Farmakologer och biomedicinare
narrower: Växt- och djurbiologer
narrower: Specialister och rådgivare inom skogsbruk

ST-läkare, klinisk farmakologi
type: Concept
in scheme: JobTech Taxonomy - Yrke
definition: Specialisttjänstgöring, ST, är den vidareutbildning som legitimerade läkare genomför för att uppnå specialistkompetens. ST-läkare klinisk farmakologi arbetar under handledning för att fördjupa sina medicinska kunskaper och färdigheter med målet att bli specialistläkare inom sitt område. ST-läkaren arbetar självständigt med patientutredningar, diagnostik och behandling, men alltid med stöd av specialister och enligt ett individuellt utbildningsprogram. Vanliga arbetsuppgifter är att ta medicinskt ansvar för patienter, delta i jourverksamhet, genomföra medicinska undersökningar och behandlingar samt dokumentera och följa upp vårdinsatser. Tjänsten omfattar också kontinuerlig kompetensutveckling, sidotjänstgöring inom närliggande områden och aktivt deltagande i handledning och utbildningsinsatser för kollegor och studenter. Källa: Arbetsförmedlingen, Karolinska Universitetssjukhuset, Sveriges läkarförbund, Region Kronoberg, Region Skåne.
broader: ST-läkare
related: NYW6 mP6 vwf
related: UtCj yMj ubw
broad match: C2211

Smed
type: Concept
in scheme: JobTech Taxonomy - Yrke
definition: Smed arbetar med metallbearbetning och formgivning genom smide. Arbetet innebär tillverkning, reparation och renovering av metallföremål. Man utför också svetsning, lödning, nitning och ytbehandling. Man använder handverktyg och maskiner såsom hammare, pressar, valsar och gradsaxar. Arbetsuppgifterna varierar beroende på inriktning. Konstsmeder arbetar främst med konstföremål och konsthantverk, såsom ljuskronor, grindar, skulpturer och inredningsdetaljer. Brukssmeder använder traditionella tekniker för att tillverka funktionella föremål och detaljer, exempelvis i rostfritt stål, svartjärn eller aluminium. Som smed kan man även arbeta inom verkstadsindustrin. Se även yrket byggnadssmed. Källa: Hantverksakademin, Hantverkslärling, Arbetsförmedlingen
broader: Smeder
related: bKLb rZ4 7Dk
related: LJxM t26 KU9
related: C8Rf fg8 YKq
related: Q9G4 Q7b bUX
related: z43j gJB CWX
related: PaxQ o1G wWH
broad match: C7221

Betongelementmontör
type: Concept
in scheme: JobTech Taxonomy - Yrke
definition: En betongelementmontör arbetar med att montera prefabricerade betongelement på byggarbetsplatser. Detta innebär att de lyfter och placerar betongelement som väggar, golv, balkar eller pelare på plats, ofta med hjälp av kranar. De ansvarar även för att fästa och justera elementen för att säkerställa en stabil konstruktion, t ex genom betonggjutning. Säkerhet är viktigt för att undvika olyckor då arbetet utförs med tunga material. Källa: Arbetsförmedlingen
broader: Övriga byggnads- och anläggningsarbetare
related: j7Cq ZJe GkT
related: TUfd 5dK pur
related: ja7J P8X YC9
broad match: C7119

Satellitoperatör
type: Concept
in scheme: JobTech Taxonomy - Yrke
definition: Satellitoperatör
broader: Ingenjörer och tekniker inom maskinteknik
related: 6Hq3 tKo V57
related: kDRm Yaa jAB
related: gSWF qL2 riJ
broad match: C3115

Oorganisk kemist
type: Concept
in scheme: JobTech Taxonomy - Yrke
definition: Oorganisk kemist
broader: Kemister
related: kJeN wmw 9wX
related: Yr11 UKD on1
broad match: C2113

Flygledare
type: Concept
in scheme: JobTech Taxonomy - Yrke
definition: Flygledare
broader: Flygledare
related: ASGV zcE bWf
broad match: C3154

Musiktekniker
type: Concept
in scheme: JobTech Taxonomy - Yrke
definition: Musiktekniker
broader: Ljus-, ljud- och scentekniker
related: 8too bEs 7NU
related: 9puE nYg crq
related: yhCP AqT tns
related: d1Ao 9bY 7Kn
broad match: C3521

Dövkonsulent
type: Concept
in scheme: JobTech Taxonomy - Yrke
definition: Dövkonsulent
broader: Planerare och utredare m.fl.
related: X82t awd Qyc
related: TZe9 NsN uce
broad match: C2422

Arbetsrättsjurist
type: Concept
in scheme: JobTech Taxonomy - Yrke
definition: Arbetsrättsjurist
broader: Affärs- och företagsjurister
related: gUyW 8DN oe6
related: X82t awd Qyc
related: x4Wi NWW ogB
related: Abcb QtH isZ
related: Ft5e 38h KFg
broad match: C2619

Produktionsingenjör, gruv
type: Concept
in scheme: JobTech Taxonomy - Yrke
definition: Produktionsingenjör, gruv
broader: Civilingenjörsyrken inom gruvteknik och metallurgi
related: 6Hq3 tKo V57
related: AZPQ Dz2 LGF
broad match: C2146

Ugnsmurare
type: Concept
in scheme: JobTech Taxonomy - Yrke
definition: Ugnsmurare arbetar med reparation och nybyggnation av ugnar och eldstäder, samt industriugnar och värmeanläggningar. De är specialiserade på att bygga och underhålla högtemperaturanläggningar som förbränningsugnar. Deras arbete är avgörande för industrier som stålverk och raffinaderier, där extrem värme krävs. Ugnsmuraren ansvarar för att applicera eldfasta material och säkerställa ugnarnas funktion och livslängd genom regelbundet underhåll och övervakning. Källa: Arbetsförmelingen
broader: Murare m.fl.
related: AixK VsH xYP
related: tmkS 5oM rbE
related: j7Cq ZJe GkT
related: EZAG S3A YsM
related: XpoJ wie yR6
related: Zko3 gps YY9
related: ja7J P8X YC9
related: FiUB 99r QvH
broad match: C7112

Projektledare, VS
type: Concept
in scheme: JobTech Taxonomy - Yrke
definition: Projektledare, VS
broader: Ingenjörer och tekniker inom maskinteknik
related: Sa9V HHy VjR
related: 6Hq3 tKo V57
related: j7Cq ZJe GkT
related: 9aEn jPz gJs
related: ZWTd B44 2jw
related: AkaZ Zv9 gRW
related: yXSE wvx EAN
related: VECr cRX rQQ
related: WZbH bE3 jQc
related: a1wy ZjC a8D
broad match: C3115

Geolog
type: Concept
in scheme: JobTech Taxonomy - Yrke
definition: Geolog
broader: Geologer och geofysiker m.fl.
related: kJeN wmw 9wX
related: PkWK CVK hy6
broad match: C2114

Dekorationsmålare, bygg
type: Concept
in scheme: JobTech Taxonomy - Yrke
definition: Dekorationsmålare, bygg
broader: Inredare, dekoratörer och scenografer m.fl.
related: j7Cq ZJe GkT
related: 9puE nYg crq
broad match: C3432

Kvalitetsrevisor
type: Concept
in scheme: JobTech Taxonomy - Yrke
definition: Kvalitetsrevisor
broader: Lednings- och organisationsutvecklare
related: X82t awd Qyc
related: Wo8D xys Lew
broad match: C2421

Ljudmixare
type: Concept
in scheme: JobTech Taxonomy - Yrke
definition: Ljudmixaren ansvarar för att blanda och balansera alla ljudspår i produktionen för att skapa en enhetlig och hög ljudkvalitet. De justerar ljudnivåer, effekter och andra ljudparametrar för att skapa den önskade ljudupplevelsen. Källa: YNFT
broader: Ljus-, ljud- och scentekniker
related: a5Hb 5DD jdz
related: n4g8 6TZ Ahf
related: 9puE nYg crq
related: d1Ao 9bY 7Kn
broad match: C3521

Stand-up-komiker
type: Concept
in scheme: JobTech Taxonomy - Yrke
definition: Stand-up-komiker underhåller publik genom att framföra humoristiska monologer, anekdoter och improvisationer på scener, klubbar eller evenemang. Vanliga arbetsuppgifter är att skriva och repetera egna skript, framföra stand-up-rutiner live, samt ibland medverka i radio, tv eller digitala medier. Många stand-up-komiker är egenföretagare och ansvarar också för administration, kundkontakt och marknadsföring. Källa: Arbetsförmedlingen
broader: Övriga yrken inom kultur och underhållning
related: PSwM Zv1 QWg
related: 8too bEs 7NU
related: 9puE nYg crq
broad match: C2659

Inspelningstekniker
type: Concept
in scheme: JobTech Taxonomy - Yrke
definition: Inspelningstekniker
broader: Bild- och sändningstekniker
related: 8too bEs 7NU
related: 9puE nYg crq
related: d1Ao 9bY 7Kn
broad match: C3521

Miljöskyddschef
type: Concept
in scheme: JobTech Taxonomy - Yrke
definition: Miljöskyddschef
broader: Miljö- och hälsoskyddsinspektörer
related: kJeN wmw 9wX
related: epLc SkD cbT
related: 4eJL Zun nUv
broad match: C3257

Banktjänstemän
type: Concept
in scheme: JobTech Taxonomy - Yrke
definition: Leder, planerar och samordnar verksamhet vid bankkontor eller bankavdelning. Gör kredit- och riskbedömningar vid exempelvis långivning. Svarar för ekonomisk rådgivning till företag och privatpersoner. Upprättar deklarationer, testamenten och andra ekonomiska handlingar.
broader: Banktjänstemän och redovisningsekonomer m.fl.
related: bgC3 M9R 1K4
related: nZMQ bGf Xou
related: eox4 5Lc W7C
related: C3312
related: QKMc eKX sUE
related: vD77 b9G AEe
related: aMyW hB7 TpU
related: 7tVG 9zf 7mw
related: pAcX ugi X4j
related: dBC3 Rwt Mue
related: UH9g R5v MCx
related: 3vyB YMf qJm
related: Napu LsC c2C
related: ZzN5 m7B 5CY
related: R58v 7Db Z6h
related: LQX6 t5s aro
related: 5t9z 7Sc 1bz
related: C4211
related: BsBK j8o Guh
related: 4uf3 dsw Cy8
related: 8m5V 7k8 wJ3
related: i7kk zcd MiW
related: YXV9 MEq TKG
related: Fiq4 siu LXn
related: hpFr jXH rg2
related: 2RDK rgU P6R
related: Gt5f wdi FSJ
related: C2P6 nsE tTa
related: BQRS U7c PTG
related: q7Mx gjU F9q
related: g2NT MEv e91
related: NsB8 Gfz Grb
related: ugVg 6Li 587
related: 4fRg DA4 Dj3
related: hYpk RYx y3V
related: SHiQ hfH nuX
related: fZ4Y KYz 79W
related: WhiP TFR goh
related: G7jP 6Kv GrG
related: EhH5 quw XQK
narrower: Kredithandläggare
narrower: Gruppledare bank
narrower: Privatekonomisk rådgivare
broad match: X82t awd Qyc

Fastighetsmäklare
type: Concept
in scheme: JobTech Taxonomy - Yrke
definition: Förmedlar köp, försäljning eller uthyrning av hus, bostadsrätter, industribyggnader m.m. Marknadsför och visar objekt.
broader: Förmedlare m.fl.
related: bgC3 M9R 1K4
related: UQod 7GP JXL
related: iRc6 N79 R9V
related: UH9g R5v MCx
related: BrdZ oPC Kft
related: Ne8j XqQ NPK
related: nF6J MNc ZxS
related: LETZ XGi W5P
related: AWcT vfc wYb
related: q7Mx gjU F9q
related: C3334
narrower: Fastighetsmäklare
broad match: RPTn bxG ExZ

Tävlingsryttare
type: Concept
in scheme: JobTech Taxonomy - Yrke
definition: Tävlingsryttare
broader: Professionella idrottsutövare
related: 9puE nYg crq
broad match: C3421

Buss- och spårvagnsförare
type: Concept
in scheme: JobTech Taxonomy - Yrke
definition: Kör buss, trådbuss eller spårvagn för att transportera passagerare. Kontrollerar biljetter och färdbevis samt ropar ut hållplatser. Ansvarar för passagerares säkerhet under färden.
broader: Lastbils- och bussförare
related: Asgf FwD KGZ
related: EqRh UqX wFB
related: LKUu eHh QS1
related: C8331
related: g6vZ i7N ZeJ
related: Kzvi T2N vx6
related: XE8H BdS 7BP
related: qV7s h3s h7u
related: XGCK 5qV wPd
related: imVM 9XE Rrm
related: jqG1 Cza MRM
related: mhTK NZr dHQ
related: okxy qpM Xjo
related: F8iA MB6 iY3
related: 79qy qn4 B53
narrower: Spårvagnsförare
narrower: Bussförare
broad match: ASGV zcE bWf

Arbetsledare trädgårdsodling
type: Concept
in scheme: JobTech Taxonomy - Yrke
definition: Arbetsledare inom trädgårdsodling leder och fördelar arbetet vid odling av köksväxter, prydnadsväxter och blommor. Arbetet innebär ofta både att leda och delta i odling, skörd och leverans. Vanliga arbetsplatser är plantskolor och handelsträdgårdar. Källa: Arbetsförmedlingen
broader: Trädgårdsodlare
related: 9o58 FuP MaJ
related: qtkv hsD JKt
related: Yttq Spk XU1
related: BqRL Dzj TyS
related: VuuL 7CH adj
broad match: C6113

Bilrekonditionerare, fönsterputsare m.fl.
type: Concept
in scheme: JobTech Taxonomy - Yrke
definition: Utför rekonditioneringsarbete och fordonsvård. Rengör fönster, skyltfönster och glasväggar. Utför övrigt rengöringsarbete.
broader: Tvättare, fönsterputsare och övriga rengöringsarbetare
related: GN1z Mve mR4
related: h65W AEU vjL
related: C9123
related: BQPp SQs dtc
related: sbMP QpN QPG
related: k9pW awM Kmy
related: G9rP CR9 BT7
related: 7yG9 yE5 AYZ
related: C9121
related: C9122
related: C9510
related: jK9j m1s vxD
related: hkzB Lob 4jT
related: 3aCX jRM Kcs
related: cq2h mQV qhi
related: pgts 2XY xKi
narrower: Bilrekonditionerare
narrower: Bilvårdare
narrower: Fönsterputsare
broad match: whao Q6A ScE

Kundtjänsteman, försäkring
type: Concept
in scheme: JobTech Taxonomy - Yrke
definition: Kundtjänsteman, försäkring
broader: Försäkringssäljare och försäkringsrådgivare
related: X82t awd Qyc
related: 9XrQ sWD twF
related: FECN C8r pQx
related: vdmX E4t 1jU
broad match: C3321

Beredare underhåll inom industriell tillverkning
type: Concept
in scheme: JobTech Taxonomy - Yrke
definition: Beredare underhåll förbereder och planerar underhåll inom industriell tillverkning. Arbetet sker med underhållsplaneringssystem där arbetsuppgifter inkluderar att granska och uppdatera produktritningar, hantera materialbeställningar samt samverka med konstruktions- och inköpsavdelningar. Man stödjer också övergången av nya komponenter från projekt till produktion och utför ofta fältarbete. Källa: Arbetsförmedlingen
broader: Ingenjörer och tekniker inom industri, logistik och produktionsplanering
related: M2qV ZzQ tft
related: 6Hq3 tKo V57
related: nBF8 zGa zjv
related: ZfKV gRT VWd
broad match: C3115

Grillkock snabbmat
type: Concept
in scheme: JobTech Taxonomy - Yrke
definition: En grillkock inom snabbmat arbetar med att tillaga och servera snabbmat såsom hamburgare, korv, kebab och andra grillade rätter på gatukök, snabbmatsrestauranger eller liknande verksamheter. Arbetet kräver snabbhet, effektivitet och förmåga att arbeta under högt tempo, särskilt under rusningstider. Källa: Arbetsförmedlingen
broader: Pizzabagare m.fl.
related: UdVa jRr 9DE
related: C8UH gNu YCe
related: 9jac aoU oP4
related: RTQf 1Qm YhD
related: ScKy FHB 7wT
related: sTt4 wNm kT3
related: rTBn DLZ 6d3
broad match: C9411

Säljande butikschefer och avdelningschefer i butik
type: Concept
in scheme: JobTech Taxonomy - Yrke
definition: Ansvarar och planerar för drift och löpande verksamhet i butik. Leder, fördelar, kontrollerar och följer upp arbetet i butiken. Anställer och introducerar medarbetare. Deltar i den dagliga säljverksamheten. Driver kaféverksamhet. Hit hör inte Administrativ butikschef (1730) Regionchef, butik (1730)
broader: Butikspersonal
related: zDmn yT9 xtd
related: 4hwd 4fh RD7
related: bf3d E1X mQq
related: pTEm Nhr fFq
related: eb5k xiB DEF
related: HJoH Nqx gAH
related: 7Rku rpo no9
related: t59S 14G MhK
related: dXwA wgg k8x
related: epBr KmF HVM
related: J8PY 9yw D5M
related: Yufg GC2 LXS
related: UH9g R5v MCx
related: 29MP yhF mjx
related: dNA9 T9K JXF
related: 4Ya1 1Rv EB3
related: GBzU V4m atY
related: DDfz ew4 kNU
related: ZzN5 m7B 5CY
related: 3wpW ewH RD2
related: FuRR uys fcp
related: oTKR GSK e9B
related: Nksx 4oe fEQ
related: eThQ HCv mY6
related: DfC4 KjK LTC
related: 5PjX 999 uLZ
related: pmgB Pvx 9fK
related: U4tf ZBt Xu1
related: 2wd8 VUk YSq
related: 1dVh cZS Exw
related: Nck1 p2a Vau
related: Gt5f wdi FSJ
related: CHKu 2Kb 1Q2
related: EcuE BY7 mc4
related: TLkF mvM acW
related: 8gMo 7zE R57
related: Td4F YtH u6S
related: q7Mx gjU F9q
related: 7HmK 1mL 9qC
related: Q5Gj qVb 1AY
related: 9BpH rab iHD
related: n72g UEM zTH
related: C5222
related: 4fRg DA4 Dj3
related: hYpk RYx y3V
related: Betk ZCh mY9
related: TrT6 J5H mJW
related: C5221
related: kj4Q nLh u8Q
related: Y4Fw JZQ AcA
narrower: Avdelningschef butik
narrower: Kaféföreståndare
narrower: Kassaledare butik
narrower: Köttmästare livsmedelsbutik
narrower: Stationschef på drivmedelsstation
narrower: Biträdande butikschef
broad match: RPTn bxG ExZ

Friskvårdskonsulenter och hälsopedagoger m.fl.
type: Concept
in scheme: JobTech Taxonomy - Yrke
definition: Planerar, leder och organiserar friskvårdsinsatser. Utreder behovet av friskvård samt utformar policy och planer för hälsofrämjande insatser i företag och organisationer.
broader: Idrottsutövare och fritidsledare m.fl.
related: pni3 zFs Gzi
related: FkEt JyE oJ7
related: jKEp zZo Mmn
related: E7QH Hnd BAC
related: TKBk pkx 4He
related: iknU zh1 EzK
related: 9i47 8CB jBe
related: Qecp WbB vyj
related: sxer JSL 7Bv
related: XZbe Z7P jiL
related: RJ3G xEf vxV
related: Uebh 9f1 YJy
related: 91Ef 58Y jX4
related: irju S7Y Xbr
related: C3423
related: 9CLK TYc cud
related: mpL2 UvN LnK
related: wAQ9 vmK Fua
related: tbnD CoQ 2b9
related: yV9B PxJ TxS
narrower: Hälsopedagog
narrower: Friskvårdsledare
narrower: Kostrådgivare
broad match: GazW 2TU kJw

ST-läkare, neurologi
type: Concept
in scheme: JobTech Taxonomy - Yrke
definition: Specialisttjänstgöring, ST, är den vidareutbildning som legitimerade läkare genomför för att uppnå specialistkompetens. ST-läkare neurologi arbetar under handledning för att fördjupa sina medicinska kunskaper och färdigheter med målet att bli specialistläkare inom sitt område. ST-läkaren arbetar självständigt med patientutredningar, diagnostik och behandling, men alltid med stöd av specialister och enligt ett individuellt utbildningsprogram. Vanliga arbetsuppgifter är att ta medicinskt ansvar för patienter, delta i jourverksamhet, genomföra medicinska undersökningar och behandlingar samt dokumentera och följa upp vårdinsatser. Tjänsten omfattar också kontinuerlig kompetensutveckling, sidotjänstgöring inom närliggande områden och aktivt deltagande i handledning och utbildningsinsatser för kollegor och studenter. Källa: Arbetsförmedlingen, Karolinska Universitetssjukhuset, Sveriges läkarförbund, Region Kronoberg, Region Skåne.
broader: ST-läkare
related: NYW6 mP6 vwf
related: UtCj yMj ubw
broad match: C2211

Djurvårdare
type: Concept
in scheme: JobTech Taxonomy - Yrke
definition: Djurvårdare arbetar inom djurhälsa och djursjukvård, med begränsade behörigheter och under ledning av veterinär. Arbetsuppgifter kan omfatta att mata och rasta djur som är inlagda på djursjukhus eller annan anläggning, städa djurstall och mottagningsrum, röntga djur, ta blodprov, analysera prover, klippa klor och päls på vakna djur samt ge läkemedel på annat sätt än genom injektion, till exempel tabletter, salvor och droppar. Djurvårdare kan även arbeta med administrativa uppgifter, så som tidsbokning och enklare frågor. Arbetsuppgifterna kan variera beroende på vilken nivå djurvårdaren arbetar på, enligt Jordbruksverkets bestämmelser. Källa: Jordbruksverket
broader: Övriga djuruppfödare och djurskötare
related: UdVa jRr 9DE
related: MLCP 6wR YbB
related: 7LbQ SRM foK
related: CP7F CgT iji
related: VuuL 7CH adj
related: fZgS VLH gzQ
broad match: C5164

Städledare och husfruar
type: Concept
in scheme: JobTech Taxonomy - Yrke
definition: Leder, planerar och samordnar det dagliga städarbetet samt följer upp och utvecklar instruktioner och rutiner. Ansvarar för städmaterial, gästartiklar, linne och annat material.
broader: Städledare och fastighetsskötare m.fl.
related: 6XRu MQm 4NK
related: GN1z Mve mR4
related: M8Ht hND Hsi
related: Ljxo 4Zn ygo
related: 5nv3 Ei4 1Xh
related: P5Lv TUM XzB
related: tXiX tYU gkE
related: ZzN5 m7B 5CY
related: C5152
related: eThQ HCv mY6
related: VZ1e t7d Thg
related: u1Wz DtQ 1Zm
related: eKuz edm kmi
related: C5151
narrower: Arbetsledare städ
broad match: whao Q6A ScE

Chefer inom handel
type: Concept
in scheme: JobTech Taxonomy - Yrke
definition: Formulerar och ansvarar för mål och strategier för verksamhet inom handel. Utformar riktlinjer, följer upp och utvärderar verksamheten mot uppsatta mål. Svarar för budget samt fördelar resurserna inom verksamheten. Har personalansvar. Hit hör inte Säljande butikschef (5222) Avdelningschef, butik (5222)
broader: Chefer inom handel
related: s5SS 7bW 1Gh
related: Bb7a V49 Da8
related: J8PY 9yw D5M
related: UH9g R5v MCx
related: SmZd Jaa BeY
related: 8tYq EXD Xwm
related: ZzN5 m7B 5CY
related: Nksx 4oe fEQ
related: eThQ HCv mY6
related: UJcF SrQ Jvw
related: 2wd8 VUk YSq
related: C1420
related: Gt5f wdi FSJ
related: TLkF mvM acW
related: q7Mx gjU F9q
related: yXmf iKi 7ci
related: VfP9 2xd g2h
related: zXNU zXR hGd
related: eKuz edm kmi
related: TGFT 7y2 ryH
related: 4fRg DA4 Dj3
related: Betk ZCh mY9
narrower: Uthyrningschef
narrower: E-commerce manager
narrower: Regionchef, butik
narrower: Centrumledare
narrower: Butikschef
narrower: Apotekschef
broad match: bh3H Y3h 5eD

Civilingenjör, elkraft
type: Concept
in scheme: JobTech Taxonomy - Yrke
definition: Civilingenjör, elkraft
broader: Civilingenjörsyrken inom elektroteknik
related: 6Hq3 tKo V57
related: YGuH BrH EAj
related: VX4Z 2yX xqZ
related: RRFS J8g TYw
related: 6YDU WKq GZP
related: A8Yn J9f K4G
related: 7VsC UNT Cry
related: E49L GLK 2u2
related: vjm7 TAC HVW
related: 43Gb amt ftT
related: SiUn tLS Sk8
related: VPut b9f rVd
related: eTqx bnu sjm
broad match: C2151

Webbmaster och webbadministratörer
type: Concept
in scheme: JobTech Taxonomy - Yrke
definition: Underhåller, övervakar och administrerar drift av Internet och interna webbplatser samt maskin- och programvara för webbservrar. Ansvarar för en webbplats övergripande struktur och innehåll.
broader: Drift-, support- och nätverkstekniker m.fl.
related: DW4R Ejt Y35
related: e4tA b22 rfY
related: sq2c q5d zXN
related: tkH5 VYd Y58
related: wynY a5Q F6t
related: JfDs FE6 EKy
related: hb1q 7u6 bqH
related: DHhX uVf y6X
related: Gk4E H9x ssE
related: VQs1 A6F bvi
related: LeES iac 1Qx
related: wE24 qV6 pJV
related: Fyzv 4ku Cse
related: xPii MYq v9r
related: qVjQ w6H dns
related: Bjvt 4Ji iHn
related: N8Tu Tsn 2VD
related: o8wR 57f jv9
related: zxNe iWG wqf
related: AfJ4 Pvv YBa
related: bJ3T CwH a2j
related: K8eq sEz eXV
related: V9z3 YfY Tob
related: voRm aoU cKB
related: buX8 38v YpB
related: fdR4 ECC San
related: Lrrv HyL PzJ
related: Vc24 oqo Qgr
related: Qdhn Fcs qyH
related: bdQe ReZ Bs4
related: FWBQ FA7 mXJ
related: eGP4 984 S1u
related: C7dn fgD zTU
related: TvaC Wot Xnz
related: rjP6 pCK AMw
related: bq5g QZW eyR
related: UuhP Skh QrH
related: jChL nQX Pvr
related: XhUm Yti Kr3
related: 4fWV khE jfp
related: NQmD sAK eFA
related: L4sY nSE UsH
related: RVMG 69z VoE
related: 2vCi hQz Y9o
related: kUcK d6Y SEr
related: nYAH rZC a2F
related: ev4i 9jA SfV
related: BKRi T8q VUy
related: y4QQ Uu9 Spg
related: CVJE Cru VPw
related: Uipj gPz Tvj
related: LrRm E3v NMF
related: Xnmr kYS YKY
related: 6QPL aN5 bGp
related: xLU5 TUM Gtw
related: 9YLn WYQ 7uA
related: HQJ2 68A AiZ
related: 4DBb Bde sVY
related: Egmd U5i sRA
related: 3JDY 1RB G7o
related: eLre uPr fuC
related: xTkt sZQ eVq
related: 5YFb ak8 3EM
related: fDfH ihY ReT
related: yNm8 krX usR
related: bR62 12C MPe
related: 2Qhs LdG PvN
related: eSrN jTs Uqh
related: 3H7m pt8 7b2
related: jCsR WQX CKD
related: Zp3W CBT Pom
related: QN8t 2kG kzL
related: euH8 yAp hiG
related: eGDx hg4 CTe
related: XRzZ xWE BNx

Socialsekreterare
type: Concept
in scheme: JobTech Taxonomy - Yrke
definition: En socialsekreterare arbetar med att stödja, utreda och hjälpa individer, familjer och grupper som befinner sig i olika sociala och ekonomiska svårigheter. Socialsekreteraren utreder och bedömer behov av stöd och hjälp enligt socialtjänstlagen, till exempel ekonomiskt bistånd, missbruksvård och stöd till barn och familjer. Gör hembesök, utvärderar stödinsatser och följer upp klienters situation. Fattar beslut om och beviljar ekonomiskt bistånd samt andra insatser. Källa: Arbetsförmedlingen
broader: Socialsekreterare
related: JuBG VGz 5qr
related: bqoN BCy RVq
related: v5gi Qw7 zV7
related: iwYg Wkm BaS
related: 9c7u Wif Xyb
related: zqxu Dkq qmw
related: Z7tu RDd 6A3
related: GazW 2TU kJw
related: hMfi yxJ reK
related: CCmK 1JA asw
related: tqW5 R3J oRx
related: TQ3Y EKP Vyq
related: DFhe Hj1 HY2
related: eN44 aYw 8ZP
related: Qgf6 D5b kaW
related: 3TJC mke Eqy
related: N8Un uRg wXh
related: foXm H91 Lyy
related: kwpH EcP gQG
related: bZEF zYE DiJ
related: 47K9 VkA TaC
related: XB2g ohn wjy
related: P45j sqo xNu
related: gFM8 wDF WfQ
related: 3Yzg WwB XVA
related: MwJP HL9 rUL
related: FW9y Vjg Ezr
related: 6CLJ PRk GFt
related: Y8MW Dbi kGu
related: tjes UnB ZFk
related: c86x MbT VV4
related: akY4 ErS YQB
related: NVFv mg8 koL
related: PpiU QxA vte
related: DpaV UG4 bDB
related: fnhW EBh bfJ
related: 7pcC aqa dXW
related: UES1 jUB VFv
related: wrBx pcM iP8
related: Tbtb uVp ZB2
related: tXm9 X5b SGq
related: Lg3T DGm k1e
broad match: C2635

Civilingenjör, farkostteknik
type: Concept
in scheme: JobTech Taxonomy - Yrke
definition: Civilingenjör, farkostteknik
broader: Civilingenjörsyrken inom maskinteknik
related: SuAn oH9 xNc
related: 6Hq3 tKo V57
broad match: C2144

Besiktningsingenjör, el-tele
type: Concept
in scheme: JobTech Taxonomy - Yrke
definition: Besiktningsingenjör, el-tele
broader: Civilingenjörsyrken inom elektroteknik
related: 6Hq3 tKo V57
related: z6Nf Xf1 Lh7
related: kDRm Yaa jAB
related: 8SJ6 wa9 fL1
broad match: C2153

Arbetsförmedlingschef
type: Concept
in scheme: JobTech Taxonomy - Yrke
definition: Arbetsförmedlingschef
broader: Övriga chefer inom samhällsservice
related: epLc SkD cbT
related: bh3H Y3h 5eD
related: k1cg rfZ 4iL
broad match: C1349

Förbundsdirektör
type: Concept
in scheme: JobTech Taxonomy - Yrke
definition: Förbundsdirektör
broader: Chefstjänstemän i intresseorganisationer
related: epLc SkD cbT
related: bh3H Y3h 5eD
broad match: C1114

Forskningslaborant, fysik
type: Concept
in scheme: JobTech Taxonomy - Yrke
definition: Forskningslaborant, fysik
broader: Laboratorieingenjörer
related: 6Hq3 tKo V57
related: EsWG kHG oXZ
broad match: C3111

Distriktschef, skogsbruk
type: Concept
in scheme: JobTech Taxonomy - Yrke
definition: Distriktschef, skogsbruk
broader: Förvaltare inom skogsbruk och lantbruk m.fl.
related: epLc SkD cbT
related: bh3H Y3h 5eD
related: VuuL 7CH adj
broad match: C1311

Piercare
type: Concept
in scheme: JobTech Taxonomy - Yrke
definition: Piercare utför håltagning i olika delar av kroppen där kund vill fästa smycke. Håltagning sker främst i öron, näsa, ögonbryn, navel eller andra områden, med hjälp av nål eller håltagningspistol. Förutom håltagning innefattar arbetsuppgifterna omfattar rådgivning, val av smycke och information om eftervård. Källa: Arbetsförmedlingen
broader: Övriga skönhets- och kroppsterapeuter
related: Uuf1 GMh Uvw
related: 9puE nYg crq
broad match: C5142

Tekniker, bilddiagnostik och medicinteknisk utrustning
type: Concept
in scheme: JobTech Taxonomy - Yrke
definition: Installerar, kontrollerar, övervakar och utför service på medicinteknisk utrustning som används vid diagnosticering eller behandling av olika sjukdomar. Sköter och övervakar t.ex. hjärtlungmaskiner.
broader: Biomedicinska analytiker, tandtekniker och laboratorieingenjörer m.fl.
related: nVVG PCh mRF
related: vi5t 1Ty Saz
related: ApUn CB8 UWH
related: qgx7 uNq F3m
related: C3211
related: CFGL C5S eLA
related: du5j oyG ju6
related: NdbW w95 cPP
related: jkPW 81C zq1
related: me7m vtv 7em
related: Rf1n 6Sj exu
related: ZnE5 spY UXL
related: dKZW S1i G81
related: DYnx H7B w7z
related: aRwo GPt n4V
related: bDte 6Uk 4tA
related: Qdcr Xda ncU
related: Npn9 t6p tV9
related: Bbj8 8y7 XJ5
related: FjqL Fvy iwc
narrower: Dentaltekniker/Dentalutrustningstekniker
narrower: Projektledare, bioteknik
narrower: Röntgentekniker
narrower: Perfusionist
narrower: Medicinteknisk ingenjör
broad match: 6Hq3 tKo V57

Lantmäteriingenjör
type: Concept
in scheme: JobTech Taxonomy - Yrke
definition: En lantmäteriingenjör är en specialist som arbetar med tekniska, juridiska och samhällsrelaterade uppgifter kopplade till fastigheter och mark. Yrket omfattar planering, genomförande och analys av mätningar samt kartläggning och fastighetsbildning. Lantmäteriingenjören hjälper till att fastställa och justera fastighetsgränser, genomföra avstyckningar och sammanslagningar av mark, ofta med hjälp av modern teknik som GPS, drönare och GIS-system. Källa: Arbetsförmedlingen
broader: GIS- och kartingenjörer
related: 6Hq3 tKo V57
related: XZ3N uRV VYH
related: rtpH mgD vdV
broad match: C3118

Driftingenjör, VA
type: Concept
in scheme: JobTech Taxonomy - Yrke
definition: Driftingenjör inom VA arbetar med drift, övervakning och optimering av anläggningar för vattenförsörjning och avloppshantering. Arbetsuppgifterna inkluderar planering och genomförande av drift och underhåll av vatten- och avloppsanläggningar, felsökning vid driftstörningar samt dokumentation och analys av driftdata. Driftingenjören utför även provtagning, tolkar analysresultat och initierar åtgärder utifrån myndighetskrav och rutiner. Yrkesrollen omfattar arbete med tekniska system, styr- och övervakningssystem samt delaktighet i förbättringsarbete och projekt. Driftingenjören samarbetar med tekniker, ingenjörer och andra funktioner för att upprätthålla en säker och effektiv drift samt följer gällande lagar och riktlinjer inom VA-sektorn.​ Källor: Sobona, Arbetsförmedlingen, jobbannonser på Platsbanken
broader: Ingenjörer och tekniker inom maskinteknik
related: 6Hq3 tKo V57
related: j7Cq ZJe GkT
related: yT4P 9sy zF2
related: 9aEn jPz gJs
related: mDAr o1M jg5
related: PSFA Y5L uYb
related: sXAT dUe eAy
broad match: C3115

Frontend-utvecklare
type: Concept
in scheme: JobTech Taxonomy - Yrke
definition: Frontend-utvecklare
broader: Mjukvaru- och systemutvecklare m.fl.
related: URP5 iwe oGE
related: bVZd pkH kgi
related: oB5o eSY PQd
related: rpnq Yqk sd1
related: TYhh 3UW bmb
related: apaJ 2ja LuF
related: KT6P hVH LRD
related: dxTf H3u oEf
related: XgQ9 XoM A2V
related: ZTvW tkE RLk
related: cYuo dCU cWC
related: sSwD fG3 tT1
broad match: C2511

Brukarspecialist
type: Concept
in scheme: JobTech Taxonomy - Yrke
definition: Person med egen erfarenhet av psykisk ohälsa som i partnerskap med ordinarie personal ger patienten eller brukaren känslomässigt stöd, kunskapsstöd och praktisk vägledning. Källa: SKR
broader: Skötare
related: NYW6 mP6 vwf
broad match: C3412

Redaktör
type: Concept
in scheme: JobTech Taxonomy - Yrke
definition: En redaktörs huvudsakliga uppgift är att bearbeta och förbättra texter för olika ändamål och målgrupper. Detta kan inkludera allt från att rätta stavfel och grammatik till att förbättra struktur, stil och tonalitet i en text. Redaktörer arbetar med allt från böcker och tidningar till webbplatser och andra typer av publikationer. Källa: Arbetsförmedlingen
broader: Journalister m.fl.
related: RCsT Rwb 1WX
related: 1M22 9Tc 3WJ
related: pYez WWr Ygt
related: rzx8 JLZ J5q
related: QomB kLR hPt
related: 4SdX 4xo BxU
related: H4iD Ts2 zjv
related: 1wex EbH 9iM
related: KDEs yD5 NHX
related: TA4Q VJq qfN
related: EQEm vQh 26o
related: ZnMn zNu JUQ
related: mSnV 5jk YtF
related: U1Nu bVK d3z
related: d2ho Pi2 rkV
related: UNsm fKz BUb
related: 8too bEs 7NU
related: AHsH ZZh uew
related: 9puE nYg crq
related: 54mu oP5 Z6g
related: 3Zey FA2 tpR
related: CjJ5 pAN 7Cr
related: UL38 btt 4Mc
related: dfEw r58 tuq
related: nG59 VCA m5U
related: wN3Z e2T 3q1
related: xMXX CDh Aag
related: DoQu UTo HPP
related: pyBw W5B hT1
related: fMnB Bxc Pj2
related: zskX ftb Xss
related: 3dPz MUg BaD
related: Emev bXT gWU
related: dKc4 PAf sTd
broad match: C2642

Hantverkspedagog
type: Concept
in scheme: JobTech Taxonomy - Yrke
definition: Hantverkspedagoger stödjer personer med psykisk ohälsa, beroendeproblematik eller funktionsnedsättning genom kreativa och praktiska hantverksaktiviteter. Arbetsuppgifter innefattar planering och genomförande av hantverksbaserade pedagogiska insatser som syftar till att stärka individens självkänsla, sociala förmågor och självständighet. Rollen omfattar även handledning och stöd i grupp eller individuellt, anpassning av aktiviteter efter brukarens behov samt samverkan med andra yrkesgrupper inom socialt arbete. Hantverkspedagoger använder hantverk som metod för rehabilitering, meningsfull sysselsättning och social inkludering. Källa: Arbetsförmedlingen
broader: Behandlingsassistenter och socialpedagoger m.fl.
related: GazW 2TU kJw
related: pvYo LK3 rX1
related: eL4m 8c4 p8b
broad match: C3412

Lagerplanerare
type: Concept
in scheme: JobTech Taxonomy - Yrke
definition: Lagerplanerare planerar och optimerar hur lager används. Arbetsuppgifter innebär bland annat att analysera och övervaka lagersaldon, beräkna kapacitetsbehöv, planera in- och utleveranser samt samordna med andra funktioner, så som inköp och produktion. Lagerplanerare arbetar ofta med digitala planeringssystem och rapporterar nyckeltal för lagerverksamheten. Beroende på arbetsplats kan lagerplanering och lagerstyrning ingå i arbetsuppgifter för andra yrken inom lager och terminal. Se även yrkena Lagerarbetare/Terminal arbetare och Arbetsledare lager och terminal. Källa: Arbetsförmedlingen
broader: Lager- och terminalpersonal
related: sSu6 qMg nYu
related: J5gJ 6vV egQ
related: tir7 BLM P6G
related: X82t awd Qyc
related: ASGV zcE bWf
related: EBG9 6rp SnH
related: oZfb NWk h5y
related: B4R1 dCX 9Xz
related: WTdE G1D m4K
related: dQDe 3ir mNh
related: WPtJ YKU zRC
broad match: C4322

Områdeschef, omsorg
type: Concept
in scheme: JobTech Taxonomy - Yrke
definition: Områdeschef, omsorg
broader: Chefer inom äldreomsorg
related: GazW 2TU kJw
related: epLc SkD cbT
related: bh3H Y3h 5eD
related: egnA 2qf nSq
broad match: C1343

Lantmätare
type: Concept
in scheme: JobTech Taxonomy - Yrke
definition: Handlägger tekniska, ekonomiska och juridiska frågor i samband med fastighetsbildning. Svarar för värdering och registrering av fastigheter. Ansvarar för mätnings- och kartläggningsarbete samt för framställning och uppdatering av kartor. Analyserar flyg- och satellitbilder. Ger råd bl.a. vid fastighetsbildning, mark- och fastighetsvärdering samt vid samverkan mellan fastigheter. Hit hör inte Kartingenjör (3117) Mätningsingenjör/MBK-ingenjör (3112)
broader: Arkitekter och lantmätare
related: tCER yDZ XnW
related: Z6GN aCQ MDc
related: 74Mw JUN VKx
related: KEPE tsb fB8
related: 5FMU Dt4 2hF
related: CSAs XK5 kkY
related: BrdZ oPC Kft
related: 5zLG 8jA HgL
related: ND2K ivB 6RA
related: 8GLo Bn4 XAq
related: VD9r h3d rN5
related: zSm1 NQU MRf
related: C2165
related: 4yr7 byG sX3
related: xxw6 hUh P1W
related: CWfM RL9 V4t
related: qMXe 1Di KMe
related: dnXS Zcy Bn1
related: XgGJ nFz J5g
related: pTEz GD2 J9b
related: c1VR Sgw DZ6
related: zSbb 3rY Z7H
related: DwsM hE1 xFm
narrower: Markförhandlare
narrower: Lantmätare
narrower: Exploateringsingenjör
narrower: Civilingenjör, lantmäteri
broad match: X82t awd Qyc

Spaterapeut
type: Concept
in scheme: JobTech Taxonomy - Yrke
definition: Spa-terapeuter utför behandlingar för avslappning och välbefinnande. Arbetsuppgifterna omfattar massage, kroppsinpackningar, ansiktsbehandlingar, aromaterapi och ibland enklare hand- och fotvård. I rollen ingår även kundmottagning, produktrekommendationer och miljöskapande arbete i spa-miljö. Källa: Kroppsterapeuternas Yrkesförbund, Arbetsförmedlingen
broader: Övriga skönhets- och kroppsterapeuter
related: CdeF Jac 66x
related: nPzP y29 CU8
related: Uuf1 GMh Uvw
related: dEzC N1b GGa
related: dwkn yQz 39k
related: XmWM BxW cur
broad match: C5142

Inredningsdesigner
type: Concept
in scheme: JobTech Taxonomy - Yrke
definition: Inredningsdesigner
broader: Inredare, dekoratörer och scenografer m.fl.
related: CyUr VEM zxS
related: 8BNg mci mX1
related: mJPP w4w Eih
related: Vkgk nWz h2a
related: LKR8 8Pq Xfs
related: 99HY qe6 cJo
related: ekge typ JMF
related: 8too bEs 7NU
related: 9puE nYg crq
related: xkPt vw8 MEH
related: tr2X itq FD3
broad match: C3432

Truckförare
type: Concept
in scheme: JobTech Taxonomy - Yrke
definition: Truckförare lastar, lossar och förflyttar gods med hjälp av truck. Arbetet innebär i huvudsak att köra truck i samband med lastning, lossning och flyttning av gods. Beroende på arbetsplats kan tillkommande arbetsuppgifter variera. Vanliga arbetplatser är lager, industrier, hamnar och byggarbetsplatser. Det är vanligt för truckförare att vara anställda via benammingsföretag. Källa: Arbetsförmedlingen
broader: Truckförare
related: qxZg szW 13p
related: WYA2 9cP zdA
related: ASGV zcE bWf
related: v5xJ Lbp pM6
related: qEfm kXH DV6
related: gdF2 mYz z3E
related: m4rL XSJ auS
related: STSQ MKh bDT
related: CHnh Udy th7
related: ti8f rRu Dqf
related: sSQu 1LG VGZ
related: ePqa Adj XLm
broad match: C8344

Butikskommunikatör/Visual merchandiser
type: Concept
in scheme: JobTech Taxonomy - Yrke
definition: Butikskommunikatör/Visual merchandiser
alternative label: Butikskommunikatör
alternative label: Visual merchandiser
broader: Inredare, dekoratörer och scenografer m.fl.
related: YCmq z6B 5Ny
related: GeDs WtB Zwe
related: 2HCr Mkj UNr
related: B6CE Ceh tYa
related: aiab pmE an8
related: 3a2c uKW wRW
related: RPTn bxG ExZ
related: nzAf 9WF y8g
related: y8sH eLq UHP
related: EXvG rHK h37
related: D6pc tE4 2Yf
related: 9puE nYg crq
related: PuYR VvL 4AQ
related: BBMe NmE fSM
related: HnnK nFE dRj
related: qcj9 7wi Xps
related: hkyz wHi Eut
related: jcRk LLd UY6
related: BUh7 fsH XDA
related: 5bhk AGv HNA
related: PuTV Ys9 7Pm
related: nDpy jKu C95
related: 3SME pR7 W3M
related: qge8 eWp Y3F
broad match: C3432

Demograf
type: Concept
in scheme: JobTech Taxonomy - Yrke
definition: Demograf
broader: Statistiker
related: X82t awd Qyc
related: eaDh YNG Sz9
broad match: C2120

Lärling, väghyvelförare
type: Concept
in scheme: JobTech Taxonomy - Yrke
definition: En lärling är anställd för att slutföra sin kvalificeringstid till väghyvelförare innan ett yrkesbevis kan utfärdas. Under kvalificeringstiden får du lärlingslön enligt avtal. Kvalificeringstiden tillsammans med teoretisk grundutbildning leder till yrkesbeviset. Ett lärlingsavtal mellan branschorganisation och företag tecknas. Källa: Arbetsförmedlingen
broader: Anläggningsmaskinförare m.fl.
related: j7Cq ZJe GkT
related: ja7J P8X YC9
broad match: C8342

Kemiingenjör
type: Concept
in scheme: JobTech Taxonomy - Yrke
definition: Kemiingenjör
broader: Ingenjörer och tekniker inom kemi och kemiteknik
related: 6Hq3 tKo V57
related: 5tyY GjC AcD
related: AqAk yrA tG3
broad match: C3116

Diabetessjuksköterska
type: Concept
in scheme: JobTech Taxonomy - Yrke
definition: Diabetessjuksköterska bedömer, planerar och följer upp vårdinsatser för personer med diabetes i syfte att främja hälsa och förebygga komplikationer. Sjuksköterska är en skyddad titel med legitimationskrav. En diabetessjuksköterska med specialistsjuksköterskeexamen får använda benämningen specialistsjuksköterska inom diabetesvård. Vanliga arbetsuppgifter är hälsobedömningar, justera och följa upp läkemedelsbehandling i samråd med läkare och ge utbildning och stöd till patienter och närstående för att stärka egenvårdsförmågan. Källa: Arbetsförmedlingen, Socialstyrelsen, Svensk sjuksköterskeförening
broader: Övriga specialistsjuksköterskor
related: NYW6 mP6 vwf
related: ytRi QuA XLX
related: QxJV jr2 jTd
related: 1f7B E5K sh3
broad match: C2221

Elektronikmontör
type: Concept
in scheme: JobTech Taxonomy - Yrke
definition: Elektronikmontörer monterar främst kretskort, elektroniska komponenter och kablar i diverse elektroniska produkter. Som elektronikmontör kan du ofta kombinera olika arbetsuppgifter och samtidigt arbeta även med testning och lödning. Källa: Arbetsförmedlingen
broader: Montörer, elektrisk och elektronisk utrustning
related: 7DgS 4Xq 5rH
related: sCGM pxm FZN
related: 9Q9F UuH zyV
related: PQTN faG J8X
related: 5ETM zu9 YMf
related: wZ8B vEg LV8
related: 6yZA gif 25L
related: dGGX oM8 2ao
related: 74dB 524 g4y
related: bXPW W92 P8E
related: 62sG HYo NfE
related: 8xCG AG3 osn
related: YNZi xc6 Koe
related: ZTxp aBN 3Yy
related: n567 xMt 5x5
related: PzKE 8MT mSX
related: zMv2 5zT wQi
related: owAx gRs vKV
related: oH33 Y1G Qyp
related: rpEx ird md9
related: 7T1n vfT pav
related: V41E 4Ds pXA
related: 231q MvK cVi
related: wTEr CBC bqh
broad match: C8212

Departementssekreterare
type: Concept
in scheme: JobTech Taxonomy - Yrke
definition: Departementssekreterare
broader: Planerare och utredare m.fl.
related: X82t awd Qyc
related: TZe9 NsN uce
broad match: C2422

Drifttekniker ledningsnät VA
type: Concept
in scheme: JobTech Taxonomy - Yrke
definition: Drifttekniker ledningsnät VA
broader: Anläggningsarbetare
related: HvQr wGJ Kdm
related: m3Zr JH8 BLz
related: MEMU Bfs ZTb
related: KMnH MCd bUW
related: 1onV rFJ mAU
related: j7Cq ZJe GkT
related: 8WZM pE5 yTt
related: Ypn4 TLR Z2Q
related: rP5q Yyb Rgv
related: UQtL JVa mbs
related: upbS QFL YQP
related: Y2Ey dGo iX9
broad match: C7119

Kundmäklare
type: Concept
in scheme: JobTech Taxonomy - Yrke
definition: Kundmäklare förmedlar köp och försäljning av aktier, obligationer och andra värdepapper på uppdrag av privatpersoner och företagskunder. Arbetsuppgifterna omfattar kundkontakt, orderläggning, rådgivning om investeringsmöjligheter, marknadsbevakning samt att hålla sig uppdaterad om finansmarknadens utveckling. Kundmäklare utvärderar finansiella risker, presenterar olika portföljstrategier och samarbetar ofta med andra specialister inom bank eller värdepappersbolag. Arbetsrollen kan även inkludera rapportering och uppföljning av kunders affärer samt presentation av investeringsalternativ. Källa: Arbetsförmedlingen, Skolverket/Utbildningsguiden
broader: Mäklare inom finans
related: RbsF qLv jeg
related: ko73 YTm fVb
related: Ejbu Qtg Hnm
related: RPTn bxG ExZ
related: X82t awd Qyc
broad match: C3311

Rekvisitör
type: Concept
in scheme: JobTech Taxonomy - Yrke
definition: Rekvisitör ansvarar för att införskaffa, tillverka, organisera och sköta all rekvisita som behövs för en film-, teater- eller TV-produktion. Vanliga arbetsuppgifter är hitta, hyra, köpa eller låna möbler, inredningsdetaljer, småföremål och andra rekvisitastycken, samt att reparera och underhålla dem under produktionens gång. Rekvisitören planerar rekvisitas användning i samråd med regissör och scenograf och säkerställer att rätt föremål finns tillgängliga vid rätt tidpunkt och på rätt plats. Källa: Arbetsförmedlingen, Stockholms Tillskärarakademi, Yrkesnämnden för Film och TV
broader: Inspicienter och scriptor m.fl.
related: LSKw JdS ZJU
related: 8too bEs 7NU
related: 9puE nYg crq
broad match: C3435

Skattejurist
type: Concept
in scheme: JobTech Taxonomy - Yrke
definition: Skattejurist
broader: Affärs- och företagsjurister
related: X82t awd Qyc
related: x4Wi NWW ogB
related: M9g3 3gJ nr9
related: Abcb QtH isZ
related: 3GYZ GL1 1JB
broad match: C2619

Hundförare
type: Concept
in scheme: JobTech Taxonomy - Yrke
definition: Hundförare arbetar med bevakning med hjälp av hund. Arbete är detsamma som för grundutbildade väktare, ordningsvakter och skyddsvakter. Hundförare har också särskild utbildning för att använda hund vid bevakning för att skydda sig själv mot brottsliga angrepp eller för att leta efter obehöriga. Hundar används också av bevakningsföretag för att söka efter sprängämnen. Källa: Bevakningsbranschens Yrkes- och Arbetsmiljönämnd
broader: Väktare och ordningsvakter
related: dVbW QJc xZi
related: P4pt 9Fu BRn
related: E7hm BLq fqZ
broad match: C5414

Veterinär
type: Concept
in scheme: JobTech Taxonomy - Yrke
definition: Veterinär undersöker, diagnostiserar och behandlar sjukdomar och skador hos djur. Veterinär är en skyddad titel med legitimationskrav. Vanliga arbetsuppgifter är kliniska undersökningar, medicinska och kirurgiska behandlingar, rådgivning till djurägare och förskrivning av läkemedel. Veterinären kan också arbeta med livsmedelskontroll, smittskydd och hygien, särskilt inom slakterier och livsmedelsindustrin. Källa: Arbetsförmedlingen, Jordbruksverket, Sveriges Veterinärförbund
broader: Veterinärer
related: Wz7b 5F8 pjG
related: ryt9 Nw7 JVv
related: NYW6 mP6 vwf
related: FiaL jbp 8vT
related: DtPs tTN xf8
related: PHBd Z9o LnK
related: dah6 YsN 18x
related: YCKW Nz5 52c
related: WjKY ZpZ 5Tt
related: H77Y q4g 5NP
related: bHq1 8TZ zuh
related: D1gU nCd uib
related: catp cn5 gYM
related: Xrm8 vqJ bar
related: aX8s v1Y xkp
related: bTte TK3 4xM
related: weHu 1FN ZZC
broad match: C2250

Embryolog
type: Concept
in scheme: JobTech Taxonomy - Yrke
definition: Embryolog
broader: Cell- och molekylärbiologer m.fl.
related: kJeN wmw 9wX
related: TXx8 Mgv BGZ
broad match: C2131

Matematisk statistiker
type: Concept
in scheme: JobTech Taxonomy - Yrke
definition: Matematisk statistiker
broader: Statistiker
related: 4uBh PJR 9Zk
related: X82t awd Qyc
broad match: C2120

Specialistläkare, akutsjukvård
type: Concept
in scheme: JobTech Taxonomy - Yrke
definition: Specialistläkare, akutsjukvård är en specialiserad legitimerad läkare med en djupare kunskap och kompetens inom sitt område. Specialistläkare är en skyddad titel och bara den som har bevis om specialistkompetens får kalla sig specialist i sin specialitet. Specialistläkare ansvarar för att diagnostisera, behandla och förebygga sjukdomar inom sin specialitet. Vanliga arbetsuppgifter är mottagningsarbete med patientbesök, rondarbete på avdelning, handledning av yngre läkare samt konsultationer till andra yrkesgrupper och specialiteter. Specialistläkare ansvarar även för att följa och leda utvecklingen inom sitt medicinska område och utför omfattande medicinsk dokumentation och administration. Källa: Arbetsförmedlingen, Karolinska Institutet, Socialstyrelsen, Sveriges Kommuner och Regioner, Sveriges läkarförbund
broader: Specialistläkare
related: NYW6 mP6 vwf
related: qSbw XHD Ycd
related: TChC u37 rt2
related: 6kb4 YBX zKU
related: EBX9 7gC eLt
related: vFjb AHi a54
related: jFHU uSj 4ke
related: KALC VvK 17U
related: QSeQ MpU wpW
related: 89LR AwA UqR
broad match: C2212

Övrig vård- och omsorgspersonal
type: Concept
in scheme: JobTech Taxonomy - Yrke
definition: Utför annat biträdande arbete inom vård och omsorg än inom 5341–5343. Exempel på arbetsuppgifter: Biträder vid obduktioner och på laboratorium.
broader: Skötare, vårdare och personliga assistenter m.fl.
related: C5329
related: C5321
related: Rhry gt3 gRP
related: Xw3d 9qU TAj
related: nA5p Ske 4zb
related: B67M 6mb LgF
related: tarU cdW NQg
related: eGs6 Hry JFw
related: ZrxP YPv 5QH
related: X86x yVk oZy
related: 7VBy vKp VX3
related: 8Nr2 zE3 FLJ
related: C5322
related: MwXk hDA hZr
related: C3259
narrower: Gipstekniker
narrower: Fysioterapibiträde
narrower: Obduktionstekniker
narrower: Arbetsterapibiträde
narrower: Tandvårdsbiträde
narrower: Laboratoriebiträde
broad match: NYW6 mP6 vwf

Lärare i yrkesämnen
type: Concept
in scheme: JobTech Taxonomy - Yrke
definition: Lärare i yrkesämnen
broader: Yrken med krav på fördjupad högskolekompetens inom utbildning
narrower: Lärare i yrkesämnen

Fartygsreparatör
type: Concept
in scheme: JobTech Taxonomy - Yrke
definition: En fartygsreparatör jobbar med att underhålla, renovera och reparera olika komponenter och system på ett fartyg för att säkerställa dess sjövärdighet och operativa effektivitet. Det innebär att ta itu med både rutinunderhållsuppgifter och akuta reparationer för att förhindra oväntade haverier och säkerställa säkerheten för besättningen och fartyget. Källa: Arbetsförmedlingen
broader: Underhållsmekaniker och maskinreparatörer
related: dRFw Rcu dX7
related: ynFn k8s Em6
related: ASGV zcE bWf
related: XouD cCj HZN
related: yhCP AqT tns
broad match: C7233

Supply chain manager/SCM manager
type: Concept
in scheme: JobTech Taxonomy - Yrke
definition: Supply chain manager/SCM manager
alternative label: SCM manager
alternative label: Supply chain manager
broader: Civilingenjörsyrken inom logistik och produktionsplanering
related: 74zh sTG Z8x
related: imtD HVn YJg
related: 6Hq3 tKo V57
related: HyV2 ZSX JHf
related: Sioy J3o Kmm
related: q8US Das zzG
related: AjC6 knc V98
related: wTCY 5ip 2A3
related: iwds EZE gU5
related: uak9 hXS us9
related: k4nY USq QeQ
related: gBmy H8o cgM
related: Bz2s u63 n3t
related: sDqJ tbG cdY
related: XihY PC6 oJy
related: xjqr APC hxf
related: XhFX GC2 28S
related: RbDp Lnp eFt
related: bG8D 36v YaT
related: wm1u nPU 2wp
related: dBHy PZZ G2w
related: RhCx ydP Zuh
related: CAji LxQ 5pJ
related: 5wVk fUw S43
related: 5Nvu Fgc FFD
related: 2xSJ wb3 Stw
related: yJNf kuj zMf
related: HArB mVY gHo
related: 2x9w XNX cR8
related: W3F5 k4r 2pk
related: JNod AG5 4h1
related: Pp36 Yhh Puc
related: sf9U 3jH Myh
broad match: C2141

Kravanalytiker
type: Concept
in scheme: JobTech Taxonomy - Yrke
definition: Kravanalytiker
broader: Systemanalytiker och IT-arkitekter m.fl.
related: WG5F H1P AL5
related: apaJ 2ja LuF
related: RJwS JUe SKW
related: ZM5B HGG Vyq
related: YmSA YpA VwF
related: CHZj hbN Wuf
related: qBsw ikL hZ2
related: 5anA RW3 YtF
related: ETvK oSq Cr9
broad match: C2511

Spårvagnsförare
type: Concept
in scheme: JobTech Taxonomy - Yrke
definition: Spårvagnsförare kör spårvagnar, tar emot betalningar och tar hand om passagerare. Spårvagnsförare kör spårvagnen på ett säkert och effektivt sätt. Då arbetet innebär kontakt med passagerare är det viktigt att vara serviceinriktad. Man hanterar trafik, väderförhållanden och eventuella störningar. Källa: Arbetsförmedlingen
broader: Buss- och spårvagnsförare
related: ASGV zcE bWf
related: Zapt qfe UbU
broad match: C8331

Professorer
type: Concept
in scheme: JobTech Taxonomy - Yrke
definition: Har ämnesansvar och övergripande ansvar för utbildnings- och forskningsverksamhet inom ämnet. Leder, genomför och utvecklar utbildning på alla nivåer inom högskola och universitet. Handleder forskarstuderande, leder forskargrupper och bedriver forskning. Utför sakkunniguppdrag.
broader: Universitets- och högskolelärare
related: snfZ N1g wrT
related: siJz YEX fvq
related: GtgF ir3 duv
related: ddzL 9as rZt
related: SWxu SnV 3oi
related: 9Ra9 2yh jH4
related: tzJA VZj 7ED
related: BvuG XdH tSq
related: Zffc M4R Gws
related: PZiV Lwg guL
related: C2310
related: FZpm KGY GrH
related: T93s ayM mop
related: Qc3r bM8 HsQ
related: 4hm5 UQk gGm
related: 5hrX ckd X8x
related: H6C4 BcN XAx
related: uwXg zmB Pdk
related: 2zkr pfv Wrk
related: UTCS daw 58F
related: jfmZ FfR NFm
related: hDvV ryY gUm
related: B7WE aJZ 3rn
related: mHaL zth 6R8
related: 9wjT WBC ppy
related: xE6k qAE vrk
related: pamn k5z ByJ
related: JYk8 qUB VcF
related: LswY aiM UT8
related: NRJn rU6 zUQ
related: 9kKp C7D Qme
related: BGCr oNQ WRD
related: ppnH 9N4 FE2
related: SYis puJ kXV
related: QEfk 7p4 yCb
narrower: Professor
broad match: MVqp eS8 kDZ

Reseproducent
type: Concept
in scheme: JobTech Taxonomy - Yrke
definition: Reseproducent
broader: Evenemangs- och reseproducenter m.fl.
related: RPTn bxG ExZ
related: 7YsN QkC YgR
related: 7K8T yx5 exC
broad match: C3332
broad match: C3339

Energiingenjör
type: Concept
in scheme: JobTech Taxonomy - Yrke
definition: Energiingenjör arbetar med att planera, utveckla och optimera energisystem för byggnader, anläggningar och industrier. Arbetsuppgifterna innefattar inventering och kartläggning av tekniska installationer, design av energieffektiva system, energiutredningar och energiberäkningar samt analys och visualisering av energidata. Energiingenjören utarbetar förslag på energieffektivisering, gör investeringsplaner och följer upp energianvändning, el-, värme- och vattenförbrukning. Yrkesrollen förekommer inom olika sektorer såsom fastighetsbolag, energibolag, industriföretag och konsultverksamheter. Energiingenjören arbetar ofta med projektledning och deltar i hela byggprocessens alla skeden, från planering till implementering och uppföljning av miljökrav och hållbarhetsstrategier.​ Källor: Arbetsförmedlingen, TUC Yrkeshögskola, KYH, jobbannonser på Platsbanken
broader: Ingenjörer och tekniker inom maskinteknik
related: Dhsg VU1 Wft
related: 6Hq3 tKo V57
related: Bt6Z oL6 41v
related: 9aEn jPz gJs
related: PABB mQ1 z7y
related: iytn JSh MUJ
related: M3FZ cyT 823
related: KxKJ DFq oM8
related: Zueg nEf 241
broad match: C3115

Skidliftvärd
type: Concept
in scheme: JobTech Taxonomy - Yrke
definition: Skidliftvärdar hjälper besökare vid skidanläggningar med påstigning vid liftar. Arbetet innebär i huvudsak att hjälpa besökare vid skidanläggningar med på- och avstigning vid liftar. Arbetet sker uteslutande utomhus. Förarbevis för skoter är ofta ett krav. Övriga, allmänna serviceuppgifter förekommer, så som att besvara frågor från besökare. Källa: Arbetsförmedlingen
broader: Övriga servicearbetare
related: UdVa jRr 9DE
related: QMoP RSE pzz
related: NE66 Uox Huu
related: yhCP AqT tns
related: uN1Y akD fHH
related: xJgc 5LZ iXt
broad match: C9629

Kommissarie, Polisen
type: Concept
in scheme: JobTech Taxonomy - Yrke
definition: Kommissarie, Polisen
broader: Poliser
related: E7hm BLq fqZ
related: iMqo ath xRX
related: DNcP Brg 61E
broad match: C3355

Controller
type: Concept
in scheme: JobTech Taxonomy - Yrke
definition: Controller
broader: Controller
related: CqHm JjQ v4w
related: TsmS S4S mUC
related: UMVH gRy RDz
related: yirm rcD 5ie
related: cCsp FV9 Lk6
related: 7P2y Bj7 m6o
related: NCmK XSP 8dk
related: qfPe Gu3 qLa
related: 2tWF 75M tJg
related: nwuz i2b q2H
related: Pb5d qWN uQe
related: eQFc 7Vq buj
related: oa3F C3K kf2
related: X82t awd Qyc
related: vNvh wpm 8hP
related: vw7i 55Q xxT
related: W4vT hzL z8K
related: ovoQ Wsh 26p
related: 5Xrp Wh3 D8s
related: r47z fh9 9NL
related: fDA4 MrS 7Dj
related: mVsn xTv rga
related: TXDX 1en kzh
related: rmbr sDP WU6
related: upmx X14 qnT
related: tkc4 nbu iUS
related: NNsa gYF nkX
related: 9r1v MqM dD6
related: LTDT Dvw EZs
related: fcpE ps5 8do
related: A61f rJd 9vZ
related: cRuR avV GaJ
related: BXdf gJ2 9jm
related: KPrP GB3 PmT
related: mMyz xea GZp
related: 7Mbt fta Smw
related: iFFC BUv Riu
related: t2gV iw5 gYR
related: 58Kp L4J TYp
related: xWQw 1gS xZo
related: 5iqf fid GHK
related: Xuhg pc6 dDp
related: E67g tbB rVH
broad match: C2411

Regionsekreterare
type: Concept
in scheme: JobTech Taxonomy - Yrke
definition: Regionsekreterare
broader: Planerare och utredare m.fl.
related: X82t awd Qyc
related: TZe9 NsN uce
related: ptW7 MeA kwP
broad match: C2422

Taxitelefonist
type: Concept
in scheme: JobTech Taxonomy - Yrke
definition: En taxitelefonist tar emot och hanterar bokningar av taxiresor via telefon eller andra digitala kanaler. De ansvarar för att ge kunderna information om priser och väntetider samt att koordinera med taxichaufförer för att säkerställa att kunderna får sina resor bokade och genomförda. Till växeln kommer två huvudkategorier av beställningar. Den ena är färdtjänst, den andra skol- och arbetsresor. Källa: Arbetsförmedlingen, Transport
broader: Telefonister
related: rp4g bdJ 57R
related: UdVa jRr 9DE
related: qmZM 165 LGH
related: X82t awd Qyc
related: jVDd XNh fCE
broad match: C4223

Bildarkivarie
type: Concept
in scheme: JobTech Taxonomy - Yrke
definition: Bildarkivarie
broader: Bibliotekarier och arkivarier
related: X82t awd Qyc
related: 7Vne Ptb Jqi
related: 9puE nYg crq
related: 2Zyy sU8 zm3
broad match: C2621

Kontorsvaktmästare
type: Concept
in scheme: JobTech Taxonomy - Yrke
definition: Kontorsvaktmästare ger stöd och service på en organisations arbetsplats. Vanliga arbetsuppgifter är underhåll av lokaler, påfyllning av förbrukningsmaterial, posthantering, beställning och lagerhållning av material, uppsättning av utrustning och möblering samt stöd vid konferensverksamhet. Arbetsplatser är vanligtvis kontor men kan även vara andra privata och offentliga arbetsplatser, så som hotell, bibliotek och köpcentrum. Kontorsvaktmästare arbetar generellt inte med teknisk fastighetsskötsel. Yrket skiljer sig därför från Fastighetsskötare och Fastighetstekniker. Källa: Arbetsförmedlingen
broader: Vaktmästare m.fl.
related: UdVa jRr 9DE
related: n1qu W3m eZu
related: c9gC sB9 EqH
related: X82t awd Qyc
related: 4YRW Vv3 7ws
related: U3Qg hLr qtn
related: VzL4 fWS o33
related: q1HW 9M1 t88
related: nYJW AKt DpL
related: yhCP AqT tns
related: pdzu y9D d5K
related: p9kW YJz Tjs
related: AhS6 7ob t9R
related: zU1W XAo rD6
broad match: C9622

Civilingenjör inom elektroteknik
type: Concept
in scheme: JobTech Taxonomy - Yrke
definition: Civilingenjörer inom elektroteknik arbetar med utveckling, design och underhåll av elektriska system och komponenter. Arbetsuppgifterna varierar beroende på bransch och arbetsgivare men inkluderar ofta systemutveckling, produktutveckling, design, felsökning, underhåll och dokumentation. Som ingenjör arbetar man ofta med att lösa tekniska problem för system och/eller produkter. Det är vanligt att specialisera sig mot specifika verktyg och programvaror. Man kan arbeta i olika branscher, till exempel energi, industri, telekom och IT. Mer seniora civilingenjörer arbetar ofta som projektledare eller chefer. Källa: Arbetsförmedlingen
broader: Civilingenjörsyrken inom elektroteknik
related: 6Hq3 tKo V57
related: Fzzo 7Xe 3bV
related: 95zs o5N 43i
related: s9pM C7Z mPN
related: rknp JQp gSc
broad match: C2152

Bibliotekarie
type: Concept
in scheme: JobTech Taxonomy - Yrke
definition: Bibliotekarie
broader: Bibliotekarier och arkivarier
related: SZhy HTK 4cz
related: kK7G FGN QJh
related: WWJv mz4 dGM
related: XKnt hVU mgi
related: dShi jUh 3YD
related: X82t awd Qyc
related: r4Qc kf5 pHE
related: zH8J 89F EHn
related: D6zC nPP 22M
related: XzVk ZZp FVG
related: fyga cLE yoo
related: N1oy hEg oNG
related: 9puE nYg crq
related: zQVG dDj t44
related: hEwA 7kc TAh
related: HEzy pvG yxh
related: 3x2W 7nL m4x
related: i1ka t2j gbu
related: vfrB bVs 9YT
related: Gm62 6hK Ymf
related: 7GzE rx4 X3M
related: ZNrX GTN EzL
related: JutT 2Sk mnF
related: 99FS Nzg UTD
related: 48tm 2xG bLk
related: i6fK pBt 2Xq
related: VLQc Hfd d51
related: z3zB mCa aRs
related: W7Jw fE8 KCF
broad match: C2622

Behandlingsassistenter och pastorer
type: Concept
in scheme: JobTech Taxonomy - Yrke
definition: Behandlingsassistenter och pastorer
broader: Yrken med krav på högskolekompetens eller motsvarande inom kultur, friskvård och socialt arbete m.m.
narrower: Behandlingsassistenter och socialpedagoger m.fl.
narrower: Pastorer m.fl.

Gruppledare för kontorspersonal
type: Concept
in scheme: JobTech Taxonomy - Yrke
definition: Samordnar, leder, planerar och fördelar arbetet inom kontor och kundservice. Utbildar och instruerar personal.
broader: Juristsekreterare, chefssekreterare och institutionssekreterare m.fl.
related: xSLo P6B 2AF
related: DJgq zBj bKt
related: aUr6 Rjg ja2
related: aMyW hB7 TpU
related: 3HjW 1BP k3S
related: 3vYj Rhf Voh
related: Uv9y v2g efa
related: Tmps QPE g3V
related: NUC3 y1C Scg
related: ZzN5 m7B 5CY
related: cw2M p2W SuJ
related: Y3B6 QRV zGk
related: eThQ HCv mY6
related: dYqT JBz NZE
related: 5wab aFK gdL
related: y3DA xBr 1Hx
related: PVnT yGT SMb
related: WBHW i3f fUd
related: qtHa AsU Cfo
related: Nig2 2pU GT8
related: LmAP e75 pc6
related: 7scD 9YP iwV
related: jcpA Zfs nSz
related: qsCj EhM fyT
related: RB7E jE5 MZ3
related: Kvft WHn KJE
related: 2ZFC 6de YSB
related: NMZ1 bCs WcR
related: CaXq Bbe T3X
related: B1rc wCc vne
related: w8bU wHe omF
related: 73gL 4uv p9J
related: sGky Wqy QvZ
related: C3341
related: 8u7A ze1 bvd
related: 6Ei3 fZV YKM
narrower: Arbetsledare, säkerhetsarbete/Gruppledare, säkerhetsarbete
narrower: Arbetsledare, kundtjänst/Gruppledare, kundtjänst
narrower: Floormanager
narrower: Arbetsledare, kontorspersonal/Gruppledare, kontorspersonal
broad match: X82t awd Qyc

Brandskyddsmontör
type: Concept
in scheme: JobTech Taxonomy - Yrke
definition: Brandskyddsmontörer monterar och underhåller passiva brandskyddssystem i byggnader. Arbetsuppgifterna inkluderar bland annat brandfogning, brandskyddsmålning, brandtätning och brandisolering. Arbetet sker i både nybyggnation och genom underhåll av befintliga byggnader. Beroende på arbetsplats kan det även ingå att identifiera brister i brandcellsgränser och ge råd om lämpliga brandskyddsprodukter. Källa: Arbtesförmedlingen
broader: Övriga byggnads- och anläggningsarbetare
related: j7Cq ZJe GkT
broad match: C7119

Location scout/Platsletare, film
type: Concept
in scheme: JobTech Taxonomy - Yrke
definition: Location scout/Platsletare, film arbetar med att hitta och föreslå inspelningsplatser (locations) som motsvarar regissörens, fotografens och scenografens vision för en filmproduktion. Vanliga arbetsuppgifter är utforska, dokumentera och presentera möjliga inspelningsmiljöer, boka platser samt samordna tillstånd och kontakter med lokala myndigheter och markägare. Källa: Arbetsförmedlingen, Yrkesnämnden för Film och TV
alternative label: Location scout
alternative label: Platsletare, film
broader: Inspicienter och scriptor m.fl.
related: 8too bEs 7NU
related: 9puE nYg crq
broad match: C3435

Förvaltnings- och planeringschefer
type: Concept
in scheme: JobTech Taxonomy - Yrke
definition: Förvaltnings- och planeringschefer
broader: Chefer inom ekonomi, HR, marknadsföring och försäljning samt annan administration m.m.
narrower: Förvaltnings- och planeringschefer

Teateragent
type: Concept
in scheme: JobTech Taxonomy - Yrke
definition: Teateragent representerar och förhandlar för skådespelare, dramatiker, regissörer och andra kreativa yrkesverksamma inom scenkonst. Vanliga arbetsuppgifter är att hitta nya roller och uppdrag för klienter, förhandla kontrakt med teatrar, produktionsbolag och andra aktörer och sköta PR och marknadsföring Källa: Arbetsförmedlingen, StagePool
broader: Övriga förmedlare
related: RPTn bxG ExZ
related: 8too bEs 7NU
related: 9puE nYg crq
broad match: C3339

Ridlärare
type: Concept
in scheme: JobTech Taxonomy - Yrke
definition: Ridlärare utbildar och tränar ryttare samt hästar inom grundläggande och avancerad ridning. Arbetsuppgifter inkluderar undervisning i ridteknik, hästhantering, säkerhetsrutiner och tävlingsförberedelser. Ridlärare planerar lektioner, anpassar träningen efter ryttarens nivå och samverkar med ridskolor, hästägare och andra aktörer inom ridsporten. Källa: Ridskolornas riksorganisation, Svenska Ridsportförbundet, Arbetsförmedlingen
alternative label: Ridinstruktör
broader: Idrottstränare och instruktörer m.fl.
related: PenB 8Hn yLL
related: 5BT7 5k5 pDk
related: x9aH JvY sNP
related: MUeD UKU HPs
related: fdC4 4dJ 2yF
related: 9kbi Bxt zpN
related: jyT1 DoZ Bpp
related: NkzV FeU ugY
related: tHyk mfi YXU
related: rbjd S7t yBo
related: MVqp eS8 kDZ
related: 5Mzb w4f XWq
related: w1x6 gF4 Asm
broad match: C3423

Projektledare: kultur, media, film, dataspel
type: Concept
in scheme: JobTech Taxonomy - Yrke
definition: Projektledare: kultur, media, film, dataspel
broader: Regissörer och producenter av film, teater m.m.
related: sVTo xRW bMa
related: w8XZ 6ha R44
related: X82t awd Qyc
related: 8too bEs 7NU
related: 9puE nYg crq
related: yXSE wvx EAN
related: bzuv wvS 3xK
related: R75r UZB JZA
related: YcPT 6ee Ctq
related: Cesw d3v ioU
broad match: C2654

Byggnadskonstruktör
type: Concept
in scheme: JobTech Taxonomy - Yrke
definition: En byggnadskonstruktör förverkligar arkitekternas visioner till praktiska och stabila bygglösningar genom att planera och utforma byggnadens strukturella system. Byggnadskonstruktören säkerställer att byggnaden är stabil, säker och uppfyller byggnormer och regler. Konstruktören måste ha djup kunskap om byggnadsmaterial, tekniker och hållbarhet för att skapa bärande system som kan motstå olika laster. Genom nära samarbete med arkitekten bidrar konstruktören till att förverkliga projektets design och säkerställa byggnadens långsiktiga hållbarhet och säkerhet. Källa; Arbetsförmedlingen
broader: Ingenjörer och tekniker inom bygg och anläggning
related: HssR ven Tj1
related: B2kz RAJ tTp
related: PMAv xo9 Wrz
related: j7Cq ZJe GkT
related: ihC1 cLE NeW
related: PFFZ V2z LuT
related: KWNv oWK 5E2
related: HQGR 2C3 chp
related: 4vFz PXy t62
related: ja7J P8X YC9
related: REMR Xdm V3o
related: P6xG 9K4 n7M
related: C41S vox 2gE
related: ZjCw 9JF b8s
related: rH9y 1fw 3r3
broad match: C3112

Fotterapeuter
type: Concept
in scheme: JobTech Taxonomy - Yrke
definition: Behandlar förhårdnader, nageltrång och andra besvär på fötter. Utför medicinsk fotvård. Ger råd om egenvård, skor och hjälpmedel. Hit hör inte Pedikyrist/Pedikurist (5149) Podiatriker/Podiater (2289)
broader: Skönhets- och kroppsterapeuter
related: 5APZ gLs AB4
related: 4QAE wtY gJh
related: C5142
related: PVRj CoJ SfS
related: YyAn TSP sqk
related: eBqZ iaD gPF
related: GeeT jCR c55
narrower: Medicinsk fotterapeut
broad match: Uuf1 GMh Uvw

Lärling, anläggningsdykare
type: Concept
in scheme: JobTech Taxonomy - Yrke
definition: Lärling, anläggningsdykare
broader: Anläggningsdykare
related: j7Cq ZJe GkT
related: ja7J P8X YC9
broad match: C7541

Akrobat
type: Concept
in scheme: JobTech Taxonomy - Yrke
definition: Akrobat
broader: Övriga yrken inom kultur och underhållning
related: 8too bEs 7NU
related: 9puE nYg crq
broad match: C2659

Rollsättare
type: Concept
in scheme: JobTech Taxonomy - Yrke
definition: Söker och väljer skådespelare till olika roller. Källa: YNFT
broader: Regissörer och producenter av film, teater m.m.
related: jTBd 5VT LSL
related: hxJs 1Fq 41F
related: 8too bEs 7NU
related: 9puE nYg crq
related: gZYx jKX KXL
related: Cesw d3v ioU
broad match: C2654

Försäljningsassistent
type: Concept
in scheme: JobTech Taxonomy - Yrke
definition: Försäljningsassistenter stödjer försäljningsorganisationen med olika administrativa arbetsuppgifter. Arbetsuppgifter kan inkludera ordermottagning, koordinera leveranser, uppdatera försäljningssystem, följa upp offerter, administrera kunduppgifter, hantera fakturering och bistå säljare med underlag inför kundmöten. Vanligtvis används affärssystem och andra digitala verktyg. Källa: Arbetsförmedlingen
broader: Marknads- och försäljningsassistenter
related: RPTn bxG ExZ
related: HvYw ic2 FN4
related: fKju yej bi6
related: XhWm pGc J1p
related: cJEX fsa YKW
related: xP9M TSR BmL
related: RVAa eLC dfz
related: kWCu zbd 8DQ
related: yS1z 6sP ksa
related: Dz1m vPe mFR
related: 7zjo fCt xxw
related: WUn7 Qxe bKQ
related: UtJX XoW Pes
related: 3bhw eCp gXE
related: mE65 dhs VkF
related: zdxw ppq aXG
broad match: C4419

Tandläkare
type: Concept
in scheme: JobTech Taxonomy - Yrke
definition: Förebygger, diagnostiserar och behandlar sjukdomar och skador i munhåla och käksystem. Undersöker och följer upp utveckling och tillväxt av tänder och käkar. Lägger upp preventions- och behandlingsplaner, lagar tänder, behandlar tandställningsfel samt utför tandoperationer. Informerar, ger råd och utfärdar anvisningar om egenbehandling och preventiv tandvård. Utvecklar teorier och metoder inom tandläkarvetenskapen.
broader: Tandläkare
related: viQT 1Vf hvu
related: Msbw VmW pGi
related: Ck61 zyS h4a
related: 4QAE wtY gJh
related: c6Gm H7X DGT
related: 9Fna GUm HWL
related: ci3b VjY RyA
related: ZKLQ YPa zHs
related: Mmxs Qrv cpG
related: b2V1 Ue5 xM2
related: nZbw skg yDf
related: R85L 23s y4M
related: AQmz Gwa yjF
related: WkAF LMB ncC
related: MVKv XXk XAi
related: C2261
related: uWKc hi4 JjZ
related: 8GzZ PU4 1oC
related: F7nJ k5s L29
related: rF7s hX1 ECH
related: rVUL AgV ZTH
related: c2YE oK3 f1u
related: 25sG BnK HU3
related: 17Uy FAd BRr
related: Qgfp vqW 51G
related: 3Csq ZWK STM
related: cwW4 SJk zvh
related: yV9B PxJ TxS
related: ezVu GhE b3b
related: FjqL Fvy iwc
narrower: Specialisttandläkare inom odontologisk radiologi
narrower: Specialisttandläkare inom oral protetik
narrower: Specialisttandläkare inom pedodonti
narrower: Tandläkare
narrower: Specialisttandläkare inom parodontologi
narrower: Specialisttandläkare inom ortodonti
narrower: Specialisttandläkare inom endodonti
narrower: Specialisttandläkare inom orofacial medicin
narrower: Specialisttandläkare inom käkkirurgi
narrower: Forskare, odontologi
narrower: ST-tandläkare
narrower: Specialisttandläkare inom bettfysiologi
broad match: NYW6 mP6 vwf

Plantskolearbetare
type: Concept
in scheme: JobTech Taxonomy - Yrke
definition: Plantskolearbetare arbetar med odling och skötsel av skogsplantor. Arbetet innebär i huvudsak att odla och sköta skogsplantor. Under sommarsäsong är vanliga arbetsuppgifter bevattning, gödsling och ogräsrensning. Under vintersäsong är arbetsuppgifterna främst att packa och levera plantor till kunder. Beroende på arbetsplats kan man även sköta maskiner som sorterar, behandlar och packar plantor. Då ingår även förebyggande och avhjälpande underhåll av produktionsutrustningen. Afrbetsuppgifter: odla växter, sköta växter, odla skogplantor, sköta skogplantor, rensa ogräs, packa Källa: Arbetsförmedlingen
broader: Bärplockare och plantörer m.fl.
related: UdVa jRr 9DE
related: ZqTy RAD 5ci
related: VuuL 7CH adj
broad match: C9215

Personskyddsväktare
type: Concept
in scheme: JobTech Taxonomy - Yrke
definition: Personskyddsväktare arbetar med att skydda enskilda personer. Arbetet innebär att skapa ett extra skydd i den enskilde kundens omedelbara närhet. Det kan innebära att om att förebygga och förhindra angrepp mot kundens liv, hälsa eller rörelsefrihet. Förebyggande skyddsarbete ingår även, inklusive planering, råd och anvisningar för att sänka risker mot den enskilde. Med särskilt tillstånd kan personskyddsväktare få bära OC-spray (pepparspray) och skjutvapen. Källa: BYA Bevakningsbranschens Yrkes- och Arbetsmiljönämnd
broader: Väktare och ordningsvakter
related: E7hm BLq fqZ
broad match: C5413

Montörer
type: Concept
in scheme: JobTech Taxonomy - Yrke
definition: Montörer
broader: Yrken inom maskinell tillverkning och transport m.m.
narrower: Montörer

Officerare
type: Concept
in scheme: JobTech Taxonomy - Yrke
definition: Officerare
broader: Officerare
narrower: Officerare

Återvinningsarbetare
type: Concept
in scheme: JobTech Taxonomy - Yrke
definition: Återvinningsarbetare
broader: Återvinningsarbetare, tidningsdistributörer och övriga servicearbetare
narrower: Renhållnings- och återvinningsarbetare

Optiker
type: Concept
in scheme: JobTech Taxonomy - Yrke
definition: Optiker undersöker synen och rekommenderar samt anpassar glasögon, kontaktlinser och andra synhjälpmedel. Optiker är en skyddad titel med legitimationskrav. Vanliga arbetsuppgifter är att genomföra synundersökningar med hjälp av olika mätinstrument, bedöma ögats hälsostatus, remittera vidare vid misstanke om ögonsjukdom samt journalföra alla undersökningar. Optikern har daglig kontakt med kunder och ger rådgivning kring synhälsa och användning av synhjälpmedel. Källa: Arbetsförmedlingen, Karolinska Institutet, SACO, Socialstyrelsen
broader: Optiker
related: NYW6 mP6 vwf
related: sqvh gTy 6Sj
related: u7CD bm6 nGy
related: 8FyG Z2w JrA
related: iCmr keb eg3
related: r1d1 6Y5 YHb
related: axch gGe VmQ
broad match: C2267

Konstintendent
type: Concept
in scheme: JobTech Taxonomy - Yrke
definition: Konstintendent
broader: Museiintendenter m.fl.
related: CHEW fSe xs3
related: JxVv btB MTz
related: 9puE nYg crq
related: HYGR tEZ 635
broad match: C2621

Resesäljare
type: Concept
in scheme: JobTech Taxonomy - Yrke
definition: Resesäljare planerar och bokar resor för privatpersoner och företag. Arbetet omfattar att föreslå resmål, transport och boende som passar kundens behov och budget samt att kombinera olika resekomponenter till paket. Resesäljare tar emot bokningar via personliga möten, telefon och internet och använder bokningssystem för att genomföra reservationer och biljetthantering. Affärsresesäljare har tydligare fokus på företagskunder och komplexa tjänsteresenät, medan privatresesäljare ofta arbetar mer med turism- och semesterresor. Källa: Arbetsförmedlingen
alternative label: Reseförsäljare
broader: Resesäljare och trafikassistenter m.fl.
related: kqiN Ae6 ttZ
related: peuc zph evN
related: sg4j jnu Tvm
related: qnEy cCM VPM
related: rDcj Tao TJJ
related: RPTn bxG ExZ
related: vjfo gvN jhR
related: 3tfd KhX m2z
related: ASGV zcE bWf
related: EYud iQc vyU
related: xB7t TGW Fh7
related: un7V 4WC deB
related: A5D7 nx6 oFD
related: F1ib cp1 qND
related: V5yB PUf JnR
related: R4vJ KoW eom
related: SWdr 4Fs 3Ga
related: MJz7 jwE GwY
related: atyc EMm yJn
related: Cihm 7Vu uWt
related: TJMu ip6 u3o
related: mTrc xoa Fua
related: Tbgq 41L 8L4
broad match: C4221

Övriga montörer
type: Concept
in scheme: JobTech Taxonomy - Yrke
definition: Utför annat monteringsarbete än inom 8211-8214. Exempel på arbetsuppgifter: Sätter i seriemässig tillverkning samman komponenter av exempelvis papp, textil, läder och liknande material till olika produkter.
broader: Montörer
related: VPF1 UZM 9Kd
related: nxpX kxs DKy
related: D5DJ sL7 dW3
related: eJaK Sy8 dED
related: qQ61 EQR rcz
related: VTwt 5Fe 6bW
related: AVTv HYi nf9
related: 85C2 bUX JUW
related: KDzy Hra iVr
related: C8219
related: pJ7H W2u qGm
related: CDSy mMU vKP
related: qPmT 5pS Th9
related: 37kK Vmn QD2
related: X4EU ZC7 QmK
related: uenm 75h fEh
related: dWbY gXC Frx
narrower: Skyltmontör
narrower: Mätartekniker VA
narrower: Montör papp- och textilprodukter
narrower: Braskaminmontör
broad match: wTEr CBC bqh

Tågtrafikledare
type: Concept
in scheme: JobTech Taxonomy - Yrke
definition: Tågtrafikledare planerar och leder tågrafik. Tågtrafikledare planerar och leder tågtrafik i samarbete med andra trafikledare och trafikinformatörer. Trafik övervakas via datoriserade system och vid behov leder man om trafiken eller hanterar incidenter och olyckor. Arbetet innebär även att ge trafikinformatörer korrekt information för att hålla resenärerna uppdaterade. Trafikledaren arbetar självständigt under skift, övervakar järnvägstrafiken med digitala verktyg och har kontakt med lokförare och blåljuspersonal vid incidenter. Källa: Järnvägsjobb, Trafikverket
broader: Transportledare och transportsamordnare
related: tiNH 43h 4rZ
related: BE3j J1z mTi
related: PFHT hzN ypV
related: 3Sru tJU XgX
related: X82t awd Qyc
related: cBZ9 B7f nH1
related: S1Sc k9E UsQ
related: ASGV zcE bWf
related: LjWq vd1 de7
related: 4CDT dvj oB2
related: rSmj Ho5 hjU
related: H84x NXy fsV
related: fR8y iuG 1pv
broad match: C4323

Biomedicinska analytiker, tandtekniker och laboratorieingenjörer m.fl.
type: Concept
in scheme: JobTech Taxonomy - Yrke
definition: Biomedicinska analytiker, tandtekniker och laboratorieingenjörer m.fl.
broader: Yrken med krav på högskolekompetens eller motsvarande inom hälso- och sjukvård samt laboratorium
narrower: Biomedicinska analytiker m.fl.
narrower: Tandtekniker och ortopedingenjörer m.fl.
narrower: Receptarier
narrower: Tekniker, bilddiagnostik och medicinteknisk utrustning
narrower: Laboratorieingenjörer

Testförare
type: Concept
in scheme: JobTech Taxonomy - Yrke
definition: Testförare kör prototyp- och förproduktionsfordon i syfte att testa och utvärdera bland annat prestanda, säkerhet och komfort. Arbetsuppgifter omfattar bland annat att testa bilar i olika situationer och dokumentera resultat av tester. Resultat av tester kan hjälpa, till exempel, ingenjörer att förbättra designlösningar och identifiera problem. Man kan arbeta för biltillverkare, oberoende fordonsprovningsorganisationer eller biltidskrifter. Källa: ESCO, Arbetsförmedlingen
broader: Övriga bil-, motorcykel- och cykelförare
related: jxJT 8mk jBW
related: UdVa jRr 9DE
related: EY3i ekR W9x
related: ASGV zcE bWf
broad match: C8322

Resesäljare, kundtjänstpersonal och receptionister m.fl.
type: Concept
in scheme: JobTech Taxonomy - Yrke
definition: Resesäljare, kundtjänstpersonal och receptionister m.fl.
broader: Kundserviceyrken
narrower: Telefonister
narrower: Resesäljare och trafikassistenter m.fl.
narrower: Hotellreceptionister m.fl.
narrower: Kundtjänstpersonal
narrower: Kontorsreceptionister
narrower: Marknadsundersökare och intervjuare

Träarbetare, utan yrkesbevis/Snickare, utan yrkesbevis
type: Concept
in scheme: JobTech Taxonomy - Yrke
definition: En snickare utan yrkesbevis saknar helt eller delvis yrkesutbildning till yrket. Arbetsuppgifterna varierar kraftigt beroende på anställning. Källa: Arbetsförmedlingen
alternative label: Snickare, utan yrkesbevis
alternative label: Träarbetare, utan yrkesbevis
broader: Träarbetare, snickare m.fl.
related: Auwn 6MV Mkp
related: j7Cq ZJe GkT
related: XUQK 1JN sTZ
related: Ap2v B1L DMq
related: ja7J P8X YC9
related: kfnW vEt CUS
broad match: C7115

Mätningsingenjör
type: Concept
in scheme: JobTech Taxonomy - Yrke
definition: En mätningsingenjör gör inmätningar och utsättningar med avancerade digitala instrument, både optiskt och med satelliter. En mätningsingenjör utför mätningar på alla typer av byggen inom väg, järnväg, markanläggningar, bostäder, tunnlar och broar. Utifrån dessa mätningar ta fram underlag till kartor och ritningar som behövs för olika projekt vid exempelvis nybyggnation, ombyggnation och underhåll. Förutom att arbeta praktiskt ute på byggarbetsplatser sitter du även på kontor med bland annat bygghandlingar, ritningar och beräkningar. Källa: Arbetsförmedlingen
broader: GIS- och kartingenjörer
related: derr CQ6 8tF
related: 6Hq3 tKo V57
related: XZ3N uRV VYH
related: RR4Z qsi PmW
related: ppH6 9co U9o
related: 9TBK Xgj 1WX
related: Fn7p mS5 FAy
related: X5GZ KPd ZTc
related: ja7J P8X YC9
related: rojd dYC mhW
related: zPiK a5E pBg
broad match: C3118

Barnskötare
type: Concept
in scheme: JobTech Taxonomy - Yrke
definition: Sköter och aktiverar barn vid förskola, familjedaghem, förskoleklass och fritidshem. Hit hör inte Barnflicka/Barnvakt (9119) Barnsjuksköterska (2232) Barnsköterska (5325)
broader: Barnskötare och elevassistenter m.fl.
related: CGBF fgA qnj
related: bCVZ ziY KHC
related: C9111
related: Cg3t mwF yoD
related: 6nLZ J6J rrT
related: uwX1 vsc ERP
related: 3N1w nTD jQn
related: 6qNy zqY hP6
related: EwLN fUp 2Yt
related: xwXQ SEg p9A
related: TsH1 ePz fpf
related: iVSa PYJ 19v
related: 2sGi rhe wet
related: Lfn7 DD6 WP6
related: tcSe wan oED
related: tg1e QpF xdX
related: qMfa U8e Lto
related: i9kS G7J FLh
related: C5311
related: 9ShZ oc6 1Jc
related: GSkM KnL mG8
related: CLo2 bZY jci
related: G8KJ TwR R1C
related: 1dHC SwK 1ge
related: 55EM sdj hja
related: aiJi WSt vq7
related: sKux n1g FWp
related: Gpb3 ty6 e1S
narrower: Dagbarnvårdare
narrower: Barnskötare
narrower: Förskoleassistent
broad match: MVqp eS8 kDZ

Borrtekniker/Brunnsborrare
type: Concept
in scheme: JobTech Taxonomy - Yrke
definition: Borrtekniker/Brunnsborrare jobbar utomhus med stora borrprojekt, främst för dricksvatten och bergvärme. Arbetet innebär i huvudsak att borra brunnar för till exempel dricksvatten, utvinning av värme eller brunnar som används vid större anläggningsprojekt. I arbetet använder borrtekniker mobila borriggar och borrverktyg. Yrket är till viss del fysiskt krävande, men det finns många hjälpmedel som underlättar arbetet. Man kan även arbeta med drift och övervakning på anläggningar. Källa: Arbetsförmedlingen
broader: Brunnsborrare m.fl.
related: j7Cq ZJe GkT
related: ja7J P8X YC9
related: p54W buf g7P
broad match: C8113

Stuguthyrare
type: Concept
in scheme: JobTech Taxonomy - Yrke
definition: Stuguthyrare hyr ut stugor till gäster. Arbetsuppgifter innefattar bland annat att marknadsföra boenden samt hantera bokningar och kundförfrågningar. Se även yrket stugvärd. Källa: Arbetsförmedlingen
broader: Uthyrare
related: UdVa jRr 9DE
related: RPTn bxG ExZ
related: dwEE AwC WCc
related: ZiFi yWQ ah1
broad match: C5249

Notarie
type: Concept
in scheme: JobTech Taxonomy - Yrke
definition: Notarie arbetar vid tingsrätt eller förvaltningsrätt med att förbereda mål och ärenden genom att göra rättsutredningar och upprätta förslag till domar och beslut. Arbetsuppgifterna omfattar även att föra protokoll vid förhandlingar och, efter en tid, självständigt handlägga vissa mål och ärenden samt leda förhandlingar som rättens ordförande i enklare mål. Notarietjänstgöringen är en utbildningstid där arbete kombineras med handledning och utbildning, vilket ger en bred förståelse för rättskedjan och domstolens verksamhet. Notarie är en aktuell titel inom domstolsväsendet och utgör ett viktigt steg i karriären för många jurister. Källor: Sveriges Domstolar
broader: Domare
related: X82t awd Qyc
related: g2Bi u4n m38
related: x4Wi NWW ogB
related: Abcb QtH isZ
broad match: C2612

ST-läkare, laboratoriemedicin
type: Concept
in scheme: JobTech Taxonomy - Yrke
definition: Specialisttjänstgöring, ST, är den vidareutbildning som legitimerade läkare genomför för att uppnå specialistkompetens. ST-läkare laboratoriemedicin arbetar under handledning för att fördjupa sina medicinska kunskaper och färdigheter med målet att bli specialistläkare inom sitt område. ST-läkaren arbetar självständigt med patientutredningar, diagnostik och behandling, men alltid med stöd av specialister och enligt ett individuellt utbildningsprogram. Vanliga arbetsuppgifter är att ta medicinskt ansvar för patienter, delta i jourverksamhet, genomföra medicinska undersökningar och behandlingar samt dokumentera och följa upp vårdinsatser. Tjänsten omfattar också kontinuerlig kompetensutveckling, sidotjänstgöring inom närliggande områden och aktivt deltagande i handledning och utbildningsinsatser för kollegor och studenter. Källa: Arbetsförmedlingen, Karolinska Universitetssjukhuset, Sveriges läkarförbund, Region Kronoberg, Region Skåne.
broader: ST-läkare
related: NYW6 mP6 vwf
related: UtCj yMj ubw
broad match: C2211

Kemist
type: Concept
in scheme: JobTech Taxonomy - Yrke
definition: Kemist
broader: Kemister
related: CpFD aoS pkZ
related: kJeN wmw 9wX
related: SAcG xr5 3G8
related: Yr11 UKD on1
related: fM7t axJ RNN
broad match: C2113

Förvaltningschef, kommun
type: Concept
in scheme: JobTech Taxonomy - Yrke
definition: Förvaltningschef, kommun
broader: Fastighets- och förvaltningschefer
related: ovbK RQQ nxW
related: GbeJ VZk b6W
related: X82t awd Qyc
related: epLc SkD cbT
related: gnJ7 Xkz ETF
related: bh3H Y3h 5eD
related: Xty2 3XW VAU
broad match: C1219
broad match: C1213

Mässman, fartyg
type: Concept
in scheme: JobTech Taxonomy - Yrke
definition: En mässman hjälper kocksteward vid matlagning och provianthantering samt städar hytter och tar hand om tvätt av lakan och handdukar. För att arbeta i ovanstående befattning krävs Basic Safety Källa: Satsa på sjöfart
broader: Hovmästare och servitörer
related: dRFw Rcu dX7
related: ASGV zcE bWf
related: XouD cCj HZN
related: 7o44 gVv s1V
related: ScKy FHB 7wT
broad match: C5131

Träarbetare, gruva
type: Concept
in scheme: JobTech Taxonomy - Yrke
definition: Träarbetare, gruva
broader: Träarbetare, snickare m.fl.
related: DTMn NVu syb
related: j7Cq ZJe GkT
broad match: C7111

Andra kontors- och kundserviceyrken
type: Concept
in scheme: JobTech Taxonomy - Yrke
definition: Andra kontors- och kundserviceyrken
broader: Yrken inom administration och kundtjänst
narrower: Arkiv- och biblioteksassistenter
narrower: Brevbärare och postterminalarbetare

Glastekniker
type: Concept
in scheme: JobTech Taxonomy - Yrke
definition: Skär till och monterar glas i fönster, dörrar och ramar. Monterar inredningar, tak och fasader av glas. Monterar vindrutor och rutor i olika typer av fordon. Ramar in konst.
broader: Takmontörer, golvläggare och VVS-montörer m.fl.
related: mqvs JPE eVo
related: 5LdD NqJ 9P7
related: q8N3 4mh 4nw
related: Qg8J Y3i sW3
related: 7LNw Nkb aTb
related: oXUT XhR ruP
related: aHCV VsV LiD
related: ZHjv wRT 6PQ
related: WV6N sHn vZq
related: gQaA usp 3et
related: 6E6C qkg 59M
related: teRw r4R G2A
related: Q7eC B7g QiU
related: PMJe rRE Nyn
related: hhva Gox PfP
related: WXLm 6LZ TdX
related: AqMb R75 hTn
related: KXvK uti a98
related: C7125
related: fhcp fFw Lbj
related: tAaK fUZ cqg
related: nkhA jPz pcE
related: X5nX qbu JLQ
related: ynWd oCo o61
related: MXh6 9Aj u7j
related: Bumt 8bQ nx8
related: aHin ifL i65
related: 95dM MKP sZ5
related: Z3nB Ecc B6h
related: WLAi BDr 5fW
related: KfEn V5y npV
related: fs3J uoX KrE
related: Xdb9 9F7 GzV
related: HHvf bfE wK9
related: RZT1 Bme Tq7
related: esQK sEP RD4
related: gxCm eQG 8Dc
related: DYwF eZF Gcx
narrower: Glas- och metallmontör
narrower: Glastekniker/Glasmästare
narrower: Konstinramare/Rammakare
narrower: Bilglasmontör
narrower: Lärling glastekniker
broad match: PaxQ o1G wWH

Forskningshandledare
type: Concept
in scheme: JobTech Taxonomy - Yrke
definition: Forskningshandledare
broader: Forskarassistenter m.fl.
related: Syd7 Sft UqL
related: X82t awd Qyc
related: c71c LVS bMV
broad match: C2310

Forskare, IT
type: Concept
in scheme: JobTech Taxonomy - Yrke
definition: Forskare, IT
broader: Övriga IT-specialister
related: apaJ 2ja LuF
broad match: C2519

Gruvgeolog
type: Concept
in scheme: JobTech Taxonomy - Yrke
definition: Gruvgeolog
broader: Geologer och geofysiker m.fl.
related: kJeN wmw 9wX
related: R4tH HHi T91
related: sTZ8 YDo tLT
broad match: C2114

Kranbilsförare
type: Concept
in scheme: JobTech Taxonomy - Yrke
definition: Kranbilsförare transporterar gods och lastar samt lossar med kran monterad på lastbilen. Kranbilar är varierande fordon som kan ha olika typer av kranar och används för att transportera olika typer av gods. Arbetet är fysiskt krävande med krav på både körförmåga och kunskap i maskinell godshantering. Föraren måste tänka på både godsets och omgivningens säkerhet, särskilt vid lyft av tunga eller farliga föremål, där omdöme och djupseende är avgörande. För att hantera kranbilar effektivt krävs också kunskaper i att köra släp och att beräkna lyftkapacitet och säker lastning. Betongpumpförare använder en lastbil med monterad betongpump för att hantera gjutningar. Källa: Transportfackens yrkes- och arbetsmiljönämnd
broader: Lastbilsförare m.fl.
related: Qce2 Fov Xy8
related: viFX RHK nQp
related: A7A9 LsF 9Eg
related: 2oYe SKZ rm6
related: GpDv WZM 1J9
related: d68E e74 a59
related: hhb7 1hV t7R
related: ASGV zcE bWf
related: Vbaw v2y j79
related: XL1U dKg 2Qe
related: JThM vbH 9uy
related: 483u hVx psa
related: 9wnn PAV q12
related: B6vf mf7 UAL
broad match: C8332

Maskinmekaniker
type: Concept
in scheme: JobTech Taxonomy - Yrke
definition: Maskinmekaniker servar, felsöker och reparerar tunga fordon och mobila maskiner. Maskinmekaniker arbetar med att utföra felsökning, reparationa och service på tunga fordon, så som jordbruks-, skogs- och entreprenadmaskiner. Yrket kräver stora kunskap inom mekanik och elektronik. I moderna tyngre fordon finns ett stort antal ihopkopplade datorer, varför maskinmekaniker behöver kunskaper inom IT och digitala verktyg för att kunna utföra sitt arbete. Maskinmekanier har en viktig roll vid större byggen och anläggningar, där maskiner som inte fungerar som de ska kostar mycket tid och pengar. Källa: Transportföretagen
broader: Motorfordonsmekaniker och fordonsreparatörer
related: K895 VMY GK2
related: kJnJ Q4n buz
related: ivs6 Sdn vQe
related: XL7b iSV 1K3
related: 8h8b bhp c51
related: ZeXU Kdm Rua
related: gcWL WJH v7n
related: CuLS a9b qNu
related: yhCP AqT tns
related: B2bv deV NML
related: pxwK AHZ Rmh
related: er9C RtQ RaU
related: vKsu nXD L6A
related: hvRD Tb8 66C
related: zmcF y8F BHz
related: EtAZ kR1 RAd
related: dX4A hDt X1q
related: FyiX fmn a9m
related: 4dU8 i9F kVQ
related: WEuS DRD L7o
related: Coeu S5h 5A9
related: VGe7 EJk CoT
related: hQWy oaB SGy
related: WYEz AZW bvU
broad match: C7231

Befraktningsmäklare
type: Concept
in scheme: JobTech Taxonomy - Yrke
definition: Befraktningsmäklare förmedlar sjötransporter genom att matcha redare med lastägare med behov av sjöfrakt. Arbetet innebär att identifiera transportlösningar, förhandla fraktvillkor och upprätta fraktavtal. Mäklaren verkar ofta internationellt, med specialisering inom vissa fartygstyper eller geografiska områden. I rollen ingår att inhämta och vidareförmedla fraktförfrågningar, bedöma affärsförslag samt ge råd under förhandlingar. Affärer kan omfatta allt från enskilda resor till tidsbefraktning. Arvodet utgår vanligtvis i form av kommission på fraktbeloppet. Källa: Sveriges Skeppsmäklare
broader: Speditörer och transportmäklare
related: AT9j agp kwd
related: RPTn bxG ExZ
related: ASGV zcE bWf
related: GXPV yNW 7PK
related: buWZ qxB eB9
related: r6WT BjA ULi
related: zg6S Svi whn
related: b7Az oWJ ttz
broad match: C3324

Patentjurist
type: Concept
in scheme: JobTech Taxonomy - Yrke
definition: Patentjurist
broader: Affärs- och företagsjurister
related: X82t awd Qyc
related: x4Wi NWW ogB
related: Abcb QtH isZ
broad match: C2619

Affärsarkitekt
type: Concept
in scheme: JobTech Taxonomy - Yrke
definition: Affärsarkitekt
broader: Lednings- och organisationsutvecklare
related: cnBN 6Nq 7Fs
related: Co1K QQN gF6
related: YE8T 8vt w94
related: apaJ 2ja LuF
related: SPn2 XdE iD3
related: qBsw ikL hZ2
related: H6wU zEP bwx
related: s1bz hvo Miv
broad match: C2421

Repetitör, dans
type: Concept
in scheme: JobTech Taxonomy - Yrke
definition: Repetitör, dans leder och stödjer dansare och koreografer under repetitioner för att säkerställa att koreografier och framträdanden utförs korrekt och enligt önskad konstnärlig vision. Vanliga arbetsuppgifter är att ackompanjera dansare under repetitioner, assistera koreografer med koreografiska detaljer, leda repetitionsprocessen och bidra till att dansarna repeterar in sina roller på ett noggrant och effektivt sätt. Källa: Arbetsförmedlingen
broader: Koreografer och dansare
related: 8too bEs 7NU
related: 9puE nYg crq
broad match: C2653

Gjutare
type: Concept
in scheme: JobTech Taxonomy - Yrke
definition: Gjuter föremål i olika material på hantverksmässigt sätt. Tillverkar gjutformar och gjutkärnor. Hit hör inte Maskinformare, gjuteri (8129) Maskinkärnmakare (8129)
broader: Gjutare, svetsare och plåtslagare m.fl.
related: L6mR dKP znq
related: VPF1 UZM 9Kd
related: mMpo at2 BSo
related: C7211
related: khf5 YbP grL
related: 8vQe Xu4 MyZ
related: qQ61 EQR rcz
related: VTwt 5Fe 6bW
related: 29hd oky Bbh
related: J3yH raM d7m
related: KDzy Hra iVr
related: itNP 1RB zbj
related: zVKm f79 DtU
related: qhYi J2C kTP
related: qNQV vWB inB
related: qwVt 8BU zXQ
related: BKYD AEo maF
related: qvhW Ldx wtd
related: uenm 75h fEh
related: Uk4f TMW mth
related: b2wR hpk rPi
related: dWbY gXC Frx
related: oDfR gmA FoN
related: MHSN 3iZ tmJ
narrower: Konstgjutare
narrower: Gjutare metallhantverk
broad match: wTEr CBC bqh

Servicehusföreståndare
type: Concept
in scheme: JobTech Taxonomy - Yrke
definition: Servicehusföreståndare
broader: Chefer inom äldreomsorg
related: GazW 2TU kJw
related: epLc SkD cbT
related: bh3H Y3h 5eD
broad match: C1343

Inkasserare och pantlånare m.fl.
type: Concept
in scheme: JobTech Taxonomy - Yrke
definition: Överlämnar delgivningshandlingar. Inkasserar utestående fordringar samt undersöker tillgångar. Gör upp avbetalningsplaner och medverkar i förlikningar. Upprättar ansökningshandlingar till Kronofogden samt ansöker om verkställighet såsom utmätningar och avhysningar. Lånar ut pengar mot pant. Värderar panter eller annan säkerhet. Informerar om lånevillkor och beräknar ränta.
broader: Croupierer och inkasserare
related: QKMc eKX sUE
related: YghK oqa Xi8
related: U9zT 51o tMo
related: vtkn PL4 wed
related: GNUT FGM V4z
related: QAaJ QeY Q6P
related: BQsM qds 7ff
related: W7Qf aRY FEo
related: C4214
related: 2RDK rgU P6R
related: EcuE BY7 mc4
related: NsB8 Gfz Grb
related: kkrJ Y8j FH1
related: FjUS MUs hg9
related: YJ2K Tvg AgA
related: C4213
related: hkJW PWy ge8
related: BGwW Ccq diY
related: WmER Xca V81
narrower: Delgivare
narrower: Kronoinspektör
narrower: Inkassohandläggare
narrower: Handläggare Kronofogden
narrower: Pantlånare
broad match: X82t awd Qyc

Trädgårdsrådgivare/Trädgårdskonsulent
type: Concept
in scheme: JobTech Taxonomy - Yrke
definition: Trädgårdsrådgivare/Trädgårdskonsulent
alternative label: Trädgårdskonsulent
alternative label: Trädgårdsrådgivare
broader: Specialister och rådgivare inom lantbruk m.m.
related: 6nbS RdB kzm
related: VuuL 7CH adj
broad match: C2132

Kantor/Kyrkomusiker
type: Concept
in scheme: JobTech Taxonomy - Yrke
definition: Kantor/Kyrkomusiker
alternative label: Kantor
alternative label: Kyrkomusiker
broader: Musiker, sångare och kompositörer
related: PSRP 7Ak 3RT
related: yyYf r5s v6C
related: CnpS nm4 bip
related: 8too bEs 7NU
related: 9puE nYg crq
related: G84v bYJ Ftk
broad match: C2652

Kallskänka
type: Concept
in scheme: JobTech Taxonomy - Yrke
definition: Kallskänkor tillagar och förbereder kalla rätter i restaurang- och storköksmiljö. Arbetsuppgifterna omfattar beredning av smörgåsar, sallader, förrätter, såser, efterrätter samt uppläggning av bufféer. Kallskänka arbetar ofta med beställningar till evenemang, festvåningar eller catering och ansvarar för att färska råvaror hanteras enligt gällande hygienrutiner. Källa: Arbetsförmedlingen
broader: Kockar och kallskänkor
related: pv2Z YKw 626
related: hog3 VVR Cij
related: 5CS9 NMf 7Yt
related: ytMF xn9 2xx
related: ScKy FHB 7wT
related: ipTY uis ktS
related: 1zMb FzG 6LY
related: kaYt HT6 EnY
related: b8pr zWx r5e
broad match: C5120

Drift- och underhållsingenjör, anläggning
type: Concept
in scheme: JobTech Taxonomy - Yrke
definition: Drift- och underhållsingenjör inom anläggning planerar, leder och övervakar drift och underhåll av infrastrukturella och tekniska anläggningar. Arbetsuppgifterna omfattar inspektion och besiktning av anläggningar, planering och uppföljning av underhållsåtgärder, samt deltagande i upphandling och hantering av underhållskontrakt. Ingenjören analyserar driftstörningar, utvärderar tekniska lösningar, föreslår förbättringsåtgärder och dokumenterar underhållsarbete. Yrkesrollen innebär ofta projektledning och samordning av interna och externa samarbetspartners samt rådgivning kring drift, materialval och miljöpåverkan. Drift- och underhållsingenjörer engageras både vid förebyggande och avhjälpande underhållsarbete i olika typer av anläggningar, exempelvis väg, järnväg, broar och större fastigheter. Källa: YH Akademin, Nackademin, Yrkesakademin
broader: Ingenjörer och tekniker inom bygg och anläggning
related: j7Cq ZJe GkT
related: sF5U 26X oCQ
related: UYiV RuJ UKd
related: ZjCw 9JF b8s
broad match: C3112

Mediaplanerare
type: Concept
in scheme: JobTech Taxonomy - Yrke
definition: Mediaplanerare
broader: Informatörer, kommunikatörer och PR-specialister
related: 2LjW muR jcd
related: u1dD yBo wCq
related: X82t awd Qyc
related: 7mNw 4Vt AQL
related: hQwe cnx kr4
related: vwxR MbC XjW
broad match: C2432

Distributionsförare
type: Concept
in scheme: JobTech Taxonomy - Yrke
definition: Distributionsförare kör ut varor till olika mottagare. Varor levereras från en central till mottagare som butiker och kontor samt och planerar sin dag baserat på fraktsedlar. Arbetet innebär många stopp med godshantering och kräver ofta körning av lastbil med släp. Föraren måste kunna hantera truck vid lastning och lossning och transportera varor som kan innefatta livsmedel i kyl- eller frysutrymmen samt farligt gods. Mycket av arbetet innebär kundkontakter. Det krävs yrkeskompetensbevis för förare för att utföra persontransporter och godstransporter med buss och lastbil. Beroende på vad som transporteras och typ av lastbil kan man behöva ytterligare utbildning, till exempel ADR-intyg, truck och bakgavellyft. Källa: Transportfackens Yrkes- och Arbetsmiljönämnd
broader: Lastbilsförare m.fl.
related: n6n3 qZH cLV
related: 2ZgM 1oL aeV
related: 3p4M azp L9B
related: 4hdD vnJ 8TF
related: 8f4g pkY zi4
related: Lojg FRy Puv
related: Rdii yxf 7rk
related: zGjD M5a HCX
related: JDZy HaT 4nb
related: 9bVT Ntw BfQ
related: d68E e74 a59
related: zJKW 43H Cgc
related: h5Vv MFR Pzt
related: nJkD zTW 6qz
related: vw1m zLV qY9
related: hhb7 1hV t7R
related: ASGV zcE bWf
related: b7Cd VGx RPc
related: pjFz SeJ riG
related: KCXd yii B1E
related: Prv9 ogi C7j
related: UNLs 21j q5P
related: 483u hVx psa
related: pSc2 21g sHa
related: 9wnn PAV q12
related: T6sV BWh cvZ
related: VNGU P8A nHQ
related: fk1Z wzK 2qi
related: iQzp Ugz GVa
broad match: C8332

Möbellackerare
type: Concept
in scheme: JobTech Taxonomy - Yrke
definition: Möbellackerare ytbehandlar möbler och snickerier. Arbetsuppgifterna inkluderar lackering, betsning och oljning av inredningsdetaljer och hela möbler. För- och efterarbete, såsom slipning, ingår också. Beroende på arbetsplats kan arbetet vara mer eller mindre maskinellt, där man använder både manuella och maskinella verktyg. Vanliga arbetsplatser är snickerier som tillverkar inredning och möbler. Se även yrket Maskinoperatör ytbehandling av trä. Källa: Arbetsförmedlingen
broader: Lackerare och industrimålare
related: srMW hR5 UxY
related: wTEr CBC bqh
broad match: C7132

Matroser och jungmän m.fl.
type: Concept
in scheme: JobTech Taxonomy - Yrke
definition: Matroser och jungmän m.fl.
broader: Transport- och maskinföraryrken
narrower: Matroser och jungmän m.fl.

Planeringsingenjör, maskin
type: Concept
in scheme: JobTech Taxonomy - Yrke
definition: Planeringsingenjör, maskin
broader: Ingenjörer och tekniker inom maskinteknik
related: 6Hq3 tKo V57
related: dq8y 5VT wNt
related: 9aEn jPz gJs
related: ibqa c8P izX
broad match: C3115

Säkerhetsadministratör, IT
type: Concept
in scheme: JobTech Taxonomy - Yrke
definition: Säkerhetsadministratör, IT
broader: IT-säkerhetsspecialister
related: MdZ3 hmi KgH
related: 51mK NDj w6K
related: 6MEA uVc J1C
related: TRPL 5av hN9
related: ysDr fm3 1DH
related: apaJ 2ja LuF
related: 8HGu Gbj LNA
related: yCS6 d1e VzJ
broad match: C2529

Homeopat
type: Concept
in scheme: JobTech Taxonomy - Yrke
definition: Homeopat
broader: Terapeuter inom alternativmedicin
related: NYW6 mP6 vwf
related: Uuf1 GMh Uvw
broad match: C3230

Cateringarbetare
type: Concept
in scheme: JobTech Taxonomy - Yrke
definition: Cateringarbetare tillagar och levererar lagad mat och tillbehör till kunder. Arbetet innebär i huvudsak att tillaga, paketera, transportera och duka upp mat till kunder. Beroende på arbetsplats kan man vara specialiserad på tillagning eller planering och leverans. Det är inte ovanligt att man som cateringarbetare arbetar i flera funktioner. Till exempel ingår i leverans av mat ofta att duka upp mat, bestick och andra tillbehör. Även servering, städning och plockning av disk ingår ofta. Källa: Arbetsförmedlingen
broader: Restaurang- och köksbiträden m.fl.
related: UdVa jRr 9DE
related: 4oH7 xSb 2mJ
related: fP1B VK6 4Ro
related: ScKy FHB 7wT
related: R6eq vcx MJa
related: 9a7r 444 aQL
related: 6bj8 HdN sFe
broad match: C9412

Utbildningshandläggare
type: Concept
in scheme: JobTech Taxonomy - Yrke
definition: Utbildningshandläggare arbetar vid universitet, högskolor eller andra utbildningsorganisationer med handläggning och administration av utbildningsrelaterade ärenden. Arbetsuppgifterna omfattar till exempel handläggning av kurs- och programadministration, antagning, registrering och examination, samt administration av tillgodoräknanden och examensärenden. Utbildningshandläggare utreder och tolkar regelverk, deltar i utveckling och kvalitetssäkring av utbildningsprocesser, samt ger information och service till studenter och personal. Rollen innebär ofta samordning och planering av utbildningsaktiviteter och omfattar kontakter med flera interna och externa parter. Se även yrket Utbildningsadministratör, vilket avser en mer renodla administrativ roll. Källa: Arbetsförmedlingen
broader: Övriga handläggare
related: T9EV N8L F5b
related: X82t awd Qyc
related: r21D sG1 Ukv
related: Qr2e Gqj 4gL
related: hJVJ HV4 pXb
broad match: C3343

Processingenjör, el-tele
type: Concept
in scheme: JobTech Taxonomy - Yrke
definition: Processingenjör, el-tele
broader: Civilingenjörsyrken inom elektroteknik
related: 6Hq3 tKo V57
related: kDRm Yaa jAB
broad match: C2153

Produktdemonstratör
type: Concept
in scheme: JobTech Taxonomy - Yrke
definition: Produktdemonstratör visar och marknadsför produkter i butik eller på evenemang. Arbetet innebär i huvudsak att sälja produkter genom att visa upp och demonstrera dessa. Det kan till exempel innebära att dela ut smakprover av livsmedel eller svara på frågor om olika funktioner hos produkten. Arbetet kan ske både i butiker eller på evenamng så som mässor. Källa: Arbetsförmedlingen
broader: Eventsäljare och butiksdemonstratörer m.fl.
related: kyce JBs mbh
related: UdVa jRr 9DE
related: eCvd idA RkK
related: Umzs d9A Ntu
related: rnzB Dwo RMq
related: mH1A 4VW Xbs
related: Kq54 ZWg KHM
related: oEjf R5A hbB
related: rDcj Tao TJJ
related: 7ikL S25 K3h
related: RPTn bxG ExZ
related: 8N1p Jut Lnh
related: MwLS it2 ERN
related: QU51 vgM Yiy
related: 3ihC rtd DYi
related: y4L7 6xd EaP
related: VwTc sXE BJa
related: 9kVE 8if 1PR
related: Nixp tYG BJH
related: 6EH4 dLU 7zj
broad match: C5242

Konstgjutare
type: Concept
in scheme: JobTech Taxonomy - Yrke
definition: Konstgjutare skapar och reparera gjutna konstverk. Arbetet innebär att smälta och gjuta metaller som järn, stål, aluminium eller mässing i olika typer av formar. Konstgjutning är ett hantverksyrke där du behärskar flera moment, från att skapa gjutformar till efterbehandling av det färdiga objektet. Inriktningar inom yrket inkluderar exempelvis gelbgjutning av mässingsföremål, klockgjutning av kyrkklockor samt tenngjutning av dekorativa föremål. Källa: Hantverksakademin
broader: Gjutare
related: PaxQ o1G wWH
related: wTEr CBC bqh
broad match: C7211

Lärare i förskoleklass
type: Concept
in scheme: JobTech Taxonomy - Yrke
definition: Förskolläraren arbetar med de yngre barnens lärande och utveckling från de första orden fram till att de börjar första klass. I det dagliga arbetet med barnen ingår bland annat läs- och skrivutveckling, samt att uppmuntra till lek och kreativitet. Arbetet utförs i arbetslag tillsammans med exempelvis barnskötare, fritidspedagoger och grundskollärare. Förskolläraren är ansvarig för att planera undervisningen. I ditt arbete utgår du från läroplanen och säkerställer att det pedagogiska innehållet i undervisningen på förskolan håller hög kvalitet. Källa: Arbetsförmedlingen -Hitta yrken, Göteborgs stad
broader: Förskollärare
related: 6o2S cvR GwA
related: UJrE Sez A7p
related: MVqp eS8 kDZ
related: qtAu 6jw YeD
broad match: C2342

Serviceingenjör, elektronik
type: Concept
in scheme: JobTech Taxonomy - Yrke
definition: Serviceingenjör inom elektronik utför installation, underhåll och felsökning av elektroniska system och utrustningar. Arbetsuppgifterna inkluderar teknisk support, reparationer, uppgraderingar samt dokumentation av serviceinsatser. Serviceingenjören samarbetar med kunder, tekniker och utvecklingsavdelningar för att säkerställa att elektronikprodukter fungerar enligt specifikationer och uppfyller kvalitetskrav. Serviceingenjörer har vanligtvis kunskaper inom elektronik, felsökningsteknik, systemintegration och kundservice. Källa: Arbetsförmedlingen
broader: Ingenjörer och tekniker inom elektroteknik
related: 6Hq3 tKo V57
related: ZEqD 6ao rTV
related: SvAW coW dGN
related: WjJP TpZ Rz8
broad match: C3114

Tonsättare
type: Concept
in scheme: JobTech Taxonomy - Yrke
definition: Tonsättare skapar och komponerar musik, ofta för olika ensembler, instrument eller medier, och kan också arrangera och bearbeta musikaliska verk. Vanliga arbetsuppgifter är att komponera nya musikstycken, arrangera och bearbeta musik, delta i repetitioner och samarbeta kring framföranden. Många tonsättare arbetar även med beställningsverk och kan behöva hantera dokumentation och tekniska aspekter av musikproduktion. Källa: Arbetsförmedlingen, Föreningen Svenska Tonsättare
broader: Musiker, sångare och kompositörer
related: 8too bEs 7NU
related: 9puE nYg crq
broad match: C2652

Reklamutdelare
type: Concept
in scheme: JobTech Taxonomy - Yrke
definition: Reklamutdelare delar ut reklam i brevlådor. Arbetet innebär att dela ut reklam i brevlådor. Utdelning sker oftast till fots eller med cykel. Tunga lyft kan förekomma och arbetet sker främst utomhus, varför god fysik kan vara en förutsättning. Arbetet är vanligtvis på deltid och/eller efter behov. Källa: Arbetsförmedlinge
broader: Reklamutdelare och tidningsdistributörer
related: HJaF su4 p82
related: UdVa jRr 9DE
related: TN3A pkw BRF
related: Z8WP XxR tG3
related: Kc8V HfF xdP
related: ASGV zcE bWf
related: iYJi T5o Di4
related: esJJ 5T3 a8W
related: JRyK k5F pbM
broad match: C9621

Marknadsundersökare/Intervjuare
type: Concept
in scheme: JobTech Taxonomy - Yrke
definition: Marknadsundersökare/intervjuare samlar in information genom intervjuer, enkäter eller observationer i syfte att kartlägga åsikter, beteenden och trender hos olika målgrupper. Arbetsuppgifterna innebär ofta att kontakta personer via telefon, på stan, i butiker eller på evenemang för att ställa frågor enligt färdiga frågeformulär. Det kan också handla om att genomföra besöksintervjuer eller arbeta hemifrån med telefonintervjuer. Resultaten rapporteras digitalt eller i särskilda system enligt uppdragsgivarens instruktioner. Vanliga arbetsgivare är företag som specialiserar sig på marknads- och opinionsundersökningar. Källa: Arbetsförmedlingen
broader: Marknadsundersökare och intervjuare
related: dGFh Zgk Pd8
related: UdVa jRr 9DE
related: RPTn bxG ExZ
related: GFMT bpm 477
related: cBcz uKw CFA
related: Z6a2 S83 YD2
related: UofG To8 iuk
broad match: C4227

Trädgårdsmästare anläggning
type: Concept
in scheme: JobTech Taxonomy - Yrke
definition: Trädgårdsmästare inom anläggning leder, planerar och deltar i anläggning, utveckling och skötsel av trädgårdar och grönytor. Arbetsuppgifterna innefattar ogräsrensning, plantering, gräsklippning, häckklippning och trädbeskärning. Yrket liknar trädgårdanläggare och parkarbetare, med skillnaden att trädgårdsmästaren är mer kvalificerad. Trädgårdsmästare har god växtkännedom för att kunna välja rätt växter till olika miljöer samt ge rådgivning till kunder. Det är inte ovanligt att man som trädgårdsmästare är även är arbetsledare för till exempel parkarbetare eller trädgårdsanläggare. Källa: Gröna arbetsgivare, Arbetsförmedlingen
broader: Trädgårdsanläggare m.fl.
related: cHhB js6 eCi
related: j7Cq ZJe GkT
related: PzmB 1Dy RAs
related: VuuL 7CH adj
broad match: C6113

Arbetsledare, tillverkning kemiska produkter
type: Concept
in scheme: JobTech Taxonomy - Yrke
definition: Arbetsledare, tillverkning kemiska produkter
broader: Arbetsledare inom tillverkning
related: Bq49 GkW Ptr
related: wTEr CBC bqh
broad match: C3122

Driftingenjör elkraft
type: Concept
in scheme: JobTech Taxonomy - Yrke
definition: Driftingenjören övervakar elnätet, kraftanläggningar och energisystem från kontrollrum eller genom att göra fältturer. Vid avbrott eller driftstörningar felsöker driftingenjören, hittar lösningar och vidtar åtgärder för att återställa driften. Driftingenjören planerar och genomför underhållsarbete för att säkerställa att elkraftsystemen fungerar optimalt. Driftingenjören hanterar både planerade och oväntade avbrott, inklusive att koppla om i systemet och hålla kontakt med kunder. Källa: Arbetsförmedlingen
broader: Ingenjörer och tekniker inom elektroteknik
related: v2u2 6w9 gyB
related: 6Hq3 tKo V57
related: GCwj T2d weh
related: U2HQ BK9 mwF
related: Ytg5 Va3 QqJ
related: H6Z4 yT7 xZQ
related: aK1S RbQ s8j
related: fVg3 Gnn oWb
related: gJTz 1gz oEj
related: u6N5 brU TJi
related: eTqx bnu sjm
related: op7a RuE PMF
broad match: C3113

Forskare, rättsvetenskap
type: Concept
in scheme: JobTech Taxonomy - Yrke
definition: Forskare, rättsvetenskap
broader: Arkeologer och specialister inom humaniora m.m.
related: X82t awd Qyc
broad match: C2632

Kock à la carte
type: Concept
in scheme: JobTech Taxonomy - Yrke
definition: À la carte-kockar tillagar måltider enligt gästers beställning, exempelvis på hotell och restauranger. I arbetet ingår bland annat att utforma menyer och att planera, förbereda och lägga upp gästers måltider. Arbetsupgifter: tillaga måltider enligt beställning, utforma menyer, presentera måltider på ett tilltalande sätt, köpa in varor, planera och förbereda måltider Källa: ISCO, Skolverket
broader: Kockar och kallskänkor
related: xTyS 8wZ LMn
related: UPU7 6Z4 67W
related: drSW y9u tnC
related: YYSm Pv3 znL
related: XKZH fZc 2An
related: b5H3 wfP Qmp
related: 3PAQ rvL yDB
related: 7goz uuv JWu
related: Jctb uYb 1FU
related: LyKc uxM jrZ
related: 9STU guE 6wm
related: 48KL nZL ynR
related: 1qu3 hRV PKd
related: MNC6 TtD nNV
related: jCzt Kp3 VnF
related: Hj3p s7D o3S
related: VRDc fL1 8MP
related: 6y2n tyy gyY
related: msEo nn2 kQr
related: BZtA RCn 4vZ
related: XV9Q cwk 6qS
related: TMBy g8r ted
related: vzQW rN3 oLi
related: RTQf 1Qm YhD
related: FCyL VwG dYh
related: D3Zk 8Vd Kcn
related: Duq7 2TY pjx
related: afPu Jhp Hp5
related: ScKy FHB 7wT
related: q283 fML XYP
related: EKtK 5mt fum
related: cJ2X g4E VgR
related: 7a1Z qqd o1u
related: 6VrZ xgD Z5N
related: PXNz gFM kri
related: oooi S5y ncr
related: kaYt HT6 EnY
related: vo6V AEU h1e
related: c3Zr YRh jvn
related: QHKs 55w N4A
related: vK9c qBY mHW
related: sUM9 b4r Xwx
related: YQT9 KYg 9bm
related: jTZJ Edz fgN
related: FDX5 xGZ ddL
related: v7B3 HYU ubn
related: nXnU gwb sBY
related: i5zY AwC RGf
related: CMb3 k9A aKZ
related: 8TyJ Vz2 U7a
related: xRtE Mkx zFf
broad match: C5120

Reservdelsansvarig
type: Concept
in scheme: JobTech Taxonomy - Yrke
definition: Reservdelsansvariga planerar och leder arbetet med reservdelar inom exempelvis för fordon, maskiner eller inom industrin. Arbetsuppgifter kan innefatta att leda verksamhet och personal i arbetet med reservdelar, inklusive beställning, lagerhållning och distribution. Andra arbetsuppgifter kan vara kontakt med leverantörer och teknisk rådgivning kring reservdelar. I större verksamheter kan även titeln reservdelschef förekomma. Reservdelsansvariga kan förutom arbetsledning även ha både verksamhetsansvar och budgetansvar. Beroende på arbetsplats kan även personalansvar ingå. Se även yrkena Reservdelsspecialist samt Arbetsledare inom lager och terminal. Källa: Arbetsföremdlingen
alternative label: Reservdelschef
broader: Arbetsledare inom lager och terminal
related: epLc SkD cbT
related: ASGV zcE bWf
broad match: C4321

Bilförsäljare
type: Concept
in scheme: JobTech Taxonomy - Yrke
definition: Bilförsäljare säljer bilar till privatpersoner och företag. Arbetsuppgifterna innefattar att ta emot kunder, visa fordon, upprätta offerter och avtal, samt hantera order och leveranser. Det ingår även att administrera säljprocessen, följa upp kundkontakter och uppdatera dokumentation i affärssystem. I rollen ingår även kringförsäljning av tillbehör samt finansierings- och försäkringslösningar. Källa: Arbetsförmedlingen
broader: Butikssäljare, fackhandel
related: UM5z 1bx 5rf
related: QUfy xkh V99
related: rDcj Tao TJJ
related: RPTn bxG ExZ
related: 2x36 UEb w16
related: zRAw 4FD PFd
related: nKiu uaE 7KY
related: tGpk dRa WEb
related: rRod L8Q dq5
broad match: C5223

Forskningslaborant, kemi
type: Concept
in scheme: JobTech Taxonomy - Yrke
definition: Forskningslaborant, kemi
broader: Laboratorieingenjörer
related: CpFD aoS pkZ
related: 6Hq3 tKo V57
related: EsWG kHG oXZ
related: fM7t axJ RNN
broad match: C3111

Förvaltnings- och organisationsjurister
type: Concept
in scheme: JobTech Taxonomy - Yrke
definition: Tolkar lagar och avtal som företrädare för t.ex. myndigheter, kommuner och organisationer. Bevakar ny lagstiftning. Ser till att den lagstiftning som finns på området följs. Skriver föreskrifter och allmänna råd utifrån de lagtexter som finns. Svarar på remisser.
broader: Jurister
related: xSLo P6B 2AF
related: DJgq zBj bKt
related: nZMQ bGf Xou
related: 7JTy BCE 1dx
related: aUr6 Rjg ja2
related: C2619
related: TSpk V3M 58x
related: 3HjW 1BP k3S
related: hqDp WRd i9s
related: YaHy ShR uo4
related: 1U6i pFi GcN
related: w9kF 5oy ySz
related: 3vYj Rhf Voh
related: DkcA 2io BNv
related: Uv9y v2g efa
related: Tmps QPE g3V
related: aMrn LR6 Eat
related: UapV Lk5 DZr
related: KZb6 UBs gP9
related: BrdZ oPC Kft
related: SmZd Jaa BeY
related: t4Ek voQ zD3
related: QAaJ QeY Q6P
related: NUC3 y1C Scg
related: TFCj pyW JR2
related: detQ YNb 9nG
related: cw2M p2W SuJ
related: nF6J MNc ZxS
related: STa2 hti QFw
related: EU8B Vir DXH
related: pLfm Uff BsM
related: VDem uq7 xxc
related: Jjgt 4oU 3Ba
related: dYqT JBz NZE
related: X9Kc p8a 1FB
related: 5wab aFK gdL
related: yPmK 7b8 L3H
related: AW8R baL eV1
related: fiLT BSW HCb
related: PVnT yGT SMb
related: qtHa AsU Cfo
related: Nig2 2pU GT8
related: rXST u2H Ujo
related: qWPT Ygb CKr
related: 312J k9G TJK
related: 4RbW Kwb whi
related: LmAP e75 pc6
related: WJa2 cQS naH
related: q7Mx gjU F9q
related: 7scD 9YP iwV
related: D6ev Zwt x83
related: NYbU buD WVZ
related: jcpA Zfs nSz
related: Juia j2p bAj
related: QFsa CfY 1Ly
related: R5ce 7aY mEs
related: RB7E jE5 MZ3
related: mD1c 2NB pDo
related: 4fRg DA4 Dj3
related: 2m2o hEw kee
related: DNuY aoK i1h
related: Jd1D jKD qaD
related: 2ZFC 6de YSB
related: Tu3a CQh nGG
related: ZSXe KXh TzJ
related: B1rc wCc vne
related: w8bU wHe omF
related: 73gL 4uv p9J
related: qD53 dVu cnU
related: iLDD cky Lir
related: 8u7A ze1 bvd
related: 6Ei3 fZV YKM
narrower: Länsjurist
narrower: Verksjurist
narrower: Förbundsjurist

TV-fotograf
type: Concept
in scheme: JobTech Taxonomy - Yrke
definition: TV-fotograf arbetar med att fånga och förmedla rörliga bilder för television, både i studio och på olika inspelningsplatser. Vanliga arbetsuppgifter är att planera tagningar, filma scener, hantera kamerautrustning och efterbearbetning av inspelat material. Arbetet sker i samarbete med regissörer och producenter för att säkerställa att bildmaterialet håller hög kvalitet. Källa: Arbetsförmedlingen och SACO
broader: Fotografer
related: 8too bEs 7NU
related: 9puE nYg crq
related: mUqx 3vY iPQ
broad match: C3431

Bokbussförare
type: Concept
in scheme: JobTech Taxonomy - Yrke
definition: Bokbussförare kör bokbuss till olika platser inom en kommun. Bokbussförare kör bokbuss enligt givna linjer inom en kommun. Bokbussen är vanligen en ombyggd buss eller lastbil. Vanliga stopp är vid förskolor och skolor som saknar egna bibliotek. Bokbussföraren arbetar oftast tillsammans med en biblotikarie som följer med bokbussen. Beroende på arbetsgivare kan viss låneadministration ingå i arbetsuppgifter. Övriga arbetsuppgifter är sedvanligt underhåll av bokbussen. Källa: Arbetsförmedlingen
broader: Lastbilsförare m.fl.
related: zGjD M5a HCX
related: ASGV zcE bWf
related: RKXf EDH hvi
broad match: C8332

Cykelbud
type: Concept
in scheme: JobTech Taxonomy - Yrke
definition: Cykelbud levererar varor till kunder. Varubud som levererar varor till kunder. Varor beställs vanligen av kunder via en mobilapp där ordern skickas till budet som hämtar upp varor hos återförsäljaren och levererar till kunden. Leveranserna sker på cykel eller moped, vilket kräver att budet känner till och följer gällande trafikregler. Arbetet innebär kontakt med både kunder och leverantörer, varför man bör trivas i att arbeta i en servicefunktion. Källa: Transportfackens yrkes- och arbetsmiljönämnd
broader: Övriga bil-, motorcykel- och cykelförare
related: Nz2S LBP bu4
related: UdVa jRr 9DE
related: W2bK sAH gcx
related: EY3i ekR W9x
related: ASGV zcE bWf
related: 5AzM x32 gnk
related: F9wn mCz F1o
related: ArKj rdQ Sqk
broad match: C9331

Dramaturg
type: Concept
in scheme: JobTech Taxonomy - Yrke
definition: Dramaturg analyserar, tolkar och bearbetar dramatik och texter för scenkonst, oftast teater, för att stödja produktionen av en föreställning. Vanliga arbetsuppgifter är att granska och ge feedback på manus, analysera pjäsens innehåll, struktur och kontext och se till att berättelsen når sin publik på önskat sätt. En viktig del är också att anpassa text och berättande utifrån målgrupp och produktionens konstnärliga vision. Källa: Arbetsförmedlingen, Malmö Stadsteater, Lunds universitet
broader: Författare m.fl.
related: 8too bEs 7NU
related: 9puE nYg crq
broad match: C2641

Bensinstationspersonal
type: Concept
in scheme: JobTech Taxonomy - Yrke
definition: Säljer drivmedel, tillbehör, biltvätt och livsmedel. Bereder och serverar snabbmat och dryck. Hyr ut bilar, lastbilar och släpvagnar. Hit hör inte Biluthyrare (5226)
broader: Butikspersonal
related: C5245
related: cWRj kbz Zh3
related: Dywf BPg usG
related: UssR m8J XA6
related: iKeJ 2nr wzA
related: FMyD iiR FKA
related: GyDU 16x 48U
related: zaFd wXf E5Z
related: xrds 8Cq rzm
related: Q5Gj qVb 1AY
related: y71S LsF xLV
related: 7o3Y Fg6 hr4
related: hYpk RYx y3V
related: rJsb Rse ixK
related: 4Q3Q 3Du XGx
related: hkzB Lob 4jT
related: 75Nu amZ Ag5
related: FN7N 7er WmW
narrower: Bensinstationsbiträde
broad match: RPTn bxG ExZ

Elnätsspecialist
type: Concept
in scheme: JobTech Taxonomy - Yrke
definition: Elnätsspecialist
broader: Civilingenjörsyrken inom elektroteknik
related: 6Hq3 tKo V57
related: NFpt RHg iqq
related: 6ByF Y4K Cue
related: DjR7 Sew TLm
related: VPut b9f rVd
broad match: C2151

Lärling, tornkranförare
type: Concept
in scheme: JobTech Taxonomy - Yrke
definition: En lärling är anställd för att slutföra sin kvalificeringstid till tornkranförare innan ett yrkesbevis kan utfärdas. Under kvalificeringstiden får du lärlingslön enligt avtal. Kvalificeringstiden tillsammans med teoretisk grundutbildning leder till yrkesbeviset. Ett lärlingsavtal mellan branschorganisation och företag tecknas. Källa: BYN
broader: Kranförare m.fl.
related: j7Cq ZJe GkT
related: ja7J P8X YC9
related: vtY3 TC1 Hg6
broad match: C8343

Forskare, skogsbruk
type: Concept
in scheme: JobTech Taxonomy - Yrke
definition: Forskare, skogsbruk
broader: Specialister och rådgivare inom skogsbruk
related: WGAZ xaM gUE
related: m7hK j9n QPx
related: VuuL 7CH adj
broad match: C2132

Flygplatskontrollant
type: Concept
in scheme: JobTech Taxonomy - Yrke
definition: Flygplatskontrollanter arbetar med säkerhetskontroller på flygplatser. Arbetet innebär i huvudsak att kontrollera passagerare och handbagage genom kroppsvisitation, röntgenutrustning och andra tekniska hjälpmedel. Andra arbetsuppgifter kan vara att kontrollera fordon, byggnader, uppställningsplatser, flygpost, fraktgods och serveringsutrustning. Då yrket ofta innebär arbete på flygplats, som är ett skyddsobjekt, kan bakgrundskontroll och säkerhetsprövning behöva göras innan anställning. Se även yrket skyddsvakt, som är en grundutbildad väktare med särskilt förordnande. Källa: Arbetsförmedlingen
broader: Väktare och ordningsvakter
related: dVbW QJc xZi
related: E7hm BLq fqZ
related: 3aFw anH Wbv
related: pZnR qxu 1ce
broad match: C5414

Finmekaniska, grafiska och konsthantverksyrken
type: Concept
in scheme: JobTech Taxonomy - Yrke
definition: Finmekaniska, grafiska och konsthantverksyrken
broader: Yrken inom byggverksamhet och tillverkning
narrower: Finmekaniker och konsthantverkare m.fl.
narrower: Prepresstekniker, tryckare och bokbindare m.fl.

Familjerättsjurist
type: Concept
in scheme: JobTech Taxonomy - Yrke
definition: Familjerättsjurist
broader: Affärs- och företagsjurister
related: GcHm pkp UT3
related: b6zt rxA Gfm
related: xmCa tXq 4a8
related: Kak9 3ed VL6
related: DUL9 Mg6 843
related: X82t awd Qyc
related: 4CN7 Gd8 oNz
related: x4Wi NWW ogB
related: kPW1 ASd 81W
related: khdd gM4 xWr
related: Abcb QtH isZ
broad match: C2619

Emballerare
type: Concept
in scheme: JobTech Taxonomy - Yrke
definition: En emballerare arbetar med att packa och skydda varor och produkter, ofta i samband med transport och lagring. Det kan innebära att använda olika material och metoder för att säkra att produkterna når mottagaren i gott skick. Arbetsuppgifterna kan variera beroende på bransch och arbetsplats, men generellt sett handlar det om att använda kartonger, pallar, plast och andra förpackningsmaterial för att skydda produkterna. Hantera och övervaka maskiner för packning, märkning och andra förberedande processer. Källa: Arbetsförmedlingen
broader: Maskinoperatörer, påfyllning, packning och märkning
related: W2uV 7xN oQP
related: JDQS 8Jd fSt
related: wTEr CBC bqh
broad match: C8183

Bro- och slussvakt
type: Concept
in scheme: JobTech Taxonomy - Yrke
definition: Bro- och slussvakter bistår fartyg och vägfordonstrafik vid öppning och stängning av broar och slussar. Arbetet innebär i huvudsak att öppna och stänga broar och slussar för båttrafik. Många broar öppnas automatiskt men behöver personal på plats för att bistå vid eventuella driftstörningar. Andra arbetsuppgifter är att bistå ankommande fartyg med information och kommunicera med hamnar om ankommande fartyg. Källa: Arbetsförmedlingen
broader: Transportledare och transportsamordnare
related: 3p4a WVY i2t
related: Yrne QZ3 trr
related: P2Lz Pyz Eyg
related: ASGV zcE bWf
related: kUyT Km8 JcH
broad match: C4323

Tågtekniker
type: Concept
in scheme: JobTech Taxonomy - Yrke
definition: Tågtekniker arbetar med avhjälpande och planerat underhåll på tåg. Arbetet innebär både felsökning av akuta fel och underhåll av komponenter enligt plan av både lok och vagnar. Arbetet sker vanligtvis i tågdepåer. Tågtekniker har vanligtvis kunskaper inom mekanik, datateknik, elektronik och automation. Källa: Arbetsförmedlingen
broader: Underhållsmekaniker och maskinreparatörer
related: gDTV tUX NGQ
related: evCA PeV QQi
related: yhCP AqT tns
related: 2gUP QiC gqW
related: CS9B yTK aH5
related: EWRg FeE hAg
related: udT8 Fvb huS
related: VsCN mNr t82
broad match: C7233

IT-jurist
type: Concept
in scheme: JobTech Taxonomy - Yrke
definition: It-jurist arbetar med juridiska frågor kopplade till informationsteknik, digitalisering och dataskydd. Arbetsuppgifterna omfattar att granska, upprätta och förhandla avtal för IT-tjänster och programvaror, tolka och tillämpa lagar kring dataskydd, integritet och cybersäkerhet, samt ge juridisk rådgivning vid digitala projekt och systeminföranden. It-jurist hanterar frågor om upphovsrätt, sekretess och GDPR, analyserar juridiska risker vid ny teknik och företräder företag eller myndigheter i förhandlingar, tvister och policyarbete. Källa: Arbetsförmedlingen
broader: Övriga jurister
related: X82t awd Qyc
related: x4Wi NWW ogB
related: Abcb QtH isZ
broad match: C2619

Utredningssekreterare
type: Concept
in scheme: JobTech Taxonomy - Yrke
definition: Utredningssekreterare
broader: Planerare och utredare m.fl.
related: X82t awd Qyc
related: TZe9 NsN uce
broad match: C2422

Slaktare
type: Concept
in scheme: JobTech Taxonomy - Yrke
definition: Slaktare arbetar med att ta emot, avliva och förbereda djurkroppar för användning av dessas kött och andra biprodukter vid produktion av livsmedel. Slaktaren står för allt arbete från att djuren anländer till dess att bara kött och ben återstår av slaktkroppen, det inkluderar bland annat avlivning, tömning på blod och urtagning av inälvor. Allt som går tas tillvara klassificeras, vägs och kyls ned. Källa: Arbetsförmedlingen - Hitta yrken, Kött- och charkföretagen
broader: Slaktare och styckare m.fl.
related: VGCB nNX oEW
related: shXq 8W2 4Ha
related: XKee 8fe CAC
related: wTEr CBC bqh
related: K3dD a8w v3d
broad match: C7511

Förhandlingssekreterare
type: Concept
in scheme: JobTech Taxonomy - Yrke
definition: Förhandlingssekreterare
broader: Planerare och utredare m.fl.
related: X82t awd Qyc
related: epLc SkD cbT
related: bh3H Y3h 5eD
broad match: C2422

Prorektor
type: Concept
in scheme: JobTech Taxonomy - Yrke
definition: Prorektor
broader: Verkställande direktörer m.fl.
related: rc2v LnU M8A
related: ZaMp faW UE9
related: epLc SkD cbT
related: bh3H Y3h 5eD
related: MVqp eS8 kDZ
broad match: C1120

Serviceelektriker, installation
type: Concept
in scheme: JobTech Taxonomy - Yrke
definition: Serviceelektrikern jobbar självständigt med felsökning och reparation av elektriska anläggningar. De gör även mindre installationer av olika slag. Det kan handla om kabeldragning, montage av elcentraler eller installation av vitvaror, värmepumpar och solpaneler. Källa: Arbetsförmedlingen
broader: Installations- och serviceelektriker
related: bFCs yuV SnF
related: bcCf gz6 n8G
related: CSf3 WS4 FQG
related: yhCP AqT tns
related: ja7J P8X YC9
related: XgKY 3kj x6V
related: zuFd pmd 93H
related: AgBe pTv DXL
related: KFAM 7hY NfZ
broad match: C7411

Kostymdesigner
type: Concept
in scheme: JobTech Taxonomy - Yrke
definition: Kostymdesigner skapar och planerar kostymer för film-, teater- eller tv-produktioner. Vanliga arbetsuppgifter är göra research, skissa och designa kostymer, leda kostymavdelningen och planera dess budget och schema, följer upp allt från inköp till sömnad och anpassning av kostymer. Arbetet sker i samarbete med regissör, producent och skådespelare. Källa: Arbetsförmedlingen, Film i Väst, Yrkesnämnden för Film och TV
broader: Övriga designer och formgivare
related: rcKf xEj Fyu
related: eV6Q 4zB oK2
related: csiA wMY i2z
related: Ybfc Vgs ySM
related: 8too bEs 7NU
related: 9puE nYg crq
related: krNo hiy b3e
related: zKcg Mie bKh
broad match: C2163

Väg- och vattenbyggnadsingenjör
type: Concept
in scheme: JobTech Taxonomy - Yrke
definition: Väg- och vattenbyggnadsingenjör
broader: Ingenjörer och tekniker inom bygg och anläggning
related: Sa9V HHy VjR
related: G6pB BdL 1Ns
related: 8YyW ZGi bZr
related: 8ZeZ pud vXC
related: j7Cq ZJe GkT
related: awH3 H2R ygb
related: NkzB vga g44
related: ZWTd B44 2jw
related: QqjF 9nq 5Hn
related: JGFq SQ1 VtD
related: AkaZ Zv9 gRW
related: Z5Xi PWH Fim
related: ivqV KSq 8V1
related: kZHV dkx gne
related: DrME wPa g12
related: Z4Re QWh 8X6
related: VECr cRX rQQ
related: WZbH bE3 jQc
related: zUE7 M3o C6y
related: ZjCw 9JF b8s
related: a1wy ZjC a8D
broad match: C3112

Takrengörare
type: Concept
in scheme: JobTech Taxonomy - Yrke
definition: Takrengörare rengör och underhåller tak och fasader. Arbetet sker främst genom högtryckstvättning för att avlägsna smuts, mossa och alger från tak och fasader. Vissa företag som utför takrengöring utför också takmålning och enklare reparationer. Arbetet sker på hög höjd och kräver säkerhetsutrustning. Då takrengöring utförs ute hos kund är körkort ofta ett krav. Källa: Arbetsförmedlingen
broader: Saneringsarbetare m.fl.
related: whao Q6A ScE
related: AMCh 2zo 737
related: DmJB bS6 7kN
related: ai5S gjH B9c
broad match: C9129

Bantekniker
type: Concept
in scheme: JobTech Taxonomy - Yrke
definition: Bantekniker arbetar med underhåll, reparation och nybyggnation av järnvägsspår, inklusive växelbyten, rälsbyten och snö- och vegetationsröjning. Bantekniker säkerställer att tågen kan färdas säkert och effektivt genom att hålla spåren i gott skick, vilket. En bantekniker samarbetar även med andra tekniker inom signal, el och telekommunikation för att lösa akuta problem i spåren. Dagens tågtrafik, med höga hastigheter och tunga laster, kräver noggrant underhåll av både spårets uppbyggnad och dess komponenter. Källa: Arbetsförmedlingen
broader: Anläggningsarbetare
related: UG7T 4q7 cPs
related: Y7K4 Jk3 US3
related: YYBq cZP nPe
related: j7Cq ZJe GkT
related: iTMk wLe 9Vw
related: LF5p Eij 7SZ
related: cggX WCu zSz
related: cV5y hhm 434
related: yhCP AqT tns
related: ja7J P8X YC9
related: upbS QFL YQP
related: xrY8 vzV XB6
related: ssjZ fY7 M3F
related: B22x oEx Jz8
broad match: C7119

Ingenjörer och tekniker inom maskinteknik
type: Concept
in scheme: JobTech Taxonomy - Yrke
definition: Utför tekniskt arbete i samband med konstruktion, tillverkning, montering, underhåll och reparation av fordon, maskiner och annan mekanisk utrustning samt värme-, vatten-, sanitets-, ventilations- och kylsystem. Utför konstruktions-, ritnings- och beräkningsarbete. Organiserar, leder och samordnar det praktiska arbetet vid tillverkning av fordon, maskiner m.m. Provar och kontrollerar maskiner och andra mekaniska produkter. Hit hör inte Civilingenjörsyrken inom maskinteknik (2144)
broader: Ingenjörer och tekniker
related: qw7x yA1 M9g
related: SHLk qhb wEx
related: DbmE 6Js HL1
related: tCER yDZ XnW
related: JQRo XJx YX9
related: BEva hvD fyY
related: uvcb DuX NW8
related: VPF1 UZM 9Kd
related: zLwt WNZ KnP
related: W5A6 NGs aM9
related: Z6GN aCQ MDc
related: 4VUm JpJ LWr
related: eHy7 eMm 1mG
related: Uige jQo uZ4
related: 9Hvc DYG iqB
related: 48zu t6j A28
related: tg8L maz wMN
related: 1CnL 8ZQ tTd
related: D8Qb A75 bDH
related: 61zA BvK zDd
related: Dbcb xEu dVS
related: cCMP ufr 9Ke
related: 7ijD koM unx
related: d4fX YoT QQc
related: RMCB qzu Www
related: n5Ww Cc9 xYG
related: Y7va 3yN FSd
related: tdFQ q6Y 7nM
related: 11L4 Q2Z 8tM
related: oaiv GsB AFK
related: gqdt aJj YQJ
related: LXoc wxV 73h
related: 74Mw JUN VKx
related: oQre F86 kHG
related: F6zK iNu bXQ
related: 2kEw jWL 6Zz
related: 6ZKB QVh xPs
related: K5JR yfk 8oj
related: kLLw dnR M38
related: apDb b1W jQx
related: yh11 sgo Z29
related: QnvA akR Rd7
related: P7h9 sUt cBp
related: YK2s pxn YWW
related: KkHc dxw Mwc
related: kfYc q1X SZ5
related: uq7L Dfk HWR
related: Y6zg 1oi cDZ
related: NtWF zFu Mhg
related: JKSD AC8 Z2S
related: yFgG g8k r6r
related: PGDh 8HQ 4BZ
related: bwYY qC7 5xE
related: Ry2v 4Hx 6ta
related: KWhH dbp DuQ
related: YAdb Wwj b3N
related: HW3B CwN pst
related: DsHp orw 8Xb
related: kJCx vqk SQG
related: wBKD S7C s4B
related: zRtu fYj XC4
related: jSAi QKc JQk
related: xsSg pg2 Bpq
related: Z2XD GQ9 qvM
related: uwev L2n fpz
related: cCGX 6Y8 87C
related: C3115
related: r78c Y6B h6r
related: ob2k Bcp XHY
related: Udbb Eay MuR
related: tNHP 38u Pjt
related: CC8f L8a UFX
related: ppUe nsQ hn5
related: irPd z5v 2o1
related: CzZc 7tx B9C

Teckenspråkslärare
type: Concept
in scheme: JobTech Taxonomy - Yrke
definition: Lärare som undervisar i teckenspråk. Källa: SKR
broader: Övriga pedagoger med teoretisk specialistkompetens
related: pVzY rff Amk
related: MVqp eS8 kDZ
related: Dmw3 TLx jgs
broad match: C2353

Forskare, teologi
type: Concept
in scheme: JobTech Taxonomy - Yrke
definition: Forskare, teologi
broader: Arkeologer och specialister inom humaniora m.m.
related: X82t awd Qyc
broad match: C2633

Frivårdschef
type: Concept
in scheme: JobTech Taxonomy - Yrke
definition: Frivårdschef
broader: Övriga chefer inom samhällsservice
related: GazW 2TU kJw
related: epLc SkD cbT
related: tGBJ Tp4 ERc
broad match: C1349

Städare
type: Concept
in scheme: JobTech Taxonomy - Yrke
definition: Städare, även kallat lokalvårddare, rengör och underhåller olika typer av miljöer, inklusive kontor, kommersiella lokaler, offentliga byggnader och privata hem. Städare utföra rengöring av golv, väggar, fönster och andra ytor med hjälp av rengöringsmedel och städutrustning. Beroende på arbetsplats används även städmaskiner för dammsugning, golvpolering och ångtvättning. Källa: Arbetsförmedlingen
broader: Städare
related: 9TaX zjk RhB
related: whao Q6A ScE
related: EQxi XSm VjP
related: msSc GwE 2qo
related: UdVa jRr 9DE
related: AbEG 6bi ngH
related: GEcK Bde GCF
related: 4nuk Bd9 DDd
related: LCMR jgv sAZ
related: X4y3 Fhv Pq1
related: mRLP URN tZX
related: gT1a SfZ aZb
related: WRaP yZF icT
related: zzMC zZ3 f28
related: uL3R JAT yHA
related: KSEL Yk1 kbP
related: 7Xt2 BhX o7H
related: 22br E8y iXU
related: tv5k wGr D6r
related: vEPG QfU DNY
related: XBYz KAj 5Vg
related: a2KZ RqC aLV
related: bcQz 7av M9Z
related: VMMC vV4 bkj
related: 8XHJ Qn8 RZb
related: 1hnX PiJ Ywe
related: 4j4y LCf 3Y2
related: fd4t 9VW sw9
related: RJ6v 34c DCg
related: LdWZ QtM 3pY
related: AwbS 6rN Vac
related: aU79 vHy ToB
related: 2EUt B3x 5S8
related: yscU Web dx5
related: 35U5 Pgu g5Y
related: AqZa mQg 4Lv
related: oMNx Juu 8P2
related: 2osh L7B r3Q
related: w5t4 rLa jaR
related: 5FRb YJH c9P
related: GoGN kg1 w8D
related: keaY KAF ZP5
broad match: C9112

Gemmolog
type: Concept
in scheme: JobTech Taxonomy - Yrke
definition: Gemmologer värderar ädelstenar genom att analysera egenskaper, skärning och härstamning, antingen för handel eller för vidare polering. Gemmologer har utförliga kunskaper om ädelstenar och pärlor. Man arbetar främst med värdering av ädelstenar, ofta på uppdrag av pantbanker eller auktionshus. Källa: Arbetsförmedlingen, Sveriges gemmologiska riksförening
broader: Guld- och silversmeder
related: PaxQ o1G wWH
broad match: C7313

Yrken med krav på högskolekompetens eller motsvarande inom teknik
type: Concept
in scheme: JobTech Taxonomy - Yrke
definition: Yrken med krav på högskolekompetens eller motsvarande inom teknik
broader: Yrken med krav på högskolekompetens eller motsvarande
narrower: Arbetsledare inom bygg och tillverkning m.m.
narrower: Piloter, fartygs- och maskinbefäl m.fl.
narrower: Ingenjörer och tekniker

Körledare
type: Concept
in scheme: JobTech Taxonomy - Yrke
definition: Körledare
broader: Musiker, sångare och kompositörer
related: ggzt bm1 3fK
related: a1RE FQL V7Z
related: 9puE nYg crq
related: 7BiG YFT HrF
broad match: C2652

Bilvårdare
type: Concept
in scheme: JobTech Taxonomy - Yrke
definition: Bilvårdare arbetar med att rengöra och underhålla fordon. Som bilvårdare arbetar man med att tvätta och rengöra fordon utvändigt och invändigt. Arbetsuppgifter inkluderar tvättning, polering, in- och utvändig rengöring. Vanligtvis utför bilvårdare även enklare reparationer och service, så som besiktning, skadekontroll, lackreparation och hjulskiften. Det kan även ingå att hämta och lämna bilar hos kunder, varför körkort kan vara nödvändigt. Källa: Arbetsförmedlingen
broader: Bilrekonditionerare, fönsterputsare m.fl.
related: whao Q6A ScE
related: 37ud yUa tGZ
related: UdVa jRr 9DE
related: kqTh AD7 7Mu
related: AYvL RUw YQ2
related: 9rdx JoE Thz
related: Uupv 4Fb 7CT
broad match: C9122

Personligt ombud
type: Concept
in scheme: JobTech Taxonomy - Yrke
definition: Personliga ombud ​stödjer individer med psykiska funktionsnedsättningar i kontakt med samhället. Arbetet innebär i huvudsak att hjälpa sin klient att få tillgång till samhällets vård, stöd och service. Genom att identifiera behov, samordna insatser och säkerställa att rättigheter tillgodoses, arbetar ombudet för att förbättra klientens livskvalitet. Personliga ombud är anställda av kommunen men arbetar fristående från myndigheter och utför uppdrag enbart på klientens begäran. Arbetsuppgifter: stödja personer med psykisk funktionsnedsättning, stödja personer att ta del av samhällsservice Källa: Arbetsförmedlingen
broader: Personliga assistenter
related: GazW 2TU kJw
related: tGBJ Tp4 ERc
broad match: C2635
broad match: C5322

Fysiker och astronomer
type: Concept
in scheme: JobTech Taxonomy - Yrke
definition: Utvecklar teorier, modeller och metoder som rör materia, rum, tid, energi, krafter och fält samt samverkan mellan dessa fenomen. Utformar praktiska tillämpningar inom fysik, astronomi, och radiofysik. Studerar fenomen, leder experiment, analyserar och värderar data. Utför beräkningar, informerar, inspekterar, samt utfärdar anvisningar och tillstånd.
broader: Fysiker, kemister m.fl.
related: Z5Te TML CNR
related: TzNH 3MM hyC
related: oYvX MYb coJ
related: wEzZ i5z Syx
related: umCi arf Sy8
related: TRMc 8hB FFS
related: D6sW Vxo qFq
related: E1bi j9u yCd
related: QSTL dTq Jsd
related: WBAe 1rD 5JT
related: MyhA se3 bvU
related: 2RsH xb5 epG
related: RF97 2z3 xKb
related: GBSd b9T fPy
related: g66S 1UU WnA
related: 1ZBT Mkv jnq
related: 3hUV hHP i7n
related: VPjj 97M PdF
related: eojD i4f 4f6
related: C2111
related: jv2V UoY 8XH
related: 1223 u6p gjG
related: Hr3s Efy c89
related: qEQz Mbj kQP
related: sZMf 5Sw dk4
related: 6QqN YRs XG1
related: t2ts Uuk Sq2
related: wZpC X9a xzG
related: TnB9 3bm SHm
narrower: Strålningsfysiker
narrower: Forensiker, fysiker
narrower: Partikelfysiker
narrower: Sjukhusfysiker
narrower: Astronom
narrower: Atomfysiker
narrower: Plasmafysiker
narrower: Kärnfysiker
narrower: Fysiker
narrower: Radiofysiker
broad match: kJeN wmw 9wX

Specialistläkare, socialmedicin
type: Concept
in scheme: JobTech Taxonomy - Yrke
definition: Specialistläkare, socialmedicin är en specialiserad legitimerad läkare med en djupare kunskap och kompetens inom sitt område. Specialistläkare är en skyddad titel och bara den som har bevis om specialistkompetens får kalla sig specialist i sin specialitet. Specialistläkare ansvarar för att diagnostisera, behandla och förebygga sjukdomar inom sin specialitet. Vanliga arbetsuppgifter är mottagningsarbete med patientbesök, rondarbete på avdelning, handledning av yngre läkare samt konsultationer till andra yrkesgrupper och specialiteter. Specialistläkare ansvarar även för att följa och leda utvecklingen inom sitt medicinska område och utför omfattande medicinsk dokumentation och administration. Källa: Arbetsförmedlingen, Karolinska Institutet, Socialstyrelsen, Sveriges Kommuner och Regioner, Sveriges läkarförbund
broader: Specialistläkare
related: NYW6 mP6 vwf
related: qSbw XHD Ycd
related: TChC u37 rt2
related: EBX9 7gC eLt
related: vFjb AHi a54
related: jFHU uSj 4ke
related: juJT 9vT qTW
related: KALC VvK 17U
related: QSeQ MpU wpW
related: 89LR AwA UqR
broad match: C2212

Handläggare Kronofogden
type: Concept
in scheme: JobTech Taxonomy - Yrke
definition: Handläggare på Kronofogden arbetar med ärenden som rör indrivning av skulder, betalningsförelägganden och verkställighet. Arbetsuppgifterna inkluderar att ta emot, registrera och pröva ansökningar, utreda ekonomiska förhållanden samt besluta om lämpliga åtgärder för att reglera skulder. Handläggaren hanterar kontakter med privatpersoner, företag, myndigheter och andra parter via telefon, e-post och brev. I arbetet ingår också att dokumentera, bedöma underlag och följa aktuella lagar och rutiner för rättssäker och effektiv handläggning. Arbetet kombinerar administrativt arbete med kundkontakt och kan även omfatta praktiskt arbete på fältet, såsom utmätning och avhysning. Handläggare på Kronofogden arbetar ofta i team och genomgår intern utbildning som kombinerar teori och praktik. Källor: Kronofogden
broader: Inkasserare och pantlånare m.fl.
related: X82t awd Qyc
related: 2pjF 8Sw qvR
broad match: C4214

Studiecirkelledare
type: Concept
in scheme: JobTech Taxonomy - Yrke
definition: En studiecirkelledare ansvarar för att planera och leda en studiecirkel, en grupp som träffas för att lära sig tillsammans. Studiecirkelledarens roll är att skapa en bra miljö för lärande, där alla deltagare känner sig delaktiga och kan bidra. Det innebär att organisera studierna, facilitera diskussioner och se till att gruppen når sina mål. Det ingår även att sköta rapportering av närvaro och kontakter med studieförbundet i studiecirkelledarens uppgifter. Källa: Riksförbundet frivilliga samhällsarbetare, ABF
broader: Övriga utbildare och instruktörer
related: JJcT huS CFf
related: nenY 9A2 NQz
related: MVqp eS8 kDZ
related: 6Ezd gku 7wG
related: GrYx 8Va Q4s
related: emWX p1P rT1
broad match: C2359

Inköpare
type: Concept
in scheme: JobTech Taxonomy - Yrke
definition: Inköpare köper in varor och tjänster som är nödvändiga för företagets verksamhet. Arbetsuppgifterna inkluderar att identifiera och analysera behov, söka och utvärdera leverantörer samt förhandla fram priser och avtal. Inköpare hanterar och följer upp inköpsprocessen från beställning till leverans, optimerar inköpsflödet för att minska kostnader och förbättra effektiviteten, och analyserar marknadstrender för att förutse prissättning. Rollen innefattar även att vårda relationer med befintliga leverantörer och samarbeta med olika delar av organisationen för att säkerställa att inköpen stödjer företagets mål och konkurrenskraft. Källor: Arbetsförmedlingen, TNG
broader: Inköpare och upphandlare
related: dUNf sk4 HbM
related: TPkZ Zut jFu
related: ZGw5 DLj SPy
related: ZTEB W6w oWP
related: Qvg9 ifK YCB
related: crZi z4z knS
related: 7Zqg cHY g4t
related: FXsH 5eN ord
related: adv7 xpc BSX
related: nByr 9xz q6c
related: yAKG f8F btt
related: 2pqJ Jnc B33
related: 53ST 17S Z8G
related: 5TDZ 7Kw B5h
related: rGZx hno p7e
related: 45nx iHX 9JP
related: RPTn bxG ExZ
related: gDLw BXm oQp
related: a73P WxS G9m
related: QzN8 bjC SCK
related: TtDY 5ZZ 9uA
related: JBa1 Ki8 kG9
related: UN5r roq B6i
related: jVHp dna WEW
related: rhF8 VaT dAf
related: JSer dop 4Ls
related: Vqnz jry A87
related: Ww4K BWD 9F5
related: VRZx fSZ 9e4
related: BzxC pW8 K3u
related: oMKh RB5 9vf
related: LSwG thr mZc
related: 5cjq kEF ve7
related: o8Rr 8UF DCJ
related: Yez7 bKG G31
related: hLfi nQm dmx
related: j7Eo HBx sm6
related: cBJh 3Cx reY
related: bz5W wf5 zcR
related: Tkyc y86 6oF
related: 5y48 AYE Uof
related: zbYw WCy 2B6
related: TCZY v6g j3v
related: SXMu aH3 qBK
related: 5MnT E3h tg3
related: vgTt 9v5 xy9
related: n4qM KrG 9dq
related: y335 u6Z wrx
related: PtLv r5Q XSb
related: efw8 uzk Pg8
related: SF9d EAX KyZ
related: L3V6 83t 4Tu
related: 3isd YTh oS1
related: UG47 Ts3 Agu
related: uSfu 9HM W6B
related: sgRJ VdK YDA
related: jbnB V5P guw
related: yubB GrM GQM
related: H1Xo LsP Txe
related: X96k csf gw2
related: Wdh7 ALA F4j
related: FMsU D4c Sba
related: ttSf vYR zNZ
related: Mi4t a2Q xgT
related: hGhJ fwQ s3U
broad match: C3323

Civilingenjör, energi
type: Concept
in scheme: JobTech Taxonomy - Yrke
definition: Civilingenjör, energi
broader: Civilingenjörsyrken inom maskinteknik
related: SuAn oH9 xNc
related: 6Hq3 tKo V57
related: wDCK VWR E5R
related: h7o5 F3F swn
broad match: C2144

Systemtestare/Funktionstestare
type: Concept
in scheme: JobTech Taxonomy - Yrke
definition: Systemtestare/Funktionstestare
alternative label: Funktionstestare
alternative label: Systemtestare
broader: Systemtestare och testledare
related: 6EvK gq4 TUy
related: g8wH fi1 ueD
related: 1m8v h89 YG1
related: frAG 1nF mWH
related: MeuL 8Gs So1
related: cq1S yzi bCm
related: iiiu 5Xg KQw
related: yidY 4qg Pj5
related: 6pve DF9 pxU
related: 4ymz VLW bqH
related: JipR Cwm C27
related: apaJ 2ja LuF
related: 1dTL d3F q6z
related: NkpP 8mQ 3v5
related: 2iaC YoK v4E
related: eHXM dJQ psV
related: Pm2J Tqs pwi
related: v4jG hn3 yfg
related: KECb LDS bjm
related: wmLt Xhc tRp
related: djJj tQQ 3AJ
related: ZWoE df5 5qa
related: cgsQ oxc LMB
related: 2GiV Qsu EPa
related: o2bF nqe LVD
broad match: C2519

Studie- och yrkesvägledare/SYV
type: Concept
in scheme: JobTech Taxonomy - Yrke
definition: En studie- och yrkesvägledare (SYV), ger vägledning och stöd till individer i deras utbildnings- och yrkesval. De hjälper till att utforska intressen, förmågor och möjligheter, samt ger information om utbildningar och arbetsmarknaden. Studievägledare kan arbeta både individuellt och i grupp, och deras arbete kan omfatta allt från att studieplanering till att ge råd om karriärval. Källa: SACO, Uppsala universitet
broader: Studie- och yrkesvägledare
related: mic3 uzf BWP
related: H9az NUP vt8
related: EZxs wuf 26A
related: ruXd T9X Xzi
related: PXmG 25i oiM
related: jEZ1 46g niW
related: sGaf XtN i6u
related: i61K upT byT
related: jAHC ivH 5WW
related: CsPH 9FF Uar
related: MVqp eS8 kDZ
related: bY9f nxu Wuv
related: qGhq K1j saV
related: iatK MwM MFr
related: 3srT kTS gBG
related: G77k KEr y7D
related: gkMH dEd Gyu
broad match: C2423

Uppfödare och skötare av lantbrukets husdjur
type: Concept
in scheme: JobTech Taxonomy - Yrke
definition: Bedriver avel, uppfödning och skötsel av lantbrukets husdjur för produktion av mjölk, kött, ägg m.m. Skor hästar. Underhåller ekonomibyggnader, maskiner och utrustning.
broader: Djuruppfödare och djurskötare
related: xW23 QFV g9F
related: yZWG ynW 4iQ
related: sUeE CXb hzj
related: XcLK M82 ogc
related: GCg8 8qw GkM
related: N4Jk Sz1 n9Z
related: 6md5 wPp d4S
related: MdQ3 2Lh Xiy
related: hsnu VgP fcj
related: ucwX rMS 9dx
related: axXs Pwm PQT
related: DM6e bth LXc
related: wkwA awm s42
related: t9HF qgT CCT
related: oYDh d6r cSu
related: xhjf d2X a4a
related: 76zY Jy9 KSt
related: RBpz aSt vhm
related: hZDG iqA bka
related: o5AT zgo if4
related: iTYM 6hM cSS
related: CVyh JMe u8R
related: b3cK YFd y5S
related: yVj6 5Ey Gku
related: 74uH 39f D58
related: jRz7 eFB RH9
related: hndr LeJ so6
related: nxLp 9ds miB
related: 4kjY ifb gE2
related: 2d8m SG1 duS
related: z99q sFD nas
related: YrPb Rbj bQT
related: DoHV moJ 7b3
related: ahfZ AE3 Jhh
related: BFEG esg Nde
related: QCwb g4M zBr
related: ZWLx ZPF kME
related: C6121
related: vkj5 FJh waJ
related: RMEA 5Bg U19
related: so32 EVN up1
related: MUVU LsK rA3
related: AwMo JWL DHG
related: cg3X 3ZW aCG
related: yYgy azb GqH
related: D7zq sxj A2e
related: xEPd bLn R5i
related: rarR CnP wRC
related: 89ab noe cw9
related: sBa5 xfE GKU
related: 37ZU mdJ hhK
related: hiQ7 duu Vvx
related: gjd2 JSR AeG
related: MaaF C4T TGd
related: bPHw mw8 Mm5
related: hZ4C vXz Swc
related: C6122
related: Y1AR zh1 9CG
related: pbbc s2J TCD
narrower: Djurskötare lantbruk
narrower: Hovslagare
narrower: Hästskötare
narrower: Stallchef
narrower: Klövvårdare
narrower: Husdjurstekniker
narrower: Lantbrukare djuruppfödning
narrower: Förman djuruppfödning
broad match: VuuL 7CH adj

Cabin stewardess/Hyttvärdinna
type: Concept
in scheme: JobTech Taxonomy - Yrke
definition: Cabin stewardess/Hyttvärdinna innebär bland annat att bädda och städa hytter ombord, städa allmänna utrymmen, samt att ge våra passagerare bästa möjliga service. Källa: div platsnnonser
alternative label: Cabin stewardess
alternative label: Hyttvärdinna
broader: Städare
related: whao Q6A ScE
related: dRFw Rcu dX7
related: 4j4y LCf 3Y2
related: AqZa mQg 4Lv
broad match: C9112

Bildredaktör
type: Concept
in scheme: JobTech Taxonomy - Yrke
definition: Bildredaktör planerar, väljer ut och bearbetar bilder för publicering i olika medier som tidningar, böcker, webbplatser och digitala kanaler. Vanliga arbetsuppgifter är att redigera och anpassa bilder och se till att bildavtal och upphovsrätt följs. Bildredaktören kan även sköta bildservice och rådgivning kring visuellt innehåll samt ibland fotografera. Källa: Arbetsförmedlingen, Platsannonser
broader: Journalister m.fl.
related: pYez WWr Ygt
related: 8too bEs 7NU
related: 9puE nYg crq
related: zN1X rvg xwz
broad match: C2642

Analytisk kemist
type: Concept
in scheme: JobTech Taxonomy - Yrke
definition: Analytisk kemist
broader: Kemister
related: CpFD aoS pkZ
related: kJeN wmw 9wX
related: Yr11 UKD on1
related: o8u3 Drh a8R
related: fM7t axJ RNN
related: 1MUY iK3 oKi
related: Pqdf Gpg 4F9
broad match: C2113

Rosenterapeut
type: Concept
in scheme: JobTech Taxonomy - Yrke
definition: Rosenterapeut
broader: Terapeuter inom alternativmedicin
related: NYW6 mP6 vwf
related: Uuf1 GMh Uvw
broad match: C3230

Genetiker
type: Concept
in scheme: JobTech Taxonomy - Yrke
definition: Genetiker
broader: Cell- och molekylärbiologer m.fl.
related: kJeN wmw 9wX
related: TXx8 Mgv BGZ
related: N8ib nya wGY
broad match: C2131

Kocksteward
type: Concept
in scheme: JobTech Taxonomy - Yrke
definition: En kocksteward jobbar tillsammans med en mässman som bistår med enklare sysslor i kök och personalmatsal. Kockstewarden är också personalkock och lagar all mat ombord till besättningen, som oftast består av 12–20 personer beroende på fartygstyp och storlek. I arbetet ingår också att göra inventeringar och beställningar som sedan befälhavaren godkänner. Kockstewarden ansvarar också för att all mat och att det är rent och snyggt i köket. Kocksteward är en befattning som oftast finns på fartygstyper där man inte har passagerare. Källa: Satsa på sjöfart
broader: Kockar och kallskänkor
related: ASGV zcE bWf
related: XouD cCj HZN
related: RTQf 1Qm YhD
related: 5ngJ k6J gXT
related: ScKy FHB 7wT
related: i5zY AwC RGf
broad match: C5120

Kasinopersonal
type: Concept
in scheme: JobTech Taxonomy - Yrke
definition: Kasinopersonal eller Casino Associate på Casino Cosmopol är en mångsidig roll med fokus på gästservice och arbete i olika delar av kasinot, såsom spelborden, receptionen, spelautomaterna eller kassan. Arbetsuppgifterna kan variera beroende på avdelning och kan innebära allt från att ge service vid spelborden till att hantera kundfrågor och utbetalningar. I april 2025 stängde det sista Casino Cosmopol. Källa: Div jobbannonser, Wikipedia
broader: Croupierer och oddssättare m.fl.
related: UdVa jRr 9DE
related: RPTn bxG ExZ
related: ScKy FHB 7wT
broad match: C4212

Landshövding
type: Concept
in scheme: JobTech Taxonomy - Yrke
definition: Landshövding
broader: General-, landstings- och kommundirektörer m.fl.
related: bh3H Y3h 5eD
broad match: C1112

Konservator
type: Concept
in scheme: JobTech Taxonomy - Yrke
definition: Konservator
broader: Bildkonstnärer m.fl.
related: QpEY yKJ bQa
related: bFa7 2zk qmR
related: 9U2Z Wot 7mS
related: 4evz S7r cuw
related: TL5y nEz jwd
related: C6fY yAq 1MM
related: 9puE nYg crq
related: PaxQ o1G wWH
related: exRX t1Q Nnf
related: ofV1 crr ZNS
broad match: C2651

Kock, fartyg
type: Concept
in scheme: JobTech Taxonomy - Yrke
definition: Som kock lagar du mat till gästerna ombord på passagerar¬fartyg och utför samtliga förekommande arbetsuppgifter i köket, precis som på en restaurang i land. Arbetet leds och fördelas på de flesta fartyg av köksmästaren som har det yttersta ansvaret. De kockar som oavsett fartygstyp hanterar besättningens mat måste alla inneha ett Fartygskockscertifikat. Källa: Satsa på sjöfart
broader: Kockar och kallskänkor
related: dRFw Rcu dX7
related: ASGV zcE bWf
related: XouD cCj HZN
related: RTQf 1Qm YhD
related: ScKy FHB 7wT
related: 5P5L 6yM jwg
related: i5zY AwC RGf
broad match: C5120

Vapentekniker
type: Concept
in scheme: JobTech Taxonomy - Yrke
definition: Vapentekniker är ett finmekaniskt yrke, med krav på hög precision i arbetet. Arbetet innebär i huvudsak att reparera och modifiera olika typer av vapen. Yrket kräver ofta en kombination av tekniskt kunnande och praktiskt handlag inom bland annat metallbearbetning, träbearbetning och precisionsteknik. Arbetsuppgifter kan variera i komplexitet, från enklare reparationer till mer komplexa uppgifter så som kalibrering. Vapentekniker har kunskaper i mekanik, finmekanik och ytbehandling. Källa: Arbetsförmedlingen
broader: Finmekaniker
related: rYjR xs5 G7r
related: PaxQ o1G wWH
related: oETa Mwx D1b
related: KecA QuP T71
broad match: C7222

Officerare
type: Concept
in scheme: JobTech Taxonomy - Yrke
definition: Leder, planerar och genomför militära operationer nationellt och internationellt. Leder militära förband.
broader: Officerare
related: iJBH bGT 71w
related: cWLT gvA VTX
related: axUd pBC gpK
related: C0110
related: TNqJ vKz kQo
related: sZpG fhF BD7
related: 8Lg4 LKc sor
related: Es1j gwu mzB
related: Pecg Gxd 8z6
related: gwsz Nnz mFQ
related: evRP Yoi Dd4
related: rBq2 Wku LMt
related: Rttn 7Xw wUk
related: AMx9 HRj Ssp
related: JjHn wR7 Zdg
related: sGky Wqy QvZ
related: yvHV XWN 2aQ
narrower: Officer
broad match: bH5L uXD ZAX

Växlare
type: Concept
in scheme: JobTech Taxonomy - Yrke
definition: Växlare arbetar med växling och rangering av godsvagnar. Växlare, även kallat förare i växlingstjänst, arbetar med godsvagnar på bangårdar. Huvudsakliga arbetsuppgifter är växling och rangering av godsvagnar. Med hjälp av radiostyrda lok rangerar man om vagnar från inkommande tåg till nya avgående tåg. Utöver själva växlingen ingår andra viktiga uppgifter såsom funktionskontroll och bromsprov. Arbetstiderna varierar och inkluderar oregelbundet skiftarbete under hela dygnet. Källa: Järnvägsjobb
broader: Bangårdspersonal
related: FVRU KCf V4m
related: 22tH t9F wSf
related: jkeN Liw n8E
related: ASGV zcE bWf
related: PWfG 62u hZp
related: 8io6 PWm RZF
related: BPMx hfr 7eV
related: pA4D je6 PZU
related: YdgB K7e Ub2
related: 4Wji WFf Fzg
related: 1rSF rxA WCG
broad match: C8312

Växtodlingsrådgivare/Växtodlingskonsulent
type: Concept
in scheme: JobTech Taxonomy - Yrke
definition: Växtodlingsrådgivare/Växtodlingskonsulent
alternative label: Växtodlingskonsulent
alternative label: Växtodlingsrådgivare
broader: Specialister och rådgivare inom lantbruk m.m.
related: p78W FNN LWK
related: zKow ibf d5T
related: WVhe Jwp 3tQ
related: zUSu Lrt tHo
related: 6nbS RdB kzm
related: VuuL 7CH adj
related: R5C6 FZV Z1f
broad match: C2132

Stadsarkivarie
type: Concept
in scheme: JobTech Taxonomy - Yrke
definition: Stadsarkivarie
broader: Övriga chefer inom samhällsservice
related: epLc SkD cbT
related: bh3H Y3h 5eD
broad match: C1349

Underhållsmekaniker och maskinreparatörer
type: Concept
in scheme: JobTech Taxonomy - Yrke
definition: Installerar, reparerar och utför service på industrimaskiner och mekanisk utrustning. Underhåller och reparerar fartygsmotorer och andra motorer (utom motorfordons- och flygmotorer) samt rälsfordon. Hit hör inte Fordonsmontör (8211) Motorbyggare (8211) Motormontör (8211)
broader: Fordonsmekaniker och reparatörer m.fl.
related: 7qAg AP3 WwV
related: MDkP E5o 3RF
related: JYAn p1X 6sb
related: 2KP2 Zfe 5Cf
related: A9yb vYZ nQ8
related: on5q A8b QMj
related: XNLN wwW x6h
related: 4eRs 1UT 621
related: CteT h4n 2en
related: in2S yKN FVw
related: ngXG y5s 5cA
related: uBrs v8K SYH
related: gSAz 16e oTu
related: fJdB viK AaA
related: VWmQ 9fd GLL
related: fsSU Uke A65
related: c7sE BBU zhP
related: 9Z8Q UYL EMM
related: aHCV VsV LiD
related: tqNp SBC LSx
related: 8sKj VoT hKR
related: 2rum RMu gid
related: 8wuS ceN nBu
related: 3j4u Apm 7WU
related: LdgJ JMm yxF
related: fjyp Sft A2M
related: JjiA c5w p3W
related: Ljpj VA3 ife
related: b9Kr C83 dG1
related: dgwT VhN kVh
related: Jpeq i4k mda
related: LDpW xuo jZp
related: Wvxt 3Ea so5
related: fNce 6z3 G4v
related: zMmn 1mh 6D5
related: MWTZ jRV uw1
related: TiAP Bua jfb
related: z6Kc Mgi mpT
related: UpyD TSX Kch
related: rm5H xiU 5bN
related: FmHS DMU bcA
related: Bh9h t3B M8h
related: MdYX Mrp HCS
related: Q7eC B7g QiU
related: MgS1 3u1 PdT
related: 6EN6 U63 Zb1
related: tKd2 9Ei PTQ
related: oEvo Btk uUE
related: wYYj eRy Hok
related: 8Uko 3kZ wkT
related: Rqez Bqv FKe
related: kSYg iMb xDo
related: moJc yZC sjN
related: E6uE hqh VZW
related: wcMJ bhu N1G
related: 5p3r SgW n54
related: 1VVe BBY rpQ
related: fjoN ZHr XG4
related: PRQR oGE 7re
related: fhcp fFw Lbj
related: dkg2 8Qz rzx
related: 2XXJ ofn VAD
related: S44W QvJ r4m
related: Bpbv qSJ Zfa
related: mSJX F5t vtX
related: MpNv 4Kx Vu5
related: ygEQ Pwp ozn
related: UUQb kwg qd1
related: 7GeN PKs ptc
related: EGCS 78o x3F
related: t17v Hrq yLk
related: M4ei Uvu Ks7
related: pXy8 4zz azx
related: 6BpN oXk 7SL
related: ST1N VMw y8e

Vävare
type: Concept
in scheme: JobTech Taxonomy - Yrke
definition: Vävaren tillverkar textilier i handdriven vävstol eller vävram. Vävning är ett konsthantverk och man kan som vävare specialisera sig på olika tekniker. Man tillverkar till exempel hemtextilier eller mer konstärliga textilier. Källa: Hantverksakademin, Arbetsförmedlingen
broader: Musikinstrumentmakare och övriga konsthantverkare
related: Bmeh 8mY Vd1
related: tXdM gc1 7h6
related: PaxQ o1G wWH
related: sSgV 5dU JXM
broad match: C7318

Träningsinstruktör
type: Concept
in scheme: JobTech Taxonomy - Yrke
definition: Träningsinstruktörer leder och instruerar om olika typer av träning, för personer i olika åldrar och med olika förutsättningar. Arbetsuppgifter kan inkluderar att planera och leda gruppträning, instruera om hur träningsutrustning bör användas och motivera personer till att genomföra träning. Träningsinstruktör anpassar träning efter behov och har kunskap om olika typer av träningsformer, med fokus på att främja säker och effektiv träning. Källa: Kroppsterapeuternas yrkesförbund, Arbetsförmedlingen
broader: Idrottstränare och instruktörer m.fl.
related: sJdm Mbx qz4
related: Afa9 vo3 u6y
related: oLec 5Y3 sag
related: ish2 f7d 1mQ
related: 1fXw t87 MvX
related: MVqp eS8 kDZ
related: WpKu Yom X2h
related: V1oi ogZ ydw
broad match: C3423

HSEQ Manager/KMA-samordnare
type: Concept
in scheme: JobTech Taxonomy - Yrke
definition: HSEQ Manager/KMA-samordnare
alternative label: HSEQ Manager
alternative label: KMA-samordnare
broader: Miljö- och hälsoskyddsinspektörer
related: mp9v vA1 JD5
related: kJeN wmw 9wX
related: 4Sup VAm Sbh
related: SHbz LUB zdt
related: p1zk 77J kxL
related: 1BRW gAL sPT
related: cNat iVd RZx
related: MFt9 cPf uBD
related: zMyu soU 73Y
related: 4eJL Zun nUv
related: Twch N9R yVK
related: VZMM VaG xVk
related: UrEQ H7W U4m
related: J7ap Ef7 5E7
broad match: C3257

Förare av jordbruks- och skogsmaskiner
type: Concept
in scheme: JobTech Taxonomy - Yrke
definition: Kör skogsmaskiner i samband med gallring och slutavverkning av skog. Kör och sköter jordbruksmaskiner exempelvis i samband med plöjning, harvning, sådd och skörd.
broader: Maskinförare
related: ddCx swx 4j2
related: b7mV 5aH rHU
related: WkEt Pmq xW6
related: oYDh d6r cSu
related: 3EaU 8Ta bev
related: NenF ShS AjD
related: RU6V bcD cG7
related: ikNp 4bD 9NJ
related: yVj6 5Ey Gku
related: Q7eC B7g QiU
related: repi cJM Lbq
related: C4T8 5NZ s2P
related: Ty8v puq yxx
related: DUBH RMu fFG
related: fhcp fFw Lbj
related: Swnd ScQ iPP
related: C8341
related: u5Q2 Uox r2i
related: jzpq afi Nos
related: DwQV Sim FNH
related: K5Fz jNz Wqc
related: mRxb SRc xne
related: nVax pj9 CrG
related: 6MnT y7u cXw
related: WGqY bSx yoF
related: yYgy azb GqH
related: weBc J69 5b3
related: 9FNf 2ia KK7
related: 8pHc Lqc QxD
related: zcAk wkg EnZ
related: 2ksN CTt FXv
related: PfHC b9Z KGa
related: MN1g BHf BC4
narrower: Skogsmaskinförare
narrower: Maskinförare lantbruk
broad match: VuuL 7CH adj

Chefsyrken
type: Concept
in scheme: JobTech Taxonomy - Yrke
top concept of: JobTech Taxonomy - Yrke
definition: Chefsyrken
narrower: Chefer inom hälso- och sjukvård samt annan samhällsservice
narrower: Politiker, verkställande direktörer och högre ämbetsmän m.fl.
narrower: Chefer inom övrig servicenäring
narrower: Chefer inom ekonomi, HR, marknadsföring och försäljning samt annan administration m.m.
narrower: Chefer inom utbildning
narrower: Chefer inom bank, finans och försäkring
narrower: Chefer inom IT, logistik, FoU, fastighetsbolag, bygg- och ingenjörsverksamhet samt tillverkning m.m.

Montörer, metall-, gummi- och plastprodukter
type: Concept
in scheme: JobTech Taxonomy - Yrke
definition: Sätter i seriemässig tillverkning samman komponenter av metall, gummi och plast till olika produkter som t.ex. leksaker, sportartiklar och cyklar. Lagar punkteringar, monterar nya däck och balanserar hjul. Hit hör inte Däcksbyggare (8213) Kantpressare (7223) Plastarbetare (8142)
broader: Montörer
related: 1Qmy Gy8 fCx
related: EkJL sAV WAx
related: iuER ipH vJD
related: VPF1 UZM 9Kd
related: 5LdD NqJ 9P7
related: es1U e6x 8d7
related: pFuD wtR Yzs
related: aHCV VsV LiD
related: mTRy UG9 fAZ
related: 3vwF yka n6K
related: 82fn Hhm 4wx
related: SMLj ds3 Qe7
related: qQ61 EQR rcz
related: T5UV tZe N3A
related: VTwt 5Fe 6bW
related: 3bv4 LwB WTx
related: G9rP CR9 BT7
related: KDzy Hra iVr
related: dLTH p6G Sz7
related: Sj6U HsZ 5Wy
related: 9Asf XUW K2w
related: MAGe Jbf y8u
related: tMML aCZ xKU
related: sbYJ XwB o8X
related: HULE 2Gr nkv
related: C8219
related: qWuc ULj n7F
related: SECo RtS YpB
related: qPmT 5pS Th9
related: GZrp 5Rf ZGY
related: x7ih HZS VDB
related: Rbju P7i 12U
related: uBaP BsX BdU
related: RtZN p11 Xw2
related: X4EU ZC7 QmK
related: cDms bzz 2Tf
related: AiwS Mhv ttk
related: BAhW Ko7 69u
related: XKi1 RS1 Us3
related: uenm 75h fEh
related: 6CVw KfC xAH
related: dWbY gXC Frx
related: 8pQb 3xi XCf
related: feDt 8f5 KRS
related: 8Tts x9Q vf4
related: pgts 2XY xKi
narrower: Robotmontör
narrower: Solskyddsmontör
narrower: Montör, gummi- och plastprodukter
narrower: Montör metallprodukter
narrower: Däckmontör
broad match: wTEr CBC bqh

Ostmästare
type: Concept
in scheme: JobTech Taxonomy - Yrke
definition: Ostmästare
broader: Ingenjörer och tekniker inom kemi och kemiteknik
related: 6Hq3 tKo V57
related: 5tyY GjC AcD
broad match: C3119

Beläggningsarbetare, utan yrkesbevis
type: Concept
in scheme: JobTech Taxonomy - Yrke
definition: En beläggningsarbetare anlägger, underhåller och reparerar vägytor. Det kan vara en parkväg, en Europaväg, en väg i ett öppet landskap, på en bro eller i en tunnel, allt från grus med bindemedel till nyutvecklade specialbeläggningar. Det är ett yrke där utveckling av teknik och arbetsmiljö går hand i hand, till exempel datoriserade asfaltverk som styrs från miljösäkrade kontrollrum eller satellitstyrda utläggningsmaskiner. Källa: BYN
broader: Anläggningsarbetare
related: j7Cq ZJe GkT
related: ammt Jz4 fjx
related: ja7J P8X YC9
related: xGxk WsH 9Xe
broad match: C7119

Helikopterförare/Helikopterpilot
type: Concept
in scheme: JobTech Taxonomy - Yrke
definition: Helikopterförare/Helikopterpilot
alternative label: Helikopterförare
alternative label: Helikopterpilot
broader: Piloter m.fl.
related: ASGV zcE bWf
related: j8HV U4E 68U
broad match: C3153

Trumtekniker
type: Concept
in scheme: JobTech Taxonomy - Yrke
definition: Trumtekniker arbetar med att ställa in, underhålla och reparera trumset och slagverksinstrument. Arbetsuppgifterna inkluderar stämning av trummor, byte av skinn, justering av hårdvara och pedaler, samt reparation och anpassning av delar som cymbaler, trumstockar och stativ. Trumtekniker kan arbeta som frilansare för musiker och turnéer, men kan även vara anställda av musikaffärer eller inspelningsstudior. Källa: Arbetsförmedlingen
broader: Musikinstrumentmakare och övriga konsthantverkare
related: PaxQ o1G wWH
broad match: C7312

Specialisttandläkare inom odontologisk radiologi
type: Concept
in scheme: JobTech Taxonomy - Yrke
definition: Specialisttandläkare inom odontologisk radiologi är en specialiserad legitimerad tandläkare med en djupare kunskap och kompetens inom sitt område. Specialisttandläkare är en skyddad titel och bara den som har bevis om specialistkompetens får kalla sig specialist i sin specialitet. Vanliga arbetsuppgifter är att utreda, diagnostisera och behandla komplexa fall inom exempelvis oral kirurgi, ortodonti, pedodonti, parodontologi, oral protetik, bettfysiologi, endodonti eller odontologisk radiologi. Specialisttandläkare samarbetar ofta i team, tar emot remisser från allmäntandläkare och bidrar med expertkunskap till både patienter och kollegor. Arbetsuppgifterna kan även omfatta konsultationer, handledning och ibland ansvar för verksamhet eller personal inom sitt specialistområde. Källa: Arbetsförmedlingen, Sveriges Kommuner och Regioner, Socialstyrelsen
broader: Tandläkare
related: LQkS TBG JpW
related: NYW6 mP6 vwf
related: proQ odJ 3A7
related: NgG1 5qR MDs
related: SRs7 HCS tVp
related: bvS2 Vmd o8t
related: 2B4i UAL 5kg
broad match: C2261

Kassaföreståndare, arbetslöshetskassa
type: Concept
in scheme: JobTech Taxonomy - Yrke
definition: Kassaföreståndare, arbetslöshetskassa
broader: Chefstjänstemän i intresseorganisationer
related: guhd NZD cvm
related: epLc SkD cbT
related: bh3H Y3h 5eD
broad match: C1114

Tunnplåtslagare
type: Concept
in scheme: JobTech Taxonomy - Yrke
definition: Tillverkar, monterar och reparerar produkter och konstruktioner av tunnplåt. Reparerar skador och byter plåtdetaljer på fordon. Kontrollerar, reparerar och rengör cisterner. Framställer och reparerar föremål i koppar, mässing och tenn.
broader: Gjutare, svetsare och plåtslagare m.fl.
related: L9Ng g1T Sot
related: srnS YkG Jfe
related: 3kAh 9uB QwN
related: VPF1 UZM 9Kd
related: qwR4 VM5 2Cd
related: T2Jq bco 6Dc
related: bsy7 dqD NBo
related: PktN Uav zKf
related: z1pf B99 fpz
related: Y2fZ kGv yUx
related: VhTi tZ1 YAV
related: 9nyH icP Qxt
related: Ytcy v8N P2w
related: aHCV VsV LiD
related: q4t6 uHb WiW
related: 68CS 8FS iKn
related: tqNp SBC LSx
related: faAc rbm bxX
related: CUNr DA7 Fjr
related: T8Vh zq2 zGy
related: hu4P Rdt hxR
related: qyUS nX3 pGH
related: JUpW QCd vCM
related: oZmV VcV sHi
related: 2E7x 4v4 9hN
related: qQ61 EQR rcz
related: VTwt 5Fe 6bW
related: nA8h Z1e BL5
related: 7CsQ uUz orf
related: utD4 mhM qvk
related: PELm cH9 AE9
related: Q7eC B7g QiU
related: zKsE iKK v99
related: HGRd egF kLp
related: 7coz KQN G7U
related: bnMZ Nt5 o48
related: KDzy Hra iVr
related: LoF7 pCA z1v
related: b316 Jsx PLj
related: f8Sz Xaf TEU
related: WBnc JXj MvY
related: fhcp fFw Lbj
related: 2ywJ fcJ Y2S
related: JULB RYa iZD
related: SrzF GXp pFE
related: hszv Fzs UiW
related: zVKm f79 DtU
related: tbzr 4h8 X1q
related: uttx Ma3 RoP
related: 8JhV mxY jHk
related: Q1D1 Pdc rnT
related: UfwF qpM LEj
related: 6BpN oXk 7SL
related: aENT QTu v8Y
related: NYYQ Hp4 FFo
related: GCYi 9tC 1pP
related: seev JQ5 q5W
related: rrEP SZN b3y
related: c14d Mgx MFA
related: C7213
related: 9VNa 4MW EYC
related: X4EU ZC7 QmK
related: C5av 941 jnP
related: 5uDy cV5 BZC
related: 1qT1 AUE git
related: D22m xCt cwN
related: VdMH Tm8 CAa
related: BKYD AEo maF
related: 4y7C Lsh EPM
related: GgZs WNA Z8z
related: YBY5 2Np HQH
related: iQfJ Crz aEJ
related: QUkC SMY 78S
related: uenm 75h fEh
related: 4mNF 7vZ vCx

Kommunsekreterare
type: Concept
in scheme: JobTech Taxonomy - Yrke
definition: Kommunsekreterare
broader: Planerare och utredare m.fl.
related: CyW5 WRq AFb
related: X82t awd Qyc
related: TZe9 NsN uce
broad match: C2422

Motormontör
type: Concept
in scheme: JobTech Taxonomy - Yrke
definition: Motormontörer bygger motordelar och färdiga motorer. Motormontörer sätter samman motordelar och färdiga motorer enligt ritning. Arbetet innefattar både mekaniska och elektriska komponenter. Man använder både manuella och automatiska verktyg. Beroende på arbetsplats kan installation och funktionstestning av motorer även ingå i arbetsuppgifterna. Källa: Arbetsförmedlingen
broader: Fordonsmontörer
related: HDZp wTW gmd
related: ux6U J9S XeS
related: wTEr CBC bqh
broad match: C8211

Gränskontrollant
type: Concept
in scheme: JobTech Taxonomy - Yrke
definition: Gränskontrollanter kontrollerar resenärers identitetshandlingar vid gränsövergångar som flygplatser och hamnar. Gränskontroll i Sverige utförs av Polisen, där syftet med gränskontroll är att upptäcka och förhindra gränsöverskridande brottslighet, såsom människosmuggling. Arbetet innebär i huvudsak verifiering av identitet och resehandlingars äkthet samt samarbete med andra myndigheter för att upprätthålla gränssäkerhet. Skiftarbete inklusive tjänstgöring alla dagar på året och alla tider på dygnet förekommer. Källa: Polisen, Arbetsförmedlingen
broader: Väktare och ordningsvakter
related: dVbW QJc xZi
related: E7hm BLq fqZ
related: oEip J7m QRT
broad match: C5414

Löne- och personaladministratörer
type: Concept
in scheme: JobTech Taxonomy - Yrke
definition: Utför löneberedningsrutiner och löpande lönearbete. Hanterar anställningsformer och tillämpning av arbetsrätt och avtal i löneberedning, löneformer och lönedelar. Sammanställer underlag för statistik, pensions- och försäkringsärenden.
broader: Kontorsassistenter och sekreterare
related: xSLo P6B 2AF
related: S2pg pcs tXu
related: nt4p 6kN Lt2
related: DJgq zBj bKt
related: yfTA ncB DSc
related: aUr6 Rjg ja2
related: 3HjW 1BP k3S
related: 3vYj Rhf Voh
related: epBr KmF HVM
related: Uv9y v2g efa
related: Tmps QPE g3V
related: fmGj KZi C9x
related: 29MP yhF mjx
related: 4Ya1 1Rv EB3
related: Aasw 39M r6u
related: NUC3 y1C Scg
related: cw2M p2W SuJ
related: hjUM GZe Bgd
related: dYqT JBz NZE
related: WCWw wZz 8iv
related: 5wab aFK gdL
related: 2Mtp uhe wmS
related: Fiq4 siu LXn
related: fiLT BSW HCb
related: PVnT yGT SMb
related: qtHa AsU Cfo
related: 8gwE 2o3 XRF
related: Nig2 2pU GT8
related: 2RDK rgU P6R
related: CHKu 2Kb 1Q2
related: C4313
related: jfd3 4zS fjt
related: LmAP e75 pc6
related: pxZi bWS MSr
related: 7scD 9YP iwV
related: TzQ6 JNP htw
related: z7wE 9xb 3jX
related: jcpA Zfs nSz
related: RB7E jE5 MZ3
related: C4416
related: Kvft WHn KJE
related: 2ZFC 6de YSB
related: NMZ1 bCs WcR
related: rF2g ssp 4nK
related: 3i8p YXT 3B5
related: CaXq Bbe T3X
related: B1rc wCc vne
related: w8bU wHe omF
related: 73gL 4uv p9J
related: 1xHU W9z CT9
related: 8u7A ze1 bvd
related: 6Ei3 fZV YKM
narrower: HR-assistent
narrower: Löneadministratör/Lönekonsult
broad match: X82t awd Qyc

Specialistläkare, hud- och könssjukdomar
type: Concept
in scheme: JobTech Taxonomy - Yrke
definition: Specialistläkare, hud- och könsjukdomar är en specialiserad legitimerad läkare med en djupare kunskap och kompetens inom sitt område. Specialistläkare är en skyddad titel och bara den som har bevis om specialistkompetens får kalla sig specialist i sin specialitet. Specialistläkare ansvarar för att diagnostisera, behandla och förebygga sjukdomar inom sin specialitet. Vanliga arbetsuppgifter är mottagningsarbete med patientbesök, rondarbete på avdelning, handledning av yngre läkare samt konsultationer till andra yrkesgrupper och specialiteter. Specialistläkare ansvarar även för att följa och leda utvecklingen inom sitt medicinska område och utför omfattande medicinsk dokumentation och administration. Källa: Arbetsförmedlingen, Karolinska Institutet, Socialstyrelsen, Sveriges Kommuner och Regioner, Sveriges läkarförbund
broader: Specialistläkare
related: NYW6 mP6 vwf
related: qSbw XHD Ycd
related: TChC u37 rt2
related: EBX9 7gC eLt
related: vFjb AHi a54
related: jFHU uSj 4ke
related: yrb6 3aN W28
related: KALC VvK 17U
related: hfqg qPo TTb
related: QSeQ MpU wpW
related: 89LR AwA UqR
broad match: C2212

Ortopedskomakare/Ortopedskotekniker
type: Concept
in scheme: JobTech Taxonomy - Yrke
definition: Ortopedskotekniker designar, tillverkar och provar ut ortopediska skor och inlägg, vilka är avsedda att förbättra komforten och funktionen för personer med särskilda behov. Ortopedskotekniker liknar yrket ortopedtekniker. Där ortopedtekniker arbetar med alla typer av ortopediska hjälpmedel har ortopedskotekniker specialiserat sig på just skor. Förutom tillverkning och utprovning ingår också reparation av ortopediska skor som arbetsuppgift. Yrket är en blandning av hantverk och medicinskt kunnande. Man använder både manuella hantverkstekniker och digitala verktyg, så som skanning och digital modellering. Källa: Arbetsförmedlingen
alternative label: Ortopedskomakare
alternative label: Ortopedskotekniker
broader: Läderhantverkare och skomakare
related: PaxQ o1G wWH
broad match: C7536

Kostymassistent
type: Concept
in scheme: JobTech Taxonomy - Yrke
definition: Kostymassistent förbereder, vårdar och organiserar kostymer inför och under filminspelningar, och stödjer kostymteamet både i produktionens för- och efterarbete. Vanliga arbetsuppgifter är inköp, tvätt, strykning, patinering och enklare sömnadsändringar av kostymer. Vanliga arbetsuppgifter inkluderar också att hantera transport, förvaring och underhåll av kostymer samt att samarbeta med produktionsteam och statistansvariga vid behov. Källa: Arbetsförmedlingen, Film i Väst, Scen & Film
broader: Skräddare och ateljésömmerskor m.fl.
related: xs1w ncv Zww
related: zDTu AR4 ohx
related: u7zK VKN 8Ht
related: 8too bEs 7NU
related: 9puE nYg crq
related: qFSy Cpa FTs
related: iAvE d5G h5k
related: KTm3 Rty v9C
broad match: C7531

Processoperatörer, stenkross- och malmförädling
type: Concept
in scheme: JobTech Taxonomy - Yrke
definition: Sköter, styr och övervakar anläggningar som krossar berg eller krossar, mal och anrikar malm.
broader: Malmförädlingsyrken och brunnsborrare m.fl.
related: VPF1 UZM 9Kd
related: aXBd tPB 9ML
related: 43MK KbH RSW
related: swHZ UXk UaE
related: 2pjc Vto TGH
related: C8112
related: Wf9b oU6 5cn
related: aF3J SgE uck
related: qQ61 EQR rcz
related: VTwt 5Fe 6bW
related: Q7eC B7g QiU
related: tLci gYE gHR
related: KDzy Hra iVr
related: fhcp fFw Lbj
related: 8Yqr o72 jqv
related: 8ZzS HB3 qxT
related: rsvQ 6ei W8S
related: GCYi 9tC 1pP
related: Rbju P7i 12U
related: pX3Z PrH aKM
related: ykyf hFy V5o
related: Stca tVg Kiu
related: sxQn ac9 VmS
related: KR1C w1G BYY
related: uenm 75h fEh
related: MT1a Nyq DGQ
related: UAMj xEe jnL
related: dWbY gXC Frx
related: xpYa ogX BF2
related: ZTk2 7eo CUb
narrower: Krossoperatör
narrower: Processoperatör malmanrikning
broad match: wTEr CBC bqh

Chief Data Officer/CDO
type: Concept
in scheme: JobTech Taxonomy - Yrke
definition: Chief Data Officer/CDO
alternative label: CDO
alternative label: Chief Data Officer
broader: IT-chefer
related: apaJ 2ja LuF
related: bh3H Y3h 5eD
related: 6Fiz 699 Hgc
broad match: C1330

Präster och diakoner
type: Concept
in scheme: JobTech Taxonomy - Yrke
definition: Präster och diakoner
broader: Yrken med krav på fördjupad högskolekompetens inom juridik, kultur och socialt arbete m.m.
narrower: Präster
narrower: Diakoner

Förvaltningschef, region
type: Concept
in scheme: JobTech Taxonomy - Yrke
definition: Förvaltningschef, region
broader: Fastighets- och förvaltningschefer
related: jNiV D8g kiZ
related: X82t awd Qyc
related: epLc SkD cbT
related: bh3H Y3h 5eD
broad match: C1219
broad match: C1213

Lärling, lastmaskinförare
type: Concept
in scheme: JobTech Taxonomy - Yrke
definition: En lärling är anställd för att slutföra sin kvalificeringstid till lastmaskinförare innan ett yrkesbevis kan utfärdas. Under kvalificeringstiden får du lärlingslön enligt avtal. Kvalificeringstiden tillsammans med teoretisk grundutbildning leder till yrkesbeviset. Ett lärlingsavtal mellan branschorganisation och företag tecknas. Källa: BYN
broader: Anläggningsmaskinförare m.fl.
related: j7Cq ZJe GkT
related: ja7J P8X YC9
broad match: C8342

Smidesoperatör
type: Concept
in scheme: JobTech Taxonomy - Yrke
definition: Smidesoperatörer ställer in och övervakar smidesmaskiner för att tillverka metallprodukter. En smidesoperatör är en maskinoperatör som programmerar och övervakar kraftfulla smidesmaskiner som pressar, hamrar och bockar uppvärmt material. Man tillverkar till exempel detaljer, prototyper och delar till mekaniska konstruktioner. Yrket skiljer sig från andra maskinoperatörer inom metallbearbetning i det att det man tillverkar har mycket hög hållfasthet. Beroende på arbetsplats arbetar man i hela eller delar av tillverkningskedjan, inklusive värmning av råmaterial, smide och leverans. Maskinunderhåll är en vanligt förekommande arbetsuppgift. Källa: Arbetsförmedlingen
broader: Maskinställare och maskinoperatörer, metallarbete
related: SPmo 4nb DW9
related: FeAv WV7 ipR
related: wTEr CBC bqh
broad match: C7223

ST-läkare, invärtesmedicin
type: Concept
in scheme: JobTech Taxonomy - Yrke
definition: Specialisttjänstgöring, ST, är den vidareutbildning som legitimerade läkare genomför för att uppnå specialistkompetens. ST-läkare invärtesmedicin arbetar under handledning för att fördjupa sina medicinska kunskaper och färdigheter med målet att bli specialistläkare inom sitt område. ST-läkaren arbetar självständigt med patientutredningar, diagnostik och behandling, men alltid med stöd av specialister och enligt ett individuellt utbildningsprogram. Vanliga arbetsuppgifter är att ta medicinskt ansvar för patienter, delta i jourverksamhet, genomföra medicinska undersökningar och behandlingar samt dokumentera och följa upp vårdinsatser. Tjänsten omfattar också kontinuerlig kompetensutveckling, sidotjänstgöring inom närliggande områden och aktivt deltagande i handledning och utbildningsinsatser för kollegor och studenter. Källa: Arbetsförmedlingen, Karolinska Universitetssjukhuset, Sveriges läkarförbund, Region Kronoberg, Region Skåne.
broader: ST-läkare
related: NYW6 mP6 vwf
related: UtCj yMj ubw
broad match: C2211

Incheckningsmedarbetare
type: Concept
in scheme: JobTech Taxonomy - Yrke
definition: Incheckningsmedarbetare arbetar med registrering och incheckning av passagerare samt fordon vid terminaler för frakt- och passagerarfartyg. Arbetsuppgifter kan omfatta mottagning av resenärer, kontroll av biljetter, identitetshandlingar och resehandlingar samt registrering av fordon som ska transporteras ombord. Vanligtvis ingår även kundtjänst som att ge information, hantera bokningar och betalningar. Yrket är vanligt förekommande vid större färjeterminaler. Beroende på arbetsgivare kan arbetet vara mer inriktat mot transport av passagerare respektive godstransport. Se även yrket Transportadministratör. Källa: Arbetsförmedlingen
broader: Resesäljare och trafikassistenter m.fl.
related: RPTn bxG ExZ
related: ASGV zcE bWf
broad match: C4221

Undersköterskor, vård- och specialavdelning och mottagning
type: Concept
in scheme: JobTech Taxonomy - Yrke
definition: Kontrollerar patienters kroppstemperatur, puls och blodtryck, tar prover och lägger om sår. Hjälper patienter med deras personliga hygien. Bäddar, delar ut mat och gör annat som ingår i den dagliga vården. Assisterar läkare och sjuksköterskor vid undersökningar och behandlingar. Tar prover, tar fram provsvar och journaler samt förbereder patienter för behandling. Plockar fram instrument inför undersökningar och ingrepp samt rengör och desinficerar dem.
broader: Undersköterskor
related: AcZJ S7J ji6
related: sicB 2Xi eQh
related: TuUX 3Jo wyq
related: 14eq XTy BPB
related: C1qR L83 nzh
related: zVBN P7y GNE
related: C5321
related: 9Fna GUm HWL
related: ckhF ACN GqU
related: Mmxs Qrv cpG
related: Rcgh Epd bDv
related: x289 bKF ihE
related: 1eKe zFj QAa
related: Hgww z4B Tyg
related: N9zh vwb Wht
related: xG3w m6i fbp
related: Lqnz Zqw nQ9
related: F7nJ k5s L29
related: 7xZ7 skn RYk
related: ZrxP YPv 5QH
related: wBPu wTW RgG
related: 7VBy vKp VX3
related: MR4H FFT mTj
related: NpcY f4G L1H
related: BvGm Zuj VLF
related: 2GuF gtz xfW
related: rF7s hX1 ECH
related: rVUL AgV ZTH
related: aoVs Qfu U3j
related: 5Kym 2ad Pqi
related: enLQ GrZ w3S
related: YTPY NjP Auq
related: pGBH BkG qJa
related: yV9B PxJ TxS
related: rtCg THP 6Lj
related: cocQ EPn YiY
narrower: Omvårdnadsassistent
narrower: Steriltekniker
narrower: Specialistundersköterska
narrower: Undersköterska, vård- och specialavdelning och mottagning
broad match: NYW6 mP6 vwf

Meteorologer
type: Concept
in scheme: JobTech Taxonomy - Yrke
definition: Bearbetar och analyserar insamlade data om luftströmmar, lufttryck, temperatur, fuktighet, fysiska och kemiska förändringar hos föroreningar och andra fenomen. Förbereder och rapporterar kort- eller långsikta väderprognoser. Gör utredningar om atmosfären och klimatet. Hit hör inte Meteorologassistent (3216) Väderobservatörer (9629)
broader: Fysiker, kemister m.fl.
related: oCn1 DTW FZg
related: C2112
related: sURo MBj hGS
related: LsHS ueq 1jZ
related: qEQz Mbj kQP
related: 2qWx WKP XYH
related: 3fcX W9M yhA
narrower: Försvarsmeteorolog
narrower: Marinmeteorolog
narrower: Prognosmeteorolog
narrower: Meteorolog
broad match: kJeN wmw 9wX

Teknikpedagog
type: Concept
in scheme: JobTech Taxonomy - Yrke
definition: Teknikpedagog
broader: Övriga pedagoger med teoretisk specialistkompetens
related: pVzY rff Amk
related: nyPj u7G 6Pu
related: 2e7Z kzE LMQ
related: zdNX n66 yh3
related: DkDN 3eT Sqs
related: zRBV aoZ 7r8
related: MVqp eS8 kDZ
related: 9aQg tcy UoL
related: AUtv j9X TGM
broad match: C2359

ST-läkare, hud- och könssjukdomar
type: Concept
in scheme: JobTech Taxonomy - Yrke
definition: Specialisttjänstgöring, ST, är den vidareutbildning som legitimerade läkare genomför för att uppnå specialistkompetens. ST-läkare hud- och könsjukdomar arbetar under handledning för att fördjupa sina medicinska kunskaper och färdigheter med målet att bli specialistläkare inom sitt område. ST-läkaren arbetar självständigt med patientutredningar, diagnostik och behandling, men alltid med stöd av specialister och enligt ett individuellt utbildningsprogram. Vanliga arbetsuppgifter är att ta medicinskt ansvar för patienter, delta i jourverksamhet, genomföra medicinska undersökningar och behandlingar samt dokumentera och följa upp vårdinsatser. Tjänsten omfattar också kontinuerlig kompetensutveckling, sidotjänstgöring inom närliggande områden och aktivt deltagande i handledning och utbildningsinsatser för kollegor och studenter. Källa: Arbetsförmedlingen, Karolinska Universitetssjukhuset, Sveriges läkarförbund, Region Kronoberg, Region Skåne.
broader: ST-läkare
related: NYW6 mP6 vwf
related: UtCj yMj ubw
broad match: C2211

Zonterapeut
type: Concept
in scheme: JobTech Taxonomy - Yrke
definition: Zonterapeut
broader: Terapeuter inom alternativmedicin
related: NYW6 mP6 vwf
related: Uuf1 GMh Uvw
related: 5Gsw sw8 Zkb
broad match: C3255
broad match: C3230

Processoperatör textilindustri
type: Concept
in scheme: JobTech Taxonomy - Yrke
definition: Processoperatörer inom textilindustri styr och övervakar maskiner inom industriell tillverkning av textilprodukter. Arbetet innebär i huvudsak att sköta maskiner för olika typer av bearbetning av textil, så som stickning och virkning. Man kan även arbeta med maskiner som tillverkar olika typer av textil, till exempel från hållbara källor. Förutom att sköta maskiner kan andra arbetsuppgifter ingå, så som att förbereda material, underhålla maskiner och kontrollera kvalitet. Beroende på arbetsplats kan man även vara delaktig i formgivning och utveckling av produkter. Det kan även förekomma truckkörning, lagerarbete och leveransförberedelse. Arbetstuppgifter: sköta maskiner, förbereda material, utföra enklare maskinunderhåll Källa: Nordiska textilakademin, Arbetsförmedlingen
broader: Övriga maskinoperatörer, textil-, skinn- och läderindustri
related: EGaL NHD oHv
related: RgWo XJP 59U
related: 3awL i5L j3y
related: G8rY CZd FAi
related: tUEp XjX YXa
related: Fm49 PQf NQB
related: VzGW ULy cdK
related: ZZai jMA WDP
related: ab67 Q6C gbo
related: VtB5 AeH 62z
related: jzPy u3h XK2
related: 1aSq Ppz zEN
related: Ndjd oR3 1c6
related: eefT TCN H2W
related: X7Sm Zmv 5rZ
related: 311m vPM 81L
related: eHdx hW5 fzS
related: gXAu faU 47w
related: 9rZ1 x1w RH3
related: mMJC Ng4 yE6
related: DcQK nwy ihq
related: wTEr CBC bqh
broad match: C8152

Maskinoperatör ytbehandling av metall
type: Concept
in scheme: JobTech Taxonomy - Yrke
definition: Maskinoperatörer inom ytbehandling av metall förbereder och behandlar metall eller metallföremål i syfte att öka motståndskraft eller för att ge metall elektriska eller magnetiska egenskaper. Arbetet innebär i huvudsak att förbereda, ställa in och övervaka maskiner som utför ytbehandlingen. Man använder olika behandlingstekniker såsom elförzinkning, varmförzinkning och pulverlackering. Arbetsuppgifter innefattar även justering av maskiner, kvalitetskontroller och underhåll av utrustning. Dokumentation och avvikelserapportering förekommer också. Beroende på arbetsplats kan truckkörning och leveransföreberedelse förekomma. Källa: Arbetsförmedlingen
broader: Maskinoperatörer, ytbehandling
related: YAkT Lki B5H
related: UdVa jRr 9DE
related: gcnT g6r D6Q
related: bVPS Db2 ST5
related: aSp1 kvW d9Q
related: VabG o2T nTL
related: txJV pWw AXT
related: b3R6 5jv W12
related: Vh8d 3gj SQ6
related: gHPg qgB 9z5
related: wTEr CBC bqh
related: UAqf aw1 f4q
broad match: C8122

Inläsare
type: Concept
in scheme: JobTech Taxonomy - Yrke
definition: Inläsare arbetar med att tolka och framföra texter på ett tydligt och engagerande sätt, ofta inom ljudboksinläsning, dokumentärer eller andra medier där talad text behövs. Vanliga arbetsuppgifter är att förbereda sig genom att läsa och förstå materialet, spela in i studio eller på distans, och hantera inspelningsutrustning med fokus på ljudkvalitet och korrekt tempo. Källa: Arbetsförmedlingen
broader: Övriga yrken inom kultur och underhållning
related: 8too bEs 7NU
related: 9puE nYg crq
related: ewq6 AdU Rh5
related: AeYu 1kk Uvb
broad match: C2656

Lärling betongarbetare
type: Concept
in scheme: JobTech Taxonomy - Yrke
definition: En lärling är anställd för att slutföra sin kvalificeringstid till betongarbetare innan ett yrkesbevis kan utfärdas. Under kvalificeringstiden får du lärlingslön enligt avtal. Kvalificeringstiden tillsammans med teoretisk grundutbildning leder till yrkesbeviset. Ett lärlingsavtal mellan branschorganisation och företag tecknas. Källa: BYN
broader: Betongarbetare
related: j7Cq ZJe GkT
related: ja7J P8X YC9
broad match: C7114

Maskinsnickare
type: Concept
in scheme: JobTech Taxonomy - Yrke
definition: Maskinsnickare tillverkar möbler, inredningssnickerier, fönster och andra produkter i större eller mindre serier. Maskinsnickare arbetar inom trä- och möbel- och inredningsindustrin. Man arbetar både manuellt och maskinellt, inklusive programmering av maskiner. Vanligtvis arbetar man med tillverkning av möbler, inredningssnickerier, fönster, dörrar och andra typer av produkter i större eller mindre serier. Man kan bearbeta materialet i olika maskiner, till exempel sågar, fräsar, hyvlar och borrar. Ofta sköter man och kontrollerar tillverkningsprocessen i sin helhet, vilket innebär att ställa in maskiner, välja material, bearbeta och kontrollera kvalitet. Källa: Arbetsförmedlingen, Trä- och möbelföretagen
broader: Maskinsnickare och maskinoperatörer, träindustri
related: JaMs VHg sKy
related: yFj1 VRX ZpX
related: 1kRj dNb ATU
related: JHhv L8E Se4
related: pHrJ bq3 vLU
related: Lvy4 gad sjx
related: jB4B uED vQh
related: qy6q EDV A3S
related: B2Za 2Tj rDG
related: v3jj fs6 DnU
related: r5av uhA hAD
related: ebVs UiN acN
related: Sdbn Mo3 NHj
related: GDzc Y6i JBU
related: bA1y 5AN 1k1
related: fCSp aRh fta
related: skZu v6k nLC
related: HAdm RdY Vpq
related: wTEr CBC bqh
broad match: C7523

Planeringstekniker, textil, glas, trä, förpackningar
type: Concept
in scheme: JobTech Taxonomy - Yrke
definition: Planeringstekniker, textil, glas, trä, förpackningar
broader: Övriga ingenjörer och tekniker
related: 6Hq3 tKo V57
broad match: C3119

Personalutbildare
type: Concept
in scheme: JobTech Taxonomy - Yrke
definition: En personalutbildare planerar, genomför och utvärderar utbildningsinsatser för medarbetare inom företag eller organisationer. Syftet är att utveckla personalens kompetens och bidra till verksamhetens mål och utveckling. Källa: Arbetsförmedlingen
broader: Övriga utbildare och instruktörer
related: YWft bBn Jyt
related: kcVm ZpX eP6
related: MVqp eS8 kDZ
related: 7orN 2Gs Wc4
broad match: C2424

Moderator
type: Concept
in scheme: JobTech Taxonomy - Yrke
definition: Moderator
broader: Övriga yrken inom kultur och underhållning
related: 9puE nYg crq
broad match: C2656

Redovisningschef
type: Concept
in scheme: JobTech Taxonomy - Yrke
definition: Redovisningschef
broader: Ekonomi- och finanschefer
related: X82t awd Qyc
related: epLc SkD cbT
related: M7TS 16B JTp
related: tVvC i5y U4s
related: bh3H Y3h 5eD
related: HxQB 5u5 WQe
related: vpNe 2XV z73
related: eBQs p5w Jkj
related: kmyZ uVt Jfy
broad match: C1211

Planeringstekniker, kemiteknik
type: Concept
in scheme: JobTech Taxonomy - Yrke
definition: Planeringstekniker, kemiteknik
broader: Ingenjörer och tekniker inom kemi och kemiteknik
related: 6Hq3 tKo V57
related: 5tyY GjC AcD
broad match: C3116

Prepresstekniker
type: Concept
in scheme: JobTech Taxonomy - Yrke
definition: Tar emot, kvalitetsbedömer, anpassar och justerar material inför tryckning.
broader: Prepresstekniker, tryckare och bokbindare m.fl.
related: HWTe SaB wiT
related: beea hNs XWo
related: 8ntq a4w 7mH
related: 15aN ATt Rb2
related: RBFh BjH AsD
related: yim5 tT1 Yva
related: rS8J fGk tCp
related: C7321
related: wXRm Aq3 9D8
related: dTK5 R7G p56
related: FQAi Nxv 4VZ
related: d92a euk ZPi
related: Ddz9 bNV nbY
related: U4RC VnB w3h
related: r6hU wxx JHd
related: zxxJ VTR hpo
related: bCHJ RTc sVi
related: E8uW GK1 AQi
related: dYog aJL kok
related: KDzy Hra iVr
related: i7AP ut3 TKX
related: xNyv PTi fSa
related: KoMU LJN 94D
related: 28YD XEz LJV
related: b28z 7oo rKZ
related: nVJB JB5 rr5
related: tfVd Bm6 Qza
related: XLL7 jMP PDm
related: 2mAa CUX vKr
related: wWte 6Xd fmQ
related: TTdj xw2 7wB
related: Pwhj Nx4 adW
related: fT6n 5mH 6km
related: RW1u RsN E8h
related: RB7E jE5 MZ3
related: r8Zw MZC SKk
related: a1fp jjB ydV
related: uenm 75h fEh
related: qYWH 9ba mjv
related: dWbY gXC Frx
related: Y2t4 aS8 tGo
related: qK2A 9oq zx6
related: jVrt anX M8R
related: yPZE 8g9 8BA
narrower: Prepressoperatör
broad match: wTEr CBC bqh

Hovmästare, servitörer och bartendrar
type: Concept
in scheme: JobTech Taxonomy - Yrke
definition: Hovmästare, servitörer och bartendrar
broader: Serviceyrken
narrower: Bartendrar
narrower: Hovmästare och servitörer

Forskare, samhällsvetenskap
type: Concept
in scheme: JobTech Taxonomy - Yrke
definition: Forskare, samhällsvetenskap
broader: Arkeologer och specialister inom humaniora m.m.
related: KT8W YVe EXf
related: X82t awd Qyc
broad match: C2633

Brandtekniker
type: Concept
in scheme: JobTech Taxonomy - Yrke
definition: Brandtekniker inspekterar och installerar brandtekniska system som brandlarm, sprinklersystem och andra säkerhetsanordningar. Arbetsuppgifterna innefattar även att utföra inspektioner, felsökning, och dokumentation för att säkerställa att system fungerar enligt gällande regelverk och standarder. I rollen kan även ingå samarbete med kunder, myndigheter och andra yrkesgrupper för att skapa säkra byggnader och miljöer. Den efterfrågade bakgrunden för en brandtekniker är oftast teknisk utbildning inom elektroteknik, byggteknik eller motsvarande, kombinerat med erfarenhet av brandskydd och tekniska system. Erfarenhet av installation och underhåll av brandlarmsystem är vanligt förekommande. Källa: Arbetsförmedlingen
broader: Brandingenjörer och byggnadsinspektörer m.fl.
related: E7hm BLq fqZ
related: 2dDC u1B EMY
related: t6c6 W8c p5m
related: SoXw zEY uhm
related: jXcN kfy DgR
broad match: C3112

Glasblåsare
type: Concept
in scheme: JobTech Taxonomy - Yrke
definition: Glasblåsare arbetar med nyproduktion av konstglas. Glasblåsaren är konsthantverkare som framställer konstglas, ofta i en egen glashytta. Arbetet innebär att forma glas från råmaterial som sand, soda, dolomit och kalksten, ibland med tillsats av metalloxider för färgat glas. Glasblåsning är ett traditionellt hantverk. Källa: Hantverksakademin, Hantverkslärling, Arbetsförmedlingen
broader: Musikinstrumentmakare och övriga konsthantverkare
related: PaxQ o1G wWH
broad match: C7315

Fiskare
type: Concept
in scheme: JobTech Taxonomy - Yrke
definition: Bedriver havs-, kust- och insjöfiske. Underhåller båtar och redskap.
broader: Fiskodlare och fiskare
related: r6uV Vr4 Qnv
related: 4jFc Uqt LwY
related: C6222
related: nApM a1U guF
related: 3aJZ gGC HzV
related: duar rCi 33K
related: qh6a 8VG LLs
related: HTX3 dha D6R
related: ZM9h 6ip qdZ
related: tPYe p8C v4Z
related: 2XXJ ofn VAD
related: JtvT uD8 gF4
related: 8Bcs wbf WJa
related: P3T4 G7P Sta
related: cUQt Ds5 Jik
related: y77a Hix Pk3
related: 2qWx WKP XYH
related: qjsN zZ2 KwE
related: hAcB kmD tBy
related: PYBv nYq F2g
related: vf55 dgi ENh
narrower: Yrkesfiskare
narrower: Fiskeskeppare
broad match: VuuL 7CH adj

Inkassohandläggare
type: Concept
in scheme: JobTech Taxonomy - Yrke
definition: Inkassohandläggare hanterar obetalda fordringar för företag och organisationer. Arbetsuppgifterna innefattar kommunikation med gäldenärer via telefon, mejl och brev, upprättande av avbetalningsplaner, hantering av betalningspåminnelser och bedömning av kunders betalningsförmåga. Inkassohandläggare dokumenterar all kommunikation, följer upp betalningar och sköter administrativa ärenden i inkassosystem. Yrket inkluderar även kontakt med Kronofogden och ibland samarbete med juridiska avdelningar eller myndigheter för att genomföra rättsliga åtgärder när så behövs. Källa: Arbetsförmedlingen, Zolva, SJR
broader: Inkasserare och pantlånare m.fl.
related: bapf FTY YLU
related: X82t awd Qyc
related: 1bKe P7d DEY
related: xwGx TyQ oXs
broad match: C4214

Tandvårdsbiträde
type: Concept
in scheme: JobTech Taxonomy - Yrke
definition: Tandvårdsbiträden assisterar tandvårdspersonal.
broader: Övrig vård- och omsorgspersonal
related: NYW6 mP6 vwf
related: oUHq C2H vEt
broad match: C5329

Teaterchef
type: Concept
in scheme: JobTech Taxonomy - Yrke
definition: Teaterchef leder och ansvarar för den konstnärliga och administrativa verksamheten vid en teater. Vanliga arbetsuppgifter är planering, budget, personalledning och utveckling av repertoar. Teaterchefen ansvarar för relationer med ägare och externa aktörer samt för att bredda finansieringen av teatern. Ansvar för verksamhet, personal och ekonomi ingår. Källa: Arbetsförmedlingen, Platsannonser
broader: Verkställande direktörer m.fl.
related: xn3s rGB vmK
related: AQfQ t29 Mt4
related: epLc SkD cbT
related: bh3H Y3h 5eD
related: 8too bEs 7NU
related: 9puE nYg crq
broad match: C1120

Driftchef, skogsbruk
type: Concept
in scheme: JobTech Taxonomy - Yrke
definition: Driftchef, skogsbruk
broader: Förvaltare inom skogsbruk och lantbruk m.fl.
related: epLc SkD cbT
related: bh3H Y3h 5eD
related: VuuL 7CH adj
broad match: C1311

Bryggmästare
type: Concept
in scheme: JobTech Taxonomy - Yrke
definition: Bryggmästare
broader: Arbetsledare inom tillverkning
related: RjKg ht2 QYq
related: wTEr CBC bqh
broad match: C3122

Mediehanterare
type: Concept
in scheme: JobTech Taxonomy - Yrke
definition: Mediehanterare
broader: Informatörer, kommunikatörer och PR-specialister
related: 8too bEs 7NU
related: 9puE nYg crq
broad match: C2432

Automationstekniker, el
type: Concept
in scheme: JobTech Taxonomy - Yrke
definition: Automationstekniker installerar, programmerar, driftsätter och underhåller automatiserade anläggningar och maskiner inom industri och fastighet. Arbetsuppgifterna omfattar montering och service av styrsystem, felsökning, insamling och analys av mätvärden, upprättande av teknisk dokumentation och förbättring av befintliga automatiserade lösningar. Automationstekniker arbetar ofta med programmering av PLC-system och samarbetar i projektgrupp med tekniker och ingenjörer. Rollen finns i många branscher där avancerad automationsutrustning används. Källor: Arbetsförmedlingen, Bransch- och företagswebbplatser,
broader: Ingenjörer och tekniker inom elektroteknik
related: 9u7p mDW ohb
related: 6Hq3 tKo V57
related: Qj2j bny qqn
related: SvAW coW dGN
related: ptvE uc7 3NQ
broad match: C3113

Övriga djuruppfödare och djurskötare
type: Concept
in scheme: JobTech Taxonomy - Yrke
definition: Bedriver avel, uppfödning och skötsel av andra djur än inom 6121-6122 för produktion av livsmedel, pälsskinn m.m. Sköter, dresserar eller tränar djur i djurpark, på cirkus m.m.
broader: Djuruppfödare och djurskötare
related: jNzh 6NW bWz
related: 4UZL UMh qFG
related: T47Z 9sQ cGY
related: RBpz aSt vhm
related: 69FX FxA 6b4
related: V8qE wKj mx4
related: xaey xNz Jg6
related: yVj6 5Ey Gku
related: nBU4 W2u 6DB
related: C6123
related: jRz7 eFB RH9
related: C5164
related: cQjT tkm mJg
related: XQkr jjn FnN
related: jyNN jer PFn
related: Au1Z 3sQ Nss
related: jo6p NKD 8mE
related: 1KBz E3j hHg
related: hYWN qgT h5R
related: hP93 f4S zUg
related: f2CZ Af2 95j
related: 8f1v NKU omg
related: fep2 969 bS8
related: C6129
related: vdVX bF1 9Ta
related: bPHw mw8 Mm5
narrower: Försöksdjurstekniker
narrower: Biodlare
narrower: Djurvårdare
broad match: VuuL 7CH adj

Bergarbetare, gruva
type: Concept
in scheme: JobTech Taxonomy - Yrke
definition: Inom gruvindustrin jobbar Bergarbetare i gruva med att bryta de delar av berget som innehåller metaller. I gruvan arbetar de i en cykel som kallas för salvcykel. Cykeln består av tre moment, som kan sammanfatta bergarbetarens arbetsuppgifter: -Bryta berget från berggrunden genom att man borrar man hål i berget och fyller hålen med sprängämnen samt spränger. -Efter brytningen är berggrunden lossad och redo för att transporteras bort. -Innan början av nästa cykel förstärker bergarbetarna väggarna genom bergförstärkning, på arbetsplatsen. Bergarbetarna i större gruvor kan ibland vara specialiserade på ett av momenten i salvcykeln. I mindre gruvor är det vanligt att arbeta med flera moment. Gruvor kan finnas både ovan och under jorden beroende på var i marken malmen ligger. I dagbrott jobbar bergarbetare utomhus. Källa: SGU
broader: Gruv- och stenbrottsarbetare
related: pnG9 Ee7 DHD
related: 9hLN xGF D8t
related: PQHZ U9m hiq
related: j7Cq ZJe GkT
related: e1UC PQH B2R
related: jwwB Pt7 GBY
related: EeWc GJ7 Vxs
related: WpSv qEZ YM1
related: HBpp dV1 7jg
related: NW6b jYY NPd
related: Y3oy ADK dk5
related: uyXi YWC Gqd
related: iW55 9hv bNp
related: b1Kc Fpf hFJ
related: gsmf rT9 yuR
related: y8uQ KRz yGY
related: q8V1 See t6C
related: LAKf uZY BYp
related: ex3w mXP g2d
related: 57RG KUE 8jJ
broad match: C8111

Arbetskonsulent
type: Concept
in scheme: JobTech Taxonomy - Yrke
definition: Arbetskonsulent
broader: Arbetsförmedlare
related: UVW1 QLU V5K
related: X82t awd Qyc
related: LZsp bUY EXW
related: JK5v hNd kJF
related: yUVK gPS ETF
related: KWeC Smo USa
related: DMzY bzx DFE
related: GX7G uNc n9Q
related: sJdz Gvm 56P
related: XMWF nSA twj
related: tkzW L4n c2N
related: bpwb 9yZ oDS
related: Hw7f 5Md 9LG
broad match: C3333

Marknadsförsäljare
type: Concept
in scheme: JobTech Taxonomy - Yrke
definition: Marknadsförsäljare säljer produkter på torg och marknader. Arbetet innebär i huvudsak att sälja produkter på torg, marknader och andra allmänna platser, både inomhus och utomhus. Källa: Arbetsförmedlingen
broader: Torg- och marknadsförsäljare m.fl.
related: B9qb ZPk 74K
related: UdVa jRr 9DE
related: rDcj Tao TJJ
related: PRtx Ju3 mSq
related: RPTn bxG ExZ
related: bTcB Tiw qPT
related: WMEZ AAB G3D
related: ZTMF BJJ EM6
broad match: C5211

Systemadministratör
type: Concept
in scheme: JobTech Taxonomy - Yrke
definition: Systemadministratör hanterar och underhåller datorsystem och nätverk inom en organisation. Arbetsuppgifter innefattar installation och konfiguration av system och nätverk, hantering av användarkonton, övervakning av systemens prestanda och tillgänglighet, felsökning av tekniska problem samt genomförande av säkerhetskopieringar. Systemadministratör uppdaterar och uppgraderar system och programvara och arbetar med att skydda systemen mot hot och intrång. Rollen inkluderar även support och utbildning till användare samt samarbete med andra IT-medarbetare för att utveckla och förbättra systemen. Källa: Arbetsförmedlingen
broader: Systemadministratörer
related: ggy7 Yx6 6mn
related: EuAp 62m NsP
related: YXsj RBj pzH
related: CqFF CqM J8x
related: 8w1w dJh juE
related: CVyq VtZ MBi
related: YKGi CgC TRJ
related: apaJ 2ja LuF
related: AqtQ uPz Kvt
related: hkC6 WBB VL2
related: t5Mx c98 Yjo
related: qZ92 xS7 8NF
related: Nc1F gwd L8f
related: JFDr qE6 RPM
related: USLF mcK ch2
related: 9qpr Smu RNi
related: yqM4 3fX BBH
related: LvK8 yun KRQ
related: x76i RKr 7SP
related: o6s5 i9r C38
broad match: C2522

Köksarkitekt
type: Concept
in scheme: JobTech Taxonomy - Yrke
definition: Köksarkitekt
broader: Inredare, dekoratörer och scenografer m.fl.
related: 9puE nYg crq
broad match: C3432

Stödassistent
type: Concept
in scheme: JobTech Taxonomy - Yrke
definition: Stödassistenter fungerar som stöd för att klara det dagliga livet för personer som har ett funktionshinder. Arbetet innebär att ge pedagogiskt stöd och/eller omsorg för att främja den enskildes förmågor och självständighet. Arbetsplatsen är vanligen gruppbostad, daglig verksamhet eller korttidshem för barn och ungdomar. Arbetsuppgifter skiljer sig åt beroende på arbetsplats. På en gruppbostad handlar det om till exempel stöd med matlagning, städning, personlig hygien, fritidsaktiviteter och hjälp med myndighetskontakter. Inom daglig verksamhet är målet med arbetsuppgifterna en meningsfull sysselsättning för personer med ett funktionshinder inom till exempel caféverksamhet, servicearbete, snickeri, konst, drama eller data. På ett korttidshem handlar arbetsuppgifterna om att ta hand om och aktivera barn och ungdomar. Källa: Arbetsförmedlingen - Hitta yrken
broader: Vårdare, boendestödjare
related: 9KuM m4b rYX
related: Ueqk 7QB t9F
related: BmE6 vjL Xiy
related: TA52 QYv yuw
related: txJU cy6 BD9
related: GazW 2TU kJw
related: 1Qt4 jtL YLp
related: Y5KX P2f pyw
related: sU2E q4d qXS
related: uZHq Ao9 FUr
related: m7GW QVG uKB
related: gCSb weN R3J
broad match: C5322

Frisörer
type: Concept
in scheme: JobTech Taxonomy - Yrke
definition: Klipper, behandlar och vårdar hår med hjälp av t. ex. sax, klippmaskin och kniv. Utför kemiska behandlingar som permanent, färgning och blekning. Gör håruppsättningar, läggningar och hårförlängningar. Tillverkar och provar ut peruker och tupéer.
broader: Skönhets- och kroppsterapeuter
related: AABX dHc UrX
related: YcrR 5QB 3XL
related: ryXf E4d FYU
related: HisK J3q rwb
related: Ckww 8Ti pWh
related: nwAG AKv zsh
related: W1DU LPz fEs
related: eYUf EBb QwC
related: CVaf GGe Les
related: Uqth qM3 Fyn
related: BK7Q 44f DdJ
related: yYrg 8jy LLa
related: C5141
related: VczR HmG PmN
related: hyt9 v8M YZc
related: 7uRS nMU TNH
related: GBF1 LEf m5G
related: dyoy LDv Sx5
related: 43v8 evE cUE
related: hYpk RYx y3V
related: NrJn nRJ TeL
related: xFSm Qwi edR
related: koMr VoX RA3
related: uKA9 HNf 8iW
narrower: Perukmakare
narrower: Frisöraspirant
narrower: Frisör
narrower: Barberare
broad match: Uuf1 GMh Uvw

Arbetsledare, tillverkning, textil- och träprodukter
type: Concept
in scheme: JobTech Taxonomy - Yrke
definition: Arbetsledare, tillverkning, textil- och träprodukter
broader: Arbetsledare inom tillverkning
related: Bq49 GkW Ptr
related: wTEr CBC bqh
broad match: C3122

Motorfordonsmekaniker och fordonsreparatörer
type: Concept
in scheme: JobTech Taxonomy - Yrke
definition: Analyserar fel, underhåller och reparerar motorer till motorfordon och båtar. Reparerar och utför service på motorcyklar, personbilar, lastbilar, långtradare, trailrar, bussar, traktorer samt cyklar. Underhåller och reparerar lantbruks-, skogs-, entreprenads- och anläggningsmaskiner. Beställer, lagerhåller och säljer reservdelar och tillbehör. Hit hör inte Flygmekaniker (7232) Helikoptermekaniker (7232) Lokreparatör (7233) Vagnreparatör, järnväg (7233)
broader: Fordonsmekaniker och reparatörer m.fl.
related: Cszq bEG Vmm
related: mczu WBE VSW
related: C7234
related: zLwt WNZ KnP
related: yMbg bQt caE
related: qQms DVy WhS
related: in2S yKN FVw
related: jbVW d5L 7YH
related: vVpY zxw ghs
related: VWmQ 9fd GLL
related: 7mSe Ndj bNG
related: iU2t rNR YFX
related: vvqa axH wqT
related: aHCV VsV LiD
related: 68CS 8FS iKn
related: faAc rbm bxX
related: x5PF qFY shE
related: 3vwF yka n6K
related: VqGG nFM SPc
related: QXtd jG5 BgH
related: 53Pb U1a RpL
related: vUGz iSh 2J2
related: Y6zg 1oi cDZ
related: XHqY JaH F4h
related: vDWM nyS fVa
related: JKSD AC8 Z2S
related: JUpW QCd vCM
related: ikNp 4bD 9NJ
related: uKZC qd6 UBo
related: g6XX 4vx K3a
related: Y7x9 sfD DFh
related: 2E7x 4v4 9hN
related: h9wm 1Tg UfH
related: PELm cH9 AE9
related: Q7eC B7g QiU
related: 86Ye QhH 84R
related: 7coz KQN G7U
related: smaU eAR nP2
related: heEF tHa RJw
related: k9pW awM Kmy
related: txco m6M RjU
related: g5Df UHK s1N
related: 73yg gLU Y3s
related: Te3y NpL tkQ
related: wYYj eRy Hok
related: xeoV TkQ 9qu
related: xAbn Wt7 ySS
related: auyj rRt P6h
related: 299A qWK 5s9
related: moJc yZC sjN
related: E6uE hqh VZW
related: qnK9 CBi ZKw
related: fjoN ZHr XG4
related: fhcp fFw Lbj
related: Sh5W Ha8 cjQ
related: GyDU 16x 48U
related: Xtys AjN 9an
related: NYdq ND3 JrB
related: fJC9 qGw f8g
related: 4U6r qYQ Qea
related: dW6y neZ EFs
related: ygEQ Pwp ozn
related: wfyt qvj smc
related: NLrf G5T pP7
related: 9FUH EYe WjD
related: Bad8 cPj JgR
related: bc3u EyC 4YF
related: Gmdz YQ7 QZv
related: eAam bTc exb
related: t17v Hrq yLk
related: pXy8 4zz azx
related: C7231
related: R6ZK FGC ovb
related: jnLy 6Ns KpH
related: 26oh VP2 3c3

Specialisttandläkare inom orofacial medicin
type: Concept
in scheme: JobTech Taxonomy - Yrke
definition: Specialisttandläkare inom orofacial medicin är en specialiserad legitimerad tandläkare med en djupare kunskap och kompetens inom sitt område. Specialisttandläkare är en skyddad titel och bara den som har bevis om specialistkompetens får kalla sig specialist i sin specialitet. Vanliga arbetsuppgifter är att utreda, diagnostisera och behandla komplexa fall inom exempelvis oral kirurgi, ortodonti, pedodonti, parodontologi, oral protetik, bettfysiologi, endodonti eller odontologisk radiologi. Specialisttandläkare samarbetar ofta i team, tar emot remisser från allmäntandläkare och bidrar med expertkunskap till både patienter och kollegor. Arbetsuppgifterna kan även omfatta konsultationer, handledning och ibland ansvar för verksamhet eller personal inom sitt specialistområde. Källa: Arbetsförmedlingen, Sveriges Kommuner och Regioner, Socialstyrelsen
broader: Tandläkare
related: NYW6 mP6 vwf
related: proQ odJ 3A7
related: M2TT tmf gXN
related: wsR5 a4n UXu
related: NgG1 5qR MDs
related: SRs7 HCS tVp
related: bvS2 Vmd o8t
related: 2B4i UAL 5kg
broad match: C2261

Paralegal
type: Concept
in scheme: JobTech Taxonomy - Yrke
definition: Paralegals ger juridiskt stöd till jurister och utför juristuppgifter som inte kräver en full juridisk utbildning. Arbetsuppgifter varierar beroende på arbetsplats och kan innefatta daglig administration, att upprätta juridiska handlingar, förbereda material till förhandlingar eller rättegångar. Vanligtvis ingår även enklare juristuppgifter, så som rättsutredningar, protokollförare vid förhandlingar samt kommunicera med ombud, klienter, domstolar och myndigheter. på advokatbyråer Även och företags juridiska avdelningar jobbar man ofta med handläggning av juridiska, ekonomiska och arbetsrättsliga frågor, gör research och sammanställa informationsmaterial. Se även yrket Domstolshandläggare. Källa: Sveriges Domstolar, yrkesutbildningsprogram, Arbetsförmedlingen
broader: Domstols- och juristsekreterare m.fl.
related: GcHm pkp UT3
related: xmCa tXq 4a8
related: X82t awd Qyc
related: 4CN7 Gd8 oNz
related: EMn8 c3z PEv
related: fREB oZa dKQ
broad match: C3411

Forensiker, fysiker
type: Concept
in scheme: JobTech Taxonomy - Yrke
definition: Forensiker, fysiker
broader: Fysiker och astronomer
related: kJeN wmw 9wX
broad match: C2111

Uthyrare
type: Concept
in scheme: JobTech Taxonomy - Yrke
definition: Hyr ut fordon, maskiner och andra varor och produkter.
broader: Butikspersonal
related: wzAA SXS jz7
related: XxwR 9MV LCy
related: Si9Z xEr pjq
related: C5249
related: heEF tHa RJw
related: knpH jqV M24
related: cvBd G8U Wxk
related: jWqZ gyq di9
related: xPqp 6o4 f8c
related: xrds 8Cq rzm
related: Bc4A Z6e Pq1
related: hYpk RYx y3V
related: g4w2 EyF UHm
related: egS2 otg r9x
related: 53Uq j5u vme
related: 75Nu amZ Ag5
narrower: Uthyrare sport- och fritidsutrustning
narrower: Stuguthyrare
narrower: Maskinuthyrare
narrower: Biluthyrare
broad match: RPTn bxG ExZ

Förlagschef, tidning
type: Concept
in scheme: JobTech Taxonomy - Yrke
definition: Förlagschef, tidning
broader: Övriga chefer inom samhällsservice
related: epLc SkD cbT
related: bh3H Y3h 5eD
related: 9puE nYg crq
broad match: C1120
broad match: C1349

Lantbrukare växtodling
type: Concept
in scheme: JobTech Taxonomy - Yrke
definition: Lantbrukare inom växtodling bedriver odling av jordbruksväxter på friland. Arbetsuppgifter omfattar markberedning, sådd, gödsling, bevattning, växtskydd, skörd och lagring av grödor. En viktig del av arbetet är att hantera och underhålla lantbruksmaskiner och redskap. Man kan arbeta både som egenföretagare och som anställd i ett lantbruksföretag. Rollen innefattar ofta många andra arbetsuppgifter, så som underhåll av ekonomibyggnader samt kontakt med leverantörer och kunder. Arbetsuppgifterna kan överlappa med gårdsmästare och driftledare, särskilt på mindre företag där yrkesrollerna är bredare. Källa: Gröna arbetsgivare, Arbetsförmedlingen
broader: Odlare av jordbruksväxter, frukt och bär
related: jKe8 9fP Ski
related: Zv1f 6rg re6
related: 8U7p UrJ 4Ft
related: eiWT iup CTY
related: pe4a Ktg XFx
related: ersH YC7 yZo
related: Low4 zAr tX3
related: VuuL 7CH adj
related: ARoN sLZ SJC
broad match: C6111

Idrottskonsulent
type: Concept
in scheme: JobTech Taxonomy - Yrke
definition: Idrottskonsulenter arbetar med stöd, utveckling och samordning av idrotts- och fritidsverksamheter inom kommuner eller organisationer. Arbetsuppgifterna inkluderar att initiera och driva projekt, samverka med föreningar och andra aktörer, arrangera aktiviteter samt bidra till planering och utveckling av anläggningar och verksamheter. Idrottskonsulent arbetar ofta med att skapa goda förutsättningar för ett rikt föreningsliv och för att främja deltagande och folkhälsa. Källa:
broader: Idrottstränare och instruktörer m.fl.
related: UR8L PVS 1qs
related: 6WME 9L5 tLy
related: Mwtn XSA 9W4
related: rUVy nVv GZW
related: MVqp eS8 kDZ
broad match: C3422

Mönsterkonstruktör
type: Concept
in scheme: JobTech Taxonomy - Yrke
definition: Mönsterkonstruktör skapar och justerar mönster för kläder för att uppnå önskad passform. Arbetsuppgifterna inkluderar att gradera måttlistor, göra mönsterförändringar, leda avprovningar och kvalitetssäkra mönster. Man kan även arbeta med tillverkning av specifika detaljer så som kragar och ärmar. Som monsterkonstruktör är det vanligt att ansvara för mönsterprocess, materialoptimering och samarbete med produktionsenheter för att säkerställa rätt passform och effektiv tygåtgång. Källa: Stockholms Tillskärarakademi, Arbetsförmedlingen
broader: Skräddare och ateljésömmerskor m.fl.
related: v8Wy XS8 9bH
related: nuYq ze9 XAX
related: kqau D4r 4fE
related: DiJx RGc KPj
related: 8too bEs 7NU
related: PaxQ o1G wWH
related: ck5L Wtc izu
broad match: C7532

Stationschef, bilprovning
type: Concept
in scheme: JobTech Taxonomy - Yrke
definition: Stationschef, bilprovning
broader: Övriga chefer inom övrig servicenäring
related: pwVF ME5 TtZ
related: epLc SkD cbT
related: bh3H Y3h 5eD
broad match: C1439

Växtodlare inom jordbruk och trädgård
type: Concept
in scheme: JobTech Taxonomy - Yrke
definition: Växtodlare inom jordbruk och trädgård
broader: Lantbruks- och trädgårdsyrken
narrower: Trädgårdsanläggare m.fl.
narrower: Trädgårdsodlare
narrower: Odlare av jordbruksväxter, frukt och bär

Smådjursskötare
type: Concept
in scheme: JobTech Taxonomy - Yrke
definition: Smådjursskötare
broader: Uppfödare och skötare av sällskapsdjur
related: UdVa jRr 9DE
related: nEZF CEG D5Y
related: VuuL 7CH adj
broad match: C5164

Datasäkerhetsansvarig
type: Concept
in scheme: JobTech Taxonomy - Yrke
definition: Datasäkerhetsansvarig
broader: IT-säkerhetsspecialister
related: TRPL 5av hN9
related: apaJ 2ja LuF
broad match: C2529

Backofficepersonal m.fl.
type: Concept
in scheme: JobTech Taxonomy - Yrke
definition: Utför registrering, avveckling och kontroll av affärshändelser inom värdepappers- och valutahandeln.
broader: Kontorsassistenter och sekreterare
related: xSLo P6B 2AF
related: DJgq zBj bKt
related: uic8 7Ar HEA
related: bwjW 1SE XWZ
related: aUr6 Rjg ja2
related: 3HjW 1BP k3S
related: pAcX ugi X4j
related: 3vYj Rhf Voh
related: Uv9y v2g efa
related: Tmps QPE g3V
related: C4312
related: 5WVG LVw ZgL
related: NUC3 y1C Scg
related: cw2M p2W SuJ
related: ytD5 G1i 2y5
related: dYqT JBz NZE
related: 5wab aFK gdL
related: Fiq4 siu LXn
related: PVnT yGT SMb
related: qtHa AsU Cfo
related: Nig2 2pU GT8
related: LmAP e75 pc6
related: 7scD 9YP iwV
related: jcpA Zfs nSz
related: RB7E jE5 MZ3
related: Kvft WHn KJE
related: 2ZFC 6de YSB
related: B1rc wCc vne
related: w8bU wHe omF
related: 73gL 4uv p9J
related: 1xHU W9z CT9
related: 8u7A ze1 bvd
related: 6Ei3 fZV YKM
narrower: Backofficepersonal
broad match: X82t awd Qyc

Betonghåltagare, utan yrkesbevis
type: Concept
in scheme: JobTech Taxonomy - Yrke
definition: En betonghåltagare gör hål genom borrning eller sågning i olika byggmaterial, som betong, tegel, eller berg, med kraftfull utrustning vid ombyggnader eller rivningar. Håltagning används ofta vid ombyggnation av hus, som vid byte av rörstammar, el eller ventilation, samt för installation av fönster, dörrar eller hissar. Vid rivning och nedmontering av betongkonstruktioner förekommer ofta moment där sågning och borrning i betong är aktuellt. Det krävs stor kunskap om både tekniska verktyg och säker hantering av tunga lyft. Källa: Arbetsförmedlingen
broader: Betongarbetare
related: j7Cq ZJe GkT
related: ja7J P8X YC9
broad match: C7114

Glastekniker/Glasmästare
type: Concept
in scheme: JobTech Taxonomy - Yrke
definition: Glasteknikern, som ofta kallas glasmästare, arbetar med glasreparationer i fönster och dörrar, att tillverka och montera hela glaspartier till uterum och altaner eller att arbeta med offentlig miljö, speglar, dekorationsglas, duschar och annat inredningsglas för hem. Glasteknikern jobbar med olika sorters glas, till exempel floatglas, laminerat glas, härdat glas och energiglas. Det är ett hantverksyrke som ställer krav på tekniska och produktspecifika kunskaper, noggrannhet, känsla för service och samarbetsförmåga. Glasteknikern kan ansöka om sitt yrkesbevis efter teoretisk grundutbildning och lärlingsanställning. Källa: Glasbranschföreningen
alternative label: Glasmästare
alternative label: Glastekniker
broader: Glastekniker
related: 1hWk 6z7 RsD
related: RuBJ j5d HMt
related: PaxQ o1G wWH
related: QBZ5 oKZ fEh
related: ja7J P8X YC9
related: Yug7 KrR 1hv
related: NqAN nmh t6E
broad match: C7125

Behandlingsassistent/Socialpedagog
type: Concept
in scheme: JobTech Taxonomy - Yrke
definition: Behandlingsassistenter/Socialpedagoger arbetar med att stödja och behandla barn, unga och vuxna som har psykosociala problem, missbruks- eller beroendeproblematik. Arbetsuppgifter innefattar att i vardagen stötta klienter i aktiviteter som fritid, studier och arbete samt hjälpa till med vardagliga sysslor såsom matlagning, städning och tvätt. Rollen innebär även motivationsarbete, samtal och lyssnande för att hjälpa klienter att lämna exempelvis drogberoende och utveckla ett självständigt liv. Arbetet kan vara psykiskt krävande men upplevs ofta meningsfullt. Behandlingsassistenter/socialpedagoger verkar ofta inom institutioner, behandlingshem, kriminalvård och socialtjänst. De arbetar nära klienterna och är en del av det dagliga livet i respektive verksamhet. Arbetet kan innebära skiftarbete och medlevarskap, där man bor och verkar tillsammans med klienterna under vissa perioder. Källa: Sveriges kommuner och regioner, Arbetsförmedlingen
alternative label: Behandlingsassistent
alternative label: Socialpedagog
broader: Behandlingsassistenter och socialpedagoger m.fl.
related: 9fBs 82L FUQ
related: VbKX Ymi G8U
related: Zf7s XKV xnM
related: uCj3 bzg FKH
related: wagD Z3m rFt
related: Npkj E1C 9jj
related: fqks yTE zYF
related: GazW 2TU kJw
related: 1Qt4 jtL YLp
related: GGnf cFn RC2
related: DLkB Ux4 ugB
related: pvYo LK3 rX1
related: ArWA En7 RYV
related: t6q3 yKD E3b
related: HfvF Ezq Wpa
related: Pkca 9u5 TQH
related: p4YQ Jxw ZMH
related: 5kGH qCk CNN
related: mw4Q HVz Mf1
related: hLAE X59 ZUE
related: Kvog 8WA 9Db
related: unCz Zd6 Bg9
related: UsuR cQx b2i
related: bUrR dJT 7ms
related: STzw nXz 3b2
related: fnhW EBh bfJ
related: uK1a YQq k6j
related: YkjL 7Kk 1eW
broad match: C3412

Väg- och anläggningsarbetare
type: Concept
in scheme: JobTech Taxonomy - Yrke
definition: Som väg- och anläggningsarbetare bygger du broar, kajer, tunnlar, gator, vägar, parker, trädgårdsanläggningar med stensättningar och mycket mer. Jobbet kan ibland vara fysiskt, men till din hjälp har du olika maskiner och tekniskt avancerade specialinstrument, där allt från asfaltering till olika rörledningar i mark ingår i arbetsuppgifterna. Väg- och anläggningsarbetare finns både inom den privata och offentliga sektorn. Väg- och anläggningsarbetaren kan ansöka om sitt yrkesbevis efter teoretisk grundutbildning och lärlingsanställning. Källa: BYN
broader: Anläggningsarbetare
related: R4c1 KHp AsB
related: HvQr wGJ Kdm
related: GnuJ 9yU yy5
related: 1onV rFJ mAU
related: j7Cq ZJe GkT
related: Cdke otX mf5
related: uf4Q KEP bt5
related: Ypn4 TLR Z2Q
related: DtUv QcG wy4
related: i8DN 8bs jED
related: UQtL JVa mbs
related: CdFy j8y meP
related: aC7C Aap sw3
related: ja7J P8X YC9
related: upbS QFL YQP
related: MMqS zDF RQ4
related: gVjL Djo i2Y
related: ss6K UmZ 7FA
related: 1tQS wpd FHK
related: ip68 58W kkx
broad match: C7119

Uthyrare sport- och fritidsutrustning
type: Concept
in scheme: JobTech Taxonomy - Yrke
definition: Uthyrare av sport- och fritidsutrustning hjälper kunder med hyra av till exmepel cyklar, skidor och friluftsutrustning. Arbetsuppgifterna inkluderar att ge kunder professionell service genom att hjälpa dem välja rätt utrustning, hantera kassatransaktioner och administrera uthyrningssystemet. Enklare reparationer och regelbundet underhåll av utrustning ingår vanligtvis. Vanliga arbetsplatser är skidanläggningar, äventyrsanläggninar och friluftsanläggningar. Källa: Arbetsförmedlingen
broader: Uthyrare
related: Ye9m S4m eLM
related: UdVa jRr 9DE
related: fRGe mRH AEu
related: RPTn bxG ExZ
related: hRXs CRH zXy
related: SQ3S Bcc P4q
related: xZ25 d16 CJy
related: H2MR JPr qew
related: ZiFi yWQ ah1
broad match: C5249

Utvecklingsingenjör, maskin
type: Concept
in scheme: JobTech Taxonomy - Yrke
definition: Utvecklingsingenjör, maskin
broader: Civilingenjörsyrken inom maskinteknik
related: SuAn oH9 xNc
related: 6Hq3 tKo V57
related: sxNv p6M hFd
broad match: C2144

Verktygsmakare
type: Concept
in scheme: JobTech Taxonomy - Yrke
definition: Tillverkar, justerar och reparerar formverktyg för plast- eller metallprodukter samt klipp- och bockverktyg. Utför verktygsfräsning, verktygssvarvning och gnistbearbetning samt bänkarbete.
broader: Smeder och verktygsmakare m.fl.
related: VPF1 UZM 9Kd
related: d4fX YoT QQc
related: V4fd 1tz yVB
related: WK5N 8ga bTa
related: LWNq MMu 1RX
related: LXoc wxV 73h
related: aHCV VsV LiD
related: K5JR yfk 8oj
related: C7222
related: yFgG g8k r6r
related: BttV qy2 xJH
related: qQ61 EQR rcz
related: VTwt 5Fe 6bW
related: 9SE2 AJw o1v
related: KDzy Hra iVr
related: LK8L tR8 qEy
related: p7ov Auf N1i
related: zVKm f79 DtU
related: goJA s5f s1q
related: JRvh wrY RmW
related: M7dW JgN VXL
related: wGxZ 5HR 6m8
related: Ju8n Z6R y2b
related: X4EU ZC7 QmK
related: BKYD AEo maF
related: Lgt8 xjP 7Fq
related: uenm 75h fEh
related: y1im PVL AMp
related: wZpC X9a xzG
related: nDqs 2d5 jqu
related: QVuW ekm ihT
related: dWbY gXC Frx
related: KTBi REk dTn
related: rUBr yGh 82H
related: RZf1 417 y1V
related: UCxw 3K4 8f1
narrower: Verktygsmakare
broad match: wTEr CBC bqh

Uppfödare och skötare av sällskapsdjur
type: Concept
in scheme: JobTech Taxonomy - Yrke
definition: Bedriver avel, uppfödning och skötsel av sällskapsdjur.
broader: Djuruppfödare och djurskötare
related: MdQ3 2Lh Xiy
related: DM6e bth LXc
related: T47Z 9sQ cGY
related: wkwA awm s42
related: 69FX FxA 6b4
related: nFvV 6GB Nne
related: jRz7 eFB RH9
related: C5164
related: yuRa gmr 9J6
related: NCSW fHy Syc
related: C6121
related: so32 EVN up1
related: ScN7 UXF rJk
related: D7zq sxj A2e
related: nk9v x1c sor
related: DYvh 2Z1 WNr
related: 89ab noe cw9
related: 1jiJ UPn yC5
related: MaaF C4T TGd
related: pbbc s2J TCD
narrower: Hundskötare
narrower: Hundtrimmare
narrower: Smådjursskötare
narrower: Smådjursuppfödare
narrower: Hundtränare
broad match: VuuL 7CH adj

Soldater m.fl.
type: Concept
in scheme: JobTech Taxonomy - Yrke
definition: Soldater m.fl.
broader: Militära yrken
narrower: Soldater m.fl.

Distributionselektriker
type: Concept
in scheme: JobTech Taxonomy - Yrke
definition: Bygger, underhåller och reparerar ledningsnät som består av luftledning eller jordkabel. Underhåller och reparerar ställverk och transformatorstationer. Besiktigar ställverk och åtgärdar fel i ledningsnätet. Hit hör inte: Industrielektriker (7412) Installationselektriker (7411)
broader: Installations- och industrielektriker m.fl.
related: FqWP 6FQ Wz5
related: wBLK nWZ 7ek
related: AEfm Ltu HrZ
related: 25bm Na8 uPa
related: aHCV VsV LiD
related: rmuF Dce PPS
related: fjyp Sft A2M
related: eVwv pwi 6Gj
related: 8ZhW wNv 5k9
related: yVj6 5Ey Gku
related: 3W8b L9H Lh8
related: 1YZS 1ch vDZ
related: PELm cH9 AE9
related: Gkva 9uK omM
related: Kg7w Qrp CzN
related: nqz6 PKY kii
related: E7Hg 452 2i1
related: AcJ9 uCy S2r
related: Rqez Bqv FKe
related: 3Rz2 ToM Va9
related: Xtys AjN 9an
related: CGMD Zzj ayH
related: eojD i4f 4f6
related: ST1N VMw y8e
related: GCYi 9tC 1pP
related: xkMt rnN TVg
related: 4bwR JVU usd
related: c14d Mgx MFA
related: C7413
related: QM4g Xik 4gR
related: oxd3 phB 77Q
related: bYfP 9R9 eVF
related: E5UW 5JV s13
related: KzNT 2ch wdT
related: AEgv 4gP ndv
related: HxYt DAb sK2
related: No3n tWf gL2
related: Wp5U HL7 wBm
related: Sbs4 dpg Y2B
related: kzto Ymy cPC
related: wZpC X9a xzG
related: nEyn Vk1 eEx
related: 4mNF 7vZ vCx
related: 9fMp wgV vhi
related: uG7n rkM WoS
related: Uytu hWi 5nh
related: Vz9a 9wt Cg4
related: zhnk EpA GaN
related: xBzd J1L w7Q
related: 84Y4 ZsE KQb
narrower: Distributionselektriker
narrower: Servicetekniker, elkraft
narrower: Kontaktledningstekniker
narrower: Stationstekniker, elkraft
broad match: yhCP AqT tns

Systemadministratörer
type: Concept
in scheme: JobTech Taxonomy - Yrke
definition: Administrerar system, databaser och lokala nätverk och ger service till användare. Installerar och konfigurerar nya applikationer och distribuerar programuppdateringar till användare.
broader: Drift-, support- och nätverkstekniker m.fl.
related: eTW8 AY5 tpe
related: sq2c q5d zXN
related: pWTc PxX xX6
related: wynY a5Q F6t
related: wbj8 LR2 aZ8
related: BMjs Jmm GJj
related: NnaR bCQ hK1
related: XVip VKv Ac4
related: juME 7Ek CBR
related: igAK 9XZ E2a
related: PNvt F2Y xrr
related: oRCp wLd dWd
related: LeES iac 1Qx
related: 5GZg Yvo Aty
related: UGqj u6c Tog
related: qVjQ w6H dns
related: Bjvt 4Ji iHn
related: N8Tu Tsn 2VD
related: cPEP iGw fPy
related: ZxHj Wvj 39H
related: wTxT qvv sDA
related: ANZn 5H8 JAu
related: Zd17 7XH myf
related: zqiz PQv xLD
related: 49fH K3e Fbm
related: KAVh Qyx GPu
related: a2Nd qJ3 S8y
related: voRm aoU cKB
related: Xyi3 dCQ 7pa
related: iukJ 2v3 MuY
related: GWWi rwD F8B
related: Lrrv HyL PzJ
related: bdQe ReZ Bs4
related: 7d2G KP4 eFb
related: UvgZ AFo 8Ua
related: eGP4 984 S1u
related: oisM 5jo EVb
related: gWt1 3JZ 56u
related: bCPt NW1 v2o
related: z3v2 Z4t CA2
related: ypyR 7oD 4Xu
related: NQmD sAK eFA
related: 5q4a wi4 WYk
related: L4sY nSE UsH
related: bKM3 9g1 WWC
related: BPMn 5Fu z9m
related: T4Fs ix5 kkv
related: eKtc 9pz qch
related: nYAH rZC a2F
related: BKRi T8q VUy
related: 8Qjp Myj xnv
related: JNqq 4GY 5Kc
related: DWfb eQD E3r
related: WQdS Jtu qPC
related: Xnmr kYS YKY
related: 3FDM hGT 5kY
related: VqXu EGE 2R1
related: j3wL CdZ Rz6
related: U2qp tJj VoQ
related: HQJ2 68A AiZ
related: uED7 pyd cK5
related: ocZE Fi7 kTv
related: Egmd U5i sRA
related: cH7n Y7S UP4
related: eLre uPr fuC
related: hGiU uSK UzY
related: gYpc sKH 3uL
related: nf2k RuW WEC
related: hQg8 jgk iVV
related: LyCZ 7mm 9VW
related: WtpN icG D61
related: gtoY Bwt 23m
related: XuRf F2y Vcq
related: 3H7m pt8 7b2
related: xGEc fZi Zf3

Redovisningsassistent
type: Concept
in scheme: JobTech Taxonomy - Yrke
definition: Redovisningsassistenter registrerar ekonomiska transaktioner och hanterar löpande bokföring inom företag och organisationer. Arbetsuppgifter omfattar fakturahantering, avstämning av konton, upprättande av ekonomiska rapporter samt förberedelse av underlag för bokslut och deklarationer. Redovisningsassistenter kontrollerar och korrigerar ekonomiska poster samt använder olika bokförings- och faktureringssystem. Arbetsuppgifterna förekommer även inom närliggande yrken som ekonomiassistent, särskilt på mindre arbetsplatser där yrkesrollerna kan överlappa. Källa: Arbetsförmedlingen
broader: Ekonomiassistenter m.fl.
related: JT18 FFA 8UJ
related: wM7P arG MmJ
related: neWZ Ska AWU
related: Hn8S 9ST hfF
related: uDoN gAR 915
related: 3JeR mW3 5i2
related: X82t awd Qyc
related: XpxA Bv3 efa
related: V5Bn QSU Zdj
related: 9ATM Rfb hUq
related: NNX6 jEd JEP
related: KLaK RvS mih
related: iGQE WFN 7ga
related: L2Fk 4xV 48e
related: ZTbG Vc9 FZk
related: 3ZtY RjP rAo
related: BPES Dkh 9TB
broad match: C4311

Automationselektriker
type: Concept
in scheme: JobTech Taxonomy - Yrke
definition: Automationselektriker arbetar med installation, drift och underhåll av automationssystem inom industri och andra tekniska anläggningar. Arbetsuppgifterna innefattar att koppla samman elektriska och elektroniska komponenter, samt att installera och konfigurera styr- och reglertekniska system som används för att automatisera produktionsprocesser. Automationselektriker genomför även felsökning och reparation av befintliga system för att säkerställa driftsäker produktion. Arbetsuppgifter kan också omfatta programmering av styrsystem, såsom PLC-system, och arbete med nätverk för kommunikation mellan olika automationsutrustningar. kompetensområden: programmering av styrsystem, felsökning och diagnostik av elektriska system samt kunskap om reglerteknik och processautomation. Källor: Arbetsförmedlingen,
broader: Industrielektriker
related: 44Az E7Q bDQ
related: yhCP AqT tns
broad match: C7412

Tatuerare
type: Concept
in scheme: JobTech Taxonomy - Yrke
definition: Tatuerare arbetar med att skapa permanenta motiv på huden genom att föra in färgpigment med hjälp av tatueringsmaskin. Arbetsuppgifterna omfattar kundmöten, motivplanering, skissarbete, hygienrutiner, hudförberedelser och själva tatueringsarbetet. Tatuerare arbetar med både färg och svartvit teknik, i varierande stilar och storlekar. Källa: Sveriges registrerade tatuerare, Arbetsförmedlingen
broader: Övriga skönhets- och kroppsterapeuter
related: 8too bEs 7NU
related: 9puE nYg crq
broad match: C5142

Tandhygienister
type: Concept
in scheme: JobTech Taxonomy - Yrke
definition: Tandhygienister
broader: Yrken med krav på högskolekompetens eller motsvarande inom hälso- och sjukvård samt laboratorium
narrower: Tandhygienister

Designer inom spel och digitala medier
type: Concept
in scheme: JobTech Taxonomy - Yrke
definition: Designar, formger och utvecklar digital och elektronisk media. Skapar specialeffekter, animering och andra audiovisuella rörliga bilder för dataspel, film, video m.m. Fastställer mål och restriktioner för designuppdraget genom samråd med kunder, intressenter och den egna organisationen.
broader: Designer och formgivare
related: DW4R Ejt Y35
related: NfDv 1zP NsD
related: e4tA b22 rfY
related: BMjs Jmm GJj
related: HWTe SaB wiT
related: DHhX uVf y6X
related: payW 4G9 EcQ
related: beea hNs XWo
related: E44v wYZ wjx
related: 5GZg Yvo Aty
related: hY1R jKB zNr
related: jMbp BAd Tyt
related: F4nq ZH3 s3u
related: 15aN ATt Rb2
related: SuJz U6P sjm
related: AfJ4 Pvv YBa
related: prQp aMi qfU
related: K8eq sEz eXV
related: RBFh BjH AsD
related: DLBo TAb Qet
related: a2Nd qJ3 S8y
related: buX8 38v YpB
related: iukJ 2v3 MuY
related: wkT5 VLV Uad
related: H2y8 rig kSH
related: wXRm Aq3 9D8
related: 6uCy RbZ aDM
related: bq5g QZW eyR
related: dTK5 R7G p56
related: FQAi Nxv 4VZ
related: rKtM WWL WCK
related: kM3U u4d ApJ
related: z3v2 Z4t CA2
related: Ddz9 bNV nbY
related: vdVs wpE JSv
related: zxxJ VTR hpo
related: bCHJ RTc sVi
related: 7S6x Nic TFv
related: LShp t9S Cc6
related: gYpc sKH 3uL
related: ikTr 8Sw jNn
related: mBmm gfH wXb
related: WtpN icG D61
related: dYog aJL kok
related: 4RmJ wiU N4k
related: i7AP ut3 TKX
related: xGEc fZi Zf3
related: euH8 yAp hiG
related: 2a2s bSc MrV
related: dwm2 1V3 MpP
related: 3ss3 e8D Nsx
related: H5KZ roq acH
related: qfkh ZRK w4W
related: 4qp4 uxR 7P9
related: xNyv PTi fSa
related: bN1e YZo pHh
related: uLhB Tto EJ2
related: KoMU LJN 94D
related: 28YD XEz LJV
related: FiV2 Gk2 bG9
related: yQcc fTn JL5
related: zZmK VPd WD8
related: b28z 7oo rKZ
related: mz5y hoY H7C
related: iZ4m kWK A5a
related: VBn4 Qqi CHB
related: nVJB JB5 rr5
related: S41p YGq Ndi
related: Ui74 HEu Kkf
related: XLL7 jMP PDm
related: 2mAa CUX vKr
related: wWte 6Xd fmQ
related: paEM G5u oz6
related: addJ 1sK pDn
related: x2P4 2XP SSX

Ambassadör
type: Concept
in scheme: JobTech Taxonomy - Yrke
definition: Ambassadör
broader: General-, landstings- och kommundirektörer m.fl.
related: bh3H Y3h 5eD
broad match: C1112

Avdelningschef, kommun
type: Concept
in scheme: JobTech Taxonomy - Yrke
definition: Avdelningschef, kommun
broader: Förvaltnings- och planeringschefer
related: igt6 iSd JVB
related: pTNB UBX yPc
related: X82t awd Qyc
related: YcNK M7P Hos
related: epLc SkD cbT
related: bh3H Y3h 5eD
related: qAwR ic5 CHb
broad match: C1213

Chefer inom utbildning
type: Concept
in scheme: JobTech Taxonomy - Yrke
definition: Chefer inom utbildning
broader: Chefsyrken
narrower: Chefer inom grund- och gymnasieskola samt vuxenutbildning
narrower: Chefer inom förskoleverksamhet
narrower: Övriga chefer inom utbildning

Golvläggare
type: Concept
in scheme: JobTech Taxonomy - Yrke
definition: Golvläggare arbetar med att installera ytskikt av olika material som trä, plast, textil, linoleum, klinkers och gummi på golv och väggar. De ansvarar för både underarbete, som slipning och spackling, samt det slutliga golvmaterialet, vilket kräver kunskap i olika arbetsmetoder. Ett viktigt arbetsområde är våtrum där golvläggaren installerar vattentäta plastmattor på golv och väggar, vilket kräver särskild hantverksskicklighet för att skapa täta skarvar. Golvläggaren kan ansöka om sitt yrkesbevis efter teoretisk grundutbildning och lärlingsanställning. Källa: Arbetsförmedlingen
broader: Golvläggare
related: wnba 8FP Trz
related: j7Cq ZJe GkT
related: mR43 htS aGU
related: ja7J P8X YC9
related: u6AV hMy D5Q
broad match: C7122

Skorstensfejartekniker
type: Concept
in scheme: JobTech Taxonomy - Yrke
definition: Skorstensfejartekniker utför lagstadgade brandskyddskontroller och besiktningar av eldstäder och rökkanaler. Skorstensfejarteknikern har en vidareutbildning och minst tre års yrkeserfarenhet som skorstensfejare. Andra arbetsuppgifter är att ge information och rådgivning kring hur nya eldstäder och rökkanaler ska placeras. Arbetet sker ute hos kunder varför körkort vanligtvis är ett krav. Källa: Sveriges skorstensfejaremästares Riksförbund, Myndigheten för samhällsskydd och beredskap, Arbetsförmedlingen
broader: Skorstensfejare
related: whao Q6A ScE
related: s3rq w7x CcD
broad match: C7133

Informationsassistent
type: Concept
in scheme: JobTech Taxonomy - Yrke
definition: Informationsassistent
broader: Informatörer, kommunikatörer och PR-specialister
related: zNZj sAc Nn6
related: ydTF 7S2 N5p
related: X82t awd Qyc
related: vwxR MbC XjW
related: F5XQ GC6 WQY
broad match: C2432
broad match: C3343

Idrottsdomare
type: Concept
in scheme: JobTech Taxonomy - Yrke
definition: Idrottsdomare dömer i idrottstävlingar enligt gällande regelverk och främjar rättvisa tävlingsförhållanden. Arbetsuppgifterna inkluderar bedömning av regelbrott, tolkning och tillämpning av regler samt samverkan med tävlingsledare och deltagare. Idrottsdomare förbereder sig genom utbildning och regeluppdateringar för att säkerställa korrekt dömande. Källa: Arbetsförmedlingen
broader: Idrottstränare och instruktörer m.fl.
related: a2f9 YdN 6jk
related: MVqp eS8 kDZ
related: 7feh PgR gvW
related: 7BgM 4mV n65
related: EwuR wxw qo3
broad match: C3422

Make-up artist
type: Concept
in scheme: JobTech Taxonomy - Yrke
definition: Make-up artister sminkar kunder för olika tillfällen som fotograferingar, bröllop, scenframträdanden, film eller vardagsbruk. Arbetsuppgifterna inkluderar färganalys, val av produkter, applicering av makeup samt anpassning till ljus och miljö. Make-up artister arbetar ofta i samarbete med fotografer, stylister eller skönhetsterapeuter. Källa: Svenska Estetikers Yrkesförbund, Arbetsförmedlingen
alternative label: MUA
broader: Övriga skönhets- och kroppsterapeuter
related: S799 1dt dvQ
related: 9puE nYg crq
broad match: C5142

Tillskärare
type: Concept
in scheme: JobTech Taxonomy - Yrke
definition: Tillskärare skär delar efter mönster av material som tyg eller läder till klädesplagg eller andra produkter. Utskärningen kan ske manuellt, med industriell bandsåg eller med hjälp av datoriserad tillskärning. Tillskärare kan arbeta inom konfektion, skrädderi, skinnhantverk, teaterkostym eller produktion av måttbeställda plagg. Beroende på arbetsplats arbetar tillskärare både med att tolka färdiga mönster och att skapa mönster. Källa: Stockholms tillskärarakademi, Arbetsförmedlingen
broader: Skräddare och ateljésömmerskor m.fl.
related: PaxQ o1G wWH
broad match: C7532

Tak- och tätskiktsmontör, utan yrkesbevis
type: Concept
in scheme: JobTech Taxonomy - Yrke
definition: Som tak- och tätskiktsmontör gör du hela tätskiktet, först isoleringen, både värmeisolering och fuktskydd, sen täcks taket med papp, plåt eller förtillverkade takelement. Tätskikt monteras på många ställen, från att vara kapillärbrytare i mark till tätning på broar och valv. En tak- och tätskiktsmontör jobbar med material som ska tåla väder och behöver därför ha kunskap om brandventilation, takfönster, gasolbrännare, plåt, papp, takbrunnar och isoleringsmaterial. Källa: BYN
broader: Takmontörer
related: FHDR rx7 DMf
related: j7Cq ZJe GkT
related: ja7J P8X YC9
broad match: C7121

Kopplingstekniker
type: Concept
in scheme: JobTech Taxonomy - Yrke
definition: Kopplingstekniker
broader: Ljus-, ljud- och scentekniker
related: 9puE nYg crq
related: d1Ao 9bY 7Kn
broad match: C3521

Yrken med krav på högskolekompetens eller motsvarande inom ekonomi och förvaltning
type: Concept
in scheme: JobTech Taxonomy - Yrke
definition: Yrken med krav på högskolekompetens eller motsvarande inom ekonomi och förvaltning
broader: Yrken med krav på högskolekompetens eller motsvarande
narrower: Poliser
narrower: Försäkringsrådgivare, företagssäljare och inköpare m.fl.
narrower: Skatte- och socialförsäkringshandläggare m.fl.
narrower: Juristsekreterare, chefssekreterare och institutionssekreterare m.fl.
narrower: Förmedlare m.fl.
narrower: Banktjänstemän och redovisningsekonomer m.fl.

Handläggare, arbetslöshetskassa/Utredare, arbetslöshetskassa
type: Concept
in scheme: JobTech Taxonomy - Yrke
definition: Handläggare och utredare vid arbetslöshetskassor hanterar, bedömer och utreder rätt till arbetslöshetsersättning för medlemmar. Arbetet innebär i huvudsak att samla in och utvärdera information som ligger till grund för beslut om ersättning. Kontinuerlig kontakt sker både skriftligt och muntligt med medlemmar samt med flera externa parter såsom Arbetsförmedlingen och Försäkringskassan. Handläggaren eller utredaren ansvarar dessutom ofta för återkravsärenden där ersättning måste betalas tillbaka. Källa: Sveriges a-kassor, Arbetsförmedlingen
alternative label: Handläggare, arbetslöshetskassa
alternative label: Utredare, arbetslöshetskassa
broader: Socialförsäkringshandläggare
related: guhd NZD cvm
related: np2K ZhZ fu8
related: F1uY pCG yaw
related: X82t awd Qyc
related: 6JVt Xpb sLH
related: WSqU iSC gwy
related: WEVR ou4 whq
related: rpDg ka4 P5w
broad match: C3353

Forskare, medicin
type: Concept
in scheme: JobTech Taxonomy - Yrke
definition: Forskare, medicin
broader: Farmakologer och biomedicinare
related: kJeN wmw 9wX
related: NYW6 mP6 vwf
related: esAo 5sX FPv
broad match: C2131

Marknadsplanerare
type: Concept
in scheme: JobTech Taxonomy - Yrke
definition: Marknadsplanerare
broader: Marknadsanalytiker och marknadsförare m.fl.
related: RPTn bxG ExZ
related: hHQV c49 ru2
related: KaFo ymm 7mJ
related: 4XyY MCb svG
related: Axmh JPX s7N
broad match: C2431

Specialistläkare, onkologi
type: Concept
in scheme: JobTech Taxonomy - Yrke
definition: Specialistläkare, onkologi är en specialiserad legitimerad läkare med en djupare kunskap och kompetens inom sitt område. Specialistläkare är en skyddad titel och bara den som har bevis om specialistkompetens får kalla sig specialist i sin specialitet. Specialistläkare ansvarar för att diagnostisera, behandla och förebygga sjukdomar inom sin specialitet. Vanliga arbetsuppgifter är mottagningsarbete med patientbesök, rondarbete på avdelning, handledning av yngre läkare samt konsultationer till andra yrkesgrupper och specialiteter. Specialistläkare ansvarar även för att följa och leda utvecklingen inom sitt medicinska område och utför omfattande medicinsk dokumentation och administration. Källa: Arbetsförmedlingen, Karolinska Institutet, Socialstyrelsen, Sveriges Kommuner och Regioner, Sveriges läkarförbund
broader: Specialistläkare
related: NYW6 mP6 vwf
related: qSbw XHD Ycd
related: TChC u37 rt2
related: EBX9 7gC eLt
related: vFjb AHi a54
related: jFHU uSj 4ke
related: KALC VvK 17U
related: QSeQ MpU wpW
related: 89LR AwA UqR
broad match: C2212

Truckförare
type: Concept
in scheme: JobTech Taxonomy - Yrke
definition: Använder truck eller liknande fordon som transporterar, lyfter, lastar, lossar och staplar gods. Hit hör inte Hamnarbetare/Stuveriarbetare (9331) Lagerarbetare (4322) Teleskoptruckförare, anläggning (8342) Terminalarbetare (4322)
broader: Maskinförare
related: swdt CX9 tHZ
related: oYDh d6r cSu
related: Ahfa KuY 4HZ
related: pGts PKK c8W
related: HeXq amc ABd
related: Zk4h jP4 e85
related: ijHY aHk ADE
related: tKd2 9Ei PTQ
related: vRUW 21M 5Eg
related: zf1U Xnn g1Z
related: hoV7 upN Q26
related: oKRb tGE xJF
related: CiMi 7ax tXs
related: 8pHc Lqc QxD
related: KwWd Ffq 2kE
related: E98A 6gA wC5
related: C8344
narrower: Truckförare
narrower: Traktorförare, industri
narrower: Teleskoptruckförare
broad match: ASGV zcE bWf

Processoperatörer, trä- och pappersindustri
type: Concept
in scheme: JobTech Taxonomy - Yrke
definition: Processoperatörer, trä- och pappersindustri
broader: Process- och maskinoperatörer
narrower: Processoperatörer, pappersmassa
narrower: Operatörer inom sågverk, hyvleri och plywood m.m.
narrower: Processoperatörer, papper
narrower: Maskinoperatörer inom ytbehandling, trä

Bibliotekschef
type: Concept
in scheme: JobTech Taxonomy - Yrke
definition: Bibliotekschef
broader: Övriga chefer inom samhällsservice
related: epLc SkD cbT
related: bh3H Y3h 5eD
related: 9puE nYg crq
related: mFnA tBX WrA
related: pR9e Ldj wVy
related: nfto dWr ZKm
broad match: C1349

Penningmarknadsmäklare
type: Concept
in scheme: JobTech Taxonomy - Yrke
definition: Penningmarknadsmäklare handlar med räntebärande värdepapper såsom statsskuldväxlar, certifikat och obligationer på penningmarknaden. Arbetsuppgifterna inkluderar köp och försäljning av dessa värdepapper för kunders räkning, marknadsbevakning, analys av ekonomiska indikatorer samt kontakt med kunder och andra aktörer på finansmarknaden. Penningmarknadsmäklare följer löpande förändringar i räntor och marknadsförhållanden för att optimera affärer och investeringar. Rollen innefattar också att upprätthålla affärsrelationer och samverka med andra finansiella aktörer. Källor: Arbetsförmedlingen, Skolverket
broader: Mäklare inom finans
related: RbsF qLv jeg
related: ko73 YTm fVb
related: Ejbu Qtg Hnm
related: RPTn bxG ExZ
related: X82t awd Qyc
broad match: C3311

Chefsjurist
type: Concept
in scheme: JobTech Taxonomy - Yrke
definition: Chefsjurist
broader: Förvaltnings- och organisationsjurister
related: cmaA rEb LHm
related: X82t awd Qyc
related: x4Wi NWW ogB
related: 5BuJ hAH WEU
related: QHr7 Bu3 UmD
broad match: C2619

Byggnadssmed
type: Concept
in scheme: JobTech Taxonomy - Yrke
definition: Byggnadssmeder tillverkar, reparerar och installerar stålkonstruktioner och byggnadsdetaljer. Man arbetar främst vid bygg- och industriprojekt. Arbetsuppgifterna kan förutom tillverkning även innefatta montering, svetsning, mekaniska arbeten och underhåll. Arbetet utförs oftast enligt ritning. Förutom stålkonstruktioner kan man även arbeta med tillverkning och installation av byggnadsdetaljer så som räcken, trappor, balkonger och grindar. Källa: Arbetsförmedlingen
broader: Smeder
related: rYMg ViC U1M
related: V3Lq bnR 81K
related: PaxQ o1G wWH
related: GG51 GRK VZD
broad match: C7221

Biblioteksassistent
type: Concept
in scheme: JobTech Taxonomy - Yrke
definition: Biblioteksassistent arbetar med administrativa uppgifter på bibliotek. Arbetet går i huvudsak ut på att stötta bibliotekarier i den dagliga verksamheten på bibliotek. Arbetsuppgifterna omfattar att ordna och låna ut böcker och andra medier, registrera och katalogisera material, samt hjälpa besökare med informationssökning och enklare referensfrågor. Biblioteksassistenter kan även ansvara för skötsel av teknisk utrustning och delta i aktiviteter och evenemang på biblioteket. Beroende på arbetsplats kan man inrikta sig, till exempel mot barn- och ungdomslitteratur eller flerspråkighetsfrågor. Källa: Svensk Biblioteksförening, Arbetsförmedlingen
broader: Arkiv- och biblioteksassistenter m.fl.
related: Jm2B 1RH x9o
related: N8nZ QNB 8Bh
related: X82t awd Qyc
related: rtcH n8Z hiX
related: UxiQ Qwe TMB
related: X67w bmm QFR
related: 1hbU KBo FV9
related: SmHu VpS CYb
related: n4Ek Tpt RQP
broad match: C4411

Förvaltningsdirektör, statlig
type: Concept
in scheme: JobTech Taxonomy - Yrke
definition: Förvaltningsdirektör, statlig
broader: General-, landstings- och kommundirektörer m.fl.
related: jDiH 7ya igy
related: epLc SkD cbT
related: bh3H Y3h 5eD
related: AFkf miw P6T
related: 3tb8 eDp 31q
broad match: C1112

Attributör
type: Concept
in scheme: JobTech Taxonomy - Yrke
definition: Attributör arbetar med att organisera, märka och hantera rekvisita och attribut vid produktioner inom teater, film och TV. Vanliga arbetsuppgifter är samordna och placera ut rekvisita enligt scenografens och produktionsledningens instruktioner, hålla ordning på materialet samt säkerställa att allt är korrekt anpassat till produktionens behov och tidsepok. Vanligt är även arbete med inventering, reparation och förvaring av rekvisita. Källa: Arbetsförmedlingen, Kulturakademin, Voodoo Film
broader: Inspicienter och scriptor m.fl.
related: 8too bEs 7NU
related: 9puE nYg crq
related: 8X2V E31 Cmi
broad match: C3435

Musikbibliotekarie
type: Concept
in scheme: JobTech Taxonomy - Yrke
definition: Musikbibliotekarie
broader: Bibliotekarier och arkivarier
related: D6zC nPP 22M
related: 9puE nYg crq
broad match: C2622

Informationsmäklare
type: Concept
in scheme: JobTech Taxonomy - Yrke
definition: Informationsmäklare
broader: Bibliotekarier och arkivarier
related: RPTn bxG ExZ
related: D6zC nPP 22M
related: 9puE nYg crq
broad match: C2622

Meteorolog
type: Concept
in scheme: JobTech Taxonomy - Yrke
definition: Meteorolog
broader: Meteorologer
related: kJeN wmw 9wX
related: hsSg K12 c5t
broad match: C2112

Sjuktransportör
type: Concept
in scheme: JobTech Taxonomy - Yrke
definition: Sjuktransportörer utför sittande och liggande transporter av patienter som har ett vårdbehov men inte kräver ambulans. Arbetet innebär att köra sjuktransportfordon och transportera patienter mellan sjukhus, vårdinrättningar och bostäder, ibland även längre sträckor. Sjuktransportörer arbetar självständigt men samarbetar ofta med ambulanssjukvården, särskilt vid förflyttningar och akuta larm där första hjälpen kan behöva ges i väntan på ambulans. Källa: Arbetsförmedlingen
broader: Ambulanssjukvårdare
related: NYW6 mP6 vwf
related: URRW c9p RLm
related: Dv4T zK3 jn1
broad match: C3258

Funktionschef, offentlig förvaltning
type: Concept
in scheme: JobTech Taxonomy - Yrke
definition: Funktionschef, offentlig förvaltning
broader: Övriga chefer inom samhällsservice
related: epLc SkD cbT
related: bh3H Y3h 5eD
broad match: C1213
broad match: C1349

Besiktningstekniker, fordon
type: Concept
in scheme: JobTech Taxonomy - Yrke
definition: En besiktningstekniker kontrollerar fordon för att se till att de uppfyller säkerhets- och miljökrav. Detta innebär att de utför tekniska kontroller av bromsar, styrning, belysning, avgassystem och andra viktiga komponenter. De arbetar ofta på bilprovningar och har kundkontakt, vilket kräver god servicekänsla. En Besiktningstekniker måste vara certifierad. Källa: Arbetsförmedlingen, Transportstyrelsen
broader: Säkerhetsinspektörer m.fl.
related: QAf1 r6S 1Gy
related: E7hm BLq fqZ
related: 8dts Xo8 6Yd
related: ifu8 Sui fUM
related: yhCP AqT tns
related: kDNx z5C AmY
related: 53fx CEq WZ5
related: FFDY GsV Fr1
broad match: C3115

Eventsäljare och butiksdemonstratörer m.fl.
type: Concept
in scheme: JobTech Taxonomy - Yrke
definition: Marknadsför, säljer och informerar om tjänster och produkter på exempelvis mässor, köpcentra och butiker. Visar kläder för återförsäljare, press och allmänhet på modevisningar. Poserar för exempelvis reklambilder eller tidningsreportage. Poserar för målare, skulptörer och konstskolor.
broader: Eventsäljare och telefonförsäljare m.fl.
related: 7Wwm JuJ ANq
related: nea3 HCX 9xn
related: C5243
related: omEV 6wT 8eP
related: 8aBi 6xp ZXB
related: MZXu MYV 9U3
related: E2tb 3Ba cUF
related: i7kk zcd MiW
related: 4oKa e7b oHW
related: TrZs mJJ fRS
related: C5241
related: nrka uKP 6QT
related: 8PbH ED5 C9s
related: wCFY QTb ioY
related: C5242
related: LCjH 3Fz riz
related: T6dP jn2 7tx
narrower: Eventförsäljare
narrower: Modell
narrower: Produktdemonstratör
narrower: Hemförsäljare
broad match: RPTn bxG ExZ

Regionchef, skogsbruk
type: Concept
in scheme: JobTech Taxonomy - Yrke
definition: Regionchef, skogsbruk
broader: Förvaltare inom skogsbruk och lantbruk m.fl.
related: epLc SkD cbT
related: bh3H Y3h 5eD
related: VuuL 7CH adj
broad match: C1311

Drift-, support- och nätverkstekniker m.fl.
type: Concept
in scheme: JobTech Taxonomy - Yrke
definition: Drift-, support- och nätverkstekniker m.fl.
broader: Yrken med krav på högskolekompetens eller motsvarande inom IT, ljud- och ljusteknik m.m.
narrower: Webbmaster och webbadministratörer
narrower: Supporttekniker, IT
narrower: Nätverks- och systemtekniker m.fl.
narrower: Drifttekniker, IT
narrower: Systemadministratörer

Barnsjuksköterskor
type: Concept
in scheme: JobTech Taxonomy - Yrke
definition: Vårdar och behandlar sjuka och skadade barn och ungdomar inom akutsjukvård, barnmedicin, barnkirurgi, spädbarnsvård eller på barnavårdscentral. Ger råd och stöd till föräldrar samt genomför hälsokontroller.
broader: Sjuksköterskor (fortsättning)
related: kmf7 TgZ WWb
related: NbjJ WBY FoA
related: 4QAE wtY gJh
related: C1qR L83 nzh
related: kXEj s4x ATw
related: 9Fna GUm HWL
related: ckhF ACN GqU
related: Mmxs Qrv cpG
related: fAqU cCM mJz
related: 1eKe zFj QAa
related: Hgww z4B Tyg
related: dJa5 Nao mDS
related: Lqnz Zqw nQ9
related: eThQ HCv mY6
related: F7nJ k5s L29
related: Ektq nPz 4YF
related: LMx4 LbA vxB
related: wBPu wTW RgG
related: MR4H FFT mTj
related: 2GuF gtz xfW
related: rF7s hX1 ECH
related: rVUL AgV ZTH
related: C2221
related: GYz6 5Jt Wmy
related: 5Kym 2ad Pqi
related: jxKr BmN CcQ
related: pGBH BkG qJa
related: qkyH MC1 YKU
related: yV9B PxJ TxS
related: 47LN 8Ac dX8
narrower: Barnsjuksköterska
broad match: NYW6 mP6 vwf

Maskinoperatör kabeltillverkning
type: Concept
in scheme: JobTech Taxonomy - Yrke
definition: En maskinoperatör inom kabeltillverkning ansvarar för att köra och underhålla maskiner som används vid tillverkningen av kablar. Detta kan innebära att man hanterar råmaterial, styr maskiner för extrudering, svetsning eller andra processer som ingår i kabeltillverkningen. Källa: Arbetsförmedlingen, diverse jobbannonser
broader: Övriga maskin- och processoperatörer vid stål- och metallverk
related: wTEr CBC bqh
broad match: C8121

Konstruktör, textil, trä, glas, förpackningar
type: Concept
in scheme: JobTech Taxonomy - Yrke
definition: Konstruktör, textil, trä, glas, förpackningar
broader: Övriga ingenjörer och tekniker
related: 6Hq3 tKo V57
related: KWNv oWK 5E2
related: C41S vox 2gE
related: 4ExV Yn6 Zmb
broad match: C3119

Gruvbyggare
type: Concept
in scheme: JobTech Taxonomy - Yrke
definition: Gruvbyggare
broader: Träarbetare, snickare m.fl.
related: DTMn NVu syb
related: j7Cq ZJe GkT
broad match: C7111

Doktorander
type: Concept
in scheme: JobTech Taxonomy - Yrke
definition: Forskar inom ett ämnesområde. Medverkar i undervisning inom grundutbildning. Hit hör inte Doktorand som bedriver sitt forskningsarbete utanför högskolan (ingår i yrke inom respektive inriktning)
broader: Universitets- och högskolelärare
related: snfZ N1g wrT
related: ddzL 9as rZt
related: 9Ra9 2yh jH4
related: Zffc M4R Gws
related: C2310
related: 5hrX ckd X8x
related: uwXg zmB Pdk
related: 9wjT WBC ppy
related: xE6k qAE vrk
related: pamn k5z ByJ
related: LswY aiM UT8
related: 9kKp C7D Qme
related: ppnH 9N4 FE2
related: QEfk 7p4 yCb
narrower: Doktorand
broad match: MVqp eS8 kDZ

Övriga chefer inom övrig servicenäring
type: Concept
in scheme: JobTech Taxonomy - Yrke
definition: Formulerar och ansvarar för mål och strategier för verksamhet inom övriga servicenäringar t.ex. camping och resebyrå. Utformar riktlinjer, följer upp och utvärderar verksamheten mot uppsatta mål. Svarar för budget samt fördelar resurserna inom verksamheten. Har personalansvar.
broader: Övriga chefer inom övrig servicenäring
related: s5SS 7bW 1Gh
related: C1439
related: aRzT 1Y9 tqq
related: moSc 5RL aYx
related: NLqJ fvZ eML
related: aBcd BQi Qyd
related: YS7V c8n MrS
related: BBb8 NqE 3Tg
related: UH9g R5v MCx
related: SmZd Jaa BeY
related: 29MP yhF mjx
related: 8tYq EXD Xwm
related: ZzN5 m7B 5CY
related: iWwC z2e Euo
related: Nksx 4oe fEQ
related: eThQ HCv mY6
related: ZxKX dN4 8DJ
related: 2wd8 VUk YSq
related: Gt5f wdi FSJ
related: jnLy 6Ns KpH
related: q7Mx gjU F9q
related: zXNU zXR hGd
related: Betk ZCh mY9
related: Njjp yXP 1QV
narrower: Verkstadschef/Servicechef fordon
narrower: Resebyråchef
narrower: Turistbyråchef
narrower: Stationschef, bilprovning
broad match: bh3H Y3h 5eD

Skyltmontör
type: Concept
in scheme: JobTech Taxonomy - Yrke
definition: Skyltmontörer monterar, demonterar och underhåller skyltar. Skyltmontörer monterar, demonterar och underhåller skyltar, exempelvis på fasader och tak. Beroende på arbetsplats kan även tillverkning av skyltar förekomma. Arbete på hög höjd och utomhus är vanligt. Källa: Arbetsförmedlinge
broader: Övriga montörer
related: wTEr CBC bqh
broad match: C8219

Fastighetsjurist
type: Concept
in scheme: JobTech Taxonomy - Yrke
definition: Fastighetsjurist
broader: Affärs- och företagsjurister
related: aGmW PsY xWQ
related: X82t awd Qyc
related: x4Wi NWW ogB
related: ika3 KEN 4sp
related: uWWi dhz sPq
related: Abcb QtH isZ
broad match: C2619

Stödpedagog
type: Concept
in scheme: JobTech Taxonomy - Yrke
definition: Stödpedagoger arbetar med att stödja personer med kognitiva funktionsnedsättningar genom pedagogiska metoder och samtalsteknik. Arbetsuppgifter omfattar kartläggning av förmågor, upprättande av genomförandeplaner samt att stimulera och uppmuntra till aktivitet, utveckling och delaktighet i vardagen. Rollen innefattar handledning av kollegor, utveckling och implementering av pedagogiska metoder samt samverkan med närstående och andra verksamheter. Stödpedagoger bidrar till en anpassad och meningsfull vardag för brukare, ofta inom LSS-verksamhet, särskilt i boende, daglig verksamhet, skola och äldreboenden. Källa: Arbetsförmedlingen, yrkeshögskoleutbilndingar
broader: Behandlingsassistenter och socialpedagoger m.fl.
related: AXuM dnp 6sL
related: EGp5 cMK Vx5
related: ckwb 96H GPu
related: pGV6 7RA 8V5
related: jWh3 qhF c1x
related: GazW 2TU kJw
related: 1Qt4 jtL YLp
related: gTNZ yLu fX8
related: pvYo LK3 rX1
related: km9U 9tB Lcw
related: pKvn Kxi NRh
related: 24T6 WTo XUw
related: pSre JAY LaX
related: Tuk2 e2a zPf
related: VJeZ mUf Bkx
related: JfFs jKD rc5
related: eL4m 8c4 p8b
related: umMv n3o 4yX
related: 28Qp gxp omp
related: rokB PWz fDF
broad match: C3412

VVS-isolerare
type: Concept
in scheme: JobTech Taxonomy - Yrke
definition: En VVS-isolerare arbetar med att isolera kalla och varma rör och ventilationskanaler i bostäder, kontorsbyggnader och på sjukhus. Det sker både vid nybyggnad och ombyggnad av hus. VVS-isoleraren jobbar ofta på en byggarbetsplats där arbetet sker tillsammans med andra yrkesgrupper, som t.ex. VVS-montörer. VVS-isoleraren får sitt certifikat efter ett branschprov som avslutar lärlingsanställningen och den teoretiska grundutbildning Källa: VVSYN
broader: Isoleringsmontörer
related: j7Cq ZJe GkT
related: ja7J P8X YC9
related: nMhD Mq6 ikX
related: CD3T 7Q4 ghE
related: bw6Z b6G 2Y4
broad match: C7124

Aktuarie/Försäkringsaktuarie/Försäkringsmatematiker
type: Concept
in scheme: JobTech Taxonomy - Yrke
definition: Aktuarie/Försäkringsaktuarie/Försäkringsmatematiker
alternative label: Aktuarie
alternative label: Försäkringsaktuarie
alternative label: Försäkringsmatematiker
broader: Matematiker och aktuarier
related: kJeN wmw 9wX
broad match: C2120

Försäkringstjänsteman
type: Concept
in scheme: JobTech Taxonomy - Yrke
definition: Försäkringstjänsteman
broader: Försäkringssäljare och försäkringsrådgivare
related: X82t awd Qyc
related: 7vd4 q34 2Wg
broad match: C3321

Försäkringsutredare
type: Concept
in scheme: JobTech Taxonomy - Yrke
definition: Försäkringsutredare
broader: Skadereglerare och värderare
related: X82t awd Qyc
broad match: C3315

Platschef, bygg
type: Concept
in scheme: JobTech Taxonomy - Yrke
definition: En Platschef inom bygg ansvarar för projektets planering och genomförande enligt kontrakt och bygghandlingar. Platschefens ansvar inkluderar resurshantering, kvalitetssäkring och arbetsmiljö Platschefen fungerar som länken mellan projektledning och arbetslag, vilket kräver både teknisk kompetens och ledarskapsförmåga. Källa: Arbetsförmedlingen
broader: Driftchefer inom bygg, anläggning och gruva
related: vawN RYp jXH
related: m18Q FKi sts
related: X7Nf BMY st6
related: j7Cq ZJe GkT
related: epLc SkD cbT
related: bh3H Y3h 5eD
related: SfdY 3hg yAv
related: ja7J P8X YC9
related: eiaN kMx 3AX
broad match: C1323

Produktionsledare, tillverkningsindustri
type: Concept
in scheme: JobTech Taxonomy - Yrke
definition: Produktionsledare inom tillverkningsindustri leder, planerar och följer upp produktionen. Ansvarsgraden varierar mellan arbetsplatser, från mer arbetsledande till mer processamordnande arbetsuppgifter. Till exempel kan produktionsledaren som arbetsledare delta i produktionen, så som vid mekanisk verkstad, med arbetsledning och schemaläggning som huvudsakliga arbetsuppgifter. Produktionsledaren kan även ha ansvar för bland annat underhåll av utrustning, produktionsprocess och regelefterlevnad, då ofta vid med automatiserad tillverkning. Källa: Arbetsförmedlingen
broader: Ingenjörer och tekniker inom maskinteknik
related: 6Hq3 tKo V57
related: WmFT DFD LCa
related: R11C X2e BA6
related: JGRM fUi L4H
related: JJei qry K46
related: FBYq Nvi 7pn
related: 9aEn jPz gJs
related: Yvc5 Bfb 5nN
related: yeHf j1S Vmw
related: RBGx z2m RjE
related: 5MeH 74b U4S
related: 1VJT K8u wGd
related: qyNG wPC QWd
broad match: C3115

Teatertekniker/Scentekniker
type: Concept
in scheme: JobTech Taxonomy - Yrke
definition: Teatertekniker/Scentekniker
alternative label: Scentekniker
alternative label: Teatertekniker
broader: Ljus-, ljud- och scentekniker
related: tEgN G8q Xqw
related: od5V 6H6 nPQ
related: g8q1 ehX 1tS
related: 8too bEs 7NU
related: 9puE nYg crq
related: yhCP AqT tns
related: d1Ao 9bY 7Kn
broad match: C3435

Forskningsingenjör, el-tele
type: Concept
in scheme: JobTech Taxonomy - Yrke
definition: Forskningsingenjör, el-tele
broader: Civilingenjörsyrken inom elektroteknik
related: 6Hq3 tKo V57
related: kDRm Yaa jAB
broad match: C2153

Forskare, mikroelektronik
type: Concept
in scheme: JobTech Taxonomy - Yrke
definition: Forskare, mikroelektronik
broader: Civilingenjörsyrken inom elektroteknik
related: 6Hq3 tKo V57
related: kDRm Yaa jAB
broad match: C2152

Gipstekniker
type: Concept
in scheme: JobTech Taxonomy - Yrke
definition: Gipstekniker lägger gips på patienter med olika typer av skador. Gipstekniker är ofta undersköterskor med utbildning inom gipsteknik. Vanliga arbetsplatser är ortopedmottagningar. Källa: Sveriges Kommuner och Regioner, Arbetsförmedlingen
broader: Övrig vård- och omsorgspersonal
related: NYW6 mP6 vwf
broad match: C5329

Regionjurist
type: Concept
in scheme: JobTech Taxonomy - Yrke
definition: Regionjurist
broader: Förvaltnings- och organisationsjurister
related: uXRL uqV NeQ
related: X82t awd Qyc
related: x4Wi NWW ogB
related: TMpS uH7 9TF
related: Abcb QtH isZ
broad match: C2619

1:e Fartygsingenjör
type: Concept
in scheme: JobTech Taxonomy - Yrke
definition: Förste fartygsingenjör är ansvarig för planeringen av fartygets underhållsarbete av den tekniska utrustningen samt brandutrustningen. Förste fartygsingenjör ansvarar och organiserar inköp av reservdelar och förbrukningsmaterial för maskinavdelningen. Förste fartygsingenjör arbetsleder maskinmanskapet. Behörigheter inom sjöfart såsom certifikat och behörighetsbevis som krävs för olika befattningar ombord och som styrs av, typ av fartyg, finns samlade i Transportstyrelsens behörighetsguide Källa: Satsa på sjöfart
broader: Maskinbefäl
related: Ymq7 RK4 91T
related: dRFw Rcu dX7
related: zeu9 EPS rGu
related: cKfM cJv Wma
related: gs65 ynn fcr
related: ASGV zcE bWf
related: XouD cCj HZN
related: isig f6Z rjG
related: vAiA oHN cgK
related: e8bK e4P 25L
broad match: C3151

Fartygsbefäl
type: Concept
in scheme: JobTech Taxonomy - Yrke
definition: Ett Fartygsbefäl har det yttersta ansvaret för besättningen, passagerarna och lasten. Fartygsbefälet har högst ställning på fartyget. Arbetsuppgifterna skiljer sig beroende på vilken sorts befälhavare man är, hur stort fartyget är, hur stor besättningen är och vilken last fartyget har. Som befälhavare har man också många administrativa uppgifter, har möten med andra chefer ombord, delegerar uppgifter och fattar beslut. Behörigheter inom sjöfart såsom certifikat och behörighetsbevis som krävs för olika befattningar ombord och som styrs av, typ av fartyg, finns samlade i Transportstyrelsens behörighetsguide Källa: Framtid
broader: Fartygsbefäl m.fl.
related: fioD 62h cEd
related: dRFw Rcu dX7
related: fmCS 7n9 DqW
related: gs65 ynn fcr
related: ASGV zcE bWf
related: XouD cCj HZN
related: jnZw Xkp eGZ
related: A7N3 idr m5z
related: gthF y5Z j3Z
related: vSAt THv Rvv
broad match: C3152

Presschef
type: Concept
in scheme: JobTech Taxonomy - Yrke
definition: Presschef
broader: Informations-, kommunikations- och PR-chefer
related: epLc SkD cbT
related: bh3H Y3h 5eD
broad match: C1222

Specialistläkare, arbets- och miljömedicin
type: Concept
in scheme: JobTech Taxonomy - Yrke
definition: Specialistläkare, arbets- och miljömedicin är en specialiserad legitimerad läkare med en djupare kunskap och kompetens inom sitt område. Specialistläkare är en skyddad titel och bara den som har bevis om specialistkompetens får kalla sig specialist i sin specialitet. Specialistläkare ansvarar för att diagnostisera, behandla och förebygga sjukdomar inom sin specialitet. Vanliga arbetsuppgifter är mottagningsarbete med patientbesök, rondarbete på avdelning, handledning av yngre läkare samt konsultationer till andra yrkesgrupper och specialiteter. Specialistläkare ansvarar även för att följa och leda utvecklingen inom sitt medicinska område och utför omfattande medicinsk dokumentation och administration. Källa: Arbetsförmedlingen, Karolinska Institutet, Socialstyrelsen, Sveriges Kommuner och Regioner, Sveriges läkarförbund
broader: Specialistläkare
related: NYW6 mP6 vwf
related: qSbw XHD Ycd
related: TChC u37 rt2
related: yeHC S3x i7V
related: EBX9 7gC eLt
related: vFjb AHi a54
related: jFHU uSj 4ke
related: KALC VvK 17U
related: QSeQ MpU wpW
related: 89LR AwA UqR
broad match: C2212

Forskare, bioteknik
type: Concept
in scheme: JobTech Taxonomy - Yrke
definition: Forskare, bioteknik
broader: Cell- och molekylärbiologer m.fl.
related: kJeN wmw 9wX
related: e1WV Q1x eUu
related: pqLg 6hG iTt
related: TXx8 Mgv BGZ
broad match: C2131

Plastmaskinställare
type: Concept
in scheme: JobTech Taxonomy - Yrke
definition: Plastmaskinställare inom plastindustri ställer in och kör maskiner för tillverkning av plastprodukter. Arbetet innebär i huvudsak att rigga och köra verktyg i formsprutningsmaskiner enligt tekniska ritningar och enligt föreskriven standard. I ställarbetet ingår även programmering av maskiner och industrirobotar. Utöver att köra maskiner ingår ofta att kontrollera kvalitet, dokumentation, förebyggande underhåll och felsökning. I arbetet ingår att samverka med plastmaskinoperatör och formsprutningsprocesstekniker när eventuella fel i processen uppstår. Källa: Polymercentrum
broader: Maskinoperatörer, plastindustri
related: EQvg Wyo rLN
related: AYgK E23 xTy
related: wTEr CBC bqh
broad match: C8142

Nätverkstekniker
type: Concept
in scheme: JobTech Taxonomy - Yrke
definition: En nätverkstekniker är en IT-specialist som ansvarar för att planera, installera, konfigurera, underhålla och felsöka datornätverk inom företag och organisationer. Nätverksteknikern installerar och konfigurerar nätverksutrustning som routrar, switchar, brandväggar och trådlösa accesspunkter. Felsöker och åtgärdar nätverksproblem och driftstörningar för att minimera avbrott och säkerställa hög driftsäkerhet. Nätverksteknikern implementerar och upprätthåller nätverkssäkerhet genom att hantera brandväggar, VPN-lösningar och säkerhetsprotokoll för att skydda mot intrång och cyberhot. Källa: Arbetsförmedlingen, Wise It
broader: Nätverks- och systemtekniker m.fl.
related: psYq Yvu hzv
related: RfK2 Edi LE1
related: HqKZ krP kPD
related: 4etY Who 5Gh
related: YXsj RBj pzH
related: CqFF CqM J8x
related: 8w1w dJh juE
related: 6MEA uVc J1C
related: ngLT 46H gS7
related: vvuA CeN uR8
related: apaJ 2ja LuF
related: h9KW 298 QRF
related: UpTg ayK 9pK
related: ZqNP v1U fPj
related: 5mjn yqj d9e
related: QG7p MQ4 zf2
related: xqnR gzH PJW
related: 5ZR1 7Qd uwv
related: o6s5 i9r C38
broad match: C3513

Animatör
type: Concept
in scheme: JobTech Taxonomy - Yrke
definition: Animatör skapar rörelse och liv i digitala figurer, objekt och miljöer inom film, spel, reklam och digitala medier. Vanliga arbetsuppgifter är att animera karaktärer och miljöer samt designa rörelser och uttryck, ofta i samarbete med regissörer, producenter och programmerare för att skapa sekvenser som kan användas i olika digitala plattformar. Källa: Arbetsförmedlingen
broader: Designer inom spel och digitala medier
related: LeTH FXZ wwm
related: c9m3 KGn sqh
related: oeHg J1V PEg
related: 8hvx UPv QT7
related: yi2E cDe LHC
related: CaXK pev Zim
related: 8too bEs 7NU
related: 9puE nYg crq
related: 3cXx xPF jTX
related: BiL6 Ruv dG9
related: zpdr e4S Zqb
related: zjko mKA n4X
related: GZMm ddo VER
related: sf58 P7c yMZ
broad match: C2166

Murare m.fl.
type: Concept
in scheme: JobTech Taxonomy - Yrke
definition: Uppför byggnadsstommar. Klär väggar med fasadtegel. Murar skorstenar, öppna spisar och kakelugnar. Putsar väggar, tak och fasader samt sätter plattor på väggar och golv. Tillverkar och monterar inredningsdetaljer av gips och gör fasadutsmyckningar. Hit hör inte Stensättare (7114)
broader: Snickare, murare och anläggningsarbetare
related: v3d9 u2H pnf
related: C7123
related: 8bXe Uzh LAP
related: zW2F 3yB qkP
related: 7tTf wHM ob1
related: o7QW 9FB PQ3
related: C7112
related: nuRM zb9 2wV
related: Ytcy v8N P2w
related: aHCV VsV LiD
related: 1zUh Hb7 ozh
related: oDPh qJ8 D5e
related: uLTA TZq Rer
related: Q8TY zw2 UqM
related: PELm cH9 AE9
related: Q7eC B7g QiU
related: uNL7 C1e TK8
related: 2gSM 1G7 hLa
related: bnMZ Nt5 o48
related: M7C1 DAy UTK
related: UYa8 GXf Ajf
related: MSJq Wbm EN9
related: ZphL V8k Bqe
related: oXv5 7ns m3N
related: fhcp fFw Lbj
related: 6VeN XR4 Zuj
related: 7jFS 6oq ZGv
related: 5Gtx bp4 cDg
related: nkhA jPz pcE
related: 4Rpx N4w oFs
related: mFao GXs pcz
related: U1ud XV7 Z8o
related: ynWd oCo o61
related: xeoH rao GgZ
related: p32N VDZ Aif
related: khUc 8j6 Pbz
related: nuMe fEL Nov
related: fhu6 H74 uuN
related: 6BpN oXk 7SL
related: 2j7x TRC sBs
related: qkVR GtC xzr
related: JLte W9s RB9
related: 8UVh Hy8 v5m
related: zBS2 p7d p42
related: WLAi BDr 5fW
related: KfEn V5y npV
related: 5Av7 qB2 msb
related: VYuU 8Bx mxu
related: jzoV 7pi LHP
related: vnHz 5DA bzd
related: njXX ghq cn3
related: JACW 2BP Da7
related: HmXd ehy QT9
related: ZfdB kLT yTk
related: 4y7C Lsh EPM
related: C7122
related: ZzuK jNE XCG
related: VeKg hfK axs
related: t8dE o19 GFz
related: gniY BUH ARG
related: Rigq 3zY T7L
related: nSmi Xbn w8J
narrower: Lärling, plattsättare
narrower: Stuckatör
narrower: Stenmontör, utan yrkesbevis
narrower: Stenmontör
narrower: Lärling, stenmontör
narrower: Murare, utan yrkesbevis
narrower: Plattsättare, utan yrkesbevis
narrower: Murare
narrower: Plattsättare
narrower: Kakelugnsmakare
narrower: Ugnsmurare
narrower: Lärling, murare
broad match: j7Cq ZJe GkT

Kriminalvårdare
type: Concept
in scheme: JobTech Taxonomy - Yrke
definition: Kriminalvårdare arbetar med övervakning och kontroll av intagning vid anstalter, häkten och frivårdskontor inom Kriminalvården. Arbetsuppgifterna innefattar säkerhetskontroller, visitationer, övervakning, frigivningsplanering, stöd och rehabilitering av intagna. Inom frivården utför kriminalvårdare även hembesök och kontroller av elektronisk fotboja samt säkerställer ordning vid frivårdskontor. Stod och rehabilitering av av intagna genom samtal, vägledning och andra åtgärder. Arbetet utförs ofta i arbetslag och kombinerar säkerhetsansvar med ett rehabiliterande förhållningssätt. Källa: Kriminalvården
broader: Kriminalvårdare
related: txdD Y7n XgE
related: E7hm BLq fqZ
related: 6pY4 F4q XiW
related: 5ubt RnS a3S
broad match: C5413

Enhetschef, offentlig förvaltning
type: Concept
in scheme: JobTech Taxonomy - Yrke
definition: En enhetschef inom offentlig förvaltning leder, samordnar och utvecklar en verksamhetsenhet med ansvar för personal, ekonomi, arbetsmiljö och verksamhetens resultat. Rollen är både operativ och strategisk och innebär att säkerställa att enhetens arbete bedrivs enligt lagar, riktlinjer och politiska beslut. I arbetsuppgifterna ingår att leda, planera och följa upp enhetens dagliga och långsiktiga arbete utifrån uppdrag och mål samt skapa goda arbetsförutsättningar, motivera och engagera medarbetare samt arbeta för en hållbar och trygg arbetsplats. Källa: Arbetsförmedlingen, div jobbannonser
broader: Förvaltnings- och planeringschefer
related: cj3J wNk YV7
related: igt6 iSd JVB
related: epLc SkD cbT
related: hSk3 cbA mit
related: bh3H Y3h 5eD
related: uzf1 Hjk Yy1
related: qaVt F8N o8L
related: 4Nhm hdS wkw
broad match: C1213

Massör
type: Concept
in scheme: JobTech Taxonomy - Yrke
definition: Massörer behandlar kroppens mjukdelsvävnader genom massage och muskeltöjningar. Massage kan ges både i friskvårdande och förebyggande syfte med att förebygga muskelspänningar som skulle kunna förorsaka skador och problem vid senare tillfälle. Som massör kan du utbilda dig vidare till massageterapeut och till medicinsk massageterapeut Källa: Kroppsterapeuternas Yrkesförbund
broader: Massörer och massageterapeuter
related: EC9N bFh wo2
related: JkXt mZk 7X5
related: Uuf1 GMh Uvw
related: 7MES mkH hm1
related: e3Gc mA8 Mda
broad match: C3255

Nämndsekreterare
type: Concept
in scheme: JobTech Taxonomy - Yrke
definition: Nämndsekreterare ger administrativt stöd till nämnders arbete inom kommuner. Arbetsuppgifter innefattar att planera, förbereder och dokumenterar nämndernas sammanträden samt säkerställer att beslutsunderlag är kompletta och skickas ut i tid till ledamöter. Rollen innefattar att skriva protokoll, hantera ärenden och verka för att nämndens arbete sker enligt gällande lagar och regelverk, såsom kommunallagen och offentlighetsprincipen. Nämndsekreterare fungerar som stöd för politiker och tjänstemän i frågor om rutiner och regelverk och hanterar även inkommande frågor kopplade till nämndens ansvarsområden. Källa: Arbetsförmedlingen
broader: Övriga handläggare
related: Q2k2 gZC AiF
related: 3mzn ieL YpB
related: X82t awd Qyc
related: GGqZ 6Ew 5Ha
related: 2fb8 k6z oSv
broad match: C3343

Maskinoperatör gummiindustri
type: Concept
in scheme: JobTech Taxonomy - Yrke
definition: Maskinoperatörer inom gummiindustrin arbetar med att sköta och övervaka olika maskiner som tillverkar produkter av gummi. Exempel på produkter är däck, hushållsartiklar eller komponenter till industrin, bland annat till fordonsindustrin. Ofta ingår det i arbetet att kontrollera tillflödet av material i maskinen, åtgärda olika störningar i produktionen och att rapportera in eller reparera maskinerna när det behövs. Beroende på arbetsplats kan truckkörning, lagerarbete och leveransförberedelser även ingå. Källa: Arbetsförmedlingen
broader: Maskinoperatörer, gummiindustri
related: o4r7 AU9 2Wx
related: M2aY xXT txi
related: c6NC 8VW Na4
related: 4vB8 2z4 YVh
related: AHMw qR8 diL
related: wTEr CBC bqh
broad match: C8141

Fibertekniker
type: Concept
in scheme: JobTech Taxonomy - Yrke
definition: Fibertekniker arbetar med installation och underhåll av fibernät för dataöverföring. Arbetet innebär i huvudsak att installera bredbandsanslutningar i fastigheter. Detta inkluderar inkoppling, blåsning, skarvning och svetsning av fiber. Man kan även arbeta med avhjälpande underhåll och sysslar till exempel med mätning och felsökning. Beroende på arbetsplats och specialisering kan man även arbeta med kopparnät, datahallar och 5G. Yrket liknar teletekniker, men där fiberteknikern/fiberinstallatören är mer specialiserad. Källa: Arbetsförmedlingen
broader: Elektronikreparatörer och kommunikationselektriker m.fl.
related: s25f ngU JfL
related: o2Cq Tzh Yyf
related: cbmK j1A 6rN
related: jS1k g2V Vfy
related: ejNE 9VH zKR
related: jcD4 iTH EgY
related: PA32 J4P ANX
related: t5Zo nzf ByW
related: XAA3 Udj Z94
related: 8Ke2 ntA toX
related: hUMq u1s MDF
related: SgED osT 6uA
related: yhCP AqT tns
related: vJ3C yeh jEe
related: J8Do NNh Hiv
related: FCwj uM1 wGD
related: 7Gqk dYu nAk
related: WjPx AQX t7a
related: wxaH Mwt DCg
broad match: C7422

Fönsterputsare
type: Concept
in scheme: JobTech Taxonomy - Yrke
definition: Fönsterputsare arbetar med att rengöra och underhålla fönster och glasytor i privata och kommersiella byggnader. Arbetet innebär i huvudsak att rengöra fönster och glasytor manuellt med trasor och skrapor samt handhållna maskiner. Källa: Arbetsförmedlingen
broader: Bilrekonditionerare, fönsterputsare m.fl.
related: whao Q6A ScE
related: UdVa jRr 9DE
broad match: C9123

Biobränsleansvarig
type: Concept
in scheme: JobTech Taxonomy - Yrke
definition: Biobränsleansvarig
broader: Förvaltare inom skogsbruk och lantbruk m.fl.
related: bh3H Y3h 5eD
broad match: C1311

Bilsadelmakare
type: Concept
in scheme: JobTech Taxonomy - Yrke
definition: Bilsadelmakare, eller biltapetserare som det också kallas, tillverkar och renoverar invändig klädsel till fordon, främst bilar och båtar. Arbetet sker i huvudsak med fordon men kan även jobba med inredning. Bilsadelmakare är ett hantverksyrke och mycket av arbetet sker manuellt. Det är vanligt att specialisera sig, till exempel mot äldre bilar eller båtar. Specialbeställningar från industrin är också förekommande där man arbetar med prototyptillverkning. Där är kunskaper i CAD eller andra program för design viktiga. Vanliga arbetsplatser är fordonstillverkare eller företag som inriktar sig på renovering av fordon, till exempel på uppdrag från kollektivtrafiken. Källa: Arbetsförmedlingen, Sadelmakarnas branschorganisation
broader: Tapetserare
related: PaxQ o1G wWH
related: DPur ucZ jU9
broad match: C7534

Processoperatör keramisk industri
type: Concept
in scheme: JobTech Taxonomy - Yrke
definition: Processoperatörer inom keramisk industri styr och övervakar industriell tillverkning av keramiska produkter. Processoperatörer inom keramisk industri styr och övervakar industriell tillverkning av keramiska produkter. Arbetet sker vanligtvis från ett kontrollrum. Förutom drift och övervakning är vanliga arbetsuppgifter provtagning, kvalitetskontroll, dokumentation, tillsyn och underhåll. En viktig del i arbetet avser säker hantering och processteg enligt instruktioner. Truckkörning är även förekommande. Källa: Arbetsförmedlingen
broader: Övriga process- och maskinoperatörer
related: wTEr CBC bqh
broad match: C8181

Chefer inom socialt och kurativt arbete
type: Concept
in scheme: JobTech Taxonomy - Yrke
definition: Formulerar och ansvarar för mål och strategier för verksamhet inom socialt och kurativt arbete. Utformar riktlinjer, följer upp och utvärderar verksamheten mot uppsatta mål. Svarar för budget samt fördelar resurserna inom verksamheten. Har personalansvar.
broader: Chefer inom socialt och kurativt arbete
related: DDYz SCK SRa
related: RGVP 7PH Zx6
related: s5SS 7bW 1Gh
related: icvA Gu9 EqB
related: YS7V c8n MrS
related: UH9g R5v MCx
related: SmZd Jaa BeY
related: 29MP yhF mjx
related: 8tYq EXD Xwm
related: ZzN5 m7B 5CY
related: detQ YNb 9nG
related: SfoE zq7 ADN
related: Nksx 4oe fEQ
related: eThQ HCv mY6
related: 5PjX 999 uLZ
related: X9Kc p8a 1FB
related: Gt5f wdi FSJ
related: q7Mx gjU F9q
related: D6ev Zwt x83
related: zXNU zXR hGd
related: GYz6 5Jt Wmy
related: C1344
narrower: Enhetschef inom social omsorg/Föreståndare inom social omsorg
narrower: Boendeföreståndare
narrower: Enhetschef inom socialtjänst
narrower: Boendechef, kommun
broad match: bh3H Y3h 5eD

Oddssättare
type: Concept
in scheme: JobTech Taxonomy - Yrke
definition: Oddssättare analyserar och beräknar sannolikheter för olika utfall inom spel, framför allt sport, trav och casino. Arbetsuppgifterna omfattar insamling och analys av statistik och data, uppföljning av spelmönster, samt fastställande och justering av odds inför och under evenemang. Oddssättare följer marknadsrörelser, bevakar konkurrenters odds och samarbetar ofta i team för att optimera företagets spelutbud. Yrket innefattar även liveoddssättning, där odds uppdateras i realtid under pågående spel, samt dokumentation av datan och ibland kontakt med tekniker för utveckling av automatiserade modeller. Rollen används både hos nationella och internationella spelbolag. Källor: spelaspel.se, Skånesport, jobbannonser
broader: Croupierer och oddssättare m.fl.
related: X82t awd Qyc
broad match: C4212

Materialplanerare
type: Concept
in scheme: JobTech Taxonomy - Yrke
definition: Materialplanerare
broader: Civilingenjörsyrken inom logistik och produktionsplanering
related: 6Hq3 tKo V57
related: cPmJ ruh r7Y
related: iwds EZE gU5
related: q84Z may YTg
related: bzb3 tjX pij
related: LJRb VMC GF2
related: SZVc h3B a9V
broad match: C2141

Yrken inom lantbruk, trädgård, skogsbruk och fiske
type: Concept
in scheme: JobTech Taxonomy - Yrke
top concept of: JobTech Taxonomy - Yrke
definition: Yrken inom lantbruk, trädgård, skogsbruk och fiske
narrower: Lantbruks- och trädgårdsyrken
narrower: Skogsarbetare, fiskodlare och fiskare

Kontaktsjuksköterska
type: Concept
in scheme: JobTech Taxonomy - Yrke
definition: Kontaktsjuksköterska samordnar vård och stödjer patienter genom hela vårdprocessen, vanligen i samband med cancer. Sjuksköterska är en skyddad titel med legitimationskrav. Vanliga arbetsuppgifter är närvara vid diagnosbesked, informera patient och närstående om vårdplan och nästa steg i behandlingen, samt att bedöma och följa upp individuella behov. Det ingår att samordna insatser mellan vårdgivare, hantera överlämningar och vara tillgänglig för frågor, råd och stöd till både patienter och närstående. Källa: Arbetsförmedlingen, Cancerfonden, Karolinska Universitetssjukhuset, Socialstyrelsen
broader: Övriga specialistsjuksköterskor
related: NYW6 mP6 vwf
broad match: C2221

Forskare, miljö
type: Concept
in scheme: JobTech Taxonomy - Yrke
definition: Forskare, miljö
broader: Specialister inom miljöskydd och miljöteknik
related: kJeN wmw 9wX
related: 4ff1 4gB Dew
broad match: C2143

Gjutare metallhantverk
type: Concept
in scheme: JobTech Taxonomy - Yrke
definition: Gjutare inom metallhantverk tillverkar gjutgods på ett hantverksmässigt sätt. Arbetet innebär att smälta och gjuta metaller som järn, stål, aluminium eller mässing i olika typer av formar. Manuell gjutning är ett hantverk där man arbetar med flera moment, från att skapa gjutformar, gjutkärnor och modeller till själva gjutningen och efterbehandlingen av gjutgodset. Man kan till exempel arbeta med att tillverka bruksföremål eller arbeta med att gjuta komponenter i en mekanisk verkstad. Vanligtvis arbetar man med att tillverka enskilda föremål eller små serier. För maskinoperatörer som arbetar med framtagning av industriellt gjutgods se yrket Gjuterioperatör. För gjutning av konstföremål se yrket Konstgjutare. Källa: Hantverksakademin, Arbetförmedlingen
broader: Gjutare
related: mHiv mNf HNA
related: DXuc GRm 9a7
related: ia7K xBt Zhg
related: kEBm jeE JNp
related: PaxQ o1G wWH
related: kRFq G39 Lmi
related: wTEr CBC bqh
related: 2282 5uP 1Qp
related: 7P9h NXn Eno
broad match: C7211

Skötarstuderande
type: Concept
in scheme: JobTech Taxonomy - Yrke
definition: Student som utbildar sig till skötare. Källa: SKR
broader: Skötare
related: NYW6 mP6 vwf
broad match: C5321

Produktionschef, anläggning
type: Concept
in scheme: JobTech Taxonomy - Yrke
definition: Produktionschef inom anläggning är ett yrke som kan se lite olika beroende på i vilket företag tjänsten finns. Det kan innebära ett övergripande ansvar för att leda och utveckla en produktionsenhet med personalansvar för projektchefer och deras produktionspersonal. Det kan också vara en mer operativ roll på ett byggprojekt som innebär att schemalägga arbetsinsatser, hantera arbetsstyrkan och utrustningen, övervaka produktionsflödet och se till att produktionen uppfyller tidplaner och kvalitetskrav. Källa: Arbetsförmedlingen
broader: Driftchefer inom bygg, anläggning och gruva
related: sf31 Sn5 FVV
related: j7Cq ZJe GkT
related: epLc SkD cbT
related: bh3H Y3h 5eD
related: ja7J P8X YC9
broad match: C1323

Övriga bil-, motorcykel- och cykelförare
type: Concept
in scheme: JobTech Taxonomy - Yrke
definition: Utför annat bilförararbete än inom 8321. Exempel på arbetsuppgifter: Kör personbil, motorcykel, cykel eller minibuss för att transportera varor. Hit hör inte Flyttkarl/Stadsbud (9332)
broader: Bil-, motorcykel- och cykelförare
related: Asgf FwD KGZ
related: C8321
related: 9kF5 wSV FsD
related: EqRh UqX wFB
related: S4iW NQ3 ubX
related: BHCG hQC kNa
related: vRUW 21M 5Eg
related: BA4E 9JW f14
related: sKLW XyF UGt
related: zf1U Xnn g1Z
related: gatN zc2 2e4
related: C8322
related: C9331
related: oai7 5Zg sE9
related: F8iA MB6 iY3
related: SLMn wo6 aAu
related: NL17 f8c AqZ
related: KwWd Ffq 2kE
related: rwir xvu 443
narrower: Testförare
narrower: Budbilsförare
narrower: Cykelbud
narrower: Personbilsförare
broad match: ASGV zcE bWf

Forskarassistenter m.fl.
type: Concept
in scheme: JobTech Taxonomy - Yrke
definition: Planerar, genomför och leder forskningsverksamhet. Medverkar i undervisning. Hit hör inte Forskarassistent utan uppgift att undervisa (ingår i yrke inom respektive inriktning)
broader: Universitets- och högskolelärare
related: snfZ N1g wrT
related: ddzL 9as rZt
related: 9Ra9 2yh jH4
related: Zffc M4R Gws
related: C2310
related: 5hrX ckd X8x
related: uwXg zmB Pdk
related: TB7B ewe qsW
related: 9wjT WBC ppy
related: xE6k qAE vrk
related: pamn k5z ByJ
related: LswY aiM UT8
related: c2YE oK3 f1u
related: 9kKp C7D Qme
related: ppnH 9N4 FE2
related: ezVu GhE b3b
related: QEfk 7p4 yCb
narrower: Forskningshandledare
narrower: Forskarassistent
narrower: Postdoktor/Postdoc
narrower: Forskningsrådgivare
narrower: Forskningsledare
broad match: MVqp eS8 kDZ

Flygplåtslagare
type: Concept
in scheme: JobTech Taxonomy - Yrke
definition: Flygpplåtslagare arbetar med reparation och underhåll av strukturella delar av flygplan och helikoptrar. Arbetsuppgifterna inkluderar bland annat nitning, borrning, reparation av plåtskador, nytillverkning efter ritning och bockning av plåt. Kunskaper i mekanik och plåtslageri är viktigt, samt egenskaper som noggranhet och problemlösningsförmåga. Det finns för närvarande inte någon specifik utbildning för flygplåtslagare i Sverige, men en bakgrund som flygmekaniker, flygtekniker eller plåtslagare kan vara en bra grund. Yrket erbjuder möjligheter till arbete både nationellt och internationellt. Källa: Transportfackens Yrkes- och Arbetsmiljönämnd
broader: Tunnplåtslagare
related: er7G zS6 fmG
related: FiDm Azj FMB
related: UVxC Smz VuQ
related: wTEr CBC bqh
related: JezX oUD TZr
broad match: C7213

Modersmålslärare i gymnasieskolan
type: Concept
in scheme: JobTech Taxonomy - Yrke
definition: Modersmålslärare i gymnasieskolan undervisar elever med annat modersmål än svenska i deras modersmål samt ger stöd i språk- och kunskapsutveckling inom olika ämnen. Vanliga arbetsuppgifter är att planera och genomföra modersmålsundervisning, följa upp och bedöma elevernas språkliga utveckling samt erbjuda studiehandledning på modersmålet för att förklara ämnesinnehåll. För att kunna arbeta som modersmålslärare behövs goda kunskaper i både svenska och modersmålet. Källor: Arbetsförmedlingen, Skolverket
broader: Gymnasielärare
related: CnAX gj5 Cud
related: kQ2y ufP Q2Z
related: wUit ryo qLN
related: j3Fj q9X fJn
related: MVqp eS8 kDZ
related: BYt9 XxD xFv
related: j3ep 8vv nLH
broad match: C2330

Purser
type: Concept
in scheme: JobTech Taxonomy - Yrke
definition: Pursers leder kabinpersonalens arbete ombord på passagerarflygplan. Arbetsuppgifter inkluderar att planera och fördela arbetsuppgifter inom kabinbesättningen, säkerställa att säkerhetsrutiner följs samt att koordinera servicearbetet gentemot passagerarna. Inför avgång informerar purser kabinpersonalen om dagens flygning, passagerarantal, särskilda behov och säkerhetsinstruktioner. Under flygning ansvarar purser för att övervaka passagerarservice, hantera eventuella konflikter eller avvikelser samt rapportera händelser till flygkapten och flygbolagets markorganisation. Purser är också kontaktperson för övrig kabinpersonal och samordnar insatser vid medicinska situationer eller nödlägen. Arbetet sker i nära samarbete med cockpitbesättningen och förutsätter god kännedom om säkerhetsföreskrifter och interna rutiner. Pursers har vanligtvis flera års erfarenhet som kabinpersonal och har genomgått särskild intern utbildning för ledningsuppdrag ombord. Källa: Arbetsförmedlingen
alternative label: Kabinchef
broader: Kabinpersonal m.fl.
related: ewj4 ZZ9 tjD
related: ASGV zcE bWf
related: ad25 cfq TMy
related: VvVD MGC gwE
related: VLft qga SdH
broad match: C5111

Specialisttandläkare inom oral protetik
type: Concept
in scheme: JobTech Taxonomy - Yrke
definition: Specialisttandläkare inom oral protetik är en specialiserad legitimerad tandläkare med en djupare kunskap och kompetens inom sitt område. Specialisttandläkare är en skyddad titel och bara den som har bevis om specialistkompetens får kalla sig specialist i sin specialitet. Vanliga arbetsuppgifter är att utreda, diagnostisera och behandla komplexa fall inom exempelvis oral kirurgi, ortodonti, pedodonti, parodontologi, oral protetik, bettfysiologi, endodonti eller odontologisk radiologi. Specialisttandläkare samarbetar ofta i team, tar emot remisser från allmäntandläkare och bidrar med expertkunskap till både patienter och kollegor. Arbetsuppgifterna kan även omfatta konsultationer, handledning och ibland ansvar för verksamhet eller personal inom sitt specialistområde. Källa: Arbetsförmedlingen, Sveriges Kommuner och Regioner, Socialstyrelsen
broader: Tandläkare
related: NYW6 mP6 vwf
related: proQ odJ 3A7
related: NgG1 5qR MDs
related: SRs7 HCS tVp
related: 6iN8 NUV d5o
related: bvS2 Vmd o8t
related: cte9 dWa 58g
related: 2B4i UAL 5kg
broad match: C2261

Konstpedagog
type: Concept
in scheme: JobTech Taxonomy - Yrke
definition: Konstpedagog
broader: Övriga pedagoger med teoretisk specialistkompetens
related: pVzY rff Amk
related: MVqp eS8 kDZ
broad match: C2355

Driftchef, vattenverk
type: Concept
in scheme: JobTech Taxonomy - Yrke
definition: Driftchef, vattenverk
broader: Produktionschefer inom tillverkning
related: epLc SkD cbT
related: bh3H Y3h 5eD
related: KttT 86S TTv
broad match: C1321

Försäkringsförmedlare
type: Concept
in scheme: JobTech Taxonomy - Yrke
definition: En försäkringsförmedlare är en oberoende expert som hjälper privatpersoner och företag att hitta och teckna lämpliga försäkringar. De arbetar på uppdrag av kunden och är inte anställda av något försäkringsbolag. Försäkringsförmedlare kan hjälpa till att identifiera risker och se till att kunden har rätt skydd. De kan också bistå vid skadereglering, vilket kan vara till stor hjälp om en skada inträffar. I Sverige måste försäkringsmäklare vara licensierade av Finansinspektionen för att få bedriva sin verksamhet. Källa: Svenska försäkrings­förmedlare, Arbetsförmedlingen
alternative label: Försäkringsmäklare
broader: Försäkringssäljare och försäkringsrådgivare
related: uyr3 tcW ixc
related: gzt6 Kjq aEG
related: X82t awd Qyc
related: srg4 THR c81
related: N5ex tgk 4Yy
broad match: C3321

Övriga designer och formgivare
type: Concept
in scheme: JobTech Taxonomy - Yrke
definition: Utför annat design- och utvecklingsarbete än inom 2171-2173. Exempel på arbetsuppgifter: Designar och utvecklar mode-, kläd-, textil-, smyckes- och glasprodukter. Fastställer mål och restriktioner för designuppdraget genom samråd med kunder och intressenter.
broader: Designer och formgivare
related: 1CnL 8ZQ tTd
related: 8S2f kNg dUk
related: s8Ui Ew6 74j
related: 3MdV 7Md ux1
related: oQre F86 kHG
related: oxYi vfW UWx
related: dTK5 R7G p56
related: 1EYb A74 7Pq
related: 2H6W q67 ygJ
related: vH2w kqg Usb
related: rQyf 4UR djn
related: x7wh 363 PGk
related: htTA 8Yx YJH
related: hPnF VPk shg
related: XCdg UJK w2q
related: qhJ9 N4G BQg
related: dVp8 t6i CaN
related: Krbu VkM PdQ
related: KM8U e1q Xwm
related: k1Rq EmU nbj
related: 5XhW VQA 2CW
related: t9A6 jvd 6h5
related: yUpR BRo 7Ay
related: C2163
related: GpSA U5b LJx
related: x35Q k3W xxR
related: ZgMd qRp Uz4
related: S9WX oNk eWe
related: haMy QRx 7vg
related: P6c3 aM5 ooQ
related: fxgU EEe 4Yf
related: jHPZ f6N Kjg
related: XN9D c7f vF1
related: G2Hv 5XN 6gC
narrower: Kostymdesigner
narrower: Kostymör
narrower: Creative director/CD
narrower: Textildesigner
narrower: Lästmodellör
narrower: Designassistent
broad match: 9puE nYg crq

Inspicienter och scriptor m.fl.
type: Concept
in scheme: JobTech Taxonomy - Yrke
definition: Ansvarar för de praktiska detaljerna i arbetet med att sätta upp en teaterföreställning eller vid inspelning. Ser till att personer och föremål finns på rätt plats vid rätt tidpunkt. Läser manus, antecknar önskemål om ljus, effekter, musik m.m. Handlägger licens- och royaltyfrågor.
broader: Fotografer, dekoratörer och underhållningsartister m.fl.
related: ZefA esM Z9F
related: jYGN rDK tM2
related: cAm2 NRV 2hX
related: BZDw 9aj p4S
related: E44v wYZ wjx
related: whxX bQP jDU
related: ADnZ 2yV SpK
related: Gmgc YGn E8Q
related: assp hgx pSE
related: oaiv GsB AFK
related: bzFf qDr Brc
related: aHCV VsV LiD
related: B83k mVq 771
related: C3435
related: Q3MS B1d RgY
related: 7tvZ Vey JsX
related: kmFW EKW yWf
related: 4z4f Tzu S2s
related: nvXa KhJ VWE
related: ExsT 7qe uhE
related: vSqz 6Hj Jrg
related: HW3B CwN pst
related: p9um Jnx 5ds
related: ryXf E4d FYU
related: ocTL noZ mpN
related: zmyW iDd Yac
related: 51Ts qag i5g
related: XCdg UJK w2q
related: qhJ9 N4G BQg
related: pLyW JYJ TFq
related: nXUc H3H Ct5
related: vvYA pay Yhj
related: Krbu VkM PdQ
related: HJRs 2wn P3Z
related: K8Za Smm Ltb
related: GCMj xLD mj6
related: hsMv Rgp w5u
related: DTx9 wZ6 jeC
related: VVj2 4Uu LL9
related: D5p7 wzU NXV
related: CR2o UpP 3sZ
related: t9A6 jvd 6h5
related: yUpR BRo 7Ay
related: obCf cWt Vjo
related: iMEL yvq cPA
related: DeWG yQm d5V
related: qPMJ D7M au8
related: bDWd gjE sWh
related: Yhyn QdP Q1i
related: BwPj cSg Hgk
related: aCtq uxu pPu
related: SLee SLb VGE
related: RB7E jE5 MZ3
related: PDiG Kwa zyy
related: DDwi f63 YVH
related: ZGoH 5eo y5z
related: VorJ XT6 7VH
related: gtLn 86s bHS
related: pJfh xeB iVp
related: eVFF obx bKN
related: Th7f fJ6 LoZ
related: G2Hv 5XN 6gC
related: Pk1y cpM ZhC
related: imX7 e4B 5L6
related: L49T vU8 gg9
related: W24a BWN wYu
related: YAMo jgk AKB
narrower: Scripta
narrower: Programsekreterare
narrower: Produktionsteknisk samordnare/PTS
narrower: Rekvisitörsassistent
narrower: Teknisk produktionsledare/TPL
narrower: Attributör
narrower: Inspicient
narrower: Studioman

Ambulanssjuksköterskor m.fl.
type: Concept
in scheme: JobTech Taxonomy - Yrke
definition: Vårdar patienter med akuta sjukdomar och skador. Har det medicinska ansvaret i en ambulans.
broader: Sjuksköterskor
related: 4QAE wtY gJh
related: 2KV1 FD8 vGp
related: C1qR L83 nzh
related: F9MX NWR 7CQ
related: 9Fna GUm HWL
related: Mmxs Qrv cpG
related: 9Ysm nvM YBu
related: ZzN5 m7B 5CY
related: dJa5 Nao mDS
related: Lqnz Zqw nQ9
related: eThQ HCv mY6
related: F7nJ k5s L29
related: Ektq nPz 4YF
related: LMx4 LbA vxB
related: wBPu wTW RgG
related: aS2X 4ZL 9h7
related: MR4H FFT mTj
related: 2GuF gtz xfW
related: rF7s hX1 ECH
related: eiAk 5vQ 2NY
related: rVUL AgV ZTH
related: WUoy Yua 8Mr
related: azXF rgu EWv
related: C2221
related: GYz6 5Jt Wmy
related: 5Kym 2ad Pqi
related: jxKr BmN CcQ
related: pGBH BkG qJa
related: yV9B PxJ TxS
narrower: Ambulanssjuksköterska
narrower: Akutsjuksköterska
broad match: NYW6 mP6 vwf

Matematiker, aktuarier och statistiker
type: Concept
in scheme: JobTech Taxonomy - Yrke
definition: Matematiker, aktuarier och statistiker
broader: Yrken med krav på fördjupad högskolekompetens inom naturvetenskap och teknik
narrower: Statistiker
narrower: Matematiker och aktuarier

Budget- och skuldrådgivare
type: Concept
in scheme: JobTech Taxonomy - Yrke
definition: Budget- och skuldrådgivare
broader: Övriga ekonomer
related: oiqh cfh JWE
related: GazW 2TU kJw
related: NcUm Jyg wVo
related: X82t awd Qyc
related: V9x8 Bjp zGr
related: T2CM ZFv MGx
related: F8Hw UTS zmt
broad match: C2412

Kommunchef/Kommundirektör/Stadsdirektör
type: Concept
in scheme: JobTech Taxonomy - Yrke
definition: Kommunchef/Kommundirektör/Stadsdirektör
alternative label: Kommunchef
alternative label: Kommundirektör
alternative label: Stadsdirektör
broader: General-, landstings- och kommundirektörer m.fl.
related: kr3c QjG 3QZ
related: epLc SkD cbT
related: bQgi wCy xot
related: bh3H Y3h 5eD
broad match: C1112

Teknisk produktionsledare/TPL
type: Concept
in scheme: JobTech Taxonomy - Yrke
definition: Teknisk produktionsledare ansvarar för att planera, samordna och leda tekniska aspekter av produktioner inom kultur, såsom evenemang, scenproduktioner och media. Vanliga arbetsuppgifter är att koordinera tekniska team, övervaka installation och drift av ljud, ljus och bild, samt samarbeta med producent och andra yrkesgrupper för att lösa tekniska problem under produktionen. I arbetet ingår säkerställa att teknisk utrustning och resurser används effektivt och att produktionen följer tidsplaner och budget. Källa: Arbetsförmedlingen
broader: Inspicienter och scriptor m.fl.
related: 8too bEs 7NU
related: 9puE nYg crq
broad match: C3435

Vattenbruksarbetare
type: Concept
in scheme: JobTech Taxonomy - Yrke
definition: Vattenbruksarbetare arbetar inom produktion av vattenlevande djur och växter som innefattar bland annat fiskar, musslor, kräftdjur och alger. Arbetsuppgifterna inkluderar praktiskt arbete som utfodring, sortering, underhåll av odlingsanläggningar och reparation av utrustning. Yrket liknar fiskodlare, med skillnad att fiskodlaren är specialiserad på just fisk. Källa: Arbetsförmedlingen, Svenskt vattenbruk, Jordbruksverket
broader: Fiskodlare
related: VuuL 7CH adj
broad match: C6221

Lärling, VVS-montör
type: Concept
in scheme: JobTech Taxonomy - Yrke
definition: En lärling är anställd på företag för att göra sin färdigutbildningstid till VVS-montör. Lärlingsanställningen görs efter skolutbildning eller tillsammans med teoretiskt kurspaket. Under färdigutbildningstiden på företaget lär sig lärlingen yrket mer praktiskt och skall nå sina kunskapsmål för branschcertifikat. Certifikat erhålls efter ett branschprov. Källa: VVSYN
broader: VVS-montörer m.fl.
related: j7Cq ZJe GkT
related: ja7J P8X YC9
broad match: C7126

Översättare, tolkar och lingvister m.fl.
type: Concept
in scheme: JobTech Taxonomy - Yrke
definition: Översätter text eller tal från ett språk till ett annat. Språkgranskar texter. Utarbetar lexikon. Utvecklar teorier och modeller om språks uppbyggnad och egenskaper. Undersöker och beskriver ett språks ursprung och utvecklingen av dess ordförråd, grammatik och syntax.
broader: Författare, journalister och tolkar m.fl.
related: KrCL cXP A2d
related: rxLV bt9 XSh
related: SLAe RtF RJZ
related: C2643
related: 9nEq dNf 5Va
related: LbC6 UqD bN5
related: PMe4 nz4 xz8
related: k5NE ijr Zh6
related: DyVQ otM g9N
related: UXtR iqA B8J
related: TdRH mHo U2N
related: iQ57 2Cq TXh
related: AwJA e1C 2ge
related: JuSE ba5 jRy
related: CtU5 jL4 he2
related: WyA4 g1g jS4
related: yhgK 1Vw x1J
related: QsnC qc3 pxb
related: NZdF 6i6 6Tt
related: XEEi zYM Jn3
related: KyBB Geq 3DC
related: 4gqm Prd THw
related: t5wy jc2 vJP
related: 3bJD mGi una
related: KFyd zgS 6aw
related: e77C 9QV ki4
related: RbcS QBg wbn
related: SD5C 2N7 KJs
related: 7rnj 4kf M3R
related: 5eLS qbN xTj
related: KJAs 4Qc ab3
related: CBRX a1b TQm
related: ZpWW FBu 3um
related: JEkW rqS ojk
related: ESkY URR Au8
related: 3TPm t2J 5fM
related: RS9e z4J jSs
related: 4End C8e 2az
related: c2YE oK3 f1u
related: J8KQ ioT uXK
related: pkKr hxU RX8
related: RHeM P9i PJb
related: Kvft WHn KJE
related: tDd3 iB1 Vgt
related: ezVu GhE b3b
related: Pk1y cpM ZhC
narrower: Översättare, skönlitteratur
narrower: Konferenstolk
narrower: Terminolog
narrower: Lingvist
narrower: Språkkonsult
narrower: Kontakttolk/Dialogtolk
narrower: Språkteknolog
narrower: Rättstolk
narrower: Lexikograf
narrower: Forskare, språk
narrower: Mediatextare
narrower: Sjukvårdstolk
narrower: Översättare, facktexter
narrower: Syntolk
narrower: Teckenspråkstolk/Dövblindtolk
narrower: Taltjänsttolk
narrower: Lokaliserare
narrower: Tolk
narrower: Skrivtolk/Vuxendövtolk
broad match: 9puE nYg crq

Undersköterska, vård- och specialavdelning och mottagning
type: Concept
in scheme: JobTech Taxonomy - Yrke
definition: Undersköterskor arbetar nära människor som av olika anledningar är i behov av vård, omsorg, stöd eller service. Undersköterska är en skyddad titel. Undersköterskan förbereder patienter och undersöknings-/behandlingsrum inför operationer. Det är vanligt att undersköterskan kontrollerar patienters temp, puls och blodtryck samt tar blodprover och lägger om sår. Undersköterskan hjälper även patienter med personlig hygien, av- och påklädning samt bidrar till att patienten känner sig trygg. Ibland ingår det i arbetet att bädda sängar, servera mat till patienter och fylla på förråd med material. Undersköterskan är delaktig i att upprätta vårdplaner. På vårdavdelningar arbetar undersköterskan ofta i team med sjuksköterskor och läkare, där patienter är inlagda av många olika anledningar, ofta stannar de en längre tid. På mottagningar och vårdcentraler kommer patienter på kortare besök. Källa: Arbetsförmedlingen
broader: Undersköterskor, vård- och specialavdelning och mottagning
related: J1hy ct6 ZqF
related: wqLt 6c7 MEN
related: 5ZvY ivK prL
related: NYW6 mP6 vwf
related: h48D PKp svc
related: 6jf4 ExH yMY
related: 4jYa 3Ai T8b
related: dscp gNH aTU
related: RY4n 8ub Lni
related: zzPn tQb DDT
related: oR71 Vk4 Rn5
related: LuRT GNk gaK
related: GBUk wE3 HjK
related: yAYj 5bW ZxW
broad match: C5321

Civilingenjörsyrken inom maskinteknik
type: Concept
in scheme: JobTech Taxonomy - Yrke
definition: Utvecklar teorier, modeller och metoder inom tillverkningsindustri t.ex. maskin- och fordonsteknik. Leder projekt-, projekterings- och konstruktionsarbete som avser fordon, komponenter, maskiner och annan mekanisk utrustning samt värme-, vatten-, sanitets-, ventilations-, och kylsystem. Ansvarar för besiktning och kontroller. Utarbetar riktlinjer och metoder för kvalitetssäkring. Hit hör inte Yrken inom maskinteknik med arbetsuppgifter motsvarande ingenjör- eller teknikernivå (3114)
broader: Civilingenjörsyrken
related: qw7x yA1 M9g
related: 7AFv z2m swt
related: DbmE 6Js HL1
related: tCER yDZ XnW
related: JQRo XJx YX9
related: BEva hvD fyY
related: uvcb DuX NW8
related: zLwt WNZ KnP
related: W5A6 NGs aM9
related: Z6GN aCQ MDc
related: 4VUm JpJ LWr
related: eHy7 eMm 1mG
related: Uige jQo uZ4
related: 9Hvc DYG iqB
related: 48zu t6j A28
related: Ev5U yQH AU8
related: tg8L maz wMN
related: sA2V erA 3WN
related: GxW1 hAb 5ZS
related: 1CnL 8ZQ tTd
related: D8Qb A75 bDH
related: 61zA BvK zDd
related: cCMP ufr 9Ke
related: 7ijD koM unx
related: d4fX YoT QQc
related: RMCB qzu Www
related: n5Ww Cc9 xYG
related: Y7va 3yN FSd
related: tdFQ q6Y 7nM
related: 11L4 Q2Z 8tM
related: oaiv GsB AFK
related: cnkK 3ev Ccf
related: ofcY XXh G4k
related: gqdt aJj YQJ
related: LXoc wxV 73h
related: 74Mw JUN VKx
related: oQre F86 kHG
related: F6zK iNu bXQ
related: RKaF ZmA 9c3
related: 2kEw jWL 6Zz
related: tqRJ 2Ds GJG
related: 8sKj VoT hKR
related: 6ZKB QVh xPs
related: K5JR yfk 8oj
related: kLLw dnR M38
related: apDb b1W jQx
related: yh11 sgo Z29
related: QnvA akR Rd7
related: P7h9 sUt cBp
related: YK2s pxn YWW
related: A8xk vzZ Uee
related: LdgJ JMm yxF
related: kfYc q1X SZ5
related: 5Gmv EZs BPe
related: pkzW YQA PtC
related: FZ7v EmJ oRh
related: uq7L Dfk HWR
related: C2144
related: NtWF zFu Mhg
related: yFgG g8k r6r
related: PGDh 8HQ 4BZ
related: bwYY qC7 5xE
related: Ry2v 4Hx 6ta
related: MWTZ jRV uw1
related: YAdb Wwj b3N
related: HW3B CwN pst
related: DsHp orw 8Xb
related: kJCx vqk SQG
related: wBKD S7C s4B
related: zRtu fYj XC4
related: jSAi QKc JQk
related: xsSg pg2 Bpq
related: rFRr KTf FjW
related: Z2XD GQ9 qvM
related: uwev L2n fpz

Församlingspräst med specialuppgifter
type: Concept
in scheme: JobTech Taxonomy - Yrke
definition: Församlingspräst med specialuppgifter
broader: Präster
related: pMfj Zjo ABp
related: GazW 2TU kJw
related: kMa4 Ez2 QcC
related: AW6i 9gS Qi9
related: DL4x vTn fiM
related: hFM3 SMG xVS
broad match: C2636

Sektionschef, offentlig förvaltning
type: Concept
in scheme: JobTech Taxonomy - Yrke
definition: Sektionschef, offentlig förvaltning
broader: Övriga chefer inom samhällsservice
related: epLc SkD cbT
related: bh3H Y3h 5eD
related: yRc8 Yg2 kok
related: RQ4F cGi CKT
broad match: C1213
broad match: C1349

Processoperatör mejeri
type: Concept
in scheme: JobTech Taxonomy - Yrke
definition: Processoperatörer vid mejerier sköter och övervakar maskiner som producerar olika mejeriprodukter. Tillverkningsprocessen sker via kontrollrum där maskinoperatören styr, övervakar och justerar produktionen. Vid mejerier är viktiga arbetsuppgifter mottagning och behandling av mjölk samt bakteriologisk och kemisk kontroll. Inom livsmedelsindustri finns även krav på säker livsmedelshantering. Beroende på arbetsplats är truckkörning, lagerarbete och leveransföreberedelse även förekommande arbetsuppgifter. Källa: Arbetsförmedlingen
broader: Maskinoperatörer, mejeri
related: WaeV Yuf p2i
related: aSuZ wuX pZ9
related: niDG o3B MEN
related: JRsN Tvh CA8
related: CcPE Da9 BEM
related: cunj yBS rSP
related: cBfs q3Z 5vv
related: 1QVT xoZ jco
related: xvEB eJf bxR
related: rcoi Qxx Znj
related: qhQ5 6yH NHf
related: vFS4 WG1 8Li
related: uVKC xP9 dpy
related: wTEr CBC bqh
broad match: C8160

B-fotograf
type: Concept
in scheme: JobTech Taxonomy - Yrke
definition: Assisterar A-foto i skapandet av bilderna, inklusive kamerauppsättning och komposition. Källa: YNFT
broader: Fotografer
related: ezCp Uwu 9FF
related: 8too bEs 7NU
related: 9puE nYg crq
related: 4zRz VFB bJm
broad match: C3431

Webbdesigner
type: Concept
in scheme: JobTech Taxonomy - Yrke
definition: Webbdesigner
broader: Designer inom spel och digitala medier
related: 2xNu ay3 x6E
related: 8sfa f7W wBA
related: ravC BZv tHA
related: oeHg J1V PEg
related: sV4b obt Yjr
related: apaJ 2ja LuF
related: 9puE nYg crq
related: pp28 8So ASN
related: xJ3z tXQ GmT
broad match: C2166

Optiker
type: Concept
in scheme: JobTech Taxonomy - Yrke
definition: Gör synundersökningar, ordinerar och provar ut glasögon, kontaktlinser och synhjälpmedel. Reparerar glasögon. Säljer glasögon, kontaktlinser och andra synhjälpmedel.
broader: Andra specialister inom hälso- och sjukvård
related: 6Btu sfD MkW
related: wmCs P12 5sg
related: GaiX BJu BWE
related: DimQ Lfo ndJ
related: 1G52 33H jQa
related: C2267
related: h51N cgx 7NJ
related: B4E8 NBS irE
narrower: Optiker
broad match: NYW6 mP6 vwf

Ordningsvakt
type: Concept
in scheme: JobTech Taxonomy - Yrke
definition: Ordningsvakter arbetare, tillsammans med Polisen, med att upprätthålla ordning på allmän plats. För att arbeta som ordningsvakt krävs grundläggande väktarutbildning och särskilt förordnande som ordningsvakt, vilket utfärdas av Polisen efter genomgången utbildning. Vanliga arbetsplatser är idrottsevenemang, kollektivtrafiken, sjukhus och köpcentrum. Polisen är förmän till ordningsvakterna, de har därför befogenhet att bland annat avvisa, avlägsna eller tillfälligt omhänderta personer som stör eller utgör hot mot allmän ordning samt avstyra straffbelagda handlingar. Källa: Bevakningsbranschens Yrkes- och Arbetsmiljönämnd
broader: Väktare och ordningsvakter
related: dVbW QJc xZi
related: E7hm BLq fqZ
related: EX8B MCg u1V
related: AtN6 CkN A79
related: MM3V 9RL wHp
broad match: C5414

Tränare inom specialidrott
type: Concept
in scheme: JobTech Taxonomy - Yrke
definition: Tränare inom specialidrott utbildar och leder utövare i en specifik idrott med med syfte att nå elitnivå. Arbetsuppgifterna inkluderar planering och genomförande av träning samt deltagande i tävlingar. Tränare inom specialidrott utvecklar utövarnas prestation och samspelar ofta med andra ledare och aktörer inom sporten för att skapa förutsättningar för framgång och utveckling. Källa: Gymnastik- och idrottshögskolan, Skolverket, Arbetsförmedlingen
broader: Idrottstränare och instruktörer m.fl.
related: n1qo GSN nWr
related: fdC4 4dJ 2yF
related: hVhb zAX wW7
related: kWy1 P1F RcQ
related: 6xRW zDv d2K
related: NcZ3 Qky Zoy
related: eqR6 orn H9r
related: MVqp eS8 kDZ
related: SfAE rZg 4Nt
related: VjAf 8nT Lfh
related: 18mj 8LR mDN
related: d9Yr YRs Zso
related: zWNo 37n 9aY
related: 9iNf Tqg iHx
broad match: C3422

Filmklippare
type: Concept
in scheme: JobTech Taxonomy - Yrke
definition: Filmklippare redigerar och sammanställer inspelat bild- och ljudmaterial till färdiga filmer, tv-program och andra rörliga produktioner. Vanliga arbetsuppgifter är att välja ut och sätta ihop scener, justera ljud och bild, färgkorrigera och samarbeta med regissör, producent och andra i produktionsteamet. Källa: Arbetsförmedlingen, Scen & Film, Yrkesnämnden för Film och TV
broader: Bild- och sändningstekniker
related: 8too bEs 7NU
related: 9puE nYg crq
related: d1Ao 9bY 7Kn
related: wSet GBs btp
broad match: C3521

Kördirigent
type: Concept
in scheme: JobTech Taxonomy - Yrke
definition: Kördirigent leder och ansvarar för att styra och samordna kören under repetitioner och framträdanden för att skapa en samspelt och musikalisk helhet. Vanliga arbetsuppgifter är att planera och genomföra körövningar, välja och arrangera repertoar samt ge sångtekniska instruktioner och musikaliska tolkningar. Kördirigenten arbetar också med att motivera och att anpassa arbetet efter körens nivå och behov. Källa: Arbetsförmedlingen, Kungliga Musikhögskolan, Malmö Universitet
broader: Musiker, sångare och kompositörer
related: 8too bEs 7NU
related: 9puE nYg crq
broad match: C2652

Militära yrken
type: Concept
in scheme: JobTech Taxonomy - Yrke
top concept of: JobTech Taxonomy - Yrke
definition: Militära yrken
narrower: Officerare
narrower: Specialistofficerare
narrower: Soldater m.fl.

Virkesområdeschef
type: Concept
in scheme: JobTech Taxonomy - Yrke
definition: Virkesområdeschef
broader: Förvaltare inom skogsbruk och lantbruk m.fl.
related: epLc SkD cbT
related: bh3H Y3h 5eD
related: VuuL 7CH adj
broad match: C1311

Planeringsarkitekter m.fl.
type: Concept
in scheme: JobTech Taxonomy - Yrke
definition: Upprättar, utarbetar och granskar planer för nya stadsdelar, bostadsområden, industriområden samt översiktliga planer och program för utveckling av fysisk miljö. Planerar för förnyelse och förändring av befintliga områden. Väger samman funktionella, tekniska, ekonomiska, miljötekniska och estetiska krav och önskemål till en fungerande helhetslösning i dialog med uppdragsgivare och myndigheter. Utarbetar förslag i form av modeller, texter och ritningar.
broader: Arkitekter och lantmätare
related: JQRo XJx YX9
related: g7bY vJ5 XC8
related: W5A6 NGs aM9
related: 2p7n zft 86S
related: sjeK fJW v9T
related: 4VUm JpJ LWr
related: ah7i FKc KGU
related: 8YxM PWA RNH
related: eHy7 eMm 1mG
related: Uige jQo uZ4
related: 1CnL 8ZQ tTd
related: 61zA BvK zDd
related: d4fX YoT QQc
related: 6MJf 3Va KQD
related: eXv8 c8M 9Ef
related: oQre F86 kHG
related: K5JR yfk 8oj
related: sc9x MMP woB
related: 5FMU Dt4 2hF
related: G4oH peY AMJ
related: yFgG g8k r6r
related: faUp zHK 2Kn
related: YAdb Wwj b3N
related: M3tL 3Qr oeB
related: DsHp orw 8Xb
related: CTuv CBk vCT
related: 9TAd zee 2Mc
related: zRtu fYj XC4
related: KYPr qfu hXf
related: SmZd Jaa BeY
related: rUFy uF1 xEZ
related: WXkX o6j FYv
related: E67G PGy fiG
related: 8GLo Bn4 XAq
related: MsNS 1ea u4p
related: ofzH ikr 67D
related: YqX1 qhL cBm
related: qWYC L13 rqj
related: f4kd T2t umz
related: woCn NVG HCt
related: HPrg bZM zh2
related: gYZ2 QV9 HAA
related: fFAM jC1 ur5
related: 76CR p4q sXc
related: UywC oRy tsV
related: C2MH EZ6 MwR
related: JRvh wrY RmW
related: hW4B SZF Qic
related: ehdK SJC 38W
related: uP2s 9yi BaC
related: AYst mik wuC
related: S84r Tb5 5EC
related: wZg2 hFD TPv
related: aJkj 92P Hdu
related: 3DEA r7Q YxU
related: bgjg cQD QgM
related: CWfM RL9 V4t
related: Tx1P roR sJy
related: oXnh Ffg j7m
related: gn6h J5L oGf
related: RrWD 6m1 ess
related: tWpg 7rw R97
related: jHPZ f6N Kjg
related: nDqs 2d5 jqu
related: szyV pTY uXK
related: 3suA kDu QDY
related: C2164
related: XN9D c7f vF1
related: Bbj8 8y7 XJ5
related: YAN9 MQ4 NiT
narrower: Stadsutvecklare/Samhällsstrateg
narrower: Planarkitekt
narrower: Planeringsarkitekt
broad match: 6Hq3 tKo V57

Chefssekreterare
type: Concept
in scheme: JobTech Taxonomy - Yrke
definition: Chefssekreterare ger administrativt stöd till chef eller ledningsgrupp. Arbetsuppgifter innefattar bland annat att koordinera och organisera kalender, möten, resor och evenemang. Rollen innefattar också hantering av korrespondens, protokollföring, sammanställning av dokumentation samt enklare utredningar och uppföljningar. Chefssekreteraren fungerar ofta som en viktig kontaktpunkt internt och externt och underlättar chefens arbete genom att planera, samordna och prioritera arbetsuppgifter. Källa: Arbetsförmedlingen
broader: Chefssekreterare och VD-assistenter m.fl.
related: Am4D aXn b9s
related: M7pY C5U gUB
related: yFGT MzQ uxP
related: X82t awd Qyc
related: KscX dx8 tqv
related: MZoc 5UY 1eC
related: ZHVc Y1d Whv
related: rjcW 5GG 6NP
related: 2yah yNn WUX
related: fecv VWk 9F3
related: kuuk H6a kx7
related: nFgq bco qYS
related: jtfg C3s tZg
related: H5ez M36 T1g
related: P9YH rvk pE6
broad match: C3343

Grundlärare, förskoleklass och 1-3
type: Concept
in scheme: JobTech Taxonomy - Yrke
definition: En lärares huvudsakliga arbetsuppgift är att planera och sköta undervisning, så att barnen får verktyg att själva kunna läsa, skriva och räkna. Lärare är ett reglerat yrke med legitimationskrav för att kunna bli tillsvidareanställd och sätta betyg. Grundläraren undervisar oftast i flera olika ämnen för samma grupp, vilket skiljer dem från ämneslärare. Som grundlärare behöver du en lärarlegitimation för att kunna bli tillsvidareanställd. Källa: Arbetsförmedlingen -Hitta yrken, Örebro universitet
broader: Grundskollärare
related: 1im5 gpH TNC
related: KDmv DbM w6z
related: yRys xFQ tET
related: 7x7m fyi 41T
related: 17Ld Tkc TbQ
related: N8fS PR4 SiB
related: sQjp 5hY mWE
related: LbSu jzW wGt
related: ppBe 3r9 2si
related: 1LGr uyo 5FQ
related: sk3S pxd juX
related: MVqp eS8 kDZ
related: aYKP 9e2 v9E
related: uGZp sES 56c
related: rZcQ Tjx YmC
related: cvMz YGJ 2qu
related: 9sgR EAy 3W9
related: j3ep 8vv nLH
related: fQST HDG cvc
broad match: C2341

Grundlärare, fritidshem
type: Concept
in scheme: JobTech Taxonomy - Yrke
definition: Grundlärare, fritidshem arbetar med att stödja och stimulera barns sociala, kreativa och kunskapsmässiga utveckling under tiden före och efter skoldagen samt på lov. Lärare är ett reglerat yrke med legitimationskrav för att kunna bli tillsvidareanställd. Vanliga arbetsuppgifter är att planera, genomföra och följa upp undervisning och aktiviteter utifrån läroplanen, leda gruppaktiviteter inom exempelvis bild, musik, idrott eller drama och arbeta med konflikthantering. Källa: Arbetsförmedlingen, Linköpings universitet, Socialstyrelsen, Skolverket, Stockholms universitet
broader: Fritidspedagoger
related: GgZZ DAE 3z6
related: MVqp eS8 kDZ
related: VTWU Ub7 8eU
related: 1Epe zKP ifU
broad match: C2342

Hallföreståndare
type: Concept
in scheme: JobTech Taxonomy - Yrke
definition: Hallföreståndare
broader: Chefer inom friskvård, sport och fritid
related: epLc SkD cbT
related: bh3H Y3h 5eD
related: vQgT e22 yw3
related: XYeL tKv CjA
broad match: C1431

Doktorand
type: Concept
in scheme: JobTech Taxonomy - Yrke
definition: Doktorand
broader: Doktorander
related: njW7 abw 29p
related: ZRE3 zJy D7X
related: MVqp eS8 kDZ
broad match: C2310

Förbundschef
type: Concept
in scheme: JobTech Taxonomy - Yrke
definition: Förbundschef
broader: Chefstjänstemän i intresseorganisationer
related: epLc SkD cbT
related: bh3H Y3h 5eD
broad match: C1114

Akutsjuksköterska
type: Concept
in scheme: JobTech Taxonomy - Yrke
definition: Akutsjuksköterska ansvarar för avancerad omvårdnad av patienter vid akuta och komplexa skador och sjukdomstillstånd. Sjuksköterska är en skyddad titel med legitimationskrav. En akutsjuksköterska med specialistsjuksköterskeexamen får använda benämningen specialistsjuksköterska inom akutsjukvård. Vanliga arbetsuppgifter är att identifiera och prioritera livshotande tillstånd, använda avancerad medicinteknisk utrustning, påbörja medicinska utredningar, inleda behandlingar och informera patienter och anhöriga. Källa: Arbetsförmedlingen, Uppsala universitet, Socialstyrelsen, Svensk sjuksköterskeförening
broader: Ambulanssjuksköterskor m.fl.
related: NYW6 mP6 vwf
related: yVeZ n35 6Mq
related: ytRi QuA XLX
related: HEou Dcq LtR
related: WwSS 9nm ZEX
related: 1f7B E5K sh3
broad match: C2221

Mikrobiolog
type: Concept
in scheme: JobTech Taxonomy - Yrke
definition: Mikrobiolog
broader: Cell- och molekylärbiologer m.fl.
related: CpFD aoS pkZ
related: kJeN wmw 9wX
related: jWLP ek2 Ta6
related: 4UFC xNt DxY
related: TXx8 Mgv BGZ
related: SAgV 56u 6qe
related: fM7t axJ RNN
broad match: C2131

Biomedicinsk analytiker/BMA
type: Concept
in scheme: JobTech Taxonomy - Yrke
definition: Biomedicinska analytiker arbetar med att utföra och analysera medicinska prover och undersökningar för att stödja diagnostik och behandling inom hälso- och sjukvården. Biomedicinska analytiker är en skyddad titel med legitimationskrav. Vanliga arbetsuppgifter är att analysera blod-, vävnads- och andra kroppsvätskeprover eller att genomföra patientnära undersökningar såsom EKG och ultraljud. Biomedicinska analytiker kan också arbeta inom forskning, läkemedelsindustri eller miljöanalys. Källa: Arbetsförmedlingen, Karolinska Institutet, Region Skåne, Socialstyrelsen
alternative label: BMA
alternative label: Biomedicinsk analytiker
broader: Biomedicinska analytiker m.fl.
related: kJeN wmw 9wX
related: NYW6 mP6 vwf
related: sqvh gTy 6Sj
related: srmC QyY 21N
related: incc qjY 87t
related: mvTK ciU fot
related: Yhm4 YuF JU7
broad match: C3212

Barchef
type: Concept
in scheme: JobTech Taxonomy - Yrke
definition: Barchefer planerar, organiserar och leder arbetet i barer. Arbetsuppgifter omfattar bemanningsplanering, dryckesbeställning, lagerhållning, inventering, schemaläggning, introduktion av nya medarbetare samt daglig samordning av barens service. Barchefen deltar ofta själv i bararbetet, särskilt vid hög belastning, och medverkar i utvecklingen av barens sortiment och rutiner. Källa: Visita, Arbetsförmedlingen
broader: Bartendrar
related: 44Qz ANp x4W
related: zeSF YFZ b1Q
related: Ckm8 sHx aow
related: j3gF W64 Kr6
related: epLc SkD cbT
related: KXpu kvY KB2
related: umky diq 9dt
related: bh3H Y3h 5eD
related: ScKy FHB 7wT
broad match: C5132

Dietister
type: Concept
in scheme: JobTech Taxonomy - Yrke
definition: Informerar, ger råd om och undervisar i närings- och kostfrågor. Utreder patienters sjukdomsbild och matvanor samt utarbetar kostförslag. Medverkar i forsknings- och utvecklingsprojekt kring kost och hälsa.
broader: Andra specialister inom hälso- och sjukvård
related: QMhf Re1 fAu
related: JYKn PRX tif
related: iknU zh1 EzK
related: ARgB D2j 2s5
related: PryY ETL JEW
related: U4ay wtk yJy
related: ohBX dJ1 xWK
related: nBDv ZQf RpH
related: dMEF pvp rFw
related: 8FGH zU4 fAt
related: RJ3G xEf vxV
related: o6h8 hBG QHm
related: K7pp Wfp 5ZK
related: wAQ9 vmK Fua
related: CYVV Vw9 mkS
related: 89Ur doj ALY
related: C2265
narrower: Dietist
narrower: Dietiststuderande
broad match: NYW6 mP6 vwf

Besiktningsingenjör, bilprovning
type: Concept
in scheme: JobTech Taxonomy - Yrke
definition: Besiktningsingenjörer inom bilprovning utför registreringsbesiktningar av nya, ombyggda och importerade fordon. Arbetet innebär att kontrollera att fordon uppfyller tekniska krav på säkerhet, genom både inspektioner av fordon samt granskning av dokumentation. Rollen innefattar kontakter både med privatpersoner och företag, så som fordonstillverkare och importörer. Beroende på arbetsplats kan registreringsbesiktningar kombineras med arbete med kontrollbesiktningar. Källa: Arbetsförmedlingen
broader: Säkerhetsinspektörer m.fl.
related: E7hm BLq fqZ
related: 8dts Xo8 6Yd
related: yhCP AqT tns
related: kDNx z5C AmY
broad match: C3115

Yrken inom administration och kundtjänst
type: Concept
in scheme: JobTech Taxonomy - Yrke
top concept of: JobTech Taxonomy - Yrke
definition: Yrken inom administration och kundtjänst
narrower: Andra kontors- och kundserviceyrken
narrower: Kundserviceyrken
narrower: Kontorsassistenter och sekreterare
narrower: Yrken inom materialförvaltning m.m.

Lärling, hissmontör
type: Concept
in scheme: JobTech Taxonomy - Yrke
definition: Efter den grundläggande utbildningen återstår 1 600 timmars lärlingstid i ett hissföretag, som är anslutet till Installationsavtalet EIO/SEF. Därefter utfärdas ett yrkescertifikat som hissmontör. Certifikatet utfärdas av Elbranschens Centrala Yrkesnämnd, ECY. Källa: Arbetsförmedlingen
broader: Industrielektriker
related: yhCP AqT tns
related: ja7J P8X YC9
broad match: C7412

Virolog
type: Concept
in scheme: JobTech Taxonomy - Yrke
definition: Virolog
broader: Cell- och molekylärbiologer m.fl.
related: kJeN wmw 9wX
related: TXx8 Mgv BGZ
broad match: C2131

Budbilsförare
type: Concept
in scheme: JobTech Taxonomy - Yrke
definition: Budbilsförare köra ut paket och varor till företag och privatpersoner. Budbilsförare, även kallat paketbilsförare, köra ut paket och varor till företag och privatpersoner. Arbetet innebär många stopp varje dag, med ständiga i- och urstigningar samt godshantering. Det kan även inkludera transport av farligt gods, livsmedel eller mediciner. Beroende på arbetsplats kan man behöva kunna hantera truck vid lastning och lossning. Det är viktigt att trivas med att ha daglig kontakt med kunder. Källa: Arbetsförmedlingen
broader: Övriga bil-, motorcykel- och cykelförare
related: n6n3 qZH cLV
related: UdVa jRr 9DE
related: e8iC HES HjC
related: JWj2 Dsh mrU
related: EY3i ekR W9x
related: qGJq Ehe Rkf
related: j8GR AUp t9S
related: GhHk G46 Bo4
related: ASGV zcE bWf
related: PVMj 1vM VXf
related: Fdzk KnB o7K
related: KJZZ seB HE2
related: 5AzM x32 gnk
related: 68w3 xw5 nFp
related: MH5y 99x R9S
related: qk55 pbZ hzS
related: 1TwY k44 3ES
related: F9wn mCz F1o
related: UNLs 21j q5P
related: aMV8 94k JcS
related: TPRF yAj Zp5
related: 1kWm TC4 MYY
broad match: C8322

E-commerce manager
type: Concept
in scheme: JobTech Taxonomy - Yrke
definition: E-commerce manager
broader: Chefer inom handel
related: 24fD XYj h4k
related: VevS VKB fpn
related: RPTn bxG ExZ
related: jSyH KFH WcC
related: oGos eZz WjD
related: drN1 qoU 76b
related: y9BT TzG qQ4
related: bh3H Y3h 5eD
related: U2fm sbM 3Yp
related: cftU yvi UZu
related: NWbg rKM FHz
related: 4E8P k6Z H5p
related: 3cpo HP9 i97
related: cd94 aEJ 9GV
related: 13DH k23 bkR
related: thoi 7jh GWY
broad match: C1420

Telefonförsäljare m.fl.
type: Concept
in scheme: JobTech Taxonomy - Yrke
definition: Säljer och förmedlar varor och tjänster per telefon till företag eller privatpersoner. Söker upp och värvar medlemmar eller bidragsgivare till organisationer.
broader: Eventsäljare och telefonförsäljare m.fl.
related: ZuYj ADn tk7
related: bwjW 1SE XWZ
related: aMyW hB7 TpU
related: AaqP 1Sj RUP
related: 7Wwm JuJ ANq
related: QHxK TyX 5zS
related: hYpk RYx y3V
related: AwhJ eLD xpG
related: C5244
related: zBNU qqu TbC
related: 9T9i UN7 zim
narrower: Telefonförsäljare
narrower: Telefonkommunikatör på intresseorganisation
broad match: RPTn bxG ExZ

Försäkringsförmedlarassistent
type: Concept
in scheme: JobTech Taxonomy - Yrke
definition: Försäkringsförmedlarassistenter stöder försäkringsförmedlare administrativt vid hantering av försäkringserbjudanden och kundkontakter. Arbetsuppgifterna kan omfatta administration av försäkringsdokument, registrering av kunduppgifter, bokning av möten samt samordning av ärenden och kommunikation med försäkringsbolag och kunder. Vanligtvis ingår även löpande korrespondens, att förbereda underlag för försäkringsförslag och bistå vid uppdatering av informationsmaterial. Källa: Arbetsförmedlingen
broader: Marknads- och försäljningsassistenter
related: PCkV AZD LDM
related: RPTn bxG ExZ
related: fKju yej bi6
broad match: C4419

Försäljnings- och marknadschefer
type: Concept
in scheme: JobTech Taxonomy - Yrke
definition: Formulerar och ansvarar för mål och strategier för försäljnings- och marknadsverksamhet. Beslutar om ramar för prissättning, rabatt- och leveransvillkor, försäljningsbudget, specialkampanjer m.m. Utformar riktlinjer, följer upp och utvärderar verksamheten mot uppsatta mål inom försäljning och marknad. Svarar för budget samt fördelar resurserna inom verksamheten. Har personalansvar. Hit hör inte Butikschef (1730) Säljande butikschef (5222) Avdelningschef, butik (5222)
broader: Försäljnings- och marknadschefer
related: t4f1 Akp Afr
related: sA2V erA 3WN
related: gHYj fbm KcU
related: Bb7a V49 Da8
related: E9LX 1eF jDB
related: UH9g R5v MCx
related: Z8gz 6SV bKW
related: 8tYq EXD Xwm
related: ZzN5 m7B 5CY
related: GCUK vig qRE
related: 3LEE 29Y TAe
related: DXNc cU4 j4N
related: Nksx 4oe fEQ
related: eThQ HCv mY6
related: ZxKX dN4 8DJ
related: xSbx mnD bdK
related: Gt5f wdi FSJ
related: C1221
related: q7Mx gjU F9q
related: yXmf iKi 7ci
related: VfP9 2xd g2h
related: zXNU zXR hGd
related: eKuz edm kmi
related: 4fRg DA4 Dj3
related: Leez v3g kU1
related: 8yeu mjf FZD
related: Lz84 K5d CcL
related: kJrF R2t t6F
related: qTCs crJ Lzw
narrower: Teamledare
narrower: Försäljningschef
narrower: Cityledare
narrower: Centrumutvecklare/Handelsutvecklare
narrower: Marknadschef
broad match: bh3H Y3h 5eD

Präst, annat trossamfund
type: Concept
in scheme: JobTech Taxonomy - Yrke
definition: Präst, annat trossamfund
broader: Präster
related: GazW 2TU kJw
broad match: C2636

Hörselpedagog
type: Concept
in scheme: JobTech Taxonomy - Yrke
definition: Person som ger råd och rehabilitering till personer med nedsatt hörsel eller med kokleaimplantat samt råd och utbildning till anhöriga. Källa: SKR
broader: Speciallärare och specialpedagoger m.fl.
related: 3pyE aAA TFD
related: eMk2 64K eCS
related: MVqp eS8 kDZ
broad match: C2351

Balettmästare
type: Concept
in scheme: JobTech Taxonomy - Yrke
definition: Balettmästare ansvarar för att leda, organisera och utveckla dansverksamheten inom en balettensemble eller vid ett operahus. Vanliga arbetsuppgifter är att ge balettens dansare daglig träning, leda repetitioner samt assistera koreografer vid instuderingar. Balettmästaren ska också säkerställa att dansarna behärskar koreografin och tekniken i föreställningarna. Källa: Arbetsförmedlingen, Kungliga Svenska Balettskolan
broader: Koreografer och dansare
related: 8too bEs 7NU
related: 9puE nYg crq
broad match: C2653

Utvecklare inom spel och digitala media
type: Concept
in scheme: JobTech Taxonomy - Yrke
definition: Utvecklar och programmerar spel och andra interaktiva medier som innefattar grafik och digitala animationer.
broader: IT-arkitekter, systemutvecklare och testledare m.fl.
related: eTW8 AY5 tpe
related: wynY a5Q F6t
related: HWTe SaB wiT
related: C2513
related: beea hNs XWo
related: Fyzv 4ku Cse
related: pwNB ces 8hN
related: 1CnL 8ZQ tTd
related: C69V W4p i5E
related: o8wR 57f jv9
related: F4nq ZH3 s3u
related: P6U8 Qpe TeQ
related: RBFh BjH AsD
related: DLBo TAb Qet
related: oQre F86 kHG
related: Lrrv HyL PzJ
related: ifWk o4W Gir
related: 6uCy RbZ aDM
related: 3nRt vck Jrv
related: FQAi Nxv 4VZ
related: Ddz9 bNV nbY
related: xfBk GnW pct
related: zxxJ VTR hpo
related: bCHJ RTc sVi
related: HQJ2 68A AiZ
related: 7S6x Nic TFv
related: LShp t9S Cc6
related: yNm8 krX usR
related: nf2k RuW WEC
related: mBmm gfH wXb
related: jjkC sJJ ZT3
related: gtoY Bwt 23m
related: eSrN jTs Uqh
related: ND2K ivB 6RA
related: i7AP ut3 TKX
related: muKv rHW 7ES
related: 5Vk5 FW2 ceH
related: 3ss3 e8D Nsx
related: H5KZ roq acH
related: bN1e YZo pHh
related: KoMU LJN 94D
related: 9vTv F6k ndN
related: yQcc fTn JL5
related: b28z 7oo rKZ
related: jBKc 5Yx Y6T
related: wWte 6Xd fmQ
related: paEM G5u oz6
related: x2P4 2XP SSX
related: KGEA Afs uqD
related: iZAE GkE dmJ
related: TTdj xw2 7wB
related: rA3m fps z3i
related: Pwhj Nx4 adW
related: d4EY PCu S8T
related: RW1u RsN E8h
related: Vr6A uKB a5E
related: MD7y HEd aEE
related: KJ76 PSw Nub
related: 6Npn 22J DRb
related: r8Zw MZC SKk
related: a1fp jjB ydV
related: M1tF Ut1 k3N
related: LB2k 2pd Vgk
related: on1Q YPq eww
related: qYWH 9ba mjv
related: eBgZ cwn FN8
related: xKTb Ger HCf
related: YPFx KXB ZAA
related: ih97 BSR 99C
related: hL3z i7Y 9mr
narrower: Engine programmer, games
narrower: Tech and Tools programmer, games
narrower: Gameplay programmer
narrower: Game programmer
broad match: apaJ 2ja LuF

Turnétekniker
type: Concept
in scheme: JobTech Taxonomy - Yrke
definition: Turnétekniker planerar, riggar och driftar ljud-, ljus- och scenutrustning vid konserter och evenemang. Vanliga arbetsuppgifter är att sätta upp och kalibrera ljud-, ljus- och bildsystem, samarbeta med artister och teknisk personal samt säkerställa kvalitet och säkerhet i produktionen. Det ingår ansvar för att all teknisk utrustning fungerar under turnéer och evenemang. Källa: Arbetsförmedlingen, Platsannonser
broader: Ljus-, ljud- och scentekniker
related: 8too bEs 7NU
related: 9puE nYg crq
related: yhCP AqT tns
related: d1Ao 9bY 7Kn
broad match: C3435

Civilingenjör, kvalitet, elektronik
type: Concept
in scheme: JobTech Taxonomy - Yrke
definition: Civilingenjör, kvalitet, elektronik
broader: Civilingenjörsyrken inom elektroteknik
related: 6Hq3 tKo V57
related: kDRm Yaa jAB
broad match: C2152

Lärling glastekniker
type: Concept
in scheme: JobTech Taxonomy - Yrke
definition: En lärling är anställd för att slutföra sin lärlingstid till glastekniker innan ett yrkesbevis kan utfärdas. Under lärlingstiden får du lärlingslön enligt avtal. Lärlingstiden tillsammans med teoretisk grundutbildning och yrkesprov leder till yrkesbeviset. Ett lärlingsavtal mellan branschorganisation och företag tecknas. Källa: Glasbranschföreningen
broader: Glastekniker
related: PaxQ o1G wWH
related: ja7J P8X YC9
broad match: C7125

Processövervakare, kemisk industri
type: Concept
in scheme: JobTech Taxonomy - Yrke
definition: Styr och övervakar exempelvis pumpar och kompressorer på anläggningar för raffinering och annan behandling av petroleum eller petroleumbaserade produkter. Sköter anläggningar för behandling av kemikalier genom krossning, upphettning, blandning, destillering, filtrering m.m.
broader: Drifttekniker och processövervakare
related: M8Ht hND Hsi
related: aQBk xvy q43
related: pGts PKK c8W
related: aF3J SgE uck
related: bEBR w2z aLu
related: tLci gYE gHR
related: iSWP AHA BSj
related: kfmY 4ux JkM
related: 41zn 6hT 9Az
related: 1vX4 pj1 yao
related: NzuP CdY o85
related: EsB4 55e Xwk
related: C3134
related: chhK KU5 vSH
related: Q6DB h8V mc7
related: C3133
related: GCYi 9tC 1pP
related: Z62p 8do ctd
related: W4er Syp Wrt
related: y1uz Rxx SWg
related: cMKB YTT EL3
related: HCSE Efi Lhk
related: AiwS Mhv ttk
related: KDN2 gBV qxt
related: MT1a Nyq DGQ
related: CgSF umG Epv
related: WFy9 Z7H oAc
narrower: Processoperatör kemisk industri
narrower: Processoperatör bioraffinaderi
broad match: yhCP AqT tns

Forsknings- och utvecklingschefer
type: Concept
in scheme: JobTech Taxonomy - Yrke
definition: Formulerar och ansvarar för mål och strategier för forsknings- och utvecklingsverksamhet. Utformar riktlinjer, följer upp och utvärderar verksamheten mot uppsatta mål för forskning och utveckling. Ansvarar för utvecklingen av tekniska processer, produkter, kunskap eller materialanvändning. Svarar för budget samt fördelar resurserna inom verksamheten. Har personalansvar.
broader: Forsknings- och utvecklingschefer
related: aSt1 LXQ MCx
related: C1223
related: BQqf 7nu gN5
related: WvVX bmW iWu
related: 7tVG 9zf 7mw
related: T8Gi jkC 6PC
related: UH9g R5v MCx
related: 8tYq EXD Xwm
related: uGaX 6vC 5Tq
related: ZzN5 m7B 5CY
related: Nksx 4oe fEQ
related: eThQ HCv mY6
related: Gt5f wdi FSJ
related: q7Mx gjU F9q
related: zXNU zXR hGd
related: Leez v3g kU1
narrower: Utvecklingschef
narrower: Forskningschef
narrower: Laboratoriechef
narrower: Forskningschef, museum
narrower: Produktutvecklingschef
narrower: Hållbarhetschef
broad match: bh3H Y3h 5eD

Turnéläggare
type: Concept
in scheme: JobTech Taxonomy - Yrke
definition: Turnéläggare planerar, koordinerar och genomför turnéer för artister, band och andra scenkonstnärer. Vanliga arbetsuppgifter är att detaljplanera turnéupplägg, boka spelställen, säkerställa transporter, boende och teknisk support samt hantera budget och kontraktsförhandlingar. Källa: Arbetsförmedlingen, Platsannonser
broader: Övriga förmedlare
related: RPTn bxG ExZ
related: 8too bEs 7NU
related: 9puE nYg crq
broad match: C3339

Målare
type: Concept
in scheme: JobTech Taxonomy - Yrke
definition: Underbehandlar och målar byggnader in- och utvändigt. Spänner väv och tapetserar. Underbehandlar och målar anläggningar och konstruktioner av olika slag.
broader: Målare, lackerare och skorstensfejare m.fl.
related: v3d9 u2H pnf
related: YVcu 9ND 78u
related: nuRM zb9 2wV
related: Ytcy v8N P2w
related: pTBQ xHF xur
related: C7131
related: 3rxW gh6 Msm
related: qmjx paH ZC4
related: oLFv MpK XZm
related: PELm cH9 AE9
related: Q7eC B7g QiU
related: A6t1 k6h bKY
related: pvuA or6 TLK
related: qdJB 5Qn i5h
related: M7C1 DAy UTK
related: fhcp fFw Lbj
related: gSne tqs z2e
related: 6VeN XR4 Zuj
related: taJh qCi EnQ
related: Jm6m Y8M fmY
related: nkhA jPz pcE
related: U1ud XV7 Z8o
related: ynWd oCo o61
related: xeoH rao GgZ
related: fhu6 H74 uuN
related: Bumt 8bQ nx8
related: Gmnh 2UL LeS
related: WLAi BDr 5fW
related: KfEn V5y npV
related: 5Av7 qB2 msb
related: ZJvR 2nd oep
related: HmXd ehy QT9
related: wn7T k1d TBe
related: WHy8 fH9 7X9
related: 2bSD ghf anH
related: ZTk2 7eo CUb
related: WrVH jzF ozJ
narrower: Lärling, målare
narrower: Målare
broad match: j7Cq ZJe GkT

Säljledare
type: Concept
in scheme: JobTech Taxonomy - Yrke
definition: Säljledare
broader: Företagssäljare
related: xAHr miX FyW
related: Edde aMS jiB
related: rAnY LUr zS3
related: 2wBv mkc Qss
related: wcAz cRp uut
related: eN5U 3Ci qYj
related: 7LQW iKY nGE
related: 3CbA x8s WkF
related: RPTn bxG ExZ
related: FDTd sEu tRr
related: 197S SUm Uu1
related: ug8t 3Cs A8k
related: ak4V z9L E7b
related: fkyC ohE A66
related: 9SzW SMk Dh8
related: YY3x aiB AVN
related: rhji NqK hhY
related: oH5R FK5 mog
related: CuSU d7h jhD
related: pcL9 s6N 4Zo
related: Aqfy en5 nru
related: Dc3s mJg 5pq
related: PWqk iCR opv
broad match: C3322

Tak- och tätskiktsmontör
type: Concept
in scheme: JobTech Taxonomy - Yrke
definition: Som tak- och tätskiktsmontör gör du hela tätskiktet, först isoleringen, både värmeisolering och fuktskydd, sen täcks taket med papp, plåt eller förtillverkade takelement. Tätskikt monteras på många ställen, från att vara kapillärbrytare i mark till tätning på broar och valv. En tak- och tätskiktsmontör jobbar med material som ska tåla väder och behöver därför ha kunskap om brandventilation, takfönster, gasolbrännare, plåt, papp, takbrunnar och isoleringsmaterial. Tak- och tätskiktsmontören kan ansöka om sitt yrkesbevis efter teoretisk grundutbildning och lärlingsanställning. Källa: BYN
broader: Takmontörer
related: 1p4V Szb 19Q
related: zcU7 WWH bKm
related: Hqpf 5Ff 4BK
related: PU3Q ZmM NCz
related: e6i8 U4x xcH
related: U1pj KLH uMw
related: FHDR rx7 DMf
related: j7Cq ZJe GkT
related: fk3g hWW Vy1
related: 5iaT X31 7yc
related: 5sRy fmT BA4
related: xe9C BwW kE8
related: ja7J P8X YC9
related: ZMzW 7Bo knv
related: jb2Y ZRg Crt
related: SbQW LYj Nao
broad match: C7121

Chefer inom förskoleverksamhet
type: Concept
in scheme: JobTech Taxonomy - Yrke
definition: Chefer inom förskoleverksamhet
broader: Chefer inom utbildning
narrower: Chefer inom förskoleverksamhet

AML-Specialist
type: Concept
in scheme: JobTech Taxonomy - Yrke
definition: AML Specialist jobbar mot penningtvätt eller andra former av finansiell kriminalitet. Rollen fokuserar på det utredande arbetet med att förebygga och bekämpa ekonomisk brottslighet. Arbetet består bland annat av att utreda, analysera och dokumentera ägarstrukturer. Samt göra kontroller och utreda transaktioner med förhöjd risk för penningtvätt. Källa: Finansförbundet
broader: Controller
related: QSob 5er 2m9
related: bEm2 oxk PyT
related: oaTa Wds PF1
related: sEMj b6v nnU
related: u8wK cbj 8Vf
related: eQFc 7Vq buj
related: X82t awd Qyc
related: BJdQ BNb NDf
related: svNT NrN SWH
broad match: C2411

Interaktionsdesigner
type: Concept
in scheme: JobTech Taxonomy - Yrke
definition: Interaktionsdesigner
broader: Övriga IT-specialister
related: YoEa bHT WPi
related: qjvP Udi Z6Z
related: e5FL ut2 cCy
related: oz7K uYT nbx
related: aXpj 8KM ech
related: KiWi YQm Tvq
related: apaJ 2ja LuF
related: WqAh 84W c8j
related: TUUX Tiu qrX
related: KT6P hVH LRD
related: dioy zD1 k37
related: pvRH 41J VRv
related: iW5c SEM RsE
related: 1NFA tQF Lp3
broad match: C2519

Övriga chefer inom samhällsservice
type: Concept
in scheme: JobTech Taxonomy - Yrke
definition: Övriga chefer inom samhällsservice
broader: Chefer inom hälso- och sjukvård samt annan samhällsservice
narrower: Övriga chefer inom samhällsservice

Produktionstekniker, petroleumutvinning
type: Concept
in scheme: JobTech Taxonomy - Yrke
definition: Produktionstekniker, petroleumutvinning
broader: Ingenjörer och tekniker inom gruvteknik och metallurgi
related: 6Hq3 tKo V57
broad match: C3117

Personbilsförare
type: Concept
in scheme: JobTech Taxonomy - Yrke
definition: Personbilsförare flyttar, hämtar och lämnar personbilar. Personbilsförare arbetar med att flytta, hämta och lämna personbilar. Det kan vara att flytta bilar mellan anläggningar, till exempel på uppdrag av bilhandlare. Det kan även vara att hämta och lämna hyrbilar eller bilar sålts eller köpts av kunder. Man kan även vara anställd av företag eller privatpersoner som chaufför, till exempel privatchaufför, eller köra personer mellan vårdinrättningar. Källa: Arbetsförmedlingen
broader: Övriga bil-, motorcykel- och cykelförare
related: BjKK QBD NEM
related: ASGV zcE bWf
related: zfFz v8q g8a
related: 68w3 xw5 nFp
related: VNGU P8A nHQ
broad match: C8322

Processingenjör, metallurgi
type: Concept
in scheme: JobTech Taxonomy - Yrke
definition: Processingenjör, metallurgi
broader: Civilingenjörsyrken inom gruvteknik och metallurgi
related: 6Hq3 tKo V57
related: AZPQ Dz2 LGF
broad match: C2146

Logopedstuderande
type: Concept
in scheme: JobTech Taxonomy - Yrke
definition: Logopedstuderande är en student som utbildar sig till logoped. Vanliga arbetsuppgifter är att assistera vid utredningar av barns språkutveckling, följa upp behandlingsinsatser och informera närstående och annan personal under handledning. Källa: Arbetsförmedlingen, Sveriges Kommuner och Regioner
broader: Audionomer och logopeder
related: NYW6 mP6 vwf
related: 1QhG ckv DnP
broad match: C2266

Lexikograf
type: Concept
in scheme: JobTech Taxonomy - Yrke
definition: Lexikograf
broader: Översättare, tolkar och lingvister m.fl.
related: 9puE nYg crq
broad match: C2643

Rekryterare/Rekryteringskonsult
type: Concept
in scheme: JobTech Taxonomy - Yrke
definition: Rekryterare/Rekryteringskonsult
alternative label: Rekryterare
alternative label: Rekryteringskonsult
broader: Personal- och HR-specialister
related: uoVV 15x oVD
related: wHLw pFn QKo
related: fE6b c7b NVY
related: DpfT jWm Eu5
related: 65mN z6z cSF
related: vYCa VNd Na6
related: YWft bBn Jyt
related: QTF9 UDa FrS
related: MQMo p61 pHw
related: 2zVL BHs 8Dc
related: X82t awd Qyc
related: KWC4 8Bq sHG
related: MX9B 6gq WVy
related: No1j 4qo TpC
related: VGJs 7ni fK8
related: r91Q Qr5 QbE
related: wWFM Yik wra
related: FyGg ss6 nXp
related: GYdS 6dT FcC
related: ADcr x1W BbY
related: N6Cs kxs Csa
related: pyNJ Xcf xzg
related: QAWU RRH biD
related: 4z5j zBu if5
related: xt6Q HTS tL3
related: kHiW piu zF9
related: uKVG yiZ gEk
related: jQXu EFN iSF
related: 5BUi Vo9 AKf
related: S2c5 fqJ kVW
related: WYWy aZS 9E8
related: HPny rCa Cgr
related: hiaJ Aqx vDd
related: qbme wLb EFU
related: YrV9 y9p 2rs
broad match: C2423

Husvagnsförsäljare
type: Concept
in scheme: JobTech Taxonomy - Yrke
definition: Husvagnsförsäljare arbetar med försäljning av husvagnar, husbilar och tillbehör. Arbetsuppgifterna inkluderar presentation av fordon, kundkontakt, offertskrivning, inbytesvärdering och uppföljning efter leverans. Kunskaper om finansiering och försäkring är viktigt i arbetet. Husvagnsförsäljare har vanligtvis god förståelse om fordonsteknik och trafikregler. Källa: Arbetsförmedlingen
broader: Butikssäljare, fackhandel
related: UM5z 1bx 5rf
related: rDcj Tao TJJ
related: RPTn bxG ExZ
related: RvaJ vnG Vbr
broad match: C5223

Museiintendenter m.fl.
type: Concept
in scheme: JobTech Taxonomy - Yrke
definition: Planerar och organiserar verksamhet på museer och konstgallerier samt ordnar utställningar och visar samlingar. Samlar in, undersöker, bedömer, klassificerar och dokumenterar miljöer eller föremål av kulturhistoriskt värde. Vårdar, förmedlar kunskap och ger råd om föremål.
broader: Museiintendenter och bibliotekarier m.fl.
related: Fo6h Y3m zJe
related: NEME JBz qhc
related: Eqx1 Q87 nV5
related: EaE2 UK8 eSV
related: UjRh U4o ZQd
related: csA4 uVB N8C
related: 44Lr qs6 RTG
related: 7Rqo DET snS
related: o5n4 Kub Rja
related: mKgc 2aa 9rK
related: s2Sw EzL Jf9
related: C2621
related: McR1 y6q 1U5
related: tqcW y4m 8xb
related: 1dVh cZS Exw
related: 8ss2 KNx H87
related: hdcx LQy E9z
related: XRfU bRB DwH
related: 9xoS pdu wqL
related: WcBe kcV 3nX
related: SHmn nzf PJi
narrower: Länsantikvarie/1:e antikvarie
narrower: Konstintendent
narrower: Museiintendent
narrower: Curator
narrower: Bebyggelseantikvarie
narrower: Konstkonsult
narrower: Antikvarie
broad match: 9puE nYg crq

Förhandlingschef
type: Concept
in scheme: JobTech Taxonomy - Yrke
definition: Förhandlingschef
broader: Fastighets- och förvaltningschefer
related: X82t awd Qyc
related: epLc SkD cbT
related: bh3H Y3h 5eD
broad match: C1219

Flygplanslastare
type: Concept
in scheme: JobTech Taxonomy - Yrke
definition: Flygplanslastare hanterar bagage och gods på flygplatser. Som flygplanslastare har man ansvar för att allt bagage och gods hanteras säkert och lastat på och av flygplanen. Vanliga arbetsuppgifter är att lasta på och av bagage samt fraktgods, avisa flygplan, manövrera gater vid ankomst och avgång. Källa: Transportfackens Yrkes- och Arbetsmiljönämnd
broader: Ramppersonal, flyttkarlar och varupåfyllare m.fl.
related: UdVa jRr 9DE
related: XZWT 1AW WjE
related: ASGV zcE bWf
related: KU3a mpw mGd
related: gbAn 6ro kBk
broad match: C9333

Teaterpedagog
type: Concept
in scheme: JobTech Taxonomy - Yrke
definition: Teaterpedagog
broader: Övriga pedagoger med teoretisk specialistkompetens
related: pVzY rff Amk
related: ikxC 9tH f38
related: MVqp eS8 kDZ
broad match: C2355

Sportchef
type: Concept
in scheme: JobTech Taxonomy - Yrke
definition: En sportchef, även kallad sportdirektör, är en ledande befattning inom idrottsföreningar med ansvar för den sportsliga verksamheten. Rollen innebär att planera, utveckla och leda lagets eller föreningens sportsliga arbete för att nå uppsatta mål, både på kort och lång sikt. Sportchefen ansvarar för rekrytering och kontraktsförhandlingar med spelare, tränare och annan sportslig personal samt leder arbetet med att bygga och utveckla spelartruppen samt tränarteamet. Källa: Södertörns högskola, div jobbannonser
broader: Chefer inom friskvård, sport och fritid
related: Nyua NW1 sfv
related: ar3q K5u y7T
related: HBGg f9x TML
related: MF57 QSQ Lfq
related: CSsn kPg 4jN
related: epLc SkD cbT
related: 536f ceV QnQ
related: Dd2Y Ft7 ePf
related: tVmy Ekk Jyt
related: yYtF 2pt HKN
related: MVqp eS8 kDZ
related: fmvN m7H 57k
broad match: C3422
broad match: C1431

Tegelbruksarbetare
type: Concept
in scheme: JobTech Taxonomy - Yrke
definition: Tegelbruksarbetare sköter maskiner för tillverkning av tegelprodukter. Tegelbruksarbetare sköter maskiner för tillverkning av tegelprodukter, så som takpannor och tegelstenar. Förutom drift maskinskötseö är vanliga arbetsuppgifter provtagning, kvalitetskontroll, dokumentation, tillsyn och underhåll. En viktig del i arbetet avser säker hantering och processteg enligt instruktioner. Truckkörning är även förekommande. Källa: Arbetsförmedlingen
broader: Övriga process- och maskinoperatörer
related: JW3S Zx1 Zt6
related: 2f29 CMA VK3
related: 5WZr jPZ tiN
related: KiNe Z29 J5F
related: qqhC 43q rtk
related: 4N7p ofG 4mN
related: wTEr CBC bqh
broad match: C8181

Delgivare
type: Concept
in scheme: JobTech Taxonomy - Yrke
definition: En delgivare, är en person som i enlighet med svensk lag formellt lämnar över juridiska dokument eller beslut till privatpersoner eller företag i rättsliga ärenden. Uppdraget innebär att säkerställa att mottagaren får kännedom om ett ärende, ofta genom att hitta och personligen överlämna handlingar. Delgivningsmän kan arbeta för kommuner, domstolar, inkassobolag eller privata delgivningsföretag och deras arbete kan vara krävande men är ett viktigt led i rättssystemet. Personal som jobbar med delgivning måste vara godkända av Länsstyrelsen och jobba i ett auktoriserat företag. Källa: Länsstyrelsen Stockholm
broader: Inkasserare och pantlånare m.fl.
related: Efa1 iKp KcZ
related: X82t awd Qyc
related: QcD8 9TW sWt
broad match: C4214

Lednings- och organisationsutvecklare
type: Concept
in scheme: JobTech Taxonomy - Yrke
definition: Utreder företags och organisationers verksamhet. Föreslår och planerar åtgärder för att utveckla och rationalisera verksamheten.
broader: Organisationsutvecklare, utredare och HR-specialister m.fl.
related: eTW8 AY5 tpe
related: oA3e PmG Ec6
related: N4f3 cLE ygk
related: q6QD 6et rcJ
related: E13X ZF3 PAb
related: TuP9 SAc iMs
related: tg8L maz wMN
related: De8g eY4 Mdg
related: D14A syC i23
related: kjop UjM GNT
related: AQtr C7f Dyt
related: h6B2 Egm LWp
related: hd6P B62 pFX
related: LLQd jDh gdd
related: G7Qq r7L 5Jo
related: E9LX 1eF jDB
related: hcdL zcK zgq
related: 7ynT 9mC a1o
related: edrF hXV qd9
related: Z8gz 6SV bKW
related: Veoy TRu rDY
related: EboV hrY Y9z
related: X9oL 76D P7S
related: 1L4q b6t eaQ
related: 9jJ4 gL1 wjS
related: a1Sf mey gVk
related: G2E9 yG4 zBW
related: swyJ kkJ zHd
related: 2rqG WLp em4
related: Q6DB h8V mc7
related: u3bU va9 8dx
related: dB1q YY2 zNu
related: JyRc EQG XTM
related: 6yhb 2aB Kjk
related: WYaT AGN yT4
related: Gt5f wdi FSJ
related: W4er Syp Wrt
related: q7Mx gjU F9q
related: MMmf fS3 L5R
related: VfP9 2xd g2h
related: zXNU zXR hGd
related: 9ikw xMV uTJ
related: C2421
related: NB2C zFs C9F
related: cULS KHX WUY
related: zARh YPC Lwk
related: 5NCy xRP RJK
related: Leez v3g kU1
related: 3Sj1 uuL y1A
related: Betk ZCh mY9
related: 3TSx fJE Z26
related: 3i8p YXT 3B5
related: vtpi HNe rDj
related: 3zgs 61Q etM
related: uNtd ZYt HFA
related: TzHP 38y mhm
related: GttC qWt DqB
narrower: Affärsanalytiker/Business analyst
narrower: Ekonomikonsult
narrower: Kvalitetssamordnare/Kvalitetskoordinator
narrower: Organisationskonsult
narrower: Civilingenjör, organisationsutveckling
narrower: Verksamhetskonsult
narrower: Affärsutvecklare
narrower: Organisationsutvecklare
narrower: Företagskonsult
narrower: Affärsarkitekt
narrower: Kvalitetsrevisor
narrower: Verksamhetsutvecklare
narrower: Verksamhetsarkitekt
narrower: Verksamhetsanalytiker
broad match: X82t awd Qyc

Gruppledare inom socialtjänst
type: Concept
in scheme: JobTech Taxonomy - Yrke
definition: Gruppledare inom socialtjänst stödjer och leder arbetsgruppen i det dagliga operativa arbetet. Arbetsuppgifterna inkluderar arbetsledning och stöd till socialsekreterare, fördelning av ärenden och prioriteringar samt uppföljning av arbetssätt för att säkerställa rättssäker och kvalitativ handläggning. Gruppledare deltar i introduktion av nyanställda, utveckling av rutiner och metodarbete samt skapar förutsättningar för samverkan internt och externt. Rollen innefattar också beslutsfattande inom gällande delegationsordning och planering vid frånvaro. Källor: Jobbannonser på Platsbanken, kommunala hemsido
broader: Socialsekreterare
related: GazW 2TU kJw
related: PXYT ipZ q44
related: DpaV UG4 bDB
broad match: C2635

Läkeeurytmist
type: Concept
in scheme: JobTech Taxonomy - Yrke
definition: Läkeeurytmist
broader: Terapeuter inom alternativmedicin
related: NYW6 mP6 vwf
related: Uuf1 GMh Uvw
broad match: C3230

Bussmekaniker
type: Concept
in scheme: JobTech Taxonomy - Yrke
definition: Bussmekaniker servar, felsöker och reparerar bussar. Bussmekaniker har mycket gemensamt med maskinmekaniker och lastbilsmekaniker då man arbetar med att utföra felsökning, reparation och service på tunga fordon. Bussmekaniker har däremot specialiserat sig på bussar. Yrket kräver stora kunskap inom mekanik och elektronik. I moderna bussar finns ett stort antal ihopkopplade datorer, varför man behöver kunskaper inom IT och digitala verktyg för att kunna utföra sitt arbete. Källa: Arbetsförmedlingen
broader: Motorfordonsmekaniker och fordonsreparatörer
related: XL7b iSV 1K3
related: Wf3e vz9 Jkb
related: PYDe r2M iaK
related: ASGV zcE bWf
related: nG5J 2VE Gmv
related: yhCP AqT tns
related: uqsj v9q Yjt
related: pxwK AHZ Rmh
related: EtAZ kR1 RAd
broad match: C7231

Slaktare och styckare m.fl.
type: Concept
in scheme: JobTech Taxonomy - Yrke
definition: Slaktar djur samt grov- eller finstyckar djurkroppar. Tillverkar charkuterier och andra köttvaror. Konserverar kött och andra livsmedel med hjälp av saltning, torkning och rökning. Hit hör inte Färdigmatlagare (8161) Charkuteriarbetare, butik (5222) Maskinoperatör, kött- och fiskberedningsindustri (8161)
broader: Slaktare, bagare och livsmedelsförädlare m.fl.
related: s5nN ufD 8ay
related: uk72 nCq m5Z
related: 5F1D zuk ryU
related: C7511
related: LEVN eV2 yrf
related: UFfC aC2 MiC
related: 7Rku rpo no9
related: Cark UGW hHY
related: qQ61 EQR rcz
related: VTwt 5Fe 6bW
related: hg5M 53c S64
related: Dywf BPg usG
related: EW9E M7k Wia
related: 9GNa nSh NbR
related: RgyY yQo 1ZQ
related: yEGV YGq DU3
related: Uuda 4Yj rq2
related: uZ1o wX9 XMb
related: Au1Z 3sQ Nss
related: tPYe p8C v4Z
related: v3fC W2t xPP
related: AP6y xf5 4WK
related: 68uT dxo CZG
related: Nck1 p2a Vau
related: eKuz edm kmi
related: sUAW 2Ub md4
related: 5Q7S Ezy xhi
related: wZw9 tMu UdV
related: uenm 75h fEh
related: kj4Q nLh u8Q
narrower: Charkuterist
narrower: Slaktare
narrower: Styckare
broad match: wTEr CBC bqh

Svetsingenjör
type: Concept
in scheme: JobTech Taxonomy - Yrke
definition: Svetsingenjör
broader: Civilingenjörsyrken inom maskinteknik
related: SuAn oH9 xNc
related: 6Hq3 tKo V57
related: Vf2W wg2 6GY
related: DF9N p5K 4yn
broad match: C2144

Environment artist
type: Concept
in scheme: JobTech Taxonomy - Yrke
definition: Environment artist skapar visuella och tredimensionella miljöer som utgör spelvärldarnas bakgrunder och atmosfär. Vanliga arbetsuppgifter är att designa landskap och byggnader, ljussätta och skapa den stämning som spelets berättelse och game design kräver. Environment artist samarbetar nära med speldesigners, programmerare och andra grafiker för att säkerställa att miljöerna fungerar både visuellt och tekniskt i spelet. Källa: Arbetsförmedlingen
broader: Designer inom spel och digitala medier
related: oeHg J1V PEg
related: apaJ 2ja LuF
related: 8too bEs 7NU
related: 9puE nYg crq
broad match: C2166

Kontrollingenjör, gruv, metallurgi
type: Concept
in scheme: JobTech Taxonomy - Yrke
definition: En kontrollingenjör inom gruva/metallurgi arbetar med att övervaka och optimera produktionsprocesser i en gruva eller inom metallframställning och bearbetning. Deras arbete innefattar att säkerställa att produktionen följer satta standarder, identifiera och åtgärda kvalitetsproblem, samt att utveckla och implementera förbättringsåtgärder. De samarbetar ofta med andra ingenjörer och produktionspersonal för att uppnå detta. Källa: Arbetsförmedlingen
broader: Ingenjörer och tekniker inom gruvteknik och metallurgi
related: 6Hq3 tKo V57
related: 9LPR 1CF WEc
broad match: C3117

Enterprise Architect
type: Concept
in scheme: JobTech Taxonomy - Yrke
definition: Enterprise Architect
broader: Systemanalytiker och IT-arkitekter m.fl.
related: hEvL sWW nLL
related: apaJ 2ja LuF
related: MJZd mtE FNQ
related: qBsw ikL hZ2
broad match: C2511

Plattsättare
type: Concept
in scheme: JobTech Taxonomy - Yrke
definition: Plattsättare klär innerväggar eller golv med kakel, klinker, konstbetongplattor eller mosaik. Plattsättaren utför även underarbeten såsom att fuktisolera golv och väggar i våtutrymmen. Som plattsättare är noggrannhet viktigt, inte minst vid arbeten med våtrum, för att förhindra vatteninträngning i övriga byggdelar. Arbetet utförs oftast inomhus och arbetsuppgifterna varierar alltifrån att sätta upp plattor i ett badrum till att kakla en 50-meters simbassäng. Källa: BYN
broader: Murare m.fl.
related: gmGC FhZ r4d
related: MnPy 8fk j4m
related: FQxY MTC FJ9
related: j7Cq ZJe GkT
related: TBZi kPb uGm
related: Zko3 gps YY9
related: s2Fg u89 geQ
related: Ya68 eCh UMA
related: wvxd xXd 4xk
related: ja7J P8X YC9
related: KoT1 hUA fWK
related: JvYP sZJ cQU
broad match: C7112

Landsarkivarie
type: Concept
in scheme: JobTech Taxonomy - Yrke
definition: Landsarkivarie
broader: Övriga chefer inom samhällsservice
related: epLc SkD cbT
related: bh3H Y3h 5eD
broad match: C1349

Byggnadsingenjör
type: Concept
in scheme: JobTech Taxonomy - Yrke
definition: Byggingenjörer behövs ända från idéutveckling och detaljplanering, till färdigställande och besiktning. De gör ritningar och konstruktioner efter beställarens behov och arbetar i kontakt med myndigheter och entreprenadfirmor för bygglov och upphandlingar. Mycket ska kalkyleras och analyseras innan själva byggnationen kan påbörjas. Byggnationen ska sedan följas noggrant för att hålla budget och tidsram. Slutligen besiktigas byggnaden och projektet kan avslutas. Källa: Arbetsförmedlingen
broader: Ingenjörer och tekniker inom bygg och anläggning
related: RwH3 Uvn BaS
related: FJbx Hui fid
related: 81bT VP1 Twt
related: WtrN YYE Lxo
related: dpZH 3ZD KGY
related: KW5z 22R cim
related: EaQN Yuf YLN
related: 2mn5 n3e ghR
related: Bttp J6E wbR
related: 72by HWx 6hu
related: qa9W YLL EnV
related: j7Cq ZJe GkT
related: hNcT nu2 XEG
related: 19zK DKu W9A
related: fRp2 KgS v3B
related: 2mNz qwC Ggt
related: VFT5 Vf3 vut
related: W3d9 xPM jGf
related: oGAk yxq z5Y
related: 6dJ9 1yM oeh
related: ZwrD 9aF wSA
related: 94Tz 2dV Fcg
related: JTLa A9X RyN
related: sf26 DJR Wos
related: uNW9 h3h Zh8
related: PDa9 rTK 9vf
related: 45PZ NQn frm
related: MZvM Xik q9x
related: SGKN BFt a15
related: KEpS iFT B8A
related: ja7J P8X YC9
related: 5r43 ott XSY
related: VZGx RYt b5p
related: ifXr zgK pYg
related: REMR Xdm V3o
related: GKN9 oci Aoe
related: kYKj 34i ZTe
related: Yyny PV5 4qD
related: Rk9K MVy TTp
related: 1TrF t5r Pf4
related: CkA6 cuX 2ws
related: ZjCw 9JF b8s
related: Fhy1 Atp MnG
related: e287 ewE 5Mo
related: Gieg UQq Ju6
related: woe2 2FZ EXd
broad match: C3112

Utvecklingsingenjör, el-tele
type: Concept
in scheme: JobTech Taxonomy - Yrke
definition: Utvecklingsingenjör, el-tele
broader: Civilingenjörsyrken inom elektroteknik
related: 6Hq3 tKo V57
related: kDRm Yaa jAB
related: GsJ8 22b sPF
broad match: C2153

Rådman
type: Concept
in scheme: JobTech Taxonomy - Yrke
definition: Rådman är en ordinarie domare i tingsrätt eller förvaltningsrätt som avgör brottmål, tvistemål och övriga ärenden i underrätt. Arbetsuppgifterna omfattar förberedelse och ledning av förhandlingar, analys av rättsliga frågor, avgörande av mål samt domskrivning och beslutsfattande. Rådman granskar bevis, lyssnar till parters och vittnens utsagor samt säkerställer att processen följer lag och praxis. Yrkestiteln råder fortfarande och är central inom underrätter. Källa: Sveriges Domstolar, Arbetsförmedlingen
broader: Domare
related: X82t awd Qyc
related: x4Wi NWW ogB
related: Abcb QtH isZ
broad match: C2612

Familjehemssekreterare/Familjehemskonsulent
type: Concept
in scheme: JobTech Taxonomy - Yrke
definition: Familjehemssekreterare (kallas även familjehemskonsulent) rekryterar, utreder och stödjer familjehem som tar emot barn och ungdomar. Arbetsuppgifterna omfattar intervjuer, bedömning av familjehemmens lämplighet, stöd och handledning före och under placeringstiden samt dokumentation av placeringar. Familjehemssekreterare samarbetar med barnhandläggare och utför resor i samband med hembesök. Arbetsuppgifterna syftar till att matcha barn och familjehem med fokus på barnets bästa. Arbetsrollen kan även inkludera att erbjuda utbildningar till familjehem och kontaktpersoner. Källor: Uppsala kommun, Malmö stad
alternative label: Familjehemskonsulent
alternative label: Familjehemssekreterare
broader: Socialsekreterare
related: GazW 2TU kJw
related: xY4L yGe 7uH
related: xFZr Dg1 Zdq
broad match: C2635

Miljöarbetare anläggning
type: Concept
in scheme: JobTech Taxonomy - Yrke
definition: Miljöarbetare vid anläggning arbetare med hantering och sortering av avfall. Som miljöarbetar vid anläggning arbetar man i huvudsak med att hantera inkommande avfall med hjälp av maskiner, framför allt truck, hjullastare och materialhanterare. Det är även vanligt att man roterar arbetsuppgifer och kör renhållningsbil för att samla in avfall hos kund för transport till anläggningen. Vid anläggningen sker bland annat sortering och mellanlagring av avfall för vidare transport till förädling. Beroende på arbetsplats kan även förädling och återvinning av sorterat avfall ske på plats. Då kan andra arbetsuppgifter ingå, så som att sköta maskiner som maler och krossar sorterat avfall. Källa: Arbetsförmedlingen
broader: Renhållnings- och återvinningsarbetare
related: whao Q6A ScE
related: qs7K Z3U Rhj
related: KVfy xhX DTs
related: UaBT 3af cFS
related: 6pon qKK Kr1
related: Ywmm QZu JiT
broad match: C9612

Kartingenjör
type: Concept
in scheme: JobTech Taxonomy - Yrke
definition: En kartingenjör arbetar med att samla in, analysera och visualisera geografisk information, vilket innebär att skapa och uppdatera kartor samt arbeta med GIS-system (geografiska informationssystem). Arbetsuppgifterna inkluderar ofta fältmätningar, bearbetning av data från exempelvis satellit eller fältarbete samt presentation av geografisk data digitalt eller i pappersformat. Källa: Arbetsförmedlingen
broader: GIS- och kartingenjörer
related: 6Hq3 tKo V57
related: XZ3N uRV VYH
related: srpb D2S 7jj
related: x4Mq SUF EL6
related: hTuW 1r3 yAn
related: Cc67 7CT gBS
related: 7Arb 2hF h3T
related: pbtd WGK f56
related: twmX 7SX ncw
broad match: C3118

Akupunktör
type: Concept
in scheme: JobTech Taxonomy - Yrke
definition: Akupunktör
broader: Terapeuter inom alternativmedicin
related: NYW6 mP6 vwf
related: B2Ez smf txT
broad match: C3230

Lättmatros
type: Concept
in scheme: JobTech Taxonomy - Yrke
definition: En lättmatros arbetar med fartygets underhåll, exempelvis målning, smörjning, vakthållning på bryggan, lastning och lossning av fartygets last. För att arbeta som lättmatros krävs Lättmatros behörighet Efter en gymnasieutbildning med inriktning mot sjöfart som är godkänd av Transportstyrelsen eller minst 6 månaders sjötid som jungman kan ansökan göras hos Transportstyrelsen Källa: Satsa på sjöfart
broader: Matroser och jungmän m.fl.
related: dRFw Rcu dX7
related: gs65 ynn fcr
related: ASGV zcE bWf
related: XouD cCj HZN
related: QQJR 11D LXL
broad match: C8350

Banktjänstemän och redovisningsekonomer m.fl.
type: Concept
in scheme: JobTech Taxonomy - Yrke
definition: Banktjänstemän och redovisningsekonomer m.fl.
broader: Yrken med krav på högskolekompetens eller motsvarande inom ekonomi och förvaltning
narrower: Skadereglerare och värderare
narrower: Redovisningsekonomer
narrower: Mäklare inom finans
narrower: Banktjänstemän

Dekorationsmålare, skyltning
type: Concept
in scheme: JobTech Taxonomy - Yrke
definition: Dekorationsmålare, skyltning
broader: Inredare, dekoratörer och scenografer m.fl.
related: TFru mTY Wi2
related: X49P vyf oX2
related: 9puE nYg crq
broad match: C3432

Medicinsk fotterapeut
type: Concept
in scheme: JobTech Taxonomy - Yrke
definition: Medicinsk fotterapeuter behandlar fötter i syfte att förebygga, lindra eller åtgärda fotrelaterade besvär. rbetsuppgifterna omfattar nagelklippning, behandling av förhårdnader, liktornar, hälsprickor och nageltrång samt rådgivning kring fotvård, egenvård och ortopediska hjälpmedel. Behandlingar utförs både manuellt och med hjälp av maskin. Dokumentation av fotstatus och i vissa fall remittering till annan vårdgivare kan ingå. Källa: Sveriges Fotterapeuter, Sveriges Kommuner och Regioner, Arbetsförmedlingen
broader: Fotterapeuter
related: nuWh mai b4B
related: QmTU NLs mp3
related: rBhF V3L HCT
related: Uuf1 GMh Uvw
related: 8Qt6 FBT vJX
related: dLSf nYT VTF
broad match: C5142

Ritare, textil, trä, glas, förpackningar
type: Concept
in scheme: JobTech Taxonomy - Yrke
definition: Ritare, textil, trä, glas, förpackningar
broader: Övriga ingenjörer och tekniker
related: 6Hq3 tKo V57
related: KWNv oWK 5E2
related: C41S vox 2gE
broad match: C3119

Husmontör
type: Concept
in scheme: JobTech Taxonomy - Yrke
definition: Husmontör utför montering av prefabricerade huselement eller sektioner, som väggar, bjälklag och tak, till småhus och villor. Arbetet utförs till största delen med hjälp av kran. Yrket kräver ofta ingen specifik yrkesutbildning. Källa: Arbetsförmedlingen
broader: Övriga byggnads- och anläggningsarbetare
related: FBb4 Yu9 yL8
related: j7Cq ZJe GkT
related: LBWc rcx qvP
related: ja7J P8X YC9
broad match: C7119

Begravnings- och krematoriepersonal
type: Concept
in scheme: JobTech Taxonomy - Yrke
definition: Förbereder, arrangerar och utför uppgifter i samband med begravningsceremonier, jordfästningar, kremeringar och gravsättningar.
broader: Övrig servicepersonal
related: ep2C YdH Qor
related: nZMQ bGf Xou
related: aF3J SgE uck
related: a9iw eu3 SVG
related: C5163
related: w2E8 TmJ yx6
related: 4frC 8Fn jfw
related: atyH hAn 5xr
related: zuEC Zsi WCx
narrower: Begravningsrepresentant
narrower: Krematorievaktmästare
narrower: Begravningsrådgivare
narrower: Borgerlig officiant
narrower: Krematorieföreståndare
narrower: Ceremonivärd
broad match: GazW 2TU kJw

Kammarrättslagman
type: Concept
in scheme: JobTech Taxonomy - Yrke
definition: Kammarrättslagman leder en dömande avdelning i kammarrätten och kombinerar chefsuppgifter med dömande verksamhet i förvaltningsmål. Arbetsuppgifterna omfattar att leda och samordna avdelningens arbete, fördela mål och ärenden, bevaka rättssäkerhet och effektivitet samt delta aktivt i avgöranden och förhandlingar. Kammarrättslagman bidrar i domstolens utvecklingsarbete, implementerar nya rutiner och handleder mindre erfarna jurister. Källa: Förordning (1996:380) med kammarrättsinstruktion, Sveriges Domstolar
broader: Domare
related: X82t awd Qyc
related: x4Wi NWW ogB
related: Abcb QtH isZ
broad match: C2612

Försäkringsrådgivare, företagssäljare och inköpare m.fl.
type: Concept
in scheme: JobTech Taxonomy - Yrke
definition: Försäkringsrådgivare, företagssäljare och inköpare m.fl.
broader: Yrken med krav på högskolekompetens eller motsvarande inom ekonomi och förvaltning
narrower: Företagssäljare
narrower: Ordersamordnare m.fl.
narrower: Försäkringssäljare och försäkringsrådgivare
narrower: Inköpare och upphandlare

Sjuksköterskor (fortsättning)
type: Concept
in scheme: JobTech Taxonomy - Yrke
definition: Sjuksköterskor (fortsättning)
broader: Yrken med krav på fördjupad högskolekompetens inom hälso- och sjukvård
narrower: Barnsjuksköterskor
narrower: Röntgensjuksköterskor
narrower: Operationssjuksköterskor
narrower: Skolsköterskor
narrower: Företagssköterskor
narrower: Övriga specialistsjuksköterskor

Processövervakare metallproduktion
type: Concept
in scheme: JobTech Taxonomy - Yrke
definition: Processövervakare inom metallproduktion övervakar och styr tillverkning av metall. Processövervakare inom metallproduktion övervakar och styr tillverkningsprocesser av metall. Arbetet sker oftast från ett kontrollrum. I arbetsuppgifterna ingår att hantera och lösa produktionsstörningar. Man utför regelbunden provtagning och produktkontroll för att upprätthålla kvalitet. Även förebyggande underhåll av maskiner och utrustning kan ingå beroende på arbetsplats. En viktig del av arbetet avser kontroll av belastningar på både den inre och yttre miljön för att säkerställa att verksamheten följer miljö- och säkerhetsföreskrifter. Källa: Arbetsförmedlingen
broader: Processövervakare, metallproduktion
related: RZK1 Vc6 ty8
related: 5B9h 7Q8 uJK
related: Zv6F GRr NhE
related: RFLW hr8 v3G
related: yhCP AqT tns
related: hWgR 2e5 Wvj
related: bRi8 VTk BE1
related: xGpa DP7 b9U
related: FJ51 XWP FX7
broad match: C3135

Charkuteriarbetare, butik
type: Concept
in scheme: JobTech Taxonomy - Yrke
definition: Charkuteriarbetare i butik hanterar och säljer charkuteriprodukter som kött, korv och delikatesser. Arbetsuppgifter inkluderar manuell skivning, paketering och exponering av varor, försäljning över disk samt kundbemötande. Charkuteriarbetare ser till att produktutbudet är fräscht och inbjudande, sköter varupåfyllning och hanterar leveranser. Rollen innefattar också viss lagringskontroll och att upprätthålla hygien- och säkerhetsrutiner enligt livsmedelslagstiftning. Källor: Arbetsförmedlingen, div jobbannonser
broader: Butikssäljare, dagligvaror
related: e2f2 4Bk WkL
related: rDcj Tao TJJ
related: 9rVa PhR uQG
related: RPTn bxG ExZ
related: vYaC 36i ubo
related: XgFf rtz pAB
related: ifET wHx 6w5
related: DYjQ bbr Zoe
related: Mv4E RxA VGZ
related: Pf9g LnN jNG
broad match: C5223

Miljö- och hälsoskyddsinspektör
type: Concept
in scheme: JobTech Taxonomy - Yrke
definition: En miljö- och hälsoskyddsinspektör arbetar med att skydda miljön och människors hälsa genom att kontrollera att verksamheter följer lagar och regler inom miljö- och hälsoskyddsområdet. Yrket innebär både myndighetsutövning och rådgivning, och arbetsuppgifterna är varierade och samhällsviktiga. I arbetsuppgifterna ingår bl a att utföra tillsyn och inspektioner på exempelvis industrier, restauranger, bostäder, vattenverk och avloppsanläggningar för att kontrollera att lagar och förordningar följs, främst enligt miljöbalken och livsmedelslagen. Källa: Arbetsförmedlingen, SACO
broader: Miljö- och hälsoskyddsinspektörer
related: kJeN wmw 9wX
related: qqW3 wqy 9HS
related: yrCH S1V sma
related: 4eJL Zun nUv
broad match: C3257

Installations- och serviceyrken inom el och elektronik
type: Concept
in scheme: JobTech Taxonomy - Yrke
definition: Installations- och serviceyrken inom el och elektronik
broader: Yrken inom byggverksamhet och tillverkning
narrower: Elektronikreparatörer och kommunikationselektriker m.fl.
narrower: Installations- och industrielektriker m.fl.

Boendechef, kommun
type: Concept
in scheme: JobTech Taxonomy - Yrke
definition: Boendechef, kommun
broader: Chefer inom socialt och kurativt arbete
related: GazW 2TU kJw
related: epLc SkD cbT
related: bh3H Y3h 5eD
broad match: C1344

Socialadministratör
type: Concept
in scheme: JobTech Taxonomy - Yrke
definition: Socialadministratör sköter administrativa och organisatoriska arbetsuppgifter inom socialt arbete. Arbetet innebär i huvudsak att vara en länk mellan socialtjänst, myndigheter och andra administrativa funktioner. Arbetsuppgifter utgörs främst av social dokumentation, inklusive administration av personakter, genomförandeplaner, och protokollförande vid kontakt med klienter. Visst utredningsarbete kan även förekomma. Arbetet sker i huvudsak i olika ärendehanteringssystem. Källa: Kunskapsförbundet, Arbetsförmedlingen
broader: Övriga kontorsassistenter och sekreterare
related: X82t awd Qyc
related: kEhJ ZT4 PYX
related: NURm 2bx i8e
broad match: C4419

Civilingenjör, konstruktion, elektronik
type: Concept
in scheme: JobTech Taxonomy - Yrke
definition: En civilingenjör i elektroteknik skapar smarta lösningar på dagens och framtidens utmaningar inom energiförsörjning, miljövänliga och säkra fordon, smarta städer, datakommunikation och mycket mer. Exempelvis behövs elektroteknik för klimatsmarta transporter, förnybar energi, e-hälsa och att hantera den ständigt ökande datatrafiken. Källa: CTH, KTH
broader: Civilingenjörsyrken inom elektroteknik
related: 6Hq3 tKo V57
related: Ex79 E8G 8fW
related: kDRm Yaa jAB
related: 5Beb kRU FQM
related: V32h kRF DGT
related: L5sW 7Pe o2v
related: iSmj RYc vT4
related: ZAqt Bws pmB
related: nrrD eFs iDq
related: bL5Z sYU Ecf
related: z3by PWM mAy
related: Cphg xxs rAF
related: d7Bi gvQ 7KC
related: T2kN Gdg 8Q1
related: r3F6 1WP S3J
broad match: C2152

Civilingenjör, konstruktion, maskin
type: Concept
in scheme: JobTech Taxonomy - Yrke
definition: Civilingenjör, konstruktion, maskin
broader: Civilingenjörsyrken inom maskinteknik
related: SuAn oH9 xNc
related: dRrC ojT BZ7
related: 6Hq3 tKo V57
related: g4oF 124 AeX
related: zVPG Q42 auQ
related: CjBS PEY DS3
related: GWsd SDf kf9
related: WjDU 3cb t77
related: t5Sf 98A jhq
related: PjKF CCs 3DZ
related: zxSk kAN t3U
related: CKwu GTd CEN
related: 2Tag Vi7 ZYD
broad match: C2144

Hamnchef
type: Concept
in scheme: JobTech Taxonomy - Yrke
definition: Hamnchef
broader: Verkställande direktörer m.fl.
related: epLc SkD cbT
related: ASGV zcE bWf
related: bh3H Y3h 5eD
broad match: C1120

Övriga universitets- och högskolelärare
type: Concept
in scheme: JobTech Taxonomy - Yrke
definition: Utför annat undervisningsarbete inom högskola och universitet än inom 2311-2314. Exempel på arbetsuppgifter: Undervisar, handleder samt examinerar inom grundutbildningen. Deltar i utvecklingen av utbildningen inom området.
broader: Universitets- och högskolelärare
related: 7Y6d qDZ Eyt
related: snfZ N1g wrT
related: ddzL 9as rZt
related: 9Ra9 2yh jH4
related: Zffc M4R Gws
related: SpRR JX9 6o6
related: C2310
related: V5EN xw2 itk
related: 5hrX ckd X8x
related: oLnc YZn 3bm
related: uwXg zmB Pdk
related: jfmZ FfR NFm
related: hDvV ryY gUm
related: 9wjT WBC ppy
related: xE6k qAE vrk
related: pamn k5z ByJ
related: LswY aiM UT8
related: c2YE oK3 f1u
related: 9kKp C7D Qme
related: ppnH 9N4 FE2
related: ezVu GhE b3b
related: QEfk 7p4 yCb
narrower: Universitets- och högskoleadjunkt
broad match: MVqp eS8 kDZ

Processoperatör glas
type: Concept
in scheme: JobTech Taxonomy - Yrke
definition: Processoperatörer inom glas styr och övervakar industriell tillverkning av glasprodukter. Processoperatörer inom glasindustri styr och övervakar industriell tillverkning av glasprodukter, så som industriellt glas och glasfiberisolering. Arbetet sker vanligtvis från ett kontrollrum. Förutom drift och övervakning är vanliga arbetsuppgifter provtagning, kvalitetskontroll, dokumentation, tillsyn och underhåll. En viktig del i arbetet avser säker hantering och processteg enligt instruktioner. Truckkörning är även förekommande. Källa: Arbetsförmedlingen
broader: Övriga process- och maskinoperatörer
related: ePZk dXB 2gM
related: BaSL TSW BW3
related: LtbB 7Er i4c
related: oDiC Gw1 oko
related: RW7k WxU R6e
related: wTEr CBC bqh
broad match: C8181

VA-chef
type: Concept
in scheme: JobTech Taxonomy - Yrke
definition: VA-chef
broader: Förvaltnings- och planeringschefer
related: 6Hq3 tKo V57
related: bh3H Y3h 5eD
related: Z4Re QWh 8X6
broad match: C1213

Kalibreringsingenjör, tillverkningsindustri
type: Concept
in scheme: JobTech Taxonomy - Yrke
definition: Kalibreringsingenjör, tillverkningsindustri
broader: Ingenjörer och tekniker inom maskinteknik
related: 6Hq3 tKo V57
related: 9aEn jPz gJs
broad match: C3115

Fysiker, kemister m.fl.
type: Concept
in scheme: JobTech Taxonomy - Yrke
definition: Fysiker, kemister m.fl.
broader: Yrken med krav på fördjupad högskolekompetens inom naturvetenskap och teknik
narrower: Meteorologer
narrower: Kemister
narrower: Fysiker och astronomer
narrower: Geologer och geofysiker m.fl.

Kulturchef
type: Concept
in scheme: JobTech Taxonomy - Yrke
definition: Kulturchef
broader: Övriga chefer inom samhällsservice
related: XkNz kK2 TQ8
related: fcTv LBx uA6
related: epLc SkD cbT
related: bh3H Y3h 5eD
related: 9puE nYg crq
broad match: C1349

Chef inom kyrkogårdsförvaltningen
type: Concept
in scheme: JobTech Taxonomy - Yrke
definition: Chef inom kyrkogårdsförvaltningen
broader: Förvaltnings- och planeringschefer
related: epLc SkD cbT
related: bh3H Y3h 5eD
broad match: C1213

Försäkringsspecialist
type: Concept
in scheme: JobTech Taxonomy - Yrke
definition: Försäkringsspecialist
broader: Försäkringssäljare och försäkringsrådgivare
related: X82t awd Qyc
related: No5E ikS hHP
broad match: C3321

Växtodlare och djuruppfödare, blandad drift
type: Concept
in scheme: JobTech Taxonomy - Yrke
definition: Bedriver växtodling kombinerat med avel och uppfödning av lantbrukets husdjur eller sällskapsdjur. Odlar och skördar jordbruksväxter samt sköter djur för att använda som lantbrukets husdjur för produktion av mjölk, kött, ägg, pälsskinn m.m. eller som sällskapsdjur.
broader: Växtodlare och djuruppfödare, blandad drift
related: yZWG ynW 4iQ
related: C6130
related: bbrX YjR caP
related: N4Jk Sz1 n9Z
related: 6md5 wPp d4S
related: HYth uQt hAk
related: r2MT yTq xZu
related: DM6e bth LXc
related: oYDh d6r cSu
related: o5AT zgo if4
related: 6E3h uR9 pxh
related: YsdN Q9t kTY
related: b3cK YFd y5S
related: oDP7 ReX a9j
related: yVj6 5Ey Gku
related: 74uH 39f D58
related: LR78 eaw bMu
related: kmBX uX9 oQF
related: 2d8m SG1 duS
related: Vig6 18E ZVA
related: z99q sFD nas
related: zpw7 qhZ XhW
related: L135 ib8 b83
related: RMEA 5Bg U19
related: wVZP gRS 52W
related: cg3X 3ZW aCG
related: mRxb SRc xne
related: nVax pj9 CrG
related: yxkr TyE GgG
related: yYgy azb GqH
related: UXUJ ftK Dr1
related: pXEi DEw QmR
related: rarR CnP wRC
related: 89ab noe cw9
related: Hnsg Mpz 6KT
related: ZZ3K X56 6BC
related: bPHw mw8 Mm5
related: hZ4C vXz Swc
related: pbbc s2J TCD
narrower: Lantbruksförman blandad drift
narrower: Gårdsmästare blandad drift
narrower: Lantbrukare blandad drift
narrower: Driftledare lantbruk med blandad drift
broad match: VuuL 7CH adj

Toxikolog
type: Concept
in scheme: JobTech Taxonomy - Yrke
definition: Toxikolog
broader: Cell- och molekylärbiologer m.fl.
related: qWrV orE kFY
related: kJeN wmw 9wX
related: TXx8 Mgv BGZ
related: p6zK bwi S5D
broad match: C2131

Civilingenjör, maskin
type: Concept
in scheme: JobTech Taxonomy - Yrke
definition: Civilingenjör, maskin
broader: Civilingenjörsyrken inom maskinteknik
related: SuAn oH9 xNc
related: 6Hq3 tKo V57
related: 6Uog tgq 6kG
related: bxdZ Qes 9J8
related: EAMS DFu sfc
related: sxNv p6M hFd
related: LTX2 zFY jqB
related: NakM iBW iyi
related: naqb 55x 6oi
related: ePLt b68 wJm
broad match: C2144

Redaktionschef
type: Concept
in scheme: JobTech Taxonomy - Yrke
definition: Redaktionschef ansvarar för tidningens dagliga arbete och utveckling och är chefredaktörens närmaste underställde i hierarkin. Vanliga arbetsuppgifter inkluderar att organisera och leda redaktionens dagliga arbetsrutiner, delta i morgonmöten för att prioritera nyheter och arbetsuppgifter, samordna med nyhetschefer och reportrar om innehåll och produktion samt säkerställa att redaktionen levererar journalistiskt arbete enligt publicistiska och etiska riktlinjer. I större tidningar kan redaktionschefen även ha ansvar för lokalredaktioner och fungera som lokal nyhetschef. Källa: Arbetsförmedlingen, Mediekompass, Publicistguiden
broader: Övriga chefer inom samhällsservice
related: 4VQi vLA isF
related: epLc SkD cbT
related: bh3H Y3h 5eD
related: 8too bEs 7NU
related: HMJS kHr mkC
related: 9puE nYg crq
related: 8Qau cX5 cVG
related: Cd9p AvR Zc1
broad match: C1349

Skogsförvaltare
type: Concept
in scheme: JobTech Taxonomy - Yrke
definition: En skogsförvaltare ansvarar för planering, genomförande och uppföljning av skogsvård, avverkning, skogsskötsel samt vägbyggnad och vägunderhåll inom ett eller flera skogsområden. Rollen innebär även personalansvar och omfattande samarbete med entreprenörer, markägare, myndigheter och organisationer. Skogsförvaltaren ansvarar för taktisk och operativ planering av skogsbruket samt fältplanering, taxering och inventering. Skogsförvaltaren upphandlar entreprenörer och säkerställa att arbeten utförs enligt avtal och gällande lagstiftning. Källa: Arbetsförmedlingen, Skogen, skogligajobb
broader: Förvaltare inom skogsbruk och lantbruk m.fl.
related: rvZs dHJ GXe
related: epLc SkD cbT
related: bh3H Y3h 5eD
related: VuuL 7CH adj
broad match: C1311

Musikalartist
type: Concept
in scheme: JobTech Taxonomy - Yrke
definition: Musikalartist gestaltar roller i musikaler och scenproduktioner där sång, dans och skådespeleri kombineras. Vanliga arbetsuppgifter är att repetera och framföra musikallåtar, koreografi och skådespel. Musikalartisten samarbetar i team med regissörer, koreografer, musiker och andra artister. Vanligt är att arbeta projektbaserat inklusive turnéer och olika typer av uppdrag. Källa: Arbetsförmedlingen, Kulturama och Musikalliansen
broader: Skådespelare
related: 8too bEs 7NU
related: 9puE nYg crq
broad match: C2655

Servitör, fartyg/Servitris, fartyg
type: Concept
in scheme: JobTech Taxonomy - Yrke
definition: Servitörer finns på passagerar- och kryssningsfartyg och serverar mat och dryck åt passagerarna. I land är servitören bara servitör. Ombord kan det ingå säkerhetsuppgifter som till exempel att sköta utrymning i händelse av en olycka. Källa: Ålands sjöfart
alternative label: Servitris, fartyg
alternative label: Servitör, fartyg
broader: Hovmästare och servitörer
related: dRFw Rcu dX7
related: wkWQ 3JH 1wK
related: VqRa 738 v98
related: ASGV zcE bWf
related: XouD cCj HZN
related: 7o44 gVv s1V
related: 7coY HT4 rJc
related: tuKW sFK K4n
related: ScKy FHB 7wT
broad match: C5131

Maskinbefäl, fartyg
type: Concept
in scheme: JobTech Taxonomy - Yrke
definition: Maskinbefäl är en gemensam benämning för befäl som ansvarar för maskin och annan teknisk utrustning ombord på ett fartyg. Maskinbefäl kan även kallas Maskinchef, Fartygsingenjör eller Maskinist. Det är Maskinchefen som har det övergripande ansvaret för fartygets maskiner och annan teknisk utrustning ombord. Arbetet är till stor del ett administrativt jobb på kontoret där man har kontakt med rederiet and olika myndigheter. Maskinchefen har också det ekonomiska ansvaret samt ansvar för brandskyddet ombord. Källa: Utbildningssidan
broader: Maskinbefäl
related: dRFw Rcu dX7
related: gs65 ynn fcr
related: ASGV zcE bWf
related: XouD cCj HZN
related: cduE 11u 2go
related: isig f6Z rjG
related: SQhJ R6Q J24
broad match: C3151

Landsantikvarie
type: Concept
in scheme: JobTech Taxonomy - Yrke
definition: Landsantikvarie
broader: Övriga chefer inom samhällsservice
related: epLc SkD cbT
related: bh3H Y3h 5eD
broad match: C1349

Maskinbefäl
type: Concept
in scheme: JobTech Taxonomy - Yrke
definition: Ansvarar för drift och underhåll av maskinell, elektrisk och elektronisk utrustning ombord på fartyg. Hit hör inte Motorman (7233)
broader: Piloter, fartygs- och maskinbefäl m.fl.
related: 7qAg AP3 WwV
related: C1VX PYa Uph
related: cP48 5in VHb
related: JYAn p1X 6sb
related: 2KP2 Zfe 5Cf
related: XNLN wwW x6h
related: HvZg eSR eTg
related: VS9s v5Q X4t
related: hCmq btw dkN
related: fJdB viK AaA
related: V7H8 ZNj EaQ
related: WBjY g8L wUV
related: 8sKj VoT hKR
related: 3j4u Apm 7WU
related: 3BCu HTK YSF
related: 1PkZ rca RAU
related: LDpW xuo jZp
related: zMmn 1mh 6D5
related: D7v7 nBw 6Tu
related: UdGt dND Baj
related: FmHS DMU bcA
related: Aycb CjZ V3v
related: GYaa Qc6 YfR
related: TumP RbS 4hY
related: 4qzk GDo 1ow
related: GNXH HRo YGk
related: C3151
related: q4p6 d9U 7D4
related: kSYg iMb xDo
related: 7fWC 3Rp 4qU
related: PRQR oGE 7re
related: fZCw Y2t J7e
related: dkg2 8Qz rzx
related: 2XXJ ofn VAD
related: S44W QvJ r4m
related: kxPJ 7Jr aRU
related: Ff3d BZT E8m
related: xUT3 aF5 i59
related: rYGi DpZ kWM
related: ojPn R8G dsv
related: M4ei Uvu Ks7
related: 6Pzb STS Bp1
related: c14d Mgx MFA
related: G6sJ pjQ xpq
related: zYzY NTD VoE
related: GVTY wrU oJQ
related: Nxfw cTk qUk
related: d7Ei HY7 5ty
related: y77a Hix Pk3
related: 9tdC NoC UMe
related: gEsp QK9 Uq6
related: 9apS eAV xqL
related: JJiW W7Z kgc
related: hHSG YTn NHt
related: aAtJ q2r J5n
related: 4mNF 7vZ vCx
related: P6te TBF 8fh
related: S7LZ tzK qSg
related: 7yxN T21 n4c
related: kwir 9Jv apf
related: YBpW yFo meQ
narrower: Elingenjör, fartyg/Fartygseltekniker
narrower: Maskinbefäl, fartyg
narrower: 2:e Fartygsingenjör
narrower: Teknisk chef, fartyg/Maskinchef, fartyg
narrower: 1:e Fartygsingenjör
broad match: ASGV zcE bWf

Läkemedelsinspektör
type: Concept
in scheme: JobTech Taxonomy - Yrke
definition: Läkemedelsinspektör
broader: Farmakologer och biomedicinare
related: kJeN wmw 9wX
related: esAo 5sX FPv
broad match: C2131

Skadereglerare och värderare
type: Concept
in scheme: JobTech Taxonomy - Yrke
definition: Leder, planerar och samordnar behandling av försäkringsärenden. Besiktigar och värderar försäkringsskador samt utreder skadeersättning. Uppskattar förluster som täcks av försäkringsavtal. Värderar egendom och tillhörigheter i samband med försäljning, försäkringsärende m.m.
broader: Banktjänstemän och redovisningsekonomer m.fl.
related: 83S2 tfi TgW
related: C3315
related: muUz Uu5 aWu
related: nPhE Q9x sbs
related: FyG2 mGL FmW
related: UQod 7GP JXL
related: zpjG UZK Hdy
related: JxuB Xi5 Yqw
related: k7hW d87 3xW
related: uGJt 4qS 3RF
related: an5D uju S3p
related: rSKd BLd ACL
related: 3SWC q3G uvC
related: YJdu yog DN6
related: 1pLs Lfr UUZ
related: 3vyB YMf qJm
related: QAaJ QeY Q6P
related: jCfj iqe hTk
related: tZM7 1Ma ib7
related: itDT 5bK hjR
related: YEWh 1zY 1gC
related: AzJi 3Dp Sm9
related: wuyU xsJ RxN
related: q7Mx gjU F9q
related: Ap4N kTp 3K5
related: q8kp NTH Kaq
related: ZDHh gux 1eB
related: 7TbA Gh9 yKX
related: djra 4NB fUV
related: AwhJ eLD xpG
related: np3s PZj fpt
related: V75F 2SG DBz
related: m62t Tir uZE
related: 3hBb 7u8 f1N
related: hkJW PWy ge8
narrower: Skadetekniker
narrower: Skadereglerare
narrower: Personskadereglerare
narrower: Cargo surveyor
narrower: Värderingsassistent
narrower: Besiktningsingenjör, försäkring
narrower: Försäkringsutredare
narrower: Värderingsman
narrower: Besiktningsman, försäkring/Skadeinspektör, försäkring
broad match: X82t awd Qyc

Scenograf
type: Concept
in scheme: JobTech Taxonomy - Yrke
definition: Scenograf skapar och realiserar den visuella sceniska miljön för teater, film eller TV, och ansvarar för att tolka manus till fysiska miljöer, dekor och rekvisita. Vanliga arbetsuppgifter är att ta fram skisser, ritningar och färdiga designplaner, planera och leda uppbyggnaden av miljöer och detaljer, samordna hantverkare och specialister, hantera budget, och säkerställa den visuella helheten. Källa: Arbetsförmedlingen, Yrkesnämnden för film och TV
broader: Inredare, dekoratörer och scenografer m.fl.
related: u7zK VKN 8Ht
related: 8too bEs 7NU
related: 9puE nYg crq
related: A9wR ed7 it3
broad match: C3432

Husdjurstekniker
type: Concept
in scheme: JobTech Taxonomy - Yrke
definition: Husdjurstekniker arbetar med fruktsamhet hos nötkreatur. Arbetsuppgifterna inkluderar insemination och dräktighetsundersökningar till lantbrukare inom nöt- och mjölkprodtion. Arbetet innebär även rådgivning om utfodring, djurhälsa och avelsstrategier. Teknikern utför även kokontroller, där data om mjölkproduktion och djurhälsa samlas in för att optimera produktion. Källa: Arbetsförmedlingen
broader: Uppfödare och skötare av lantbrukets husdjur
related: mQPZ sUE tRX
related: 52iz HXR 9Xi
related: CaFX R9h sky
related: VuuL 7CH adj
broad match: C6121

Specialistläkare, kirurgi
type: Concept
in scheme: JobTech Taxonomy - Yrke
definition: Specialistläkare, kirurgi är en specialiserad legitimerad läkare med en djupare kunskap och kompetens inom sitt område. Specialistläkare är en skyddad titel och bara den som har bevis om specialistkompetens får kalla sig specialist i sin specialitet. Specialistläkare ansvarar för att diagnostisera, behandla och förebygga sjukdomar inom sin specialitet. Vanliga arbetsuppgifter är mottagningsarbete med patientbesök, rondarbete på avdelning, handledning av yngre läkare samt konsultationer till andra yrkesgrupper och specialiteter. Specialistläkare ansvarar även för att följa och leda utvecklingen inom sitt medicinska område och utför omfattande medicinsk dokumentation och administration. Källa: Arbetsförmedlingen, Karolinska Institutet, Socialstyrelsen, Sveriges Kommuner och Regioner, Sveriges läkarförbund
broader: Specialistläkare
related: jQCv AFs CJL
related: ECED pPZ 7VL
related: SCGR VYb vcX
related: NYW6 mP6 vwf
related: zC4f cdB gw2
related: qSbw XHD Ycd
related: vpmc zsN Tc5
related: TChC u37 rt2
related: GokY wce fTd
related: uvW2 NAd SZF
related: cbhy npk QGE
related: EBX9 7gC eLt
related: C3kU mTm 3cy
related: JwoC QBz iFU
related: vFjb AHi a54
related: jFHU uSj 4ke
related: uwqM RtR wLw
related: 2g2f 7b3 Vyh
related: WASM aPa i9j
related: ASoB Zaq wFL
related: a4ct LSR tfJ
related: VB21 yNX sXo
related: G4YA 2ar RDn
related: mWxX gLk 5co
related: HG15 9aA 3hV
related: KALC VvK 17U
related: QSeQ MpU wpW
related: 8iRW sun zXq
related: 89LR AwA UqR
broad match: C2212

Paleontolog
type: Concept
in scheme: JobTech Taxonomy - Yrke
definition: Paleontolog
broader: Geologer och geofysiker m.fl.
related: kJeN wmw 9wX
broad match: C2114

Skorstensfejare
type: Concept
in scheme: JobTech Taxonomy - Yrke
definition: Skorstensfejare, även kallat sotare, rengör och inspekterar eldstäder, skorstenar och imkanaler. Arbetet utförs i med handredskap som sotarlina och borstar för själva sotningen. Även tekniska hjälpmedel används så som mätinstrument, tryckluft, roterande borstar och högtryckstvättar. Utöver sotning kan andra arbetsuppgifter förekomma, så som täthetsprovningar av skorstenar samt kontroll och rengöring av ventilation. Källa: Sveriges skorstensfejaremästares Riksförbund, Myndigheten för samhällsskydd och beredskap, Arbetsförmedlingen
broader: Skorstensfejare
related: TViS M23 nPv
related: whao Q6A ScE
related: gMfK Wpp 33y
broad match: C7133

Yrken med krav på högskolekompetens eller motsvarande inom hälso- och sjukvård samt laboratorium
type: Concept
in scheme: JobTech Taxonomy - Yrke
definition: Yrken med krav på högskolekompetens eller motsvarande inom hälso- och sjukvård samt laboratorium
broader: Yrken med krav på högskolekompetens eller motsvarande
narrower: Terapeuter inom alternativmedicin
narrower: Tandhygienister
narrower: Djursjukskötare och veterinärassistenter
narrower: Biomedicinska analytiker, tandtekniker och laboratorieingenjörer m.fl.

Produktionsberedare inom industriell tillverkning
type: Concept
in scheme: JobTech Taxonomy - Yrke
definition: Produktionsberedare förbereder och planerar produktion inom industriell tillverkning. Arbetet sker med affärsplaneringssystem där arbetsuppgifter inkluderar att granska och uppdatera produktritningar, hantera materialbeställningar samt samverka med konstruktions- och inköpsavdelningar. Man stödjer också övergången av nya komponenter från projekt till produktion och utför ofta fältarbete. Källa: Arbetsförmedlingen
broader: Ingenjörer och tekniker inom industri, logistik och produktionsplanering
related: M2qV ZzQ tft
related: 6Hq3 tKo V57
related: nBF8 zGa zjv
related: RfpC cRb GQN
related: ZfKV gRT VWd
broad match: C3115

Mediatextare
type: Concept
in scheme: JobTech Taxonomy - Yrke
definition: Mediatextare
broader: Översättare, tolkar och lingvister m.fl.
related: nWt7 xYs L9f
related: rabZ U3f jQF
related: 9puE nYg crq
related: eKb4 MeJ duZ
related: kF5z ZJz i8k
broad match: C2643

Fondchef, statlig
type: Concept
in scheme: JobTech Taxonomy - Yrke
definition: Fondchef, statlig
broader: Chefer inom bank, finans och försäkring
related: X82t awd Qyc
related: epLc SkD cbT
related: bh3H Y3h 5eD
broad match: C1346

Organisationssekreterare, intresseorganisation
type: Concept
in scheme: JobTech Taxonomy - Yrke
definition: Organisationssekreterare, intresseorganisation
broader: Planerare och utredare m.fl.
related: X82t awd Qyc
related: TZe9 NsN uce
broad match: C2422

Maskinoperatörer, textil-, tvätt- och läderindustri m.m.
type: Concept
in scheme: JobTech Taxonomy - Yrke
definition: Maskinoperatörer, textil-, tvätt- och läderindustri m.m.
broader: Process- och maskinoperatörer
narrower: Maskinoperatörer, blekning, färgning och tvättning
narrower: Övriga maskinoperatörer, textil-, skinn- och läderindustri

Processingenjör, gruv
type: Concept
in scheme: JobTech Taxonomy - Yrke
definition: Processingenjör, gruv
broader: Civilingenjörsyrken inom gruvteknik och metallurgi
related: 6Hq3 tKo V57
related: AZPQ Dz2 LGF
broad match: C2146

Specialistläkare, infektionssjukdomar
type: Concept
in scheme: JobTech Taxonomy - Yrke
definition: Specialistläkare, infektionssjukdomar är en specialiserad legitimerad läkare med en djupare kunskap och kompetens inom sitt område. Specialistläkare är en skyddad titel och bara den som har bevis om specialistkompetens får kalla sig specialist i sin specialitet. Specialistläkare ansvarar för att diagnostisera, behandla och förebygga sjukdomar inom sin specialitet. Vanliga arbetsuppgifter är mottagningsarbete med patientbesök, rondarbete på avdelning, handledning av yngre läkare samt konsultationer till andra yrkesgrupper och specialiteter. Specialistläkare ansvarar även för att följa och leda utvecklingen inom sitt medicinska område och utför omfattande medicinsk dokumentation och administration. Källa: Arbetsförmedlingen, Karolinska Institutet, Socialstyrelsen, Sveriges Kommuner och Regioner, Sveriges läkarförbund
broader: Specialistläkare
related: NYW6 mP6 vwf
related: 5MTC SDc txF
related: GRS8 2sR Nzo
related: qSbw XHD Ycd
related: TChC u37 rt2
related: GnRp 8Wa Rmf
related: EBX9 7gC eLt
related: vFjb AHi a54
related: jFHU uSj 4ke
related: bQkW AP6 zN1
related: KALC VvK 17U
related: QSeQ MpU wpW
related: 89LR AwA UqR
broad match: C2212

Regionskattechef
type: Concept
in scheme: JobTech Taxonomy - Yrke
definition: Regionskattechef
broader: Förvaltnings- och planeringschefer
related: X82t awd Qyc
related: epLc SkD cbT
related: bh3H Y3h 5eD
related: sZfR Db3 tfz
broad match: C1213

Sug- och spolbilsförare
type: Concept
in scheme: JobTech Taxonomy - Yrke
definition: Sug- och spolbilsförare arbetar bland annat med att spola avloppsledningar, tömma tankar och rengöra filter. Man arbetar ofta på uppdrag av byggföretag eller kommuner. Föraren behöver vara serviceinriktad och ha god lokalkännedom, samt ha kunskap om hantering av farligt gods. Behörighet att köra med släp är en fördel för yrket. Källa: Transportfackens yrkes- och arbetsmiljönämnd
broader: Lastbilsförare m.fl.
related: wBZA 2QJ vRx
related: mZnq LRZ G2n
related: qbnB uNK Jxu
related: zGjD M5a HCX
related: XTgV oiR 2Dq
related: fmSe eVg dfJ
related: Fm3k apv Rcb
related: BoLy skQ hBw
related: Rge8 RHu xQu
related: d68E e74 a59
related: hhb7 1hV t7R
related: ASGV zcE bWf
related: ooRF MGR 81N
related: 7TNd KPX vDe
related: m1je bQL Z7A
related: 4jeB Bkt Qda
related: 483u hVx psa
related: YEFE tAc fD2
related: 9wnn PAV q12
broad match: C8332

Begravningsrepresentant
type: Concept
in scheme: JobTech Taxonomy - Yrke
definition: Begravningsrepresentanter hämtar och transporterar avlidna inför och i samband med begravningsceremoni. Yrket kan även kallas begravningstransportör. Arbetsuppgifterna innefattar hämtning av avlidna på bårhus, svepning och kistläggning samt transporter till kylförvaring respektive ceremonilokal. Andra arbetsuppgifter kan vara iordningställande kring kistan inför ceremoni. Beroende på arbetsplats kan även praktiska uppgifter under begravningsceremoni förekomma, så som kistbärning och gravsättning. Då yrket i huvudsak innebär transporter är körkort för personbil ett krav. Källa: Sveriges Begravningsbyråers Förbund, Arbetsförmedlingen
broader: Begravnings- och krematoriepersonal
related: rt4q HTi mt3
related: GazW 2TU kJw
related: Szdo EFD KA1
related: P7nK zAq ARY
related: oegR sQR LxF
broad match: C5163

Grundlärare, 4-6
type: Concept
in scheme: JobTech Taxonomy - Yrke
definition: En lärares huvudsakliga arbetsuppgift är att planera och sköta undervisning, så att barnen får verktyg att själva kunna läsa, skriva och räkna. Lärare är ett reglerat yrke med legitimationskrav för att kunna bli tillsvidareanställd och sätta betyg. Grundläraren undervisar oftast i flera olika ämnen för samma grupp, vilket skiljer dem från ämneslärare. För att kunna bli tillsvidareanställd och få sätta betyg behöver du en lärarlegitimation. Källa: Arbetsförmedlingen -Hitta yrken, Örebro universitet
broader: Grundskollärare
related: 1im5 gpH TNC
related: kXfH oGq ziE
related: yRys xFQ tET
related: 7x7m fyi 41T
related: kRxj gb4 AE7
related: KtmA ALs 6gt
related: CXJp V1U ycY
related: xCBk bc1 Bpq
related: aHCZ PzT rG8
related: N8fS PR4 SiB
related: sQjp 5hY mWE
related: LbSu jzW wGt
related: 4xo2 qza oLa
related: zPhY JMC weQ
related: GnFC WGM uAq
related: ppBe 3r9 2si
related: MVqp eS8 kDZ
related: G9yV QuL LSh
related: aYKP 9e2 v9E
related: X1Rj twR g7h
related: 3jJC HQR 7px
related: uGZp sES 56c
related: rZcQ Tjx YmC
related: cvMz YGJ 2qu
related: 9sgR EAy 3W9
related: j3ep 8vv nLH
related: fQST HDG cvc
broad match: C2341

Forskare, pedagogik
type: Concept
in scheme: JobTech Taxonomy - Yrke
definition: Forskare, pedagogik
broader: Övriga pedagoger med teoretisk specialistkompetens
related: pVzY rff Amk
related: MVqp eS8 kDZ
broad match: C2359

Produktionschef, bygg
type: Concept
in scheme: JobTech Taxonomy - Yrke
definition: Produktionschef inom bygg är ett yrke som kan se lite olika beroende på i vilket företag tjänsten finns. Det kan innebära ett övergripande ansvar för att leda och utveckla en produktionsenhet med personalansvar för projektchefer och deras produktionspersonal. Det kan också vara en mer operativ roll på ett byggprojekt som innebär att schemalägga arbetsinsatser, hantera arbetsstyrkan och utrustningen, övervaka produktionsflödet och se till att produktionen uppfyller tidplaner och kvalitetskrav. Källa: Arbetsförmedlingen
broader: Driftchefer inom bygg, anläggning och gruva
related: sf31 Sn5 FVV
related: m18Q FKi sts
related: j7Cq ZJe GkT
related: epLc SkD cbT
related: bh3H Y3h 5eD
related: 6HyV Nzw QHL
related: Z69j 8MQ Bpj
related: ja7J P8X YC9
related: A3ii 9pD GuJ
broad match: C1323

Betongarbetare, utan yrkesbevis
type: Concept
in scheme: JobTech Taxonomy - Yrke
definition: Betongarbetarens uppgifter är bland annat att armera, gjuta och bearbeta betong i olika byggprojekt som till exempel husgrunder, golv och broar. Betongarbetare armerar och gjuter husgrunder, väggar och pelare. En betongarbetare arbetar inte bara med husbyggnad utan även vid väg- och brobyggen. Betongarbetare gjuter också betonggolv och efter gjutningen kan det krävas efterbearbetning, såsom vakumsugning och slipning för att höja ytans kvalite. Slipningen görs med hjälp av speciella maskiner. Källa Arbetsförmedlingen
broader: Betongarbetare
related: j7Cq ZJe GkT
related: ja7J P8X YC9
related: QUEY 4bk em1
broad match: C7114

Boendeföreståndare
type: Concept
in scheme: JobTech Taxonomy - Yrke
definition: Boendeföreståndare
broader: Chefer inom socialt och kurativt arbete
related: GazW 2TU kJw
related: epLc SkD cbT
related: ayZh 9Ci mX4
related: ntDU jpf sN7
related: bh3H Y3h 5eD
related: GHQq sKK ELR
broad match: C1344

Specialistpsykolog
type: Concept
in scheme: JobTech Taxonomy - Yrke
definition: En specialistpsykolog är en legitimerad psykolog med fördjupad kompetens inom något av de 10 specialistområden, exempelvis klinisk psykologi, neuropsykologi eller arbets- och organisationspsykologi. Psykolog är en skyddad titel med legitimationskrav. Rollen innebär avancerat kliniskt arbete, handledning, utvecklings- och ledningsuppdrag. En specialistpsykolog ansvarar för kvalificerade psykologiska utredningar, bedömningar och behandlingar, särskilt vid komplexa eller svårbedömda ärenden, fungera som expertstöd och ge “second opinion” vid komplicerade fall samt handleda och utbilda mindre erfarna psykologer, PTP-psykologer och ibland andra yrkesgrupper inom verksamheten. Källa: Arbetsförmedlingen, Region Värmland, Socialstyrelsen
broader: Psykologer
related: vj6a Eh9 2wV
related: NYW6 mP6 vwf
related: GazW 2TU kJw
broad match: C2634

Ledsagare
type: Concept
in scheme: JobTech Taxonomy - Yrke
definition: Ledsagare bistår personer med funktionsnedsättningar att delta i samhällslivet utanför hemmet. Detta kan inkludera aktiviteter som fritidssysselsättningar, resor eller sociala besök. Syftet är att motverka social isolering och främja en aktiv livsstil. Ledsagarservice beviljas som en personlig insats anpassad efter individens behov och kan beviljas enligt Lagen om stöd och service till vissa funktionshindrade (LSS) eller Socialtjänstlagen (SoL). Arbetet innebär nära samarbete med den enskilde, där ledsagaren underlättar för individen att delta i olika aktiviteter och att interagera med andra människor. Källa: Arbetsförmedlingen
broader: Personliga assistenter
related: UdVa jRr 9DE
related: GazW 2TU kJw
related: Zdhm 2zk p8H
related: ARP9 7nc QEe
broad match: C5322

Vårdutvecklare
type: Concept
in scheme: JobTech Taxonomy - Yrke
definition: Vårdutvecklare
broader: Planerare och utredare m.fl.
related: Nxdn wGG gMt
related: X82t awd Qyc
related: bXZW Ka2 Ff5
related: UToj qQd v6h
related: TZe9 NsN uce
related: 5H2x GD5 UNE
related: ZEZX mAL bE6
broad match: C2421

Chef inom bank
type: Concept
in scheme: JobTech Taxonomy - Yrke
definition: Chef inom bank
broader: Chefer inom bank, finans och försäkring
related: X82t awd Qyc
related: epLc SkD cbT
related: bh3H Y3h 5eD
related: HGsS VTf UYJ

Infrastrukturspecialist, It
type: Concept
in scheme: JobTech Taxonomy - Yrke
definition: En IT-infrastrukturspecialist ansvarar för att designa, implementera och förvalta den underliggande tekniska infrastrukturen som behövs för IT-tjänster och system. Det kan innebära allt från att sätta upp nätverk och servrar till att arbeta med molnbaserade lösningar och säkerhetssystem. Specialisten säkerställer att infrastrukturen är skalbar, pålitlig och kostnadseffektiv. Källa: Wise IT
broader: Ingenjörer och tekniker inom elektroteknik
related: 6Hq3 tKo V57
related: u6N5 brU TJi
related: xvJN fPM eRP
broad match: C3114

Miljöhandläggare
type: Concept
in scheme: JobTech Taxonomy - Yrke
definition: Miljöhandläggare
broader: Specialister inom miljöskydd och miljöteknik
related: LxEH 8Br zXL
related: kJeN wmw 9wX
related: i5Jh A62 xZC
related: 214y LZd XxU
related: pNct 3WL BPh
related: E4N4 MnA qmP
related: VVm7 wWn onJ
related: zWKH KmW vvD
related: YjHK 9bN RGe
related: Yy43 kPh WGs
related: KqkE 5dd WAR
related: 4ff1 4gB Dew
related: 4Aio fg5 M7g
related: EtgB 1H5 Vdk
broad match: C2133

Biokemist
type: Concept
in scheme: JobTech Taxonomy - Yrke
definition: Biokemist
broader: Kemister
related: CpFD aoS pkZ
related: kJeN wmw 9wX
related: Yr11 UKD on1
related: fM7t axJ RNN
related: kF1T hMk ZGp
broad match: C2113

Sjukvårdstolk
type: Concept
in scheme: JobTech Taxonomy - Yrke
definition: Sjukvårdstolk
broader: Översättare, tolkar och lingvister m.fl.
related: cspa Mji BMS
related: 9puE nYg crq
broad match: C2643

Importchef
type: Concept
in scheme: JobTech Taxonomy - Yrke
definition: Importchef
broader: Inköps-, logistik- och transportchefer
related: X82t awd Qyc
related: epLc SkD cbT
related: bh3H Y3h 5eD
broad match: C1324

Civilingenjörsyrken inom elektroteknik
type: Concept
in scheme: JobTech Taxonomy - Yrke
definition: Utvecklar teorier, modeller och metoder inom elektroteknik. Leder projekterings- och konstruktionsarbete som avser elektrotekniska produkter och anläggningar. Svarar för produktion och teknisk utveckling samt för provning och kontroller av elektrotekniska produkter och anläggningar. Undersöker och ger råd om elektrotekniska material, produkter eller processers tekniska aspekter. Hit hör inte Yrken inom elektroteknik med arbetsuppgifter motsvarande ingenjör- eller teknikernivå (3113)
broader: Civilingenjörsyrken
related: 7PHz phA t1T
related: xZLY ZU5 E1q
related: FqWP 6FQ Wz5
related: ebrf 1Fe ksC
related: uvcb DuX NW8
related: Gk4E H9x ssE
related: A5HJ aMw BQt
related: Qpvg yTe ozK
related: azqw 7dF CkQ
related: eHy7 eMm 1mG
related: iUew moc BRk
related: DjRV REm VWr
related: tg8L maz wMN
related: sA2V erA 3WN
related: 9xBC Q2v wt6
related: kjAi 8yN pgg
related: 61zA BvK zDd
related: jRmz YPq DJM
related: 4MQo 2b2 u1z
related: d4fX YoT QQc
related: QwLM BaT D3w
related: z1Jn sEk Lmx
related: n5Ww Cc9 xYG
related: gnTS st6 iAd
related: e89D KrX H3C
related: oaiv GsB AFK
related: q2gX XVu Pno
related: g7gz 58E jaQ
related: 8Xp7 Tzo Y6X
related: ofcY XXh G4k
related: qgx7 uNq F3m
related: C2152
related: 74Mw JUN VKx
related: 2kEw jWL 6Zz
related: EuVK o4G CkD
related: Vc24 oqo Qgr
related: 6ZKB QVh xPs
related: K5JR yfk 8oj
related: yh11 sgo Z29
related: Ni4P t3u oM1
related: YK2s pxn YWW
related: C2153
related: kfYc q1X SZ5
related: UuhP Skh QrH
related: NtWF zFu Mhg
related: xAbu uKA Jeu
related: K1Az 43o qWR
related: ByFL cg4 y91
related: 4fWV khE jfp
related: yFgG g8k r6r
related: 8ZhW wNv 5k9
related: bwYY qC7 5xE
related: ksNo 7bD ez3
related: 2vCi hQz Y9o
related: FnZT ewa vH7
related: aphz ZZU HyV
related: YAdb Wwj b3N
related: PpQM 12A gFU
related: opLa Pe7 5yg
related: Qosk 7TN jwT
related: HW3B CwN pst
related: kJCx vqk SQG
related: 6yXa XxZ WSV
related: caWZ HUm yNp
related: zRtu fYj XC4
related: jSAi QKc JQk
related: qAPk 7uX SAU
related: uwev L2n fpz
related: r78c Y6B h6r
related: ob2k Bcp XHY
related: Udbb Eay MuR
related: tNHP 38u Pjt
related: bMmc jnh BYV
related: AxPX zi5 1k9
related: irPd z5v 2o1

Fartygsinspektör
type: Concept
in scheme: JobTech Taxonomy - Yrke
definition: Fartygsinspektörer arbetar med tillsyn, besiktning och inspektion av svenska och utländska fartyg för att säkerställa säkerhet, miljö och arbetsmiljö ombord. Arbetsuppgifter inkluderar besiktning av nybyggnationer, ombyggnationer och inflaggning, granskning av ritningar och teknisk dokumentation samt genomförande av hamnstats- och värdstatskontroller. Rollen innebär även operativa kontroller i hamnar och vid incidenter, och kan kräva beredskapstjänstgöring med utryckningar. Sjöingenjörsexamen efterfrågas för att arbeta som Fartygsinspektör. Källa: Transportstyrelsen
broader: Säkerhetsinspektörer m.fl.
related: dRFw Rcu dX7
related: m33m kyS UKB
related: E7hm BLq fqZ
related: yhCP AqT tns
related: kDNx z5C AmY
related: 1BQB 21n qRh
broad match: C3115

Hundskötare
type: Concept
in scheme: JobTech Taxonomy - Yrke
definition: En hundskötare tar hand om hundars grundläggande behov och välbefinnande, ofta på hunddagis, hundpensionat eller kennel. Arbetsuppgifterna inkluderar utfodring, motionering, hygienvård (t.ex. kloklippning, bad) och att hålla rent och tryggt i hundens miljö. Källa: Arbetsförmedlingen, div jobbannonser
broader: Uppfödare och skötare av sällskapsdjur
related: UdVa jRr 9DE
related: JEyw Zr5 2Ux
related: 38ST bqq R8r
related: 8QM5 mt3 1gJ
related: 8eJB xuD ezT
related: j37K oeh mb9
related: 3NMs Bfh xMf
related: iDtg bX4 eH7
related: VuuL 7CH adj
related: 7prb BBJ iK6
broad match: C5164

Skyltmakare
type: Concept
in scheme: JobTech Taxonomy - Yrke
definition: Skyltmakare tillverkar skyltar. Arbetet innefattar att designa, tillverka och underhålla skyltar i material som trä, plast, metall och glas. Arbetsuppgifterna omfattar hela processen, från planering och produktion till montering och reparation. Skyltmakare skapar bland annat reklamskyltar, husnummer och gatuskyltar, både i traditionellt och modernt utförande. Källa: Hantverksakademin, Hantverkslärling, Arbetsförmedlingen
broader: Musikinstrumentmakare och övriga konsthantverkare
related: PaxQ o1G wWH
related: 4a7z Me5 Yqe
broad match: C7316

Skorstensfejare
type: Concept
in scheme: JobTech Taxonomy - Yrke
definition: Sotar rökgasvägar i eldstäder och skorstenar. Rengör imkanaler och köksfläktar. Kontrollerar värmeanläggningar och gör täthetsprövningar och rökgasanalyser.
broader: Målare, lackerare och skorstensfejare m.fl.
related: 77dm PVF Skk
related: FyAL 3mK dYH
related: rL1T t2q RM6
related: Q7eC B7g QiU
related: Et6u byH aB7
related: CzZc 7tx B9C
related: ur5t WrD DXL
related: fhcp fFw Lbj
related: vUq1 BxS wc8
related: 6BpN oXk 7SL
related: 14MH jik z2A
related: C7133
related: 8RJH 4Xc 1Cr
related: f5fY FAy uwx
related: zCai NdW 3qn
related: GuFR GfS fQ6
related: cKJw Yw3 Jm9
narrower: Skorstensfejare
narrower: Skorstensfejartekniker
broad match: whao Q6A ScE

Koordinator: kultur, media, film, dataspel
type: Concept
in scheme: JobTech Taxonomy - Yrke
definition: Koordinator: kultur, media, film, dataspel arbetar med att planera, samordna och säkerställa att produktioner och projekt inom kultur, media, film och dataspel genomförs effektivt och enligt uppsatta mål. Vanliga arbetsuppgifter är planering av tid, resurser och personal, kommunikation mellan olika aktörer i projektet samt att följa upp och rapportera projektets framdrift. Koordinatorn stödjer också kvalitetssäkring och kan hantera administrativa uppgifter kopplade till projektet. Källa: Arbetsförmedlingen
broader: Regissörer och producenter av film, teater m.m.
related: fchp Ugw 3hX
related: FfDD gxA Bsr
related: xsuH Arz yyE
related: jkGV wS2 XLN
related: X82t awd Qyc
related: d6U5 2wt 2wM
related: xyvv zbe 5tX
related: EzSi Feb w1o
related: 8too bEs 7NU
related: 9puE nYg crq
related: 7sJj xKj 2UE
related: gCVr duc QL9
related: MLFe Dyk 7CV
related: 5yy1 SiZ gr1
related: XCvG 4nd vsw
related: Cesw d3v ioU
related: yB6U NRh yHh
broad match: C2654

Maskinoperatör kött- och fiskberedning
type: Concept
in scheme: JobTech Taxonomy - Yrke
definition: Maskinoperatörer inom kött- och fiskberedning sköter och övervakar maskiner som producerar livsmedel. Yrket är mycket likt maskinoperatörer in livsmedelsindustri, med skillnaden att man arbetare med eller har specialiserat sig på kött- och/eller fiskberedning. Arbetet kan ske via kontrollrum där maskinoperatören styr, övervakar och justerar produktionen. Beroende på arbetsplats och typ av livsmedel kan arbetsmoment som utförs för hand även förekomma. Inom livsmedelsindustri finns även krav på att man som medarbetare har utbildning i säker livsmedelshantering. Beroende på arbetsplats kan truckkörning, lagerarbete och leveransföreberedelse förekomma. Källa: Arbetsförmedlingen
broader: Maskinoperatörer, kött- och fiskberedningsindustri
related: WKnf dQf q8B
related: bV8q sfR 74S
related: 8aRN xaW 5H8
related: GvqE Lcp FNa
related: mWKt fij Gq2
related: oHK8 Ehd FnZ
related: FGsT GA3 rc4
related: CuDT UrQ Hwf
related: FPd1 V8z 3JV
related: oTFT uAn dFz
related: wTEr CBC bqh
related: Jdrb iry 53u
broad match: C8160

Måltidsutvecklare
type: Concept
in scheme: JobTech Taxonomy - Yrke
definition: Måltidsutvecklare arbetar med utveckling och förbättring av offentliga måltider. Vanliga arbetsuppgifter är att bedriva projekt inom hållbarhet och näringskvalitet samt att ta fram och implementera nya rutiner och koncept för måltidsverksamhet. Rollen innefattar ofta utbildning av personal, näringsberäkning, utveckling av menyer samt inspiration och stöd till köksanställda. Måltidsutvecklare driver utvecklingsarbete kring exempelvis matsvinn, hälsa, och hållbara menyer. Måltidsutvecklare samarbetar ofta med kostchefer inom kommunala verksamheter. Källa: Sveriges kommuner och regioner, Arbetsförmedlingen
broader: Storhushållsföreståndare
related: tSRM mGL X5G
related: yz6N S6H tw6
related: AuMQ UCg 5yT
related: ScKy FHB 7wT
related: AVGt mbC dMb
related: neZF 7t1 31Q
broad match: C3434

Landskapsarkitekt
type: Concept
in scheme: JobTech Taxonomy - Yrke
definition: Landskapsarkitekter arbetar med att planera utformningen av yttre miljöer och grönområden, genom att ta fram ritningar och modeller på större bostads- och industriområden, men även enskilda gator, torg och parker. Utifrån olika behov, önskemål och krav tar man fram lösningar som är väl fungerande för ändamålet men även ur ekonomiskt, ekologiskt och estetiskt perspektiv. Källa: Arbetsförmedlingen
broader: Landskapsarkitekter
related: 6Hq3 tKo V57
related: n5Te obL 2MW
related: 59H4 Tz8 KHL
related: kyJJ xtr QLc
related: ja7J P8X YC9
related: dmoJ och Z48
related: SZdM Fgt A95
broad match: C2162

Hamnarbetare
type: Concept
in scheme: JobTech Taxonomy - Yrke
definition: Lastar och lossar gods samt dirigerar trafik i hamnar. Hit hör inte Depåman/Depåtekniker (4322) Terminalarbetare (4322) Truckförare (8344)
broader: Hamnarbetare och ramppersonal m.fl.
related: swdt CX9 tHZ
related: C9333
related: ws2R MBQ svX
related: Ahfa KuY 4HZ
related: tWch mrP ECi
related: pGts PKK c8W
related: tKd2 9Ei PTQ
related: J455 EA8 ZxD
related: wDfP nC2 4rj
related: ENrQ eiN i3i
related: HnQ2 FhC xgt
related: CiMi 7ax tXs
related: ykyf hFy V5o
related: jPhb feC ypa
related: XQet 5J6 HGj
related: rwir xvu 443
narrower: Hamnarbetare
broad match: ASGV zcE bWf

Osteopat
type: Concept
in scheme: JobTech Taxonomy - Yrke
definition: Osteopat undersöker, bedömer, behandlar och förebygger hälsoproblem för att återställa kroppens funktion. Vanliga arbetsuppgifter är bedöma hälsa och medicinsk historik, fysiska undersökningar och rörelsetester och utforma behandlingsplaner. Osteopaten använder mjuka manipulationer och tryck för att förbättra ledrörlighet, minska muskelspänningar och ger råd om hälsoförbättrande övningar och livsstilsförändringar. Källa: Arbetsförmedlingen, Osteopatakademien, Svenska Osteopatförbundet
broader: Kiropraktorer och naprapater m.fl.
related: NYW6 mP6 vwf
broad match: C2269

Fiskeribiolog
type: Concept
in scheme: JobTech Taxonomy - Yrke
definition: Fiskeribiolog
broader: Växt- och djurbiologer
related: kJeN wmw 9wX
related: iajc qiE dY4
broad match: C2131

Riksgäldsdirektör
type: Concept
in scheme: JobTech Taxonomy - Yrke
definition: Riksgäldsdirektör
broader: General-, landstings- och kommundirektörer m.fl.
related: epLc SkD cbT
related: bh3H Y3h 5eD
broad match: C1112

Projektledare logistik
type: Concept
in scheme: JobTech Taxonomy - Yrke
definition: Projektledare inom logistik planerar, leder och följer upp logistikprojekt. Rollen är central i utveckling och implementering av logistiklösningar vid exempelvis lageretableringar, omläggning av transportnätverk eller införande av nya IT-system inom försörjningskedjan. Projektledaren analyserar behov, definierar mål, tar fram tids- och resursplaner, och ansvarar för att projektet levereras enligt uppsatta krav. Det är vanligt att arbeta med både nationella och internationella projekt inom till exempel transportoptimering, e-handel, 3PL-lösningar eller hållbar logistik. Källa: Arbetsförmedlingen
broader: Speditörer och transportmäklare
related: PP8i rsX rGG
related: ASGV zcE bWf
related: yXSE wvx EAN
broad match: C3331

Signalingenjör
type: Concept
in scheme: JobTech Taxonomy - Yrke
definition: Signalingenjör arbetar med utveckling, design och optimering av signalbehandlingssystem inom kommunikation och elektronik. Arbetsuppgifterna inkluderar analys av signaler, algoritmutveckling, simulering samt testning av signalbehandlingsmetoder för att förbättra kvalitet och prestanda i överföringssystem. Signalingenjören samarbetar ofta med produktutveckling, elektronikingenjörer och systemdesigners för att integrera signalbehandlingslösningar i produkter och system. Signalingenjörer har vanligtvis kunskaper inom digital signalbehandling, kommunikationsteknik, matematik och programmering. Källa: Arbetsförmedlingen
broader: Ingenjörer och tekniker inom elektroteknik
related: 6Hq3 tKo V57
related: SvAW coW dGN
broad match: C3522

Elevassistent
type: Concept
in scheme: JobTech Taxonomy - Yrke
definition: Elevassistenter stödjer elever och lärare för att göra lärandet lättare. Elevassistenter ger extra hjälp i klassrummet under undervisningen, stöd på raster, i omklädningsrum och på utflykter till enskilda elever, en klass eller en fritidsgrupp. Arbetsuppgifter varierar beroende på det stöd eleven är i behov av. Elevassistentens grunduppgift är att finnas som stöd och resurs för en eller flera elever. Arbetet kan innebära att hjälpa eleven att få studiero och kunna delta i undervisningen. I vissa fall handlar det om hjälp vid måltider, raster eller vid ombyte. Källa: Arbetsförmedlingen
broader: Elevassistenter m.fl.
related: SQLu wDR LUu
related: UdVa jRr 9DE
related: kSmi bjE cdU
related: bYNr aMJ Bc3
related: sH2L i3B 53m
related: Send iE5 Adf
related: S2eq ux4 Si9
related: gL5b kTk Rde
related: MVqp eS8 kDZ
related: DvLw tdL Lzt
related: V5oC T9y 2vG
related: gTWk 4yY tKj
broad match: C5312

Snabbmatspersonal, köks- och restaurangbiträden m.fl.
type: Concept
in scheme: JobTech Taxonomy - Yrke
definition: Snabbmatspersonal, köks- och restaurangbiträden m.fl.
broader: Yrken med krav på kortare utbildning eller introduktion
narrower: Snabbmatspersonal, köks- och restaurangbiträden m.fl.

Montörer, elektrisk och elektronisk utrustning
type: Concept
in scheme: JobTech Taxonomy - Yrke
definition: Sätter i seriemässig tillverkning samman el- och teleutrustning genom att t.ex. skruva, löda och svetsa. Hit hör inte Elektromekaniker (7412) Elektronikmontör (7420) Installationselektriker (7411) Linjemontör, elkraft (7413)
broader: Montörer
related: 8Mhi Q7T hwt
related: EkJL sAV WAx
related: VPF1 UZM 9Kd
related: wBLK nWZ 7ek
related: A3WD tih jtM
related: nCFH bCW Ldf
related: pFuD wtR Yzs
related: oYuG DTW R2D
related: ax2t Yyg 2Sy
related: mTRy UG9 fAZ
related: NiuC Egy dim
related: qQ61 EQR rcz
related: VTwt 5Fe 6bW
related: PELm cH9 AE9
related: Q7eC B7g QiU
related: KDzy Hra iVr
related: kA5a zfY 69j
related: 9Asf XUW K2w
related: M6Q7 tQ8 w2Q
related: Xtys AjN 9an
related: HULE 2Gr nkv
related: 8pwJ sfn cAx
related: 8Wtz Hxe Yz2
related: C8212
related: nkhA jPz pcE
related: dW6y neZ EFs
related: ynWd oCo o61
related: qBC1 XU2 c8o
related: qPmT 5pS Th9
related: ASXn RvT PNP
related: x7ih HZS VDB
related: WLAi BDr 5fW
related: KymG vW5 bjG
related: uBaP BsX BdU
related: X4EU ZC7 QmK
related: BAhW Ko7 69u
related: AEgv 4gP ndv
related: XKi1 RS1 Us3
related: 4y7C Lsh EPM
related: aZhT EK1 ypN
related: uenm 75h fEh
related: wZpC X9a xzG
related: dWbY gXC Frx
related: 7Zdv HXJ 6Dg
related: HcDb Fvn FPf
narrower: Solcellsmontör
narrower: Elektronikmontör
narrower: Solcellsinstallatör
narrower: Elmontör
broad match: wTEr CBC bqh

Finansiell controller
type: Concept
in scheme: JobTech Taxonomy - Yrke
definition: Finansiell controller
broader: Controller
related: 4M2P k5N BgZ
related: eQFc 7Vq buj
related: uriN X3f efy
related: X82t awd Qyc
related: vw7i 55Q xxT
related: oZhH GzK b37
related: FpNL aUn N83
related: z9Ja vVV b3m
related: HKdA Pbv CML
related: K2x3 xss uje
related: 21Wd DZX xZA
related: AFo9 1h3 bP9
broad match: C2411

Journalister m.fl.
type: Concept
in scheme: JobTech Taxonomy - Yrke
definition: Samlar lokala, nationella och internationella nyheter med hjälp av intervjuer, undersökningar och observationer för tidningar, TV, radio och andra media. Redigerar artiklar och inslag. Granskar och bevakar uppgifter av allmänintresse. Undersöker och rapporterar om utvecklingen inom speciella områden, såsom medicin, vetenskap och teknik. Skriver ledare och kommentarer samt gör inslag om aktuella ämnen och uttrycker en tidnings, radio- eller TV-kanals åsikt.
broader: Författare, journalister och tolkar m.fl.
related: AuHz M2K yZW
related: rPMH yr9 h7d
related: pnc1 ipM Xvv
related: BZDw 9aj p4S
related: E44v wYZ wjx
related: poUy FfV mr3
related: wmgT tiS RSn
related: 1CnL 8ZQ tTd
related: gx8F mte Nm5
related: MD6w gZ7 czL
related: fvcS YGu rhe
related: MhUt 1eW m2e
related: TDfm YCB Gyh
related: hsjK E8p YNw
related: d2DF mFF gQj
related: F4nq ZH3 s3u
related: assp hgx pSE
related: aZDe N9r xic
related: AfJ4 Pvv YBa
related: oQre F86 kHG
related: tbE2 Kne hLN
related: oJK5 S7T DTU
related: 1Uuq WHZ dPu
related: 7tvZ Vey JsX
related: dTK5 R7G p56
related: id7h ns8 83w
related: 4z4f Tzu S2s
related: Aj1W rmu niY
related: 49Hd QeU Dvg
related: vSqz 6Hj Jrg
related: Rz5y 53L 7Tk
related: 7R8A NCp MVw
related: b8XR ec5 jsU
related: 4dTw UTp 6YJ
related: q6nz 5go P7G
related: eqeV oP1 J8v
related: UH9g R5v MCx
related: St3s bmV dHC
related: LShp t9S Cc6
related: nvM6 J6v qKQ
related: ak7w 385 hM4
related: d7GK rmt 4FC
related: 8tYq EXD Xwm
related: 4vue Bzu Jke
related: Emrj oG2 D7b
related: dYog aJL kok
related: 4RmJ wiU N4k
related: AKM1 Fwg AC7
related: QKCY 93f GgW
related: DE5P D82 384
related: pLyW JYJ TFq
related: 67C3 Yoo jte
related: dwm2 1V3 MpP
related: 5AdH yyr MPW
related: H5KZ roq acH
related: jfmZ FfR NFm
related: 42PE qfg e8t
related: xNyv PTi fSa
related: mTDZ awC yZc
related: jDQy MkJ SN4
related: eHkH gdM v8E
related: LyVp zhc czS
related: DXNc cU4 j4N
related: FiV2 Gk2 bG9
related: rDwo tV5 qic
related: yQcc fTn JL5
related: j2zU qdz 37s
related: tiKj bwa DGL
related: mz5y hoY H7C
related: oEJ1 Jm7 J97
related: BoFp ELR f5Z
related: tLz8 cPk fY5
related: 7NpA Fob fUr
related: VVj2 4Uu LL9
related: CR2o UpP 3sZ

Biträdande universitetslektor/Biträdande högskolelektor
type: Concept
in scheme: JobTech Taxonomy - Yrke
definition: Biträdande universitetslektor/Biträdande högskolelektor
alternative label: Biträdande högskolelektor
alternative label: Biträdande universitetslektor
broader: Universitets- och högskolelektorer
related: bh3H Y3h 5eD
broad match: C2310

Orgelbyggare
type: Concept
in scheme: JobTech Taxonomy - Yrke
definition: Orgelbyggare bygger och renoverar piporglar. Som orgelbyggare är en stor del av yrket att restaurera, underhålla och rekonstruera äldre orglar. Musikinstrumentmakare, inklusive orgelbyggare, är ett hantverksyrke, där viktiga kunskaper är bland annat materialkunskap, verktygsvård, maskinbearbetning, ritning och uppmätning samt ytbehandling. För orgelbyggare är kunskaper om olika träslag särskilt viktigt. Källa: Hantverksakademin, Hantverkslärling, Arbetsförmedlingen
broader: Musikinstrumentmakare och övriga konsthantverkare
related: PaxQ o1G wWH
related: nWE2 we5 1PX
related: YuAL ETk ih5
broad match: C7312

PR-konsult
type: Concept
in scheme: JobTech Taxonomy - Yrke
definition: PR-konsult
broader: Informatörer, kommunikatörer och PR-specialister
related: iK5M SvY M9J
related: S7y8 kV5 s5L
related: X82t awd Qyc
related: Yb1w sSy Rh9
related: Pw3G nt9 mua
related: vwxR MbC XjW
broad match: C2432

Forskare, genetik
type: Concept
in scheme: JobTech Taxonomy - Yrke
definition: Forskare, genetik
broader: Cell- och molekylärbiologer m.fl.
related: kJeN wmw 9wX
related: TXx8 Mgv BGZ
broad match: C2131

Ekonomibiträde, fartyg
type: Concept
in scheme: JobTech Taxonomy - Yrke
definition: Ekonomibiträde på fartyg arbetar inom intendenturavdelningen med städning, diskning, proviantering, servisplockning, mässuppassning, biträdande i kök och kallskänk, m m. Källa: SEKO
broader: Restaurang- och köksbiträden m.fl.
related: dRFw Rcu dX7
related: ASGV zcE bWf
related: XouD cCj HZN
related: ScKy FHB 7wT
related: R6eq vcx MJa
broad match: C9412

2D artist/2D-grafiker
type: Concept
in scheme: JobTech Taxonomy - Yrke
definition: 2D artist/2D-grafiker
alternative label: 2D artist
alternative label: 2D-grafiker
broader: Designer inom spel och digitala medier
related: vwhH HzU R9f
related: oeHg J1V PEg
related: 9puE nYg crq
related: zXeK 6P9 vQd
broad match: C2166

Bärplockare
type: Concept
in scheme: JobTech Taxonomy - Yrke
definition: Bärplockare plockar bär och frukter i skogen eller på odlingar. Arbetet innebär i huvudsak att plocka bär i skogen, så som lingon och blåbär men även svampplockning kan förekomma. Man kan även arbeta med plockning på bär- och fruktodlingar, där jordgubbsplockning är vanligt förekommande arbetsuppgift. Arbetet sker främst utomhus under säsong, beroende på arbetsgivare vanligen månaderna juli till oktober. Arbetsuppgfiter: plocka bär, plocka bär i skog och mark, plocka bär på odling Källa: Arbetsförmedlingen
broader: Bärplockare och plantörer m.fl.
related: UdVa jRr 9DE
related: ZqTy RAD 5ci
related: VuuL 7CH adj
related: nbgh 4eS K9o
broad match: C9211

Berggrundsgeolog
type: Concept
in scheme: JobTech Taxonomy - Yrke
definition: Berggrundsgeolog
broader: Geologer och geofysiker m.fl.
related: kJeN wmw 9wX
broad match: C2114

Underhållschef
type: Concept
in scheme: JobTech Taxonomy - Yrke
definition: Underhållschef
broader: Ingenjörer och tekniker inom gruvteknik och metallurgi
related: 6Hq3 tKo V57
related: epLc SkD cbT
broad match: C3117

Uppräkningspersonal
type: Concept
in scheme: JobTech Taxonomy - Yrke
definition: Uppräkningspersonal arbetar med maskinell uppräkning av dagskassor med sedlar och mynt. Vanliga arbetsplatser är bevaknings- och säkerhetsföretag som arbetar med värdetransporter av till exempel dagskassor från verksamheter. Källa: Arbetsförmedlingen
broader: Kassapersonal m.fl.
related: UdVa jRr 9DE
related: RPTn bxG ExZ
related: v14c 1Yk wV1
related: vQ8d QFb K1a
broad match: C5230

Civilingenjör, produktion, gruv, metallurgi
type: Concept
in scheme: JobTech Taxonomy - Yrke
definition: Civilingenjör, produktion, gruv, metallurgi
broader: Civilingenjörsyrken inom gruvteknik och metallurgi
related: 6Hq3 tKo V57
related: AZPQ Dz2 LGF
broad match: C2146

Lindansare
type: Concept
in scheme: JobTech Taxonomy - Yrke
definition: Lindansare
broader: Övriga yrken inom kultur och underhållning
related: 8too bEs 7NU
related: 9puE nYg crq
broad match: C2659

Skyddsingenjör
type: Concept
in scheme: JobTech Taxonomy - Yrke
definition: Skyddsingenjör
broader: Arbetsmiljöingenjörer, yrkes- och miljöhygieniker
related: E7hm BLq fqZ
broad match: C2263

Upphovsrättsjurist
type: Concept
in scheme: JobTech Taxonomy - Yrke
definition: Upphovsrättsjurist
broader: Affärs- och företagsjurister
related: X82t awd Qyc
related: x4Wi NWW ogB
related: Abcb QtH isZ
broad match: C2619

ST-läkare, barn- och ungdomsmedicin
type: Concept
in scheme: JobTech Taxonomy - Yrke
definition: Specialisttjänstgöring, ST, är den vidareutbildning som legitimerade läkare genomför för att uppnå specialistkompetens. ST-läkare barn- och ungdomsmedicin arbetar under handledning för att fördjupa sina medicinska kunskaper och färdigheter med målet att bli specialistläkare inom sitt område. ST-läkaren arbetar självständigt med patientutredningar, diagnostik och behandling, men alltid med stöd av specialister och enligt ett individuellt utbildningsprogram. Vanliga arbetsuppgifter är att ta medicinskt ansvar för patienter, delta i jourverksamhet, genomföra medicinska undersökningar och behandlingar samt dokumentera och följa upp vårdinsatser. Tjänsten omfattar också kontinuerlig kompetensutveckling, sidotjänstgöring inom närliggande områden och aktivt deltagande i handledning och utbildningsinsatser för kollegor och studenter. Källa: Arbetsförmedlingen, Karolinska Universitetssjukhuset, Sveriges läkarförbund, Region Kronoberg, Region Skåne.
broader: ST-läkare
related: NYW6 mP6 vwf
related: UtCj yMj ubw
broad match: C2211

Solskyddsmontör
type: Concept
in scheme: JobTech Taxonomy - Yrke
definition: Solskyddsmontörer monterar olika typer av solskydd in- och utvändigt på byggnader. Solskyddsmontörer monterar och olika typer av solskydd, såsom markiser, persienner, solfilm och rullgardiner. Arbetsuppgifterna inkluderar att mäta och anpassa solskyddslösningar efter kundernas behov samt att montera fästen och skenor på plats. Service och reparationer på befintliga solskydd ingår i arbetet. Källa: Arbetsförmedlingen
broader: Montörer, metall-, gummi- och plastprodukter
related: UdVa jRr 9DE
related: 6bmT 9nx eRB
related: cs2d ws7 hmt
related: nSs6 t15 3A4
related: Ys4w EaN Fyk
related: Jtkb 1jf uaX
related: xDdk nzP r3G
related: 3ymS 6pc 653
related: wTEr CBC bqh
related: 3vNk 83L bMK
broad match: C8219

Projektledare, telekom
type: Concept
in scheme: JobTech Taxonomy - Yrke
definition: Projektledare inom telekom planerar, koordinerar och följer upp projekt kopplade till utveckling, installation och drift av telekommunikationsnät och tjänster. Arbetsuppgifterna inkluderar projektplanering, resurshantering, tidsuppföljning samt kommunikation med kunder och leverantörer. Projektledaren hanterar projektets alla faser från förstudie till avslut och säkerställer att tekniska och ekonomiska mål nås. Projektledaren samarbetar ofta med tekniska specialister, försäljning och leverantörer för att integrera lösningar i telekominfrastrukturen. Projektledare inom telekom har vanligtvis kunskaper inom projektstyrning, telekomteknik, avtals- och leverantörshantering samt ekonomisk uppföljning. Källor: Arbetsförmedlingen, SACO, jobbannonser på Platsbanken och vakanser.se, företagswebbplatser inom telekomsektorn
broader: Ingenjörer och tekniker inom elektroteknik
related: V69P kB4 aoU
related: wZ13 3mb xoQ
related: SvAW coW dGN
related: yhCP AqT tns
related: AsUJ xrH unR
related: yXSE wvx EAN
related: dErA jSG 3Y4
related: NBF6 iUc hR5
broad match: C3522
broad match: C3113

Attaché
type: Concept
in scheme: JobTech Taxonomy - Yrke
definition: Attaché
broader: Planerare och utredare m.fl.
related: X82t awd Qyc
related: TZe9 NsN uce
broad match: C2422

Textilingenjör
type: Concept
in scheme: JobTech Taxonomy - Yrke
definition: Textilingenjörer utvecklar och kvalitetssäkrar textila produkter inom olika sektorer. Arbetsuppgifter skiljer sig mellan arbetsgivare beroende på vilken produkt man arbetar med, så som kläder, hemtextil och teknisk textil. Man kan arbeta med utveckling av produkter, material och funktionslösningar för till exempel fordonsindustrin eller vården. Man kan även ha andra roller så som inom produktionsplanering, kvalitetskontroll, försäljning eller forskning. Källa: Högskolan i Borås, Arbetsförmedlingen
broader: Övriga ingenjörer och tekniker
related: 6Hq3 tKo V57
broad match: C3119

Centrumutvecklare/Handelsutvecklare
type: Concept
in scheme: JobTech Taxonomy - Yrke
definition: Centrumutvecklare/Handelsutvecklare
alternative label: Centrumutvecklare
alternative label: Handelsutvecklare
broader: Försäljnings- och marknadschefer
related: RPTn bxG ExZ
related: epLc SkD cbT
related: bh3H Y3h 5eD
broad match: C1221

Distributionselektriker
type: Concept
in scheme: JobTech Taxonomy - Yrke
definition: Distributionselektrikerns uppdrag är att säkra elförsörjningen till bland annat fastigheter, industrier, sjukhus, jordbruk och kommunala anläggningar. En distributionselektriker arbetar utomhus med lokalnät, låg- och högspänning 0,4-20kV, det så kallade distributionsnäten i städer och på landsbygd. Distributionselektrikerna arbetar med nybyggnation, underhåll och reparation av både luftledning och markkabel med tillhörande ställverk och transformatorstationer. Källa: Åsbro kursgård
broader: Distributionselektriker
related: RqDA 3Pq Bz3
related: m1a1 8gW Dga
related: upGH kQU S1i
related: 35yo dZJ cvF
related: 2eRA BpE ejw
related: 9kKC c7A LkH
related: 8ETK UKA K16
related: qw5o ACg QVh
related: ksbC 4aL FxY
related: XhAP agU Sve
related: Reif BnR w6K
related: hmjd keP vTY
related: yhCP AqT tns
related: Njjq qPr 7XE
related: tULw SZj kCx
related: yo2B u4S tmr
related: qujR VHb J9c
related: EYhc GuB 4vy
related: rgGK xPu nL1
broad match: C7413

Tvättare, fönsterputsare och övriga rengöringsarbetare
type: Concept
in scheme: JobTech Taxonomy - Yrke
definition: Tvättare, fönsterputsare och övriga rengöringsarbetare
broader: Städyrken
narrower: Bilrekonditionerare, fönsterputsare m.fl.

Författare, journalister och tolkar m.fl.
type: Concept
in scheme: JobTech Taxonomy - Yrke
definition: Författare, journalister och tolkar m.fl.
broader: Yrken med krav på fördjupad högskolekompetens inom juridik, kultur och socialt arbete m.m.
narrower: Journalister m.fl.
narrower: Översättare, tolkar och lingvister m.fl.
narrower: Författare m.fl.

Ventilationsmontör
type: Concept
in scheme: JobTech Taxonomy - Yrke
definition: En ventilationsmontör installerar ventilationssystem i byggnader och ser till att det finns frisk luft inomhus. Nya och gamla byggnader, små villor såväl som enorma fabriker, arenor och köpcentrum. Konkret innebär arbetet montering av kanaler, ﬂäktar och aggregat. Ibland kräver det även egen tillverkning i verkstaden. Injusteringar, underhåll och kontroller av ventilationssystem kan också vara en del av jobbet. Källa: Plåt och Ventbyrån
broader: VVS-montörer m.fl.
related: nj6J t8N W2E
related: XQcy vRZ 6sH
related: j7Cq ZJe GkT
related: hY5k iuD stk
related: ja7J P8X YC9
related: anqH Jqa 8pA
broad match: C7126

Koreolog
type: Concept
in scheme: JobTech Taxonomy - Yrke
definition: Koreolog analyserar, dokumenterar och skriver ner dansrörelser i form av noter för att kunna bevara och överföra koreografiska verk. Vanliga arbetsuppgifter är att noggrant notera varje rörelse, inklusive huvudvridningar, armlyft, kroppspositioner och förflyttningar, till exempel i hela balettpartitur som kan bli flera hundra sidor långa. Koreologen samarbetar ofta nära koreografer för att säkerställa att dansens uttryck och rörelser dokumenteras korrekt. Källa: Arbetsförmedlingen
broader: Koreografer och dansare
related: 8too bEs 7NU
related: 9puE nYg crq
broad match: C2653

Museipedagog/Museilärare
type: Concept
in scheme: JobTech Taxonomy - Yrke
definition: Museipedagog/Museilärare
alternative label: Museilärare
alternative label: Museipedagog
broader: Övriga pedagoger med teoretisk specialistkompetens
related: pVzY rff Amk
related: MVqp eS8 kDZ
broad match: C2359

Specialistläkare, psykiatri
type: Concept
in scheme: JobTech Taxonomy - Yrke
definition: Specialistläkare, psykiatri är en specialiserad legitimerad läkare med en djupare kunskap och kompetens inom sitt område. Specialistläkare är en skyddad titel och bara den som har bevis om specialistkompetens får kalla sig specialist i sin specialitet. Specialistläkare ansvarar för att diagnostisera, behandla och förebygga sjukdomar inom sin specialitet. Vanliga arbetsuppgifter är mottagningsarbete med patientbesök, rondarbete på avdelning, handledning av yngre läkare samt konsultationer till andra yrkesgrupper och specialiteter. Specialistläkare ansvarar även för att följa och leda utvecklingen inom sitt medicinska område och utför omfattande medicinsk dokumentation och administration. Källa: Arbetsförmedlingen, Karolinska Institutet, Socialstyrelsen, Sveriges Kommuner och Regioner, Sveriges läkarförbund
broader: Specialistläkare
related: NYW6 mP6 vwf
related: qSbw XHD Ycd
related: gBPm Sok R7v
related: TChC u37 rt2
related: 5DjY L9k Hzy
related: EBX9 7gC eLt
related: 1FhL tLz wLs
related: vFjb AHi a54
related: jFHU uSj 4ke
related: PqPY xBJ E15
related: KALC VvK 17U
related: QSeQ MpU wpW
related: 89LR AwA UqR
broad match: C2212

Informationskonsult
type: Concept
in scheme: JobTech Taxonomy - Yrke
definition: Informationskonsult
broader: Informatörer, kommunikatörer och PR-specialister
related: X82t awd Qyc
related: Yb1w sSy Rh9
related: vwxR MbC XjW
broad match: C2432

Värdetransportör
type: Concept
in scheme: JobTech Taxonomy - Yrke
definition: Värdetransportörer är väktare som arbetar med att transportera värdeföremål. Arbetsuppgifterna innefattar att transportera värdeföremål eller kontanter från dagskassor samt ladda och utföra service på uttags- och insättningsautomater. Värdetransportörer arbetar ofta på uppdrag av butiker, växlingskontor och andra aktörer inom privat och offentlig sektor. Arbetet sker med bil varför körkort är ett krav. Man arbetar oftast tillsammans med en kollega. Källa: Bevakningsbranschens Yrkes- och Arbetsmiljönämnd
broader: Väktare och ordningsvakter
related: dVbW QJc xZi
related: Ag31 RLC 4qd
related: E7hm BLq fqZ
broad match: C5414

Hovrättspresident
type: Concept
in scheme: JobTech Taxonomy - Yrke
definition: Hovrättspresident är den högsta chefen vid en hovrätt och ansvarar för att domstolen bedriver sin verksamhet enligt gällande rätt och fungerar effektivt. Arbetsuppgifterna inkluderar att leda och samordna hovrättens totala verksamhet, planera och utveckla rättsskipningen, företräda domstolen i olika sammanhang samt delta i rekrytering av domare och fiskaler. Hovrättspresident medverkar i hovrättens ledningsgrupp och driver strategiskt utvecklingsarbete för att säkerställa rättssäkerhet och kvalitet i domstolens arbete. Rollen kombinerar juridiskt arbete med administrativt och strategiskt ledarskap. Källor: Wikipedia, Sveriges Domstolar
broader: Domare
related: X82t awd Qyc
related: x4Wi NWW ogB
broad match: C2612

Preparator/Taxidermist
type: Concept
in scheme: JobTech Taxonomy - Yrke
definition: Preparator/Taxidermist
alternative label: Preparator
alternative label: Taxidermist
broader: Bildkonstnärer m.fl.
related: 9puE nYg crq
broad match: C3433

HR-controller
type: Concept
in scheme: JobTech Taxonomy - Yrke
definition: HR-controller
broader: Controller
related: eQFc 7Vq buj
related: X82t awd Qyc
related: vw7i 55Q xxT
broad match: C2411

Stengravör
type: Concept
in scheme: JobTech Taxonomy - Yrke
definition: Stengravörer skapar och kompletterar inskriptioner och dekorativa element på gravstenar och andra stenprodukter. Arbetsuppgifterna inkluderar att designa att design manuellt eller digitalt, skära och hantera gummidukar för blästring, samt att måla och guldförgylla stenytor. Gravören utför även textkompletteringar och renoveringar av gravstenar på plats, samt andra uppgifter som att hugga text för hand. Källa: Sveriges stenindustriförbund
broader: Stenhuggare m.fl.
related: wTEr CBC bqh
broad match: C7113

Apotekare
type: Concept
in scheme: JobTech Taxonomy - Yrke
definition: Forskar inom, tillverkar, kontrollerar, marknadsför och säljer läkemedel inom exempelvis apotek, läkemedelsindustri och sjukhus. Informerar allmänheten och vårdpersonal om läkemedlets effekter och användning.
broader: Andra specialister inom hälso- och sjukvård
related: onsq 9NH AnV
related: u47A 7yp rvf
related: WM8A Yp3 TUS
related: Mmxs Qrv cpG
related: R85L 23s y4M
related: iSWP AHA BSj
related: xAbn Wt7 ySS
related: 26DW RVn 42Q
related: C2262
related: 5GDg kKH HSr
related: PzDN Tzu s2m
related: a1Sf mey gVk
related: WjHF M2k SwE
related: TGFT 7y2 ryH
related: 9kw3 UiG 7VA
narrower: Apotekare
broad match: NYW6 mP6 vwf

Arbetsterapeuter
type: Concept
in scheme: JobTech Taxonomy - Yrke
definition: Förebygger, förbättrar och kompenserar nedsatt aktivitetsförmåga. Tränar fysiska och psykiska förmågor samt förändrar arbetsmetoder. Föreskriver och anpassar hjälpmedel, t.ex. IT-baserade hjälpprogram, specialdesignade redskap m.m. Medverkar i frågor om tillgänglighet i den fysiska miljön, t.ex. anpassning av bostad, arbetsplats och skola.
broader: Naprapater, sjukgymnaster och arbetsterapeuter m.fl.
related: cira HWD Xw9
related: 4QAE wtY gJh
related: C2269
related: LwQx Mxi eTW
related: LWYK QZL 5ov
related: LKeA F5v 76C
related: HhU2 a7t gG3
related: H812 q3A Ctm
related: M9z7 pRr wUs
related: Sj2n Kcr 3hm
related: Msi7 dJ1 mtD
related: ykbs 7vm ZnR
related: dJa5 Nao mDS
related: YU6v SsT UBm
related: 3miH vfA 3rv
related: 2jpJ qwQ 7Kd
related: Fth2 2jd dPn
related: eGs6 Hry JFw
related: zMr8 cTC PCB
related: ymzF Sqz 6uh
related: NpcY f4G L1H
related: 8E5S bt2 a2S
related: hiTj DLq LDX
related: e9Qi WjN h71
related: aoVs Qfu U3j
related: nDE1 gZr UJX
related: 5agw dEi Ag4
related: 4685 HbX wEx
related: WwvG N5s ErQ
related: cocQ EPn YiY
narrower: Arbetsterapeutstuderande
narrower: Specialistarbetsterapeut
narrower: Hjälpmedelskonsulent
narrower: Arbetsterapeut
broad match: NYW6 mP6 vwf

Tandhygienist
type: Concept
in scheme: JobTech Taxonomy - Yrke
definition: Tandhygienist arbetar med att förebygga, undersöka och behandla sjukdomar i munhålan hos både barn och vuxna. Tandhygienist är en skyddad titel med legitimationskrav. Vanliga arbetsuppgifter är att undersöka och diagnostisera patienters munhälsa, ta röntgenbilder, avlägsna tandsten och plack samt utföra kariesförebyggande åtgärder. Tandhygienisten informerar och motiverar patienter till bättre munhygien och ger råd om kost, tobak och livsstil. Källa: Arbetsförmedlingen, Karolinska Institutet, SACO, Socialstyrelsen
broader: Tandhygienister
related: NYW6 mP6 vwf
related: sqvh gTy 6Sj
related: VLqw kVL QxN
broad match: C3251

Stylist
type: Concept
in scheme: JobTech Taxonomy - Yrke
definition: Stylister arbetar med att skapa helhetsintryck inom klädsel, hår, makeup och tillbehör inför fotograferingar, visningar, event eller vardaglig stilvägledning. Arbetsuppgifterna omfattar val av kläder och accessoarer, färg- och stilrådgivning, koordinering med andra yrkesroller samt medverkan vid ombyten och fotografering. Källa: Arbetsförmedlingen
broader: Övriga skönhets- och kroppsterapeuter
related: Uuf1 GMh Uvw
related: S799 1dt dvQ
related: 9puE nYg crq
related: jxMM YAQ rQK
related: 7qjP tpU 7Vn
related: tk7N pUv Q4A
broad match: C5142

Speltestare/QA
type: Concept
in scheme: JobTech Taxonomy - Yrke
definition: Speltestare/QA
alternative label: QA
alternative label: Speltestare
broader: Designer inom spel och digitala medier
related: oeHg J1V PEg
related: apaJ 2ja LuF
related: 9puE nYg crq
broad match: C2166

Ceremonivärd
type: Concept
in scheme: JobTech Taxonomy - Yrke
definition: Ceremonivärdar arbetar vid begravningar och andra högtider med praktiskt och socialt stöd. Arbetsuppgifter kan innefatta att ta emot gäster, visa tillrätta, dela ut programblad och hantera teknik. Ceremonivärdar förväntas ofta kunna genomföra ett framträdande under ceremonin, så som ett musikstycke, sjunga en sång eller läsa en dikt. Källa: Sveriges Begravningsbyråers Förbund, Arbetsförmedlingen
broader: Begravnings- och krematoriepersonal
related: GazW 2TU kJw
broad match: C5163

Arkiv- och biblioteksassistenter m.fl.
type: Concept
in scheme: JobTech Taxonomy - Yrke
definition: Förtecknar, sorterar och tar fram arkivhandlingar. Biträder vid katalogisering och registrering av böcker och annat publicerat material. Ordnar och lånar ut böcker, tidskrifter m.m. Biträder vid informationssökning. Sköter bild- och ljudanläggningar. Biträder vid registrering, skötsel och utställning av museiföremål.
broader: Arkiv- och biblioteksassistenter
related: 7H4j dRM Vbo
related: udqs kCm YJ6
related: HEia YGh KRv
related: qjeU 6sK 9Uf
related: 7Rqo DET snS
related: C4411
related: UdTc HVX bJN
related: zX4C 7jY ygC
related: G91h 2aK aXY
related: 1dVh cZS Exw
related: C4415
related: Em9g vpP fDo
narrower: Arkivassistent
narrower: Biblioteksassistent
narrower: Museiassistent
broad match: X82t awd Qyc

Chefer inom äldreomsorg
type: Concept
in scheme: JobTech Taxonomy - Yrke
definition: Chefer inom äldreomsorg
broader: Chefer inom hälso- och sjukvård samt annan samhällsservice
narrower: Chefer inom äldreomsorg

Processingenjör, maskin
type: Concept
in scheme: JobTech Taxonomy - Yrke
definition: Processingenjör, maskin
broader: Civilingenjörsyrken inom maskinteknik
related: SuAn oH9 xNc
related: 6Hq3 tKo V57
broad match: C2144

Församlingsföreståndare, frikyrka
type: Concept
in scheme: JobTech Taxonomy - Yrke
definition: Församlingsföreståndare inom en frikyrka leder och utvecklar församlingens verksamhet och gemenskap. Arbetsuppgifter innefattar predikningar, undervisning, själavård, samordning av gudstjänstlivet och ledarskap för olika verksamhetsområden som barn- och ungdomsarbete. Församlingsföreståndare har vanligtvis goda kunskaper i teologi, ledarskap och församlingens ansvar utåt och inåt. Rollen innebär ofta nära samarbete med volontärer och andra kyrkliga ledare såsom pastorer och diakoner. Källa: Equmeniakyrkan, Arbetsförmedlingen
broader: Pastorer m.fl.
related: GazW 2TU kJw
related: oEQG QBk Tgq
broad match: C3413

Affärskonsult, IT
type: Concept
in scheme: JobTech Taxonomy - Yrke
definition: Affärskonsult, IT
broader: Systemanalytiker och IT-arkitekter m.fl.
related: CjU9 Jws VRm
related: apaJ 2ja LuF
related: qBsw ikL hZ2
broad match: C2511

Key account manager/KAM
type: Concept
in scheme: JobTech Taxonomy - Yrke
definition: Key account manager/KAM
broader: Företagssäljare
related: aBsn JYB 1a8
related: xahN qVP 4Dm
related: Ey2T dQm GQK
related: PpoM szm 8LE
related: 9Nnt hqH RU3
related: rDcj Tao TJJ
related: 9JNZ 5XB Rfv
related: RPTn bxG ExZ
related: 6oEA M4M gpw
related: 1dTc xMc iMU
related: dEMk NYW haE
related: yQAT XoC DwW
related: xMBb V6K Cfq
related: uDCq E7y pc2
related: NGpb 2v7 wAq
related: NZvP k1X kHJ
related: 2Nsh Aiy Hrm
related: oNoE Fu3 Xw6
related: V9up XtW W7d
related: Dc3s mJg 5pq
related: TXfM fGT kXB
broad match: C3322

Testutvecklare
type: Concept
in scheme: JobTech Taxonomy - Yrke
definition: Testutvecklare
broader: Systemtestare och testledare
related: g8wH fi1 ueD
related: EW8K t3M uDD
related: RVSr ui7 w3V
related: JhH7 dUK VbR
related: KytA 8Mt 5Ss
related: apaJ 2ja LuF
related: M19E CGH EXb
related: JtGc AYL 7Xm
related: kTEN mZu DXF
related: 4jhS mhN ApZ
related: Q1ca mQf ySp
related: gaDY GiV nXP
related: iWvf Bfw JeZ
related: sfLP 9W7 KQA
related: DceQ JK5 GKf
related: gJPc nN3 RFP
broad match: C2519

Sömmerska konfektion
type: Concept
in scheme: JobTech Taxonomy - Yrke
definition: Sömmerskor inom konfektion syr och reparerar kläder. Man kan arbeta både med att tillverka kläder inom konfektionsindustri och med hantverksmässig sömnad. Som sömmerska behärskar man oftast alla moment, inklusive mönsterkonstruktion, utskärning, ändring och provning. Beroende på arbetsplats kan man arbeta med hela eller delar av processen. Yrket skiljer sig från maskinoperatörer inom textilindustrin, där man vanligtvis arbetar mer industriellt och med större volymer. Yrket skiljer sig även från skräddare som tillverkar kläder efter mått. Se även yrket sömmerska hemtextilier och andra textilprodukter. Källa: Stockholms tillskärarakademi, Arbetsförmedlingen
broader: Skräddare och ateljésömmerskor m.fl.
related: 6TRL Uxx MqM
related: kmTr eca Az8
related: PaxQ o1G wWH
related: FyLo 8XN Z6v
broad match: C7531

Konferensplanerare
type: Concept
in scheme: JobTech Taxonomy - Yrke
definition: Konferensplanerare
broader: Evenemangs- och reseproducenter m.fl.
related: W7Ah Lyo Uih
related: ro75 7Nj 4Ar
related: ScKy FHB 7wT
related: pauF uro g88
broad match: C3332

ST-läkare, klinisk genetik
type: Concept
in scheme: JobTech Taxonomy - Yrke
definition: Specialisttjänstgöring, ST, är den vidareutbildning som legitimerade läkare genomför för att uppnå specialistkompetens. ST-läkare klinisk genetik arbetar under handledning för att fördjupa sina medicinska kunskaper och färdigheter med målet att bli specialistläkare inom sitt område. ST-läkaren arbetar självständigt med patientutredningar, diagnostik och behandling, men alltid med stöd av specialister och enligt ett individuellt utbildningsprogram. Vanliga arbetsuppgifter är att ta medicinskt ansvar för patienter, delta i jourverksamhet, genomföra medicinska undersökningar och behandlingar samt dokumentera och följa upp vårdinsatser. Tjänsten omfattar också kontinuerlig kompetensutveckling, sidotjänstgöring inom närliggande områden och aktivt deltagande i handledning och utbildningsinsatser för kollegor och studenter. Källa: Arbetsförmedlingen, Karolinska Universitetssjukhuset, Sveriges läkarförbund, Region Kronoberg, Region Skåne.
broader: ST-läkare
related: NYW6 mP6 vwf
related: UtCj yMj ubw
broad match: C2211

Tandläkare
type: Concept
in scheme: JobTech Taxonomy - Yrke
definition: Tandläkare undersöker, diagnostiserar och behandlar sjukdomar och skador i munhålan och käksystemet. Tandläkare är en skyddad titel med legitimationskrav. Vanliga arbetsuppgifter är kliniska undersökningar, lagning av tänder, rotfyllningar, behandling av tandköttsinflammationer samt operativa ingrepp. Tandläkaren arbetar även förebyggande genom att ge råd och utföra åtgärder för att minska risken för framtida problem. Källa: Arbetsförmedlingen, Sveriges Tandläkarförbund
broader: Tandläkare
related: kGP4 qaB SV6
related: NYW6 mP6 vwf
related: sqvh gTy 6Sj
related: FZKi vg5 uSm
related: Wup4 Gr5 3hT
related: wsR5 a4n UXu
related: 14kN wpX AWb
related: QPB5 jaR oHa
related: YJWb bXT LYb
related: NgG1 5qR MDs
related: Kyy4 To9 MNi
related: hZbr N6z sY9
related: bvS2 Vmd o8t
related: vJYr pn5 Nqj
related: 4XbS AwC 4Lb
broad match: C2261

Förpackningstekniker
type: Concept
in scheme: JobTech Taxonomy - Yrke
definition: Förpackningstekniker arbetar vanligtvis med bland annat: - ta fram ny förpackningslösningar - analysera befintliga förpackningslösningar - analysera förpackningsbehov Förpackningstekniker har vanligtvis kunskaper om: - grafisk design - material - logistik - styr- och reglerteknik Källa: Yrkeshögskoleutbildningar och aktuella annonser
broader: Övriga ingenjörer och tekniker
related: 6Hq3 tKo V57
related: 9puE nYg crq
broad match: C2141

Dietiststuderande
type: Concept
in scheme: JobTech Taxonomy - Yrke
definition: Dietiststuderande är en student som utbildar sig till dietist. Vanliga arbetsuppgifter är medverka vid nutritionsutredningar, utforma individuella kostplaner och ge kostråd till patienter under handledning. Källa: Arbetsförmedlingen, Sveriges Kommuner och Regioner
broader: Dietister
related: NYW6 mP6 vwf
broad match: C2265

Anläggningsdykare
type: Concept
in scheme: JobTech Taxonomy - Yrke
definition: Anläggningsdykare arbetar under vattenytan med att bygga och reparera broar, hamnar, farleder och kraftverk. I arbetsuppgifterna ingår till exempel att schakta, borra, spränga, svetsa, bygga formar, armera och gjuta. Dykarbeten kan utföras på ner till 50 meters djup, men görs oftast på grundare vatten. Källa: YRGO
broader: Anläggningsdykare
related: NXTk 5bQ 1un
related: j7Cq ZJe GkT
related: ja7J P8X YC9
related: 1dwp fJc mpr
broad match: C7541

Musiker
type: Concept
in scheme: JobTech Taxonomy - Yrke
definition: Musiker
broader: Musiker, sångare och kompositörer
related: tu8L E6v Qxz
related: EwHB sfF h4g
related: 52Bj wvs DTn
related: UcW3 uAK rsG
related: kTmv iGU L74
related: pMf1 Zvz sWK
related: kV8s Xyf on3
related: TYSR rpC w1Z
related: Jcuk R8K Kfv
related: 8too bEs 7NU
related: 9xWa Y2e Vy1
related: 9puE nYg crq
related: DZzt 5ha VPS
related: wNLf 9bZ Dan
related: 733v yFv kUq
related: qWqz AUG 5jk
related: vLL2 Rf5 a9n
related: qPTw 9o6 xh2
related: Err4 5QP iGE
related: XWW1 PM4 agy
related: RsjH BpT K8i
related: eH1b 5yY Fat
broad match: C2652

Ballongpilot
type: Concept
in scheme: JobTech Taxonomy - Yrke
definition: Ballongpilot
broader: Piloter m.fl.
related: ASGV zcE bWf
related: 3cKK GiA k9t
broad match: C3153

Chefer inom grund- och gymnasieskola samt vuxenutbildning
type: Concept
in scheme: JobTech Taxonomy - Yrke
definition: Chefer inom grund- och gymnasieskola samt vuxenutbildning
broader: Chefer inom utbildning
narrower: Chefer inom grund- och gymnasieskola samt vuxenutbildning

Fartygsintendent
type: Concept
in scheme: JobTech Taxonomy - Yrke
definition: En fartygsintendent har både ekonomi- och personalansvar, leder och fördelar arbetet i köket, gör menyer till restaurangerna ombord samt alla inköp av mat och köksutrustning. Fartygsintendent innehar en befäls/chefsbefattning ombord. Källa: Satsa på sjöfart
broader: Storhushållsföreståndare
related: dRFw Rcu dX7
related: ASGV zcE bWf
related: XouD cCj HZN
related: ScKy FHB 7wT
broad match: C3434

Jaktvårdare/Viltvårdare
type: Concept
in scheme: JobTech Taxonomy - Yrke
definition: Jaktvårdare/Viltvårdare
alternative label: Jaktvårdare
alternative label: Viltvårdare
broader: Specialister och rådgivare inom skogsbruk
related: jmY3 939 tFT
related: hmCM xgK FR7
related: eiNA tzr dug
related: WGAZ xaM gUE
related: 4adS RdY p56
related: VuuL 7CH adj
broad match: C3143

Game programmer
type: Concept
in scheme: JobTech Taxonomy - Yrke
definition: Game programmer är nyckelpersoner i spelutvecklingsteamet och ansvarar för att omsätta spelidéer till fungerande, interaktiva produkter genom teknisk expertis och programmering. Rollen kräver både teknisk skicklighet och samarbetsförmåga för att skapa engagerande spelupplevelser. Källa: Arbetsförmedlingen, Yrgo
broader: Utvecklare inom spel och digitala media
related: 2Lgw fMQ qSg
related: apaJ 2ja LuF
related: 8too bEs 7NU
related: 9puE nYg crq
related: PpaS NaH 3Zo
related: 2TYW oUc vdg
broad match: C2513

Programvärd/Programvärdinna
type: Concept
in scheme: JobTech Taxonomy - Yrke
definition: Programvärd/Programvärdinna välkomnar och guidar tittare och gäster i tv-program genom att presentera programinnehåll och skapa en positiv atmosfär. Vanliga arbetsuppgifter är presentation av programmet, introduktion av gäster och segment. Programvärden arbetar ofta i studiomiljöer eller vid offentliga evenemang och samarbetar med produktionsteam för att informera om programmet, svara på publikfrågor och säkerställa att sändningen flyter på smidigt. Källa: Arbetsförmedlingen
alternative label: Programvärd
alternative label: Programvärdinna
broader: Övriga yrken inom kultur och underhållning
related: 8too bEs 7NU
related: 9puE nYg crq
broad match: C2656

Företagssjuksköterska
type: Concept
in scheme: JobTech Taxonomy - Yrke
definition: Företagssjuksköterska arbetar både förebyggande och rehabiliterande för att minska sjukfrånvaro och öka välbefinnandet på arbetsplatser. Sjuksköterska är en skyddad titel med legitimationskrav. En företagssjuksköterska med specialistsjuksköterskeexamen får använda benämningen specialistsjuksköterska inom företagshälsovård. Vanliga arbetsuppgifter är att genomföra hälsoundersökningar, medicinska kontroller och riskbedömningar, samt ge rådgivning kring livsstil, ergonomi och arbetsmiljö. Företagssjuksköterskan stödjer chefer och medarbetare vid rehabilitering och återgång i arbete, hanterar akuta skador och sjukdomsfall samt organiserar vaccinationer och hälsokampanjer. Källa: Arbetsförmedlingen, Socialstyrelsen, Svensk sjuksköterskeförening, Vårdförbundet
broader: Företagssköterskor
related: NYW6 mP6 vwf
related: 8fTS xZx d5P
related: ytRi QuA XLX
related: 2Rex 4NG GSf
related: 1f7B E5K sh3
broad match: C2221

Webbanalytiker
type: Concept
in scheme: JobTech Taxonomy - Yrke
definition: Webbanalytiker
broader: Marknadsanalytiker och marknadsförare m.fl.
related: dN4g wvH Zvj
related: s2RS kp8 V9G
related: apaJ 2ja LuF
related: 4XyY MCb svG
related: K5ME auP T9i
related: K4XN ASr 3qu
related: 4oiQ goj 5us
broad match: C2431

Stålkonstruktionsmontörer och grovplåtsslagare
type: Concept
in scheme: JobTech Taxonomy - Yrke
definition: Tillverkar och monterar detaljer till konstruktioner av grovplåt. Tillverkar, monterar, uppför och reparerar tunga metallbalkar och plåtar till stålkonstruktioner och ställningar.
broader: Gjutare, svetsare och plåtslagare m.fl.
related: iDGk f9j S1m
related: VPF1 UZM 9Kd
related: zjmW vt5 Nof
related: aHCV VsV LiD
related: JUpW QCd vCM
related: oZmV VcV sHi
related: qQ61 EQR rcz
related: C7214
related: Q7eC B7g QiU
related: KDzy Hra iVr
related: 5Ud5 g5L 43L
related: WBnc JXj MvY
related: fhcp fFw Lbj
related: SrzF GXp pFE
related: zVKm f79 DtU
related: Q1D1 Pdc rnT
related: yMcD XPe FWP
related: YXUJ Mzg Az9
related: 6BpN oXk 7SL
related: seev JQ5 q5W
related: UHKN Nqw 6Z5
related: x76R p6y bzs
related: R6ZK FGC ovb
related: c14d Mgx MFA
related: pYta n3P To9
related: CJ7k dsm sHj
related: BKYD AEo maF
related: 4y7C Lsh EPM
related: GgZs WNA Z8z
related: 3Qxc S4B fhw
related: uenm 75h fEh
related: 4mNF 7vZ vCx
related: rwir xvu 443
related: dWbY gXC Frx
related: xShN Vkr s7D
related: ZTk2 7eo CUb
related: C7215
related: fRF9 96h p1y
narrower: Stålbyggnadsmontör
narrower: Grovplåtslagare
narrower: Fartygsplåtslagare
broad match: wTEr CBC bqh

Omsorgschef
type: Concept
in scheme: JobTech Taxonomy - Yrke
definition: Omsorgschef
broader: Förvaltnings- och planeringschefer
related: GazW 2TU kJw
related: epLc SkD cbT
related: bh3H Y3h 5eD
broad match: C1213

Maskinoperatör mekanisk verkstad
type: Concept
in scheme: JobTech Taxonomy - Yrke
definition: Maskinoperatörer i mekanisk verkstad sköter och övervakar maskiner som bearbetar arbetsstycken av metall. Beroende på arbetsplats sköter man maskiner som bearbetar genom bland annat pressning, borrning, sågning, fräsning, tryck och gnistning. Det är vanligt att man på arbetsplatser roterar mellan olika maskiner men även att specialisera sig på en viss maskin. Maskinunderhåll, ritningsläsning samt truck- och traverskörning är också förekommande. Källa: Arbetsförmedlingen
broader: Maskinställare och maskinoperatörer, metallarbete
related: rGju 6AF tQJ
related: jKeW iNt F9X
related: jz2H 3a5 pmn
related: gbbX CaY S71
related: 5so4 vEY 6v5
related: t9mN ve6 Yy1
related: 1T63 hcF zfS
related: uVv8 ZaR JAG
related: 1JQh xWT YRz
related: rtSG su7 yyJ
related: XPAA pNQ pgT
related: XF24 Nm3 m5Y
related: Wg8A sdg 4bG
related: tXiL kfe oTg
related: NwxM Nhf rj1
related: z1fD i3M sPz
related: Q8J3 csV y52
related: 4iLA TqR Yvy
related: TVwZ Uum EJp
related: 4eCd Mto 7Eh
related: 5nUY Ujw R9i
related: 1va7 C57 Gjr
related: 8CZp Yi8 J4K
related: K1pX 7Q3 uHZ
related: Rizt PyY yYr
related: BFae 5rp FT4
related: eR8R TTU eTU
related: pSJG 8j5 DH1
related: Q1F6 2qe 5VR
related: wTEr CBC bqh
related: x6HG PQT zgC
broad match: C7223

Hovslagare
type: Concept
in scheme: JobTech Taxonomy - Yrke
definition: Hovslagare arbetar med att verka och sko hästar. Arbetsuppgifter omfattar att bedöma hovars skick, utföra verkning och anpassa skor efter hästens behov samt montera och justera hästskor. Hovslagare samarbetar ofta med veterinär vid behov av medicinsk behandling av hovar och kan utföra enklare hovvårdande åtgärder på ordination av veterinär. Arbetet utförs på stall, gårdar eller vid kliniker och omfattar även rådgivning till hästägare om hovvård och skötsel. Hovslagare har vanligtvis goda kunskaper om hästars anatomi och rörelsemekanik. Källa: Jordbruksverket, Jobba grönt, Hovslagarföreningen, Arbetsförmedlingen
broader: Uppfödare och skötare av lantbrukets husdjur
related: 52iz HXR 9Xi
related: VuuL 7CH adj
broad match: C6121

Mediakonsulent
type: Concept
in scheme: JobTech Taxonomy - Yrke
definition: Mediakonsulent
broader: Informatörer, kommunikatörer och PR-specialister
related: X82t awd Qyc
related: vwxR MbC XjW
broad match: C2432

Förskolekonsulent
type: Concept
in scheme: JobTech Taxonomy - Yrke
definition: Förskolekonsulent
broader: Speciallärare och specialpedagoger m.fl.
related: 3pyE aAA TFD
related: MVqp eS8 kDZ
broad match: C2351

Kostekonom
type: Concept
in scheme: JobTech Taxonomy - Yrke
definition: Kostekonomer arbetare med utveckling och styrning inom måltidsverksamheter, oftast inom offentlig sektor. Arbetet kombinerar kunskap om kost och näring med ekonomisk planering och personalledning, vilket skiljer dem från andra kostprofiler som mer fokuserar på praktisk måltidsutveckling eller kostrådgivning. Förutom inom offentlig sektor kan man även arbeta med utveckling av nya livsmedel, forskning, kvalitetskontroll, marknadsföring, förebyggande hälsovård och utbildning. Källa: SACO, Arbetsförmedlingen
broader: Storhushållsföreståndare
related: PYnr pAb CCX
related: yz6N S6H tw6
related: BZtA RCn 4vZ
related: 8Rxv 4iX dnT
related: ScKy FHB 7wT
related: HGLS wuD 6dM
broad match: C3434

HR-chef
type: Concept
in scheme: JobTech Taxonomy - Yrke
definition: HR-chef
broader: Personal- och HR-chefer
related: g9kp xtb PxM
related: bLBJ 3CH obJ
related: wiXH S4Z LuE
related: yw8m Yq2 2X4
related: EXo2 LLT Drm
related: zri8 bHr ygY
related: YWft bBn Jyt
related: X82t awd Qyc
related: epLc SkD cbT
related: nnMs R9K b8y
related: bh3H Y3h 5eD
related: Uvxw 4sW JHv
related: 2X7U gqd vFh
related: 7MwZ Gf3 FPZ
related: 5nes D3A DNf
related: v9WP uH2 4Tn
related: fzHx fJV ssc
related: 1kVc Fm2 hHq
related: GrgC omu rXG
related: 1r1h Tcu kSK
related: 1rN1 3Pt JK4
related: TazP x4n sRj
related: 1wAn R6D 4C8
related: cXxt WZ2 DFP
related: 9iYt h4B G9f
related: ioCa Mtk KXe
broad match: C1212

Trumtillverkare
type: Concept
in scheme: JobTech Taxonomy - Yrke
definition: Trumtillverkare bygger och reparerar trummor och andra slagverk. Musikinstrumentmakare, inklusive trumtillverkare, är ett hantverksyrke, där viktiga kunskaper är bland annat materialkunskap, verktygsvård, maskinbearbetning, ritning och uppmätning samt ytbehandling. För trumtillverkare är kunskaper om olika träslag och relevanta metaller särskilt viktigt. Källa: Hantverksakademin, Hantverkslärling, Arbetsförmedlingen
broader: Musikinstrumentmakare och övriga konsthantverkare
related: PaxQ o1G wWH
related: NWbe e2N xiA
broad match: C7312

Forskningshandläggare
type: Concept
in scheme: JobTech Taxonomy - Yrke
definition: Forskningshandläggare arbetar med samordning och finansiering av forskning och forskningsverksamhet. Arbetsuppgifter inkluderar bland annat granskning och beslut om forskningsfinansiering, samordning och kvalitetssäkring av ansökning av forskningsanslag, uppföljning av projekt samt rapportering till finansiärer och myndigheter. Beroende på arbetsplats kan även regelefterlevnad ingå i arbetsuppgifter. Förutom finansiering kan forskningshandläggare även arbeta relativt brett inom ett område, inklusive att samordna kontakter med forskare, omvärldsbevakning, föredra för beslutsfattare. Även strategiskt arbete kan förekomma, så som långsiktiga forskningsstrategier och verksamhetsutveckling. Källa: Arbetsförmedlingen
broader: Övriga handläggare
related: sLHc 5wZ teG
related: Vhyt rhf cwZ
related: X82t awd Qyc
related: gBWp KXs 1HT
related: yj5V ay4 Q7N
related: hJVJ HV4 pXb
related: xCpz bDe bXn
related: 1qAr qx8 5KP
broad match: C3343

Kinesiolog
type: Concept
in scheme: JobTech Taxonomy - Yrke
definition: Kinesiolog
broader: Terapeuter inom alternativmedicin
related: NYW6 mP6 vwf
related: Uuf1 GMh Uvw
broad match: C3230

Transportadministratör
type: Concept
in scheme: JobTech Taxonomy - Yrke
definition: Transportadministratör hanterar administrativa uppgifter kopplade till transporter. Arbetsuppgifter omfattar bland annat fakturering, registrera beställningar, beställa transportuppdrag, ha löpande kontakt med med speditörer och distributörer. Man kan arbeta både med nationell och internationell transport samt med olika transportsätt, inklusive sjö-, flyg-, tåg- och vägtransport. En viktig del av arbetet är hantering av dokumentation i samband med transporter, så som tullhandlingar, registrering av fraktsedlar, intyg kring farligt gods. Beroende på arbetsplats kan även kundservice ingå. Källa: Arbetsförmedlingen
broader: Övriga kontorsassistenter och sekreterare
related: fDwD i8k ccK
related: eZnn uX4 Xxk
related: RPTn bxG ExZ
related: jpSd bo8 uyS
related: y62F yTq may
related: ZhvD coe d9Y
related: FW3a ufD oCC
related: ASGV zcE bWf
related: g8Wh 2PR Ks6
related: EQuL x1F V8q
related: DvsL xih MgM
related: Rtxx yjx ERD
related: HcTC eyP jyZ
related: e2Nz u7Z T4J
related: vmFD EYg CNr
related: oN7r LfJ XS3
related: 6oS5 72C NjP
related: umw6 NND TUr
related: WSUT j4Z 2pz
related: v7oB at6 8u8
related: gsts 2nS PbE
broad match: C4110

Chefsbarnmorska
type: Concept
in scheme: JobTech Taxonomy - Yrke
definition: Chefsbarnmorska
broader: Chefer inom hälso- och sjukvård
related: NYW6 mP6 vwf
related: epLc SkD cbT
related: bh3H Y3h 5eD
broad match: C1342

Produktionsledare: kultur, media, film, dataspel
type: Concept
in scheme: JobTech Taxonomy - Yrke
definition: Produktionsledare: kultur, media, film, dataspel
broader: Regissörer och producenter av film, teater m.m.
related: kczZ duT e3i
related: 8too bEs 7NU
related: 9puE nYg crq
related: Cesw d3v ioU
related: Jv7a 9x2 3Fu
broad match: C2654

Fastighetsförvaltare
type: Concept
in scheme: JobTech Taxonomy - Yrke
definition: Förvaltar fastigheter, svarar för uthyrning och besiktning samt skriver underhållsplaner. Förhandlar om hyror samt ansvarar för ekonomiska kalkyler och upprättar kontrakt. Tar in och granskar offerter. Hit hör inte Fastighetsingenjör (3112)
broader: Förmedlare m.fl.
related: CY3S ton bPV
related: UQod 7GP JXL
related: Kf1r uu8 QDW
related: fT3m z6J So9
related: iRc6 N79 R9V
related: ySUN PZC HQW
related: btWi E8p fmx
related: zk3x WAU QtB
related: UH9g R5v MCx
related: BrdZ oPC Kft
related: Ne8j XqQ NPK
related: jmqj shU 3VD
related: ZzN5 m7B 5CY
related: iGkG ssy xaX
related: nF6J MNc ZxS
related: 26yR WKq qra
related: 4XyZ 6t8 TWq
related: Gt5f wdi FSJ
related: q7Mx gjU F9q
related: Es4W jdP yxd
related: pHeH DcY dML
related: Cxha 8ST 5u1
related: C3334
narrower: Skogsekonom
narrower: Fastighetsinspektör
narrower: Fastighetsassistent
narrower: Fastighetsförmedlare
narrower: Bostadsförvaltare
narrower: Hyreskonsulent
narrower: Områdesförvaltare, fastighet
narrower: Skogsvärderare
narrower: Fastighetsförvaltare
broad match: 6Hq3 tKo V57

Assessor
type: Concept
in scheme: JobTech Taxonomy - Yrke
definition: Assessor arbetar som domare eller kvalificerad jurist inom det svenska domstolsväsendet, ofta efter flera års arbete som fiskal. Arbetsuppgifterna omfattar utredning, förberedelse och rättslig prövning av mål och ärenden, tillämpning av lagar och prejudikat samt avgörande av juridiska frågor tillsammans med andra domare. Assessorer deltar i förhandlingar, skriver domar, fattar beslut och kan även genomföra utredningsuppdrag inom myndigheter. Rollen innebär ofta tjänstgöring utanför domstolen för att bygga erfarenhet och meritera sig inför en framtida fast domartjänst. Källa: Sverides Domstolar
broader: Domare
related: BRBe Jme wPB
related: X82t awd Qyc
related: ZwN4 8CT ZFy
related: x4Wi NWW ogB
related: Abcb QtH isZ
related: uxiM ztM 7gk
related: PQp6 Mzy FXB
broad match: C2612

Forskningsassistent, biologi
type: Concept
in scheme: JobTech Taxonomy - Yrke
definition: Forskningsassistent, biologi
broader: Cell- och molekylärbiologer m.fl.
related: kJeN wmw 9wX
related: TXx8 Mgv BGZ
broad match: C2131

Kvalitetsingenjör, metallurgi/Kvalitetstekniker, metallurgi
type: Concept
in scheme: JobTech Taxonomy - Yrke
definition: Kvalitetsingenjör, metallurgi/Kvalitetstekniker, metallurgi
alternative label: Kvalitetsingenjör, metallurgi
alternative label: Kvalitetstekniker, metallurgi
broader: Ingenjörer och tekniker inom gruvteknik och metallurgi
related: 6Hq3 tKo V57
broad match: C3117

Smeder och verktygsmakare m.fl.
type: Concept
in scheme: JobTech Taxonomy - Yrke
definition: Smeder och verktygsmakare m.fl.
broader: Metallhantverks- och reparatörsyrken
narrower: Verktygsmakare
narrower: Maskinställare och maskinoperatörer, metallarbete
narrower: Smeder
narrower: Slipare m.fl.

Forskare, statskunskap
type: Concept
in scheme: JobTech Taxonomy - Yrke
definition: Forskare, statskunskap
broader: Arkeologer och specialister inom humaniora m.m.
related: X82t awd Qyc
broad match: C2633

Vårdbiträden
type: Concept
in scheme: JobTech Taxonomy - Yrke
definition: Vårdbiträden
broader: Omsorgsyrken
narrower: Vårdbiträden

Soldat/Sjöman
type: Concept
in scheme: JobTech Taxonomy - Yrke
definition: Soldat och sjöman är grundläggande befattningar inom Försvarsmakten, där du arbetar med att försvara Sverige och bidra till internationell säkerhet. Du kan tjänstgöra inom armén, marinen, flygvapnet eller Hemvärnet, och arbetsuppgifterna varierar beroende på vilken befattning och inriktning du har. I arbetsuppgifterna ingår att delta i övningar, insatser och operationer i Sverige och utomlands samt utföra uppgifter inom exempelvis strid, teknisk tjänst, ledning, underrättelse, säkerhet, logistik eller sjukvård beroende på befattning. Källa: Försvarsmakten
alternative label: Sjöman
alternative label: Soldat
broader: Soldater m.fl.
related: bH5L uXD ZAX
related: JzXf fBP c75
related: Lgzf x9V 72Z
related: PK4J sbw nbo
related: frGf fMP Afd
related: LqVG mTq JhK
related: pCC5 uut MtC
related: idQz yMR pgR
related: G8bk SYH pY3
related: ZmdX 3wu RUs
related: HEgd Fjx tz5
related: ihyj Ssv aUk
related: gs65 ynn fcr
related: tXFr 3dU Ptx
related: XRk3 vNb orm
related: SdBG Rxh s7r
related: 8kMK QxB kaF
related: fpMG yYW jPD
related: yPcY Bna w2k
related: dycU yqZ oz2
related: Uva4 Axj fMt
related: uLEf oJd ifw
related: 5wM8 zam AQX
related: f4gB N5w z88
related: JpMG vWf atM
related: eHEm s1Z 6qJ
related: VsNp RU9 Gqm
related: PAA3 yrV YgT
related: TAGz z5p ZEL
related: 3HVo NrS vhi
related: KvgW grM DuG
related: DwGx oR9 N4t
related: gjoJ vb4 mti
related: hsyt h8i h5y
related: 8gPx Nnq vgc
related: WpFj BoW Whh
related: FH28 nJb GaE
related: Jk7S zAN RXs
related: Ls7G Lkn RVv
related: UHNH tSV hMJ
related: ZDhe VLB EP2
related: BhwU YD9 Nss
related: PpoJ Dtv cEV
related: SvW9 m3x DZs
broad match: C0310

Kranmontör
type: Concept
in scheme: JobTech Taxonomy - Yrke
definition: Kranmontörer arbetar med att montera, demontera och underhålla kranar inom industri, hamn och byggen. Arbetet sker främst på plats där kranen används, men kan även innebära underhåll och reparation av kranar i verkstad. Yrket benämns även som krantekniker. Källa: Arbetsförmedlingen
broader: Underhållsmekaniker och maskinreparatörer
related: b7Fe Z8B fCY
related: CMFj Ecx NtX
related: iofr Zzj G2W
related: ynFn k8s Em6
related: yhCP AqT tns
related: T4qs hwD D8a
related: DyJq 635 CHy
broad match: C7233

Lokförare
type: Concept
in scheme: JobTech Taxonomy - Yrke
definition: Framför lok, motorvagnar, pendeltåg, tunnelbana och växlingslok i person- och godstrafik.
broader: Lokförare och bangårdspersonal
related: RtCa HMY aVG
related: EqRh UqX wFB
related: SyNE WWi MdC
related: ujYV AxW Prq
related: 7xS5 gyX hvX
related: M93A uLb dup
related: vGYy wzy 141
related: LopZ 2F7 i2X
related: FCdQ vPV Yrq
related: W39t UBk 83a
related: oxd3 phB 77Q
related: z27u gun RCh
related: C8311
related: SX34 4Ed rNM
narrower: Lokförare
narrower: Tunnelbaneförare
broad match: ASGV zcE bWf

Förvaltningsjurist
type: Concept
in scheme: JobTech Taxonomy - Yrke
definition: Förvaltningsjurist
broader: Förvaltnings- och organisationsjurister
related: kXNJ 5Av NHx
related: U1TG 3tM v3f
related: ps7Q fHf U62
related: NCPb R9e ZDv
related: JSi2 hKk f6f
related: X82t awd Qyc
related: x4Wi NWW ogB
related: oN3d NQ6 WjE
related: tRLQ ZVM 16P
related: DgdR rDU mDN
related: 7bBD KuT EAW
related: dpR4 6zn d4d
related: Abcb QtH isZ
related: 59VD xhz d4J
related: bUPu nob kRA
related: W7bG ENq FMt
broad match: C2619

Croupier
type: Concept
in scheme: JobTech Taxonomy - Yrke
definition: En croupier, även kallad casino dealer, är en yrkesperson som arbetar på ett casino och ansvarar för att leda och driva olika casinospel vid spelborden, såsom blackjack, poker, roulette och baccarat. Croupierns huvudsakliga uppgift är att säkerställa att spelet genomförs rättvist och enligt reglerna, samtidigt som spelarna får en underhållande och professionell spelupplevelse. Källa: Arbetsförmedlingen
broader: Croupierer och oddssättare m.fl.
related: UdVa jRr 9DE
related: NNCF PzD evy
related: RPTn bxG ExZ
related: Ui1Y ajc Dtz
related: ScKy FHB 7wT
broad match: C4212

Kontakttolk/Dialogtolk
type: Concept
in scheme: JobTech Taxonomy - Yrke
definition: Kontakttolk/Dialogtolk
alternative label: Dialogtolk
alternative label: Kontakttolk
broader: Översättare, tolkar och lingvister m.fl.
related: cspa Mji BMS
related: 9puE nYg crq
broad match: C2643

Forskare, farmakologi
type: Concept
in scheme: JobTech Taxonomy - Yrke
definition: Forskare, farmakologi
broader: Farmakologer och biomedicinare
related: kJeN wmw 9wX
related: fjGF oCc zdp
related: pUed XYX tgK
related: esAo 5sX FPv
broad match: C2131

Turistvärd
type: Concept
in scheme: JobTech Taxonomy - Yrke
definition: Turistvärdar tar emot och ger service till besökare vid turistmål, evenemang eller servicepunkter som campingar, boenden, resecentrum eller attraktioner. Arbetsuppgifter omfattar att möta gäster på plats, ge information om aktiviteter och i vissa fall hålla i aktiviteter, hjälpa till med in- och utcheckning, hålla ordning i serviceytor samt bidra till en positiv upplevelse för turister och besökare. Turistvärdar arbetar ofta säsongsvis i anslutning till sommarturism eller vid större evenemang. Källa: Arbetsförmedlingen
broader: Guider och reseledare
related: 7goz uuv JWu
related: RPTn bxG ExZ
related: jcT6 WJU wCz
related: wewM h18 V13
related: EKtK 5mt fum
related: VB3n ANL MBS
broad match: C5113

VA-ingenjör
type: Concept
in scheme: JobTech Taxonomy - Yrke
definition: VA-ingenjör
broader: Ingenjörer och tekniker inom bygg och anläggning
related: Sa9V HHy VjR
related: er3n vM2 gDN
related: j7Cq ZJe GkT
related: QEkS ciA kuG
related: JRvH w6U gsn
related: RvCa hiV 7xY
related: NkzB vga g44
related: 535p nqY GmZ
related: ZWTd B44 2jw
related: 1jAJ 6jf 84w
related: kYQT SjL emz
related: Ee1t 1wn 9yu
related: AkaZ Zv9 gRW
related: Uand ug8 VAT
related: VECr cRX rQQ
related: goBY KuV h1b
related: WZbH bE3 jQc
related: ZjCw 9JF b8s
related: a1wy ZjC a8D
broad match: C3112

Skräddare, tapetserare och läderhantverkare m.fl.
type: Concept
in scheme: JobTech Taxonomy - Yrke
definition: Skräddare, tapetserare och läderhantverkare m.fl.
broader: Hantverksyrken inom trä, textil m.m.
narrower: Sömmare
narrower: Skräddare och ateljésömmerskor m.fl.
narrower: Läderhantverkare och skomakare
narrower: Tapetserare

Försvarsmeteorolog
type: Concept
in scheme: JobTech Taxonomy - Yrke
definition: Försvarsmeteorolog
broader: Meteorologer
related: kJeN wmw 9wX
broad match: C2112

Slaktare, bagare och livsmedelsförädlare m.fl.
type: Concept
in scheme: JobTech Taxonomy - Yrke
definition: Slaktare, bagare och livsmedelsförädlare m.fl.
broader: Livsmedelsförädlare
narrower: Slaktare och styckare m.fl.
narrower: Provsmakare och kvalitetsbedömare
narrower: Bagare och konditorer

Begravningsrådgivare
type: Concept
in scheme: JobTech Taxonomy - Yrke
definition: Begravningsrådgivare planerar och samordnar begravningar. Arbetsuppgifter kan innefatta samtal med anhöriga, utformning av ceremonier, välja kista eller urna, hantera dödsfallsdokumentation och boka tider för begravning. Arbetet inkluderar ofta samverkan med andra yrkesroller inom begravningsverksamheten. Källa: Sveriges Begravningsbyråers Förbund, Arbetsförmedlingen
broader: Begravnings- och krematoriepersonal
related: DJZi RgC 31J
related: GazW 2TU kJw
related: g1J4 3Y7 5Bz
related: 1zA3 hF4 Ss7
broad match: C5163

Fysioterapibiträde
type: Concept
in scheme: JobTech Taxonomy - Yrke
definition: Fysioterapibiträden biträder fysioterapeut och utför visst behandlingsarbete. Arbetet kan även innebära att enskilt behandla patienter, dock under delegering av fysioterapeut. Källa: Sveriges Kommuner och Regioner, Arbetsförmedlingen
broader: Övrig vård- och omsorgspersonal
related: NYW6 mP6 vwf
related: 9d9g A86 zue
related: dB3J 44o nt4
related: mhaG BXu pVL
broad match: C5329

Golvslipare, trä
type: Concept
in scheme: JobTech Taxonomy - Yrke
definition: Golvslipare utför slipning och behandling av alla slags trägolv såsom parkett, brädgolv, trösklar och trappor. I de fall det behövs utförs även reparationer av golv i samband med slipning. När golvet är slipat behandlas det med någon typ av ytskiktsbehandling. Källa: Arbetsförmedlingen
broader: Golvläggare
related: j7Cq ZJe GkT
related: mR43 htS aGU
related: ja7J P8X YC9
broad match: C7122

Psykoterapeuter
type: Concept
in scheme: JobTech Taxonomy - Yrke
definition: Ger psykoterapeutisk eller psykoanalytisk behandling genom samtal med individer, familjer eller grupper. Undersöker psykiska problem, kartlägger hinder och möjligheter till lösningar.
broader: Psykologer och psykoterapeuter
related: 9nLt bM5 h7q
related: s57R LAb igj
related: 9SBv Es9 hcQ
related: oGSH N4E qSx
related: EH8q u8m bMn
related: 4QAE wtY gJh
related: 61rX uPX YwJ
related: Ke1n tw2 tEa
related: sdad xS5 eZi
related: SdUN U1M aqG
related: ZnGd a1m 2Fi
related: 6Sfy R4r do7
related: 2Mbj 579 yZj
related: MjPH 341 Zmc
related: C2634
related: DahM A3K dYy
related: Sj2n Kcr 3hm
related: n2qQ tks 1pS
related: M6ki Xy3 o8a
related: wNW9 zPT yY6
related: eoGp ZP3 Lex
related: 3Y9v Urp QGn
related: 91Ef 58Y jX4
related: n9ho 3vf UZP
related: UoxX DrK FDn
related: UYmn hbY hjB
related: bhp9 3YQ YMH
related: jxKr BmN CcQ
related: 47LN 8Ac dX8
related: YJVW wfP ZA4
narrower: Psykoterapeut
broad match: NYW6 mP6 vwf

Floormanager
type: Concept
in scheme: JobTech Taxonomy - Yrke
definition: Floormanager övervakar och koordinerar den dagliga verksamheten på en butik, ett hotell, ett köpcentrum eller annan serviceinriktad plats. Arbetsuppgifterna inkluderar närvaro på plats för att skapa goda relationer med kunder och hyresgäster, hantering av säkerhets- och miljöfrågor, kommunikation med olika intressenter samt samordning av personal och städning. Floormanager introducerar nya hyresgäster och ansvarar för uppföljning av rutiner, utbildningar samt budgetarbete inom verksamhetens ramar. Rollen innebär även snabb problemlösning, informationsspridning och att bidra till en trygg och trivsam miljö för alla besökare. Källor: Jobbannonser på Wise.se, Besöksliv.se
broader: Gruppledare för kontorspersonal
related: RPTn bxG ExZ
related: X82t awd Qyc
broad match: C3341

Psykiatrisjuksköterska
type: Concept
in scheme: JobTech Taxonomy - Yrke
definition: Psykiatrisjuksköterska bedömer, planerar och genomför vårdinsatser för personer med psykisk ohälsa i olika vårdmiljöer. Sjuksköterska är en skyddad titel med legitimationskrav. En psykiatrisjuksköterska med specialistsjuksköterskeexamen får använda benämningen specialistsjuksköterska inom psykiatrisk vård. Vanliga arbetsuppgifter är bedöma patienters psykiska tillstånd, planera och genomföra omvårdnadsinsatser samt följa upp läkemedelsbehandling. Psykiatrisjuksköterskan genomför stödjande samtal och arbetar med ångesthantering. Arbetet innebär också att samordna vårdinsatser i team, delta i vårdplanering och arbeta förebyggande samt hälsofrämjande. Källa: Arbetsförmedlingen, Region Gävleborg, Röda Korsets Högskola, Socialstyrelsen, Svensk sjuksköterskeförening
broader: Psykiatrisjuksköterskor
related: NYW6 mP6 vwf
related: 5dFZ iYB xCS
related: ZA5m zqi tAm
related: ytRi QuA XLX
related: XK33 xoR FZQ
related: ePyu XWB FkC
related: 1f7B E5K sh3
broad match: C2221

Hälso- och sjukvårdskurator
type: Concept
in scheme: JobTech Taxonomy - Yrke
definition: Hälso- och sjukvårdskurator ger psykosocialt stöd och behandling till patienter och närstående inom hälso- och sjukvården. Hälso- och sjukvårdskurator är en skyddad titel med legitimationskrav. Vanliga arbetsuppgifter är att vara samtalsstöd vid kris, sjukdom eller svåra besked, samt att utreda och bedöma patienters sociala situation och behov av stödinsatser. Arbetet sker ofta i team med andra yrkesgrupper och innebär samverkan med både vårdpersonal och externa aktörer som socialtjänst eller försäkringskassa. Källa: Akademikerförbundet SSR, Arbetsförmedlingen, Socialstyrelsen, Örebro universitet
broader: Kuratorer
related: sqvh gTy 6Sj
related: GazW 2TU kJw
related: Tz5C 1eK Rax
broad match: C2635

Serviceyrken
type: Concept
in scheme: JobTech Taxonomy - Yrke
definition: Serviceyrken
broader: Service-, omsorgs- och försäljningsyrken
narrower: Hovmästare, servitörer och bartendrar
narrower: Skönhets- och kroppsterapeuter
narrower: Kabinpersonal, tågmästare och guider m.fl.
narrower: Övrig servicepersonal
narrower: Kockar och kallskänkor
narrower: Städledare och fastighetsskötare m.fl.

Systemanalytiker och IT-arkitekter m.fl.
type: Concept
in scheme: JobTech Taxonomy - Yrke
definition: Tar fram strategier för utveckling av IT-system. Ansvarar för företags och organisationers IT-struktur och ser till att IT används på ett effektivt sätt. Ansvarar för att den tekniska arkitekturen understödjer verksamhetens behov och krav.
broader: IT-arkitekter, systemutvecklare och testledare m.fl.
related: eTW8 AY5 tpe
related: abgV e4C gwj
related: CtvK s26 dNs
related: pWTc PxX xX6
related: wynY a5Q F6t
related: NnaR bCQ hK1
related: juME 7Ek CBR
related: igAK 9XZ E2a
related: ebrf 1Fe ksC
related: oRCp wLd dWd
related: HKgZ SWa vn8
related: W4Ud Do3 B6S
related: LeES iac 1Qx
related: pwNB ces 8hN
related: vzMh qW9 hHg
related: 1QYQ Xka TQ5
related: 7pQ1 pc6 qRD
related: TUg4 3hv 1iJ
related: 67V1 6cE VAt
related: UGqj u6c Tog
related: 19PK uxU Wzy
related: qVjQ w6H dns
related: pz6a ZgP ePX
related: 4f1v w91 qVM
related: uR9q DNx eWm
related: U5pM 1wB 8nc
related: N8Tu Tsn 2VD
related: aB7G VwT AfU
related: ZxHj Wvj 39H
related: jTYU TTp 4iW
related: C69V W4p i5E
related: z3Ln 9aJ DqN
related: Zd17 7XH myf
related: 49fH K3e Fbm
related: AfJ4 Pvv YBa
related: b8Yk S7p Nc7
related: ofcY XXh G4k
related: KAVh Qyx GPu
related: zepK dRd cwN
related: ifWk o4W Gir
related: xwT1 oxn Dwq
related: mYLj nHM zSE
related: yXg3 YoW xeC
related: oisM 5jo EVb
related: VLaA on6 CMq
related: 3nRt vck Jrv
related: bq5g QZW eyR
related: K343 BJR mAR
related: bCPt NW1 v2o
related: LLQd jDh gdd
related: s9Ys tMu iKM
related: Ss2A BH7 YrK
related: 4Dqo LPf qrU
related: YLwx pBc LKV
related: 5q4a wi4 WYk
related: bKM3 9g1 WWC
related: BPMn 5Fu z9m
related: T4Fs ix5 kkv
related: 2vCi hQz Y9o
related: G7Qq r7L 5Jo
related: 8Qjp Myj xnv
related: Utw1 tLL sS2
related: DWfb eQD E3r
related: USj9 RR6 Q1z
related: WQdS Jtu qPC
related: DKZ6 8AL nna
related: 44NU bjv f3M
related: j3wL CdZ Rz6
related: HQJ2 68A AiZ
related: cH7n Y7S UP4
related: idYc Nc2 oYB
related: hYyY NPi H65
related: qktt D6R UnN
related: G7so 7Ax 7dW
related: d7GK rmt 4FC

Arrestantvakt
type: Concept
in scheme: JobTech Taxonomy - Yrke
definition: Arrestantvakt, även kallat arrestvakt, bevakar frihetsberövade personer i polisens arrestlokaler. Arbetsuppgifterna inkluderar även mottagning, visitation och tillsyn av frihetsberövade i arrestlokalen. Det kan även ingå administrativa uppgifter såsom dokumentation av omhändertaganden och registrering i datasystem. Arrestantvakten bistår även vid transporter till exempelvis häktesförhandlingar och bevakningsuppdrag på sjukhus. Arbetet innebär oregelbundna arbetstider. Källa: Polisen, Arbetsförmedlingen
broader: Kriminalvårdare
related: E7hm BLq fqZ
related: FsF4 prh 5ts
related: 6pY4 F4q XiW
broad match: C5413

Virkeschef
type: Concept
in scheme: JobTech Taxonomy - Yrke
definition: Virkeschef
broader: Förvaltare inom skogsbruk och lantbruk m.fl.
related: epLc SkD cbT
related: bh3H Y3h 5eD
related: VuuL 7CH adj
broad match: C1311

Produktionsekonom
type: Concept
in scheme: JobTech Taxonomy - Yrke
definition: Produktionsekonom
broader: Övriga ekonomer
related: KgL9 Mmd XbA
related: X82t awd Qyc
related: Ha8m ptc mvn
related: GXu8 E4K Ea6
broad match: C2411

Apotekschef
type: Concept
in scheme: JobTech Taxonomy - Yrke
definition: Apotekschef
broader: Chefer inom handel
related: NYW6 mP6 vwf
related: NpTM i8S aKL
related: epLc SkD cbT
related: bh3H Y3h 5eD
related: joMs PbC jyt
broad match: C1420

Sömmare
type: Concept
in scheme: JobTech Taxonomy - Yrke
definition: Syr segel, kapell, tält, ryggsäckar, bilklädslar m.m. i textil eller liknande material. Monterar och syr exempelvis paraplyer och lampskärmar. Broderar för hand dekorationer på kläder och andra produkter.
broader: Skräddare, tapetserare och läderhantverkare m.fl.
related: d2xr WGs DiJ
related: Qg8J Y3i sW3
related: EmPd sYg gz3
related: fsXf YkD 9YL
related: gYYb 4cn Sn6
related: 8G1B Scm 3Y5
related: 2et7 Ne6 YKd
related: L5BY ziJ qrZ
related: C7533
related: TJ8G gZg 5tL
related: P5oH GSX kMW
related: 2XGY TET niQ
related: Mw6B tJp nyj
related: Z3nB Ecc B6h
related: wBu8 sKV SiA
related: X4EU ZC7 QmK
related: 7UCz jGn Wui
related: fiC1 ULz H6h
related: moLD 8yo 61d
related: 1XGi fRm WN9
narrower: Segelmakare
narrower: Sömmerska hemtextilier och andra textilprodukter
broad match: PaxQ o1G wWH

Röntgentekniker
type: Concept
in scheme: JobTech Taxonomy - Yrke
definition: Röntgentekniker
broader: Tekniker, bilddiagnostik och medicinteknisk utrustning
related: 6Hq3 tKo V57
related: MXyU 1JB fbu
broad match: C3211

Miljöjurist
type: Concept
in scheme: JobTech Taxonomy - Yrke
definition: Miljöjurist arbetar med att tolka och tillämpa miljölagstiftning, ge juridisk rådgivning och hantera rättsliga frågor som rör miljöskydd i såväl företag som myndigheter. Arbetsuppgifterna omfattar att bistå vid tillståndsprövningar, företräda företag eller offentliga aktörer i miljötvister, upprätta och granska avtal, ta fram yttranden samt delta i tillsyns- och utredningsarbete kring miljöfarlig verksamhet. Miljöjurist granskar miljökonsekvensbedömningar, hanterar frågor kring förorenade områden, vattenrätt och naturvård samt hjälper klienter att leva upp till lagkrav för hållbar utveckling. Titeln är aktuell och används i både privat och offentlig sektor. Källor: Paneo, Länsstyrelsen,
broader: Övriga jurister
related: X82t awd Qyc
related: x4Wi NWW ogB
related: Abcb QtH isZ
related: Hc2m mLN FCh
broad match: C2619

Maskinförare
type: Concept
in scheme: JobTech Taxonomy - Yrke
definition: Maskinförare
broader: Transport- och maskinföraryrken
narrower: Anläggningsmaskinförare m.fl.
narrower: Förare av jordbruks- och skogsmaskiner
narrower: Kranförare m.fl.
narrower: Truckförare

Civilingenjör, bioteknik
type: Concept
in scheme: JobTech Taxonomy - Yrke
definition: Civilingenjör, bioteknik
broader: Cell- och molekylärbiologer m.fl.
related: CpFD aoS pkZ
related: kJeN wmw 9wX
related: mdEZ f2B eKt
related: e1WV Q1x eUu
related: pqLg 6hG iTt
related: TXx8 Mgv BGZ
related: fM7t axJ RNN
broad match: C2131

Övriga maskin- och processoperatörer vid stål- och metallverk
type: Concept
in scheme: JobTech Taxonomy - Yrke
definition: Utför annat maskin- och processoperatörsarbete inom stål och metall än inom 8121-8122. Exempel på arbetsuppgifter: Styr och övervakar maskiner som drar, pressar och formar metall för att tillverka tråd, spik, stållinor, rör, stänger och liknande produkter. Övervakar och kontrollerar automatiska anläggningar för gjutning. Sköter maskiner för tillverkning av gjutformar och gjutkärnor. Hit hör inte Gjutare (7211) Stränggjutare, stålverk (8121) Värmare, valsverk (8123) Ugnsoperatör (8193)
broader: Process- och maskinoperatörer, vid stål- och metallverk
related: L6mR dKP znq
related: VPF1 UZM 9Kd
related: iuqD 2gc yd9
related: ws2R MBQ svX
related: 74Mw JUN VKx
related: aHCV VsV LiD
related: 2pjc Vto TGH
related: Ys1T oUv PaG
related: LfEo 4ra UqQ
related: EdSD Q31 Tsf
related: HdTd d7E pWn
related: pGts PKK c8W
related: aF3J SgE uck
related: rQEw 7c9 Ewt
related: uoyo 7gt 3CV
related: qQ61 EQR rcz
related: VTwt 5Fe 6bW
related: Uynk tQh JiH
related: Q7eC B7g QiU
related: cmqD ZW4 nLQ
related: YSMf UrF L4E
related: rjqd j8s N8y
related: MMfW 4Tt uDu
related: P6a2 FwA j9x
related: jNEE s3B 24H
related: KDzy Hra iVr
related: 1C31 5tQ i7g
related: fhcp fFw Lbj
related: JULB RYa iZD
related: N2yh y5H rTH
related: qhYi J2C kTP
related: qNQV vWB inB
related: NX1z MuM sh1
related: KXKQ z4Z U8A
related: Rbju P7i 12U
related: 3t7P 9GP Bx4
related: oQD7 SMq 4bz
related: zwad Sua Ugk
related: pYmd ofz PuE
related: mgUa d8m eLY
related: vN5n 8CX W51
related: TDeb X4Q m9u
related: aTW4 ANo ohG
related: uenm 75h fEh
related: 2bVU N49 sM7
related: MT1a Nyq DGQ
related: qn22 kbi Mwa
related: hTdh Avm d1Q
related: wgzc YWB GRr
related: dWbY gXC Frx
related: ZTk2 7eo CUb
related: LhvF NZc r6N
related: C8121
narrower: Maskinoperatör kabeltillverkning
narrower: Gjuterioperatör
narrower: Maskinoperatör metallformning
broad match: wTEr CBC bqh

Materialstyrare
type: Concept
in scheme: JobTech Taxonomy - Yrke
definition: Materialstyrare
broader: Civilingenjörsyrken inom logistik och produktionsplanering
related: 6Hq3 tKo V57
related: iwds EZE gU5
broad match: C2141

Operatörer inom sågverk, hyvleri och plywood m.m.
type: Concept
in scheme: JobTech Taxonomy - Yrke
definition: Styr och övervakar maskiner och utrustning som behandlar, sågar, skär och flisar trä för vidare användning. Sköter lagring, sortering och torkning av virke. Styr och övervakar maskiner och utrustning som tillverkar skiktträ, träfiber- och spånskivor. Defibrerar, limmar, pressar, torkar, stansar, sågar, sorterar etc.
broader: Processoperatörer, trä- och pappersindustri
related: VPF1 UZM 9Kd
related: ECs4 p2b JiU
related: 74Mw JUN VKx
related: 2pjc Vto TGH
related: WYUi DLH 7LS
related: pGts PKK c8W
related: ngdX 24q xrB
related: aF3J SgE uck
related: qQ61 EQR rcz
related: VTwt 5Fe 6bW
related: a1Fd V76 tZ2
related: KDzy Hra iVr
related: ohP6 JWd 63B
related: GCYi 9tC 1pP
related: C8172
related: wcrS gX9 LcS
related: Rbju P7i 12U
related: 73Pw nip 4EW
related: 6QbK rSS Dkp
related: BGie HPa fNA
related: TmR1 2py idB
related: 22JT eUQ XPo
related: uenm 75h fEh
related: dWbY gXC Frx
related: n2jB VYB gjx
related: 4aj7 yr6 q8r
narrower: Sågverksoperatör
narrower: Maskinoperatör träindustri
narrower: Hyveloperatör sågverk
broad match: wTEr CBC bqh

Drifttekniker elkraft
type: Concept
in scheme: JobTech Taxonomy - Yrke
definition: Drifttekniker inom elkraft övervakar och underhåller system för produktion av elektricitet. Drifttekniker inom elkraft arbetar vid kraftverk för produktion av elektricitet. Arbetsuppgifter innefattar att övervaka drift från ett kontrollrum, utföra rondering för att inspektera utrustning och identifiera eventuella driftstörningar. Driftteknikern genomför också rutinmässigt underhåll, felsökning och åtgärder för att optimera anläggningens effektivitet och säkerhet. Arbetet sker ofta i samarbete med en driftinjengör eller elkrafttekniker, vilken styr och övervakar produktionen. Källa: Sobona, Arbetsförmedlingen
broader: Drifttekniker vid värme- och vattenverk
related: 8BwD RMR 4mK
related: yhCP AqT tns
related: Kq3q gCJ crS
related: muap VbY HcK
broad match: C3131

Intensivvårdssjuksköterska
type: Concept
in scheme: JobTech Taxonomy - Yrke
definition: Intensivvårdssjuksköterska förebygger, vårdar och behandlar patienter med svikt i ett eller flera organsystem. Sjuksköterska är en skyddad titel med legitimationskrav. En intensivvårdssjuksköterska med specialistsjuksköterskeexamen får använda benämningen specialistsjuksköterska inom intensivvård. Vanliga arbetsuppgifter är administration av läkemedel, utvärdering av patientens tillstånd, korrigering av given behandling, provtagningar, förberedelser av patienterna inför undersökning och assistans vid undersökningar och behandlingar. Arbetet innefattar preventiv, akut, kurativ, rehabiliterande och palliativ vård. Källa: Arbetsförmedlingen, Socialstyrelsen, Svensk sjuksköterskeförening, Röda Korsets Högskola
broader: Intensivvårdssjuksköterskor
related: NYW6 mP6 vwf
related: upJQ tcX KyB
related: MAcb LBa ubo
related: zgZP U9T KK3
related: ytRi QuA XLX
related: Mu9D YKH QST
related: WwSS 9nm ZEX
related: 1f7B E5K sh3
broad match: C2221

Automationstekniker, maskin
type: Concept
in scheme: JobTech Taxonomy - Yrke
definition: Automationstekniker, maskin
broader: Ingenjörer och tekniker inom maskinteknik
related: T71m C3U AQN
related: 6Hq3 tKo V57
related: pvMN JAW LYP
related: Qj2j bny qqn
related: 9aEn jPz gJs
related: mTT5 xgE sRx
related: Pm1R 1J6 Fwd
broad match: C3115

Kvalitetsmätare, metallprodukter
type: Concept
in scheme: JobTech Taxonomy - Yrke
definition: Kvalitetsmätare, metallprodukter
broader: Övriga ingenjörer och tekniker
related: 6Hq3 tKo V57
broad match: C3119

Förman djuruppfödning
type: Concept
in scheme: JobTech Taxonomy - Yrke
definition: Förmän inom djuruppfödning leder och organiserar det dagliga arbetet med uppfödning av lantbruket husdjur, exempelvis nötkreatur, grisar, får eller fjäderfä. Arbetsuppgifter omfattar planering och fördelning av arbetsuppgifter inom djurskötsel, utfodring, rengöring av djurutrymmen och övervakning av djurens hälsa. Förmän följer upp produktionen, dokumenterar djurhållning och rapporterar till lantbrukare eller driftledning. I arbetet ingår att samordna personal, introducera nya medarbetare och säkerställa att rutiner för djurskydd och smittskydd efterlevs. Förman hanterar även enklare vårdåtgärder, assisterar vid förlossningar och avelsarbete samt deltar i underhåll av anläggning och tekniska system. Se även yrkena Lantbrukare djuruppfödning och Driftledare lantbruk med blandad drift. Källa: Jobba grönt, Arbetsförmedlingen
broader: Uppfödare och skötare av lantbrukets husdjur
related: VuuL 7CH adj
broad match: C6121

Hovmästare och servitörer
type: Concept
in scheme: JobTech Taxonomy - Yrke
definition: Organiserar och leder serveringspersonals arbete. Tar emot bordsreservationer samt beställningar på mat och dryck på restauranger eller hotell. Ansvarar för drycker på en restaurang. Serverar gäster mat och dryck på restauranger, konferensanläggningar, passagerarfartyg m.m.
broader: Hovmästare, servitörer och bartendrar
related: JYAn p1X 6sb
related: bgC3 M9R 1K4
related: fJdB viK AaA
related: zeB7 Xk7 wZ5
related: 3Z9i jNu wnT
related: SogP 82Z 66E
related: LDpW xuo jZp
related: gspB 1ci Nt3
related: XDok jQC Q7x
related: zMmn 1mh 6D5
related: Eksc iXV Z1S
related: ZdiP HTr Bqk
related: gcwv JBu uTA
related: FmHS DMU bcA
related: Y25e JjD 31Y
related: Dywf BPg usG
related: bw5i aVL h7e
related: S4vL AVu s6q
related: ZzN5 m7B 5CY
related: PRQR oGE 7re
related: 4kNn tuk 8tt
related: tPYe p8C v4Z
related: i9kS G7J FLh
related: S44W QvJ r4m
related: 2nZz 9RT Gt4
related: 5AC4 y1Q qLq
related: eThQ HCv mY6
related: rYGi DpZ kWM
related: M4ei Uvu Ks7
related: j1Yr UhC X16
related: fZzc bG7 2hH
related: L9MT j2G 8nC
related: bUi9 ERk nAc
related: EcuE BY7 mc4
related: ZvbR g69 jGv
related: 5fAq Squ o7p
related: zYzY NTD VoE
related: Nxfw cTk qUk
related: vxPD 87A wmk
related: eKuz edm kmi
related: SJaZ pXy 771
related: hYpk RYx y3V
related: JJiW W7Z kgc
related: aAtJ q2r J5n
related: C5131
related: P6te TBF 8fh
related: Bvh1 pDm M5Y
related: S7LZ tzK qSg
related: kj4Q nLh u8Q
related: CWGv KBN FxU
narrower: Servitör/Servitris
narrower: Servitör, fartyg/Servitris, fartyg
narrower: Hovmästare
narrower: Intendenturpersonal, sjöfart
narrower: Mässman, fartyg
narrower: Sommelier
broad match: ScKy FHB 7wT

Rehabhandläggare
type: Concept
in scheme: JobTech Taxonomy - Yrke
definition: Rehabhandläggare samordnar och stödjer rehabiliteringsprocesser för personer med sjukskrivning eller störd arbetsförmåga. Arbetsuppgifterna inkluderar bedömning av patientens behov, planering av rehabiliteringsinsatser samt samverkan med vårdgivare, arbetsgivare och försäkringskassan. Rehabhandläggare följer upp rehabiliteringsåtgärder och bidrar till att anpassa arbetsplats och arbetsuppgifter för att underlätta återgång i arbete. Arbetet innebär även kontakt med läkare och andra yrkesgrupper för att säkerställa en helhetssyn på patientens rehabilitering. Källor: Arbetsförmedlingen, Vårdgivarguiden
broader: Socialsekreterare
related: GazW 2TU kJw
related: DpaV UG4 bDB
broad match: C2635

Laborant, kemi
type: Concept
in scheme: JobTech Taxonomy - Yrke
definition: Laborant, kemi
broader: Laboratorieingenjörer
related: CpFD aoS pkZ
related: 6Hq3 tKo V57
related: EsWG kHG oXZ
related: 1zfb J4Y Loh
related: fM7t axJ RNN
broad match: C3111

Musikförläggare
type: Concept
in scheme: JobTech Taxonomy - Yrke
definition: Musikförläggare arbetar med att upptäcka, utveckla och stödja musikskapare och säkerställa att upphovsrätten respekteras och inkomstflöden administreras korrekt. Vanliga arbetsuppgifter är att identifiera och utveckla låtskrivare och kompositörer, hantera registreringar hos organisationer som Stim, bevaka rättigheter samt förhandla och upplåta rättigheter för musikverk. Musikförläggaren hanterar också musikskapares finanser. Källa: Arbetsförmedlingen, Musikförläggarna
broader: Verkställande direktörer m.fl.
related: bh3H Y3h 5eD
related: 8too bEs 7NU
related: 9puE nYg crq
broad match: C1120

Auktionsbiträde
type: Concept
in scheme: JobTech Taxonomy - Yrke
definition: Auktionsbiträden utför administrativa uppgifter vid auktionshus. Arbetet innebär i huvudsak att förbereda varor för auktion och assistera auktionsförrättaren under auktionen. En vanlig arbetsuppgift är att hantera in- och utlämning av varor. Detta inkluderar att packa upp, ställa ut och ta betalt för föremål. Vidare kan det även förekomma att förbereda sålda föremål för transport, vilket kan innebära tunga lyft. Beroende på arbetsplats kan man som auktionsbiträde även hjälpa till med värdering och fotografering av föremål. Källa: Arbetsförmedlingen
broader: Övriga servicearbetare
related: UdVa jRr 9DE
related: RPTn bxG ExZ
related: R1rB KiG 49A
related: gq9R jhF W2V
broad match: C9629

Kontraktsansvarig
type: Concept
in scheme: JobTech Taxonomy - Yrke
definition: Kontraktsansvarig ansvarar för kontrakt från utformning hela vägen till avslut och/eller industrialisering. En kontraktsansvarig initierar, utformar, förhandlar, genomför, administrerar, utvärderar och avslutar kontrakt. Det ingår också att se till att inblandade parter följer kontraktsvillkor och att utveckla och underhålla relationer med oberoende entreprenörer, leverantörer och kunder. Kontraktsansvarig kan också vara en mer strategisk roll som rådgivare till chefer för att säkerställa att kontrakt och avtalsförfaranden effektivt motsvarar affärsstrategier. Inte ovanligt med juridisk och/eller ekonomisk bakgrund. Vanligtvis behövs också teknisk kunskap inom området. Arbetsuppgifter inkluderar behovsanalys, kapacitetsplanering, kontraktsutformning och uppföljning.
broader: Inköpare och upphandlare
related: sQqT Wqg uPc
related: RPTn bxG ExZ
broad match: C3323

Akademisekreterare
type: Concept
in scheme: JobTech Taxonomy - Yrke
definition: Akademisekreterare
broader: Planerare och utredare m.fl.
related: qK6q 7KY V6j
related: X82t awd Qyc
related: mvZD V7Y Js1
related: TZe9 NsN uce
broad match: C2422

Glashantverkare
type: Concept
in scheme: JobTech Taxonomy - Yrke
definition: Glashantverkare reparerar glasprodukter. Reparation och restaurering kan avse små sprickor till större återuppbyggnad. Arbetet anpassas efter föremålets funktion, som bruks- eller prydnadsföremål. Vanliga verktyg inkluderar smältugn, blåslampa samt slip- och poleringsutrustning. Källa: Hantverksakademin, Hantverkslärling
broader: Musikinstrumentmakare och övriga konsthantverkare
related: PaxQ o1G wWH
broad match: C7315

Marinarkeolog
type: Concept
in scheme: JobTech Taxonomy - Yrke
definition: Marinarkeolog
broader: Arkeologer och specialister inom humaniora m.m.
related: kJeN wmw 9wX
broad match: C2632

Chefspilot
type: Concept
in scheme: JobTech Taxonomy - Yrke
definition: Chefspilot
broader: Piloter m.fl.
related: ASGV zcE bWf
broad match: C3153

Aromaterapeut
type: Concept
in scheme: JobTech Taxonomy - Yrke
definition: Aromaterapeut
broader: Terapeuter inom alternativmedicin
related: NYW6 mP6 vwf
related: Uuf1 GMh Uvw
broad match: C3230

Lärling, industrirörmontör
type: Concept
in scheme: JobTech Taxonomy - Yrke
definition: En lärling är anställd på företag för att göra sin färdigutbildningstid till industrirörmontör. Lärlingsanställningen görs efter skolutbildning eller tillsammans med teoretiskt kurspaket. Under färdigutbildningstiden på företaget lär sig lärlingen yrket mer praktiskt och skall nå sina kunskapsmål för branschcertifikat. Certifikat erhålls efter ett branschprov. Källa: VVSYN
broader: VVS-montörer m.fl.
related: j7Cq ZJe GkT
broad match: C7126

Controller
type: Concept
in scheme: JobTech Taxonomy - Yrke
definition: Analyserar, följer upp och bevakar företags, organisationers och myndigheters resultat, lönsamhet, verksamhetsplan och hållbarhetsstrategier. Formulerar mål, gör prognoser och anger riktlinjer för ekonomiarbetet. Utvecklar planerings- och uppföljningssystem.
broader: Revisorer, finansanalytiker och fondförvaltare m.fl.
related: xSLo P6B 2AF
related: DJgq zBj bKt
related: FYk9 RXp 7c5
related: hVq9 mTt xkv
related: eox4 5Lc W7C
related: 7BhC UuS dAf
related: bLgk bom LJr
related: aUr6 Rjg ja2
related: h8Z3 Fq9 ohg
related: hD5G NDU vyT
related: h6B2 Egm LWp
related: 7tVG 9zf 7mw
related: 3HjW 1BP k3S
related: NVfN 26P KUU
related: dSoQ LXG Eh7
related: 3vYj Rhf Voh
related: 5X5B xr3 VSY
related: dBC3 Rwt Mue
related: cmrN Uff Nyc
related: Uv9y v2g efa
related: gn9Y yYC LiH
related: Tmps QPE g3V
related: P1Zc ZkT K8y
related: dc2G fUp wZN
related: awjU C3D XEJ
related: UH9g R5v MCx
related: PFWV Si2 w7i
related: QAaJ QeY Q6P
related: NUC3 y1C Scg
related: ZQux yii D4Q
related: 1qn1 fsa hZm
related: Ygao Vsn eJ2
related: iyhf Cm4 cWw
related: xwAq e21 98L
related: cw2M p2W SuJ
related: z9qQ ei6 Mjs
related: WnFA bt8 kPs
related: 34kt 5uy oYz
related: jjfg y9o zwQ
related: FfWB f5U 9NB
related: W7Qf aRY FEo
related: BsBK j8o Guh
related: s6Ui k2K kf2
related: dYqT JBz NZE
related: 5wab aFK gdL
related: wCxc kMg keR
related: WNnT qrt M77
related: PVnT yGT SMb
related: c52V CGT Gbb
related: qtHa AsU Cfo
related: hTcc jPm dwc
related: Nig2 2pU GT8
related: A5jq Gnu 8tG
related: RAmC iVK sUe
related: ibzL TeE YqA
related: Gt5f wdi FSJ
related: 4yr7 byG sX3
related: C2P6 nsE tTa
related: LmAP e75 pc6
related: nfdN dwW 6PE
related: 7scD 9YP iwV
related: H2yF VoB Pxi
related: bHQT Bhn w3S
related: jcpA Zfs nSz
related: Lq2i vZo BEx
related: e47M NXa 4NG
related: RB7E jE5 MZ3
related: LAFL 9mg crP
related: 4fRg DA4 Dj3
related: CVTD iab JgP
related: DxyA A72 J4a
related: 7um4 89D Cr7
related: Leez v3g kU1
related: u4QG GL8 hkJ
related: C2411

Arbetsmiljöingenjörer, yrkes- och miljöhygieniker
type: Concept
in scheme: JobTech Taxonomy - Yrke
definition: Inspekterar arbetsplatser för att kontrollera att arbetsmiljölagen och gällande föreskrifter följs. Kartlägger och analyserar arbetsmiljö för att garantera och stärka hälsosamma arbetsförhållanden. Mäter hälsorisker och utreder arbetsskador. Informerar om risker samt föreslår och genomför lösningar för att förebygga sjukdom eller skada.
broader: Specialister inom miljö- och hälsoskydd
related: 8R6B ypK iSj
related: E13X ZF3 PAb
related: AyNP DoC owX
related: 4sDr kFf cjc
related: 82z9 FxR bSg
related: vbSZ HZN PPX
related: L7X3 qqn RBr
related: UFmx AbD 645
related: arMR 18o KaR
related: QaW1 QPc BXF
related: iAdq LpN xfc
related: NxTN 57S Apf
related: NcUy XRE xNh
related: 9HDt vcq beE
related: BpCp mzz 9YP
related: W4er Syp Wrt
related: S84r Tb5 5EC
related: eTDK F6v 6yX
related: C2263
related: nDE1 gZr UJX
related: sGky Wqy QvZ
narrower: Arbetsmiljöingenjör
narrower: Skyddsingenjör
narrower: Yrkeshygieniker
narrower: Arbetsmiljöinspektör
narrower: Ergonom
broad match: E7hm BLq fqZ

Övriga IT-specialister
type: Concept
in scheme: JobTech Taxonomy - Yrke
definition: Utför annat specialistarbete inom IT än inom 2511-2516. Exempel på arbetsuppgifter: Planerar och lägger upp strategier för hur informationsteknik eller datateknik ska användas på ett företag eller i en organisation. Forskar inom IT.
broader: IT-arkitekter, systemutvecklare och testledare m.fl.
related: eTW8 AY5 tpe
related: abgV e4C gwj
related: NfDv 1zP NsD
related: CtvK s26 dNs
related: wynY a5Q F6t
related: W4Ud Do3 B6S
related: pwNB ces 8hN
related: 7pQ1 pc6 qRD
related: iUew moc BRk
related: 19PK uxU Wzy
related: hY1R jKB zNr
related: jTYU TTp 4iW
related: C69V W4p i5E
related: AWnv mhJ 8uc
related: AfJ4 Pvv YBa
related: b8Yk S7p Nc7
related: ifWk o4W Gir
related: xwT1 oxn Dwq
related: H9Lc RGr vUb
related: eGP4 984 S1u
related: yXg3 YoW xeC
related: oisM 5jo EVb
related: C2519
related: 3nRt vck Jrv
related: dTK5 R7G p56
related: Ss2A BH7 YrK
related: YLwx pBc LKV
related: wYxH RXX ZYx
related: BPMn 5Fu z9m
related: LRKC pQs pQz
related: G7Qq r7L 5Jo
related: RVvx tdf Dfk
related: USj9 RR6 Q1z
related: BPtY iXv eAd
related: cH7n Y7S UP4
related: trJM HZA Hjp
related: hYyY NPi H65
related: G7so 7Ax 7dW
related: Hg5q Rqp uZw
related: i2z8 u7i U9U
related: jjkC sJJ ZT3
related: pR2V H8A TGg
related: ND2K ivB 6RA
related: ap4S N2Q vJy
related: xT8A n4a Zji
related: 5WE9 XCR D5p
related: muKv rHW 7ES
related: KNYZ p95 rpr
related: yMYG Niy Wy4
related: bre7 QmH U8U
related: kJyW TcC r2e
related: mRpj JZE DxB
related: 3JPR oR7 UUS
related: cMK9 dv4 CZd
related: BAAQ Cnj rZU
related: ceUs fcn miS
related: jYaA Cwa Yyf
related: TMVb DnH etF
related: 2rqG WLp em4
related: VYpX 5pE eSz
related: Ahm9 oCZ 6XW
related: RHQG 2uA vKR
related: 2CXh FUJ vTH
related: 7Ycu EKz oMw
related: nD8v y8P Gi3
related: McKJ SG4 hCM
related: puvJ R8K 8e6
related: AdgQ txR S3M
related: wwBc 7Re 5ut
related: 3Yok z1U cus
related: YpFB 2Qq uwS
related: egj8 qhY 1bN
related: W4er Syp Wrt
related: Eoto bfn ztH
related: SaTd K5z ex1

Tandsköterskor
type: Concept
in scheme: JobTech Taxonomy - Yrke
definition: Tandsköterskor
broader: Omsorgsyrken
narrower: Tandsköterskor

Växtskötare
type: Concept
in scheme: JobTech Taxonomy - Yrke
definition: Växtskötare planterar och sköter om växter inom olika miljöer. Arbetet innebär enklare arbetsuppgifter inom odling och skötsel av växter, så som blommor, träd och buskar. Växtskötsel innebär bland annat vattning, dammning, beskärning och omplantering. Vanliga arbetsplatser är företag som sysslar med växtodling och försäljning av växter. Man kan även arbeta som resande växtskötare för företag som hyr ut växter till arbetsplatser. Se även yrkena Odlingsarbetare trädgård samt Park- och trädgårdsarbetare. Källa: Arbetsförmedlingen
broader: Bärplockare och plantörer m.fl.
related: uJ4v ysr Pwb
related: UdVa jRr 9DE
related: zsak hgP 86J
related: Uecr sUH SZ5
related: ZqTy RAD 5ci
related: h5XF a73 gjN
related: VuuL 7CH adj
related: vk3m NXF sKE
broad match: C9211

Ytkemist
type: Concept
in scheme: JobTech Taxonomy - Yrke
definition: Ytkemist
broader: Kemister
related: kJeN wmw 9wX
related: Yr11 UKD on1
broad match: C2113

Finanskonsult
type: Concept
in scheme: JobTech Taxonomy - Yrke
definition: Finanskonsult
broader: Finansanalytiker och investeringsrådgivare m.fl.
related: RbsF qLv jeg
related: X82t awd Qyc
broad match: C2412

Inspector dealer
type: Concept
in scheme: JobTech Taxonomy - Yrke
definition: Inspector dealer arbetar inom spel- och kasinoverksamhet med övervakning av spelbord och säkerställande av att spelregler följs. Arbetsuppgifterna omfattar kontroll av transaktioner, hantering av marker och pengar samt skapa en rättvis och säker spelmiljö. Inspector dealer observerar spel, identifierar avvikelser och bedrarier, och kan även hantera statistik och sannolikhetsberäkningar relaterade till spelet. Vissa arbetsuppgifter kan innebära deltagande i utbildning av ny personal och rapportering av incidenter. Källa: Arbetsförmedlingen
broader: Croupierer och oddssättare m.fl.
related: RPTn bxG ExZ
related: ScKy FHB 7wT
broad match: C4212

Chefer inom handel
type: Concept
in scheme: JobTech Taxonomy - Yrke
definition: Chefer inom handel
broader: Chefer inom övrig servicenäring
narrower: Chefer inom handel

Automationsingenjör, gruvteknik och metallurgi
type: Concept
in scheme: JobTech Taxonomy - Yrke
definition: Automationsingenjör, gruvteknik och metallurgi
broader: Ingenjörer och tekniker inom gruvteknik och metallurgi
related: 6Hq3 tKo V57
broad match: C3117

Golvläggare
type: Concept
in scheme: JobTech Taxonomy - Yrke
definition: Utför golvbeläggningar av textil, plast, linoleum, kork och parkett. Ytbehandlar trägolv.
broader: Takmontörer, golvläggare och VVS-montörer m.fl.
related: v3d9 u2H pnf
related: 76hp Qsy S2h
related: hLfP 61p DQc
related: nuRM zb9 2wV
related: Encp 2KQ 9x3
related: aHCV VsV LiD
related: gCa2 BuT UVE
related: Psdi otm PNL
related: qKDQ Y6s Phq
related: PELm cH9 AE9
related: Q7eC B7g QiU
related: ZVGn feA UY9
related: BHXE FVm nNT
related: uNL7 C1e TK8
related: 7hqq SwK WeQ
related: FUk8 QA9 5oo
related: M7C1 DAy UTK
related: Vrh6 MwU tMD
related: ZphL V8k Bqe
related: oXv5 7ns m3N
related: fhcp fFw Lbj
related: 6VeN XR4 Zuj
related: nkhA jPz pcE
related: U1ud XV7 Z8o
related: ynWd oCo o61
related: xeoH rao GgZ
related: zf8y AK6 PV8
related: fhu6 H74 uuN
related: KfEn V5y npV
related: 5Av7 qB2 msb
related: jzoV 7pi LHP
related: njXX ghq cn3
related: LAiW b8V KT6
related: HmXd ehy QT9
related: C7122
related: Rw7P Usj 7Mk
related: RZT1 Bme Tq7
related: ZTk2 7eo CUb
related: WrVH jzF ozJ
narrower: Golvslipare, trä
narrower: Lärling, golvläggare
narrower: Golvläggare
narrower: Golvläggare, utan yrkesbevis
broad match: j7Cq ZJe GkT

Geologer och geofysiker m.fl.
type: Concept
in scheme: JobTech Taxonomy - Yrke
definition: Utvecklar teorier, modeller, begrepp och metoder samt tillämpar vetenskaplig kunskap inom geologi, geofysik, hydrologi m.m. Undersöker och kartlägger berggrunden, de lösa jordlagren och grundvattnet. Undersöker, beräknar och forskar kring vattenföring, vattenstånd, isförhållanden, vågor m.m. Hit hör inte: Geologassistent (3215) Geotekniker (2146)
broader: Fysiker, kemister m.fl.
related: HACr 3sZ 4gm
related: uE9W cjo dTw
related: ph2f wuM ae1
related: sURo MBj hGS
related: uWaM WHp tV4
related: cqQu U4C ZTc
related: aEAa zEW qrL
related: fExN 14j VdF
related: 8ZZy KK1 X5z
related: QA2h ceW R3b
related: UoS3 9yg PF2
related: MrXS BuR kvW
related: KZb6 UBs gP9
related: ZMm6 nJj CeR
related: Ys1x eSx wLc
related: UXhY wj1 QSW
related: MJje v9X Srn
related: EyXA uLV v9Q
related: C2114
related: iTGk Hat ZXh
related: 1dVh cZS Exw
related: BLMQ 6BV Pwa
related: sqqf Pfv ZAU
related: qEQz Mbj kQP
related: Hiyy sRE X9b
related: 86sT wc6 QsW
related: CWfM RL9 V4t
related: 5UMW 9C8 tEJ
related: 2qWx WKP XYH
related: Moxn 7AQ mim
related: Nb1A Sca LbP
narrower: Seismolog
narrower: Paleontolog
narrower: Hydrogeolog
narrower: Gruvgeolog
narrower: Geolog
narrower: Kvartärgeolog
narrower: Oceanograf
narrower: Hydrolog
narrower: Geofysiker
narrower: Berggrundsgeolog
narrower: Geokemist
broad match: kJeN wmw 9wX

Nätverks- och systemtekniker m.fl.
type: Concept
in scheme: JobTech Taxonomy - Yrke
definition: Installerar och konfigurerar kommunikationsutrustning samt ansvarar för underhåll av denna utrustning, t. ex. brandväggar, routrar, switchar etc.
broader: Drift-, support- och nätverkstekniker m.fl.
related: pWTc PxX xX6
related: wynY a5Q F6t
related: NnaR bCQ hK1
related: hb1q 7u6 bqH
related: XVip VKv Ac4
related: juME 7Ek CBR
related: igAK 9XZ E2a
related: oRCp wLd dWd
related: HKgZ SWa vn8
related: LeES iac 1Qx
related: wqXe tsX y7s
related: qVjQ w6H dns
related: N8Tu Tsn 2VD
related: aB7G VwT AfU
related: ZxHj Wvj 39H
related: Zd17 7XH myf
related: 49fH K3e Fbm
related: urLT mLe FHv
related: bT7R xGv GnZ
related: bJ3T CwH a2j
related: Lrrv HyL PzJ
related: 7d2G KP4 eFb
related: mYLj nHM zSE
related: bCPt NW1 v2o
related: 5q4a wi4 WYk
related: V2u7 DEg 6i8
related: bKM3 9g1 WWC
related: 2vCi hQz Y9o
related: eKtc 9pz qch
related: DWfb eQD E3r
related: 1FS5 pZc X5o
related: WQdS Jtu qPC
related: GZEU zfs Fcc
related: yoeN KxU Wp1
related: j3wL CdZ Rz6
related: HQJ2 68A AiZ
related: xTkt sZQ eVq
related: nf2k RuW WEC
related: N9zP r7b yiK
related: LyCZ 7mm 9VW
related: PMhY w2C ajS
related: DL93 n1W VFP
related: 3H7m pt8 7b2
related: dyvM XQ5 zgT
related: C2523
related: QN8t 2kG kzL
related: pYJh yqM cfy
related: nhXC MeA vzi
related: uBLB rJz L99
related: 4qaY nGh gq1
related: k9dd 4aU 3fj
related: 6PiD AjD 4a3
related: Lqeq PaN Kuv
related: kraG fcm 3Mo
related: pqTD 5Mi 3mx
related: N9we hv9 hsc
related: q2v1 YcS Dff
related: izZk 2EE 5sH
related: 85vp 6Vr 4N1
related: zU9b joy UL6
related: yHvf EiK QUF
related: C3513
related: T7DS X2X Y4N
related: sPhy WnE 1Xd
related: Tzfj C7N L2R
related: G4sF xod zoq
related: ZbX6 6Fd A4Y
related: t78J nRk xGn
related: hfRX 1xN X8Z
related: voW2 EsY 1Vj
related: pnX9 gFn CLt
related: a4W9 9Mz sWY
related: 2dyp mQp ezF
related: KRDJ nhm wLb
related: KJ76 PSw Nub

Ekologisk hudvårdsterapeut
type: Concept
in scheme: JobTech Taxonomy - Yrke
definition: Ekologiska hudvårdsterapeuter arbetar med hudbehandlingar där ekologiska och naturliga produkter används som ett alternativ till konventionell hudvård. Arbetsuppgifter omfattar rengöring, peeling, ansiktsmassage, masker, kroppsinpackningar och enklare hudvårdsbehandlingar. Terapeuten anpassar produkter utifrån hudtyp och arbetar med metoder som främjar hudens egen balans. I arbetet ingår även rådgivning om hudvård och livsstilsfaktorer med ett holistiskt synsätt. Källa: Kroppsterapeuternas Yrkesförbund
broader: Hudterapeuter
related: Uuf1 GMh Uvw
related: evbo yPB ZYj
broad match: C5142

Valsverksingenjör
type: Concept
in scheme: JobTech Taxonomy - Yrke
definition: Valsverksingenjör
broader: Civilingenjörsyrken inom gruvteknik och metallurgi
related: 6Hq3 tKo V57
related: AZPQ Dz2 LGF
broad match: C2146

Teknisk chef, fartyg/Maskinchef, fartyg
type: Concept
in scheme: JobTech Taxonomy - Yrke
definition: En teknisk chef har den högsta positionen inom maskin och el och har det övergripande ansvaret för fartygets maskiner och annan teknisk utrustning ombord samt ansvar för maskinpersonalen och avdelningens ekonomi. I de administrativa uppgifterna ingår bland annat varvsplanering, internkontroll och för-beredelser inför besiktningar och inspektioner av fartyget. Behörigheter inom sjöfart såsom certifikat och behörighetsbevis som krävs för olika befattningar ombord och som styrs av, typ av fartyg, finns samlade i Transportstyrelsens behörighetsguide Källa: Satsa på sjöfart
alternative label: Maskinchef, fartyg
alternative label: Teknisk chef, fartyg
broader: Maskinbefäl
related: dRFw Rcu dX7
related: epLc SkD cbT
related: gs65 ynn fcr
related: ASGV zcE bWf
related: XouD cCj HZN
related: isig f6Z rjG
broad match: C3151

Forskningsassistent, humaniora
type: Concept
in scheme: JobTech Taxonomy - Yrke
definition: Forskningsassistent, humaniora
broader: Arkeologer och specialister inom humaniora m.m.
related: X82t awd Qyc
broad match: C2633

Maskinsnickare och maskinoperatörer, träindustri
type: Concept
in scheme: JobTech Taxonomy - Yrke
definition: Ställer in hel- och halvautomatiska träbearbetningsmaskiner samt utför bearbetning.
broader: Ytbehandlare, trä och möbelsnickare m.fl.
related: VPF1 UZM 9Kd
related: Qk22 Scd XLr
related: PktN Uav zKf
related: 5gQS Mcn CRF
related: TQNS 4fV yzd
related: 74Mw JUN VKx
related: aHCV VsV LiD
related: 2pjc Vto TGH
related: FsW4 5wN iAb
related: WYUi DLH 7LS
related: pGts PKK c8W
related: UXFa vHf ddp
related: ngdX 24q xrB
related: aF3J SgE uck
related: YVaz 9nR 6NM
related: qQ61 EQR rcz
related: VTwt 5Fe 6bW
related: PELm cH9 AE9
related: KDzy Hra iVr
related: JFDz Uyg Nmy
related: sbYJ XwB o8X
related: 7jFS 6oq ZGv
related: zVKm f79 DtU
related: Xa6W AB4 Et1
related: ZqZp rib 2PF
related: HKmV 7A9 nkz
related: KoK2 ruP YAi
related: BdEM JCH d3d
related: EGCS 78o x3F
related: ZuMC 5GQ 9jw
related: KDGW 77q zgQ
related: Wdpj 9k2 9Tz
related: PuQP aBK nqJ
related: NgvP A87 SuB
related: Rbju P7i 12U
related: 3aii Kdh 1nL
related: AiwS Mhv ttk
related: BGie HPa fNA
related: wn7T k1d TBe
related: 22JT eUQ XPo
related: BKYD AEo maF
related: 8TGJ EdB b7b
related: wpVJ UXf uSb
related: uenm 75h fEh
related: wZpC X9a xzG
related: MT1a Nyq DGQ
related: dWbY gXC Frx
related: NRPg xF1 DLu
related: E5Rd ZpF 5CT
related: Uytu hWi 5nh
related: NoNy o7q jCt
related: d2yX cZM fSy
related: 4aj7 yr6 q8r
related: C7523
narrower: CNC-operatör trä
narrower: Hyveloperatör inom trä- och möbelindustri
narrower: Maskinsnickare
narrower: Trähusindustriarbetare
broad match: wTEr CBC bqh

Glas- och metallmontör
type: Concept
in scheme: JobTech Taxonomy - Yrke
definition: Glas- och metallmontör monterar glas- och metallkonstruktioner i fasader, tak och entréer vid nyproduktion samt om- och tillbyggnader. Montering sker ofta utomhus och från byggnadsställning, ibland på hög höjd. Yrket kräver kunskap att hantera maskiner, ha monteringstekniska kunskaper och ha kännedom om krav på glasning av brand- och säkerhetspartier. Glas- och metallmontören kan ansöka om sitt yrkesbevis efter teoretisk grundutbildning och lärlingsanställning. Källa: Arbetsförmedlingen
broader: Glastekniker
related: Gtj7 Aty A9y
related: YYrF DSy yUB
related: PaxQ o1G wWH
related: r8wp DHw 4so
related: PmJU uWt QLt
related: ja7J P8X YC9
broad match: C7125

Friskvårdsledare
type: Concept
in scheme: JobTech Taxonomy - Yrke
definition: Friskvårdsledare leder och genomför friskvårds- och hälsofrämjande aktiviteter för individer och grupper. Yrket är vanligt inom offentlig sektor, särskilt kommuner. Arbetsuppgifterna inkluderar bland annat att genomföra träningspass, hälsoutbildningar och kostrådgivning. Källa Arbetsförmedlingen
broader: Friskvårdskonsulenter och hälsopedagoger m.fl.
related: 9fkp N2T et5
related: 4RoX pH3 Y9h
related: pqYV ae6 M3i
related: mrC7 nNQ VW7
related: GazW 2TU kJw
related: yt4E oJn 3AR
related: 7NHG yP6 ucW
related: Ms5r ver kmf
related: 1T6B xeY p3m
related: vQXr Meo FJV
related: d3zG k6q E63
related: Ceco 6De qh8
related: Abys 5p1 Cnq
related: mH3F TfR fvZ
related: YJzM YsZ VAw
broad match: C3423

Viltforskare
type: Concept
in scheme: JobTech Taxonomy - Yrke
definition: Viltforskare
broader: Växt- och djurbiologer
related: kJeN wmw 9wX
broad match: C2132
broad match: C2131

Provningsingenjör, maskin
type: Concept
in scheme: JobTech Taxonomy - Yrke
definition: Provningsingenjör, maskin
broader: Civilingenjörsyrken inom maskinteknik
related: M4bK swu kXn
related: SuAn oH9 xNc
related: 6Hq3 tKo V57
broad match: C2144

Fartygselektriker
type: Concept
in scheme: JobTech Taxonomy - Yrke
definition: En fartygselektriker arbetar med underhåll av all elektrisk utrustning ombord exempelvis felsökning, reparationsarbeten och nyinstallation. Fartygselektrikern arbetar i team tillsammans med elingenjören och övrig maskin-personal. Källa: Satsa på sjöfart
broader: Industrielektriker
related: dRFw Rcu dX7
related: 44Az E7Q bDQ
related: ASGV zcE bWf
related: XouD cCj HZN
related: yhCP AqT tns
related: nQS4 FKH 2eQ
related: GTpc SLX F9D
broad match: C7412

Signaltekniker
type: Concept
in scheme: JobTech Taxonomy - Yrke
definition: Signaltekniker arbetar med besiktning, underhåll, felavhjälpning och nybyggnation av signalsystem inom järnvägen. Som signaltekniker arbetar du med besiktning, felsökning, underhåll, felavhjälpning och nyinstallationer av signalsystem inom järnväg. Det innebär till exempel arbete med växelstyrningar och signalsäkerhetsanläggningar. Arbetet innebär även att dokumentera utförda arbetsuppgifter och säkerställa installationer följer gällande tekniska standarder och säkerhetskrav. Källa: Arbetsförmedlingen, Trafikverket
broader: Elektronikreparatörer och kommunikationselektriker m.fl.
related: uk32 RNB kmy
related: jS1k g2V Vfy
related: NnFr 4bk 1cD
related: jGzq tiS Z82
related: yhCP AqT tns
related: i7Rj 1AM bQL
related: PCXp cTo SCx
related: JiCo Mh3 7BH
related: QW24 e6v Rcu
broad match: C7422

Psykologer
type: Concept
in scheme: JobTech Taxonomy - Yrke
definition: Undersöker, utreder, diagnostiserar och behandlar människors psykiska funktioner, besvär och sjukdomar. Ger råd och vägledning i konfliktlösning. Ger stöd vid organisationsförändringar, ledarskapsutveckling och personalförsörjning m.m. Utvecklar teorier, modeller och metoder inom psykologi och psykoanalys.
broader: Psykologer och psykoterapeuter
related: f3dF p3R yoj
related: 9nLt bM5 h7q
related: mxzF E88 mBS
related: s57R LAb igj
related: S9dA 1uW nfZ
related: 9SBv Es9 hcQ
related: oGSH N4E qSx
related: Sehr ZHt 4X6
related: EH8q u8m bMn
related: 61rX uPX YwJ
related: ZVmP Jed doQ
related: 6Xzm Grt V57
related: Ke1n tw2 tEa
related: sdad xS5 eZi
related: SdUN U1M aqG
related: Azca cCi Y21
related: GkcK nJA h4i
related: ZnGd a1m 2Fi
related: qpdp mgT 1pi
related: 6Sfy R4r do7
related: ecnD hDr QSy
related: Hh2K Seb wZQ
related: mb8o p2H 3a2
related: 2Mbj 579 yZj
related: CFPu xiL cbr
related: 73kE uFW vvT
related: dgfE kmf wGX
related: YSTT c61 xv3
related: C2634
related: TNxu Boc KNx
related: DahM A3K dYy
related: nF96 5Ky TaX
related: Sj2n Kcr 3hm
related: n2qQ tks 1pS
related: aPu7 3G9 YFD
related: t4h4 UKs gMA
related: iQbs wzq 7s9
related: 1oWH 1nQ hmN
related: p7YQ Hke wXv
related: 5etA xF4 E7C
related: 2EDw wE3 13f
related: faek i1g AwE
related: sQRG XKK M5n
related: M6ki Xy3 o8a
related: gT8Y Evb GEm
related: JVoz HXv 9xr
related: wNW9 zPT yY6
related: V6wR FyB Qco
related: v2GT AcT bcm
related: psMX XVq MXZ
related: 2jpJ qwQ 7Kd
related: eoGp ZP3 Lex
related: FsfU LfR jpi
related: fQoJ XhX pVs
related: USwc mJ5 1wV
related: nRHk Nkv zqk
related: 9fky 4rQ 1LA
related: tqC3 TwD M9P
related: 3Y9v Urp QGn
related: Fp5j 5Y7 QUs
related: QoMt T8x WTS
related: 91Ef 58Y jX4
related: UoxX DrK FDn
related: Mv9z oVo 4oQ
related: Lb5p DSW twg
related: UYmn hbY hjB
related: bhp9 3YQ YMH
related: jxKr BmN CcQ
related: T2RH tSw 2FG
related: PzXz 1Nv j1M
related: 47LN 8Ac dX8
related: AM1Q 6r2 nHC
related: PW2p 31x z48
related: YJVW wfP ZA4
narrower: Specialistpsykolog

Lärare i grundskolan, årskurs 1-6
type: Concept
in scheme: JobTech Taxonomy - Yrke
definition: Lärare i grundskolan, årskurs 1–6 planerar, genomför och följer upp undervisning i flera olika ämnen för elever i åldrarna 6–12 år. Lärare är ett reglerat yrke med legitimationskrav för att kunna bli tillsvidareanställd och sätta betyg. Vanliga arbetsuppgifter är att planera och leda lektioner, bedöma och dokumentera elevers kunskapsutveckling och ge återkoppling till elever och vårdnadshavare. Källa: Arbetsförmedlingen, Göteborgs universitet, Skolverket, Socialstyrelsen
broader: Grundskollärare
related: kXfH oGq ziE
related: xCBk bc1 Bpq
related: aHCZ PzT rG8
related: 4xo2 qza oLa
related: GnFC WGM uAq
related: ppBe 3r9 2si
related: sk3S pxd juX
related: MVqp eS8 kDZ
related: G9yV QuL LSh
related: 3jJC HQR 7px
related: uGZp sES 56c
related: rZcQ Tjx YmC
related: cvMz YGJ 2qu
related: 9sgR EAy 3W9
related: fQST HDG cvc
broad match: C2341

Yrken inom maskinell tillverkning och transport m.m.
type: Concept
in scheme: JobTech Taxonomy - Yrke
top concept of: JobTech Taxonomy - Yrke
definition: Yrken inom maskinell tillverkning och transport m.m.
narrower: Montörer
narrower: Transport- och maskinföraryrken
narrower: Process- och maskinoperatörer

Områdesförvaltare, fastighet
type: Concept
in scheme: JobTech Taxonomy - Yrke
definition: Områdesförvaltare, fastighet
broader: Fastighetsförvaltare
related: 6Hq3 tKo V57
related: WDoL Rzs 4G1
related: PA5R Mgn h65
related: yhCP AqT tns
related: V2TZ rR8 AN5
related: 2DEw Sv8 Tou
broad match: C3334

Arbetsledare, murning
type: Concept
in scheme: JobTech Taxonomy - Yrke
definition: Arbetsledaren inom murning är den som leder murningsarbetena ute på byggarbetsplatsen. Arbetsledaren bevakar att material finns på plats och samordnar arbetet med de entreprenörer. Arbetsledaren har ansvaret för att arbetet utförs enligt gällande ritningar och anvisningar och för att säkerhetsföreskrifterna följs. Källa: Arbetsförmedlingen
broader: Arbetsledare inom bygg, anläggning och gruva
related: j7Cq ZJe GkT
related: ja7J P8X YC9
broad match: C3123

Maskinoperatörer, kemisktekniska och fotografiska produkter
type: Concept
in scheme: JobTech Taxonomy - Yrke
definition: Styr och övervakar maskiner som monterar ammunition eller bearbetar kemikalier och andra ämnen för tillverkning av ammunition, sprängämnen och fyrverkerier. Styr och övervakar maskiner inom kemisk-teknisk industri som tillverkar kemikaliebaserade produkter som laminat, lim, linoleum, stearinljus, halogengaser och liknande. Styr och övervakar maskiner och utrustning som framställer och förstorar fotografiska bilder eller kopierar text, bild eller ritning. Hit hör inte Processoperatör, kemisk industri (8192)
broader: Maskinoperatörer, kemiska och farmaceutiska produkter m.m.
related: C8131
related: xKyJ xRE vxN
related: VPF1 UZM 9Kd
related: 7JvD uRU 389
related: 8S2f kNg dUk
related: 74Mw JUN VKx
related: 2pjc Vto TGH
related: pGts PKK c8W
related: aF3J SgE uck
related: qQ61 EQR rcz
related: VTwt 5Fe 6bW
related: p9bT EiV onR
related: E8uW GK1 AQi
related: BDmg hia r6T
related: KDzy Hra iVr
related: 1vX4 pj1 yao
related: sbYJ XwB o8X
related: dW6y neZ EFs
related: d3oB oX3 kF8
related: 8Lrt DBh iZ6
related: Q6DB h8V mc7
related: 4Tde Bpz 99g
related: SdBw 3e9 1ph
related: 6s37 N7Y UuC
related: WpA7 Zfn Sww
related: qbdH pmV FPg
related: PuQP aBK nqJ
related: W4er Syp Wrt
related: Rbju P7i 12U
related: kM3z axv hj1
related: X4EU ZC7 QmK
related: AiwS Mhv ttk
related: pCcr eK8 AnT
related: r8ux eGa cjz
related: uenm 75h fEh
related: EUFp soZ qMe
related: MT1a Nyq DGQ
related: dWbY gXC Frx
related: bZqv ZFY fRG
related: CgSF umG Epv
related: C8132
narrower: Maskinoperatör fotografiska produkter
narrower: Operatör batteritillverkning
narrower: Maskinoperatör sprängämnen och pyroteknik
narrower: Maskinoperatör kemitekniska produkter
broad match: wTEr CBC bqh

Operachef
type: Concept
in scheme: JobTech Taxonomy - Yrke
definition: Operachef leder och ansvarar för den konstnärliga och administrativa verksamheten vid en operainstitution. Vanliga arbetsuppgifter är att planera repertoarer, hantera budgetar, rekrytera och personalledning och förhandlar med samarbetspartners och finansiärer. Ansvar för verksamhet, personal och ekonomi ingår. Källa: Arbetsförmedlingen, Kungliga Operan och GöteborgsOperan
broader: Verkställande direktörer m.fl.
related: epLc SkD cbT
related: bh3H Y3h 5eD
related: 8too bEs 7NU
related: 9puE nYg crq
broad match: C1120

Kock storhushåll
type: Concept
in scheme: JobTech Taxonomy - Yrke
definition: Kockar inom storhushåll lagar mat i större volymer för exempelvis skolor, äldreboenden, sjukhus eller personalrestauranger. Arbetsuppgifterna omfattar planering, förberedelse, tillagning, varmhållning och servering av måltider enligt näringsrekommendationer och matsedel. Kockar i storhushåll arbetar ofta med specialkost. Källa: Skolverket, Arbetsförmedlingen
broader: Kockar och kallskänkor
related: b5H3 wfP Qmp
related: 1zSL 8yT QM8
related: Jctb uYb 1FU
related: jk6u waB YUr
related: YZj8 iJz U4q
related: 6y2n tyy gyY
related: 4hNP 8L4 h4L
related: w3Fo Fex KJT
related: qryU Fm7 xPK
related: RTQf 1Qm YhD
related: 1F8R kbZ Fsd
related: 9w7Y jEY QGJ
related: 9vXb 9v1 NYJ
related: iBpY BSk MvP
related: 7tuY HM2 vKd
related: ScKy FHB 7wT
related: z85R 8H7 8HF
related: Naf9 bk2 gJs
related: q283 fML XYP
related: 7a1Z qqd o1u
related: f68w Wss 2pA
related: hC2k LrM wKx
related: CQxR hzK VSs
related: 7qj8 YUL HH1
related: Fots CVv Y6S
related: zshs h6A Smd
related: i5zY AwC RGf
related: s1Z6 LfV qHk
related: 3eAk Jk7 DNe
related: jgWx qtk 2NP
related: r9Jo z27 AxY
broad match: C5120

Talpedagog
type: Concept
in scheme: JobTech Taxonomy - Yrke
definition: Talpedagog
broader: Speciallärare och specialpedagoger m.fl.
related: dBQ4 R1F HxQ
related: 3pyE aAA TFD
related: yt9L Cbg wKr
related: MVqp eS8 kDZ
broad match: C2352

Illusionist
type: Concept
in scheme: JobTech Taxonomy - Yrke
definition: Illusionist
broader: Övriga yrken inom kultur och underhållning
related: 8too bEs 7NU
related: 9puE nYg crq
broad match: C2659

Grafisk formgivare
type: Concept
in scheme: JobTech Taxonomy - Yrke
definition: Grafiska formgivare arbetar med att skapa visuellt material för olika typer av kommunikation, såsom annonser, logotyper, broschyrer och webbplatser. Arbetsuppgifter inkluderar design, layout och produktion av grafiskt material. Man använder olika mjukvaror och tekniker för att skapa material som möter kundernas eller uppdragsgivarnas behov. Grafiska formgivare har vanligtvis goda kunskaper om färglära, typografi och designprinciper.
broader: Grafiska formgivare m.fl.
related: cD8B dA8 sax
related: bP3H jT8 9vV
related: APqg EXo nVM
related: BMMN VHy GyF
related: edAB uhQ 3Cs
related: zg95 3qq yKH
related: 8too bEs 7NU
related: 9puE nYg crq
related: WjCH PZv eAC
related: YwJq NrA csx
related: 8534 5ur DS7
related: EWtt pzH yGB
related: 4CN2 xWL VwQ
related: ekd3 VQn ESX
related: Rwek c2y nTH
related: areF bMC ihk
broad match: C2166

Integrationshandläggare
type: Concept
in scheme: JobTech Taxonomy - Yrke
definition: Integrationshandläggare arbetar med att stödja och vägleda personer som nyligen anlänt till Sverige eller befinner sig i en integrationsprocess. Arbetsuppgifterna omfattar utredning, planering och uppföljning av individuella insatser som underlättar etableringen och deltagandet i samhället. Integrationshandläggare genomför möten och rådgivande samtal, samordnar kontakter med myndigheter, arbetsgivare, utbildningsanordnare och andra samhällsaktörer. Rollen innebär även administrativt arbete, dokumentation och samverkan med externa parter för att främja integration och mångfald. Arbetsmiljön är ofta kontorsbaserad men innehåller även fältarbete och platsbesök. Integrationshandläggare har vanligtvis goda kunskaper om integration, samhällsfrågor, myndighetsutövning och interkulturell kommunikation. Källa: Sveriges Kommuner och Regioner (SKR), Arbetsförmedlingen
broader: Övriga yrken inom socialt arbete
related: avqR q2W 2aT
related: Wh24 tF4 hpj
related: 31cX qWy G2w
related: s8Tb bS1 7jz
related: GazW 2TU kJw
related: AkEV Eef GEu
related: tGBJ Tp4 ERc
related: Yce7 a7J tHQ
related: PZJp aMF 9TM
related: epWS XSF cFh
related: rDfw tPZ BmE
related: Cy8W 1nc tt3
broad match: C2635

Avfallsspecialist
type: Concept
in scheme: JobTech Taxonomy - Yrke
definition: Avfallsspecialist
broader: Specialister inom miljöskydd och miljöteknik
related: AoH2 7Gd aCY
related: 4ff1 4gB Dew
related: VuuL 7CH adj
broad match: C2133

Avdelningschef, gruva
type: Concept
in scheme: JobTech Taxonomy - Yrke
definition: Avdelningschef, gruva
broader: Driftchefer inom bygg, anläggning och gruva
related: A5Pv est PdK
related: j7Cq ZJe GkT
related: epLc SkD cbT
related: bh3H Y3h 5eD
broad match: C1322

Gårdsmästare blandad drift
type: Concept
in scheme: JobTech Taxonomy - Yrke
definition: Gårdsmästare inom blandad drift leder och organiserar det dagliga arbetet på lantbruk med både växtodling och djuruppfödning. Arbetsuppgifterna omfattar planering och genomförande av sådd, gödsling, växtskydd och skörd, samt övervakning av grödornas utveckling och kvalitet. Då yrket avser blandad drift ingår även planering och fördelning av arbetsuppgifter inom djurskötsel, utfodring, rengöring av djurutrymmen och övervakning av djurens hälsa. Gårdsmästare hanterar maskiner och utrustning, sköter dokumentation och underhåller tekniska anläggningar. Beroende på arbetsplats kan många arbetsuppgifter förekomma i andra yrken, inklusive lantbrukare och driftledare. På större lantbruksföretaget kan det vara nödvändigt att det finns gårdsmästare som har en arbetsledande funktion för andra medarbetare. På mindre lantbruksföretag kan detta eventuellt inte vara nödvändigt. Se även yrkena Lantbrukare blandad drift och Driftledare lantbruk med blandad drift. Gårdsmästare arbetar generellt mer operativt, medan driftledare generellt arbetar mer strategiskt. Källa: Arbetsförmedlingen
alternative label: Rättare, blandad drift
broader: Växtodlare och djuruppfödare, blandad drift
related: epLc SkD cbT
related: VuuL 7CH adj
broad match: C6130

Kyrkokamrer
type: Concept
in scheme: JobTech Taxonomy - Yrke
definition: Kyrkokamrer
broader: Förvaltnings- och planeringschefer
related: X82t awd Qyc
related: epLc SkD cbT
related: bh3H Y3h 5eD
broad match: C1213

Vattenkrafttekniker
type: Concept
in scheme: JobTech Taxonomy - Yrke
definition: Vattenkrafttekniker utför drift, underhåll och övervakning av vattenkraftverk och dess tekniska system. Arbetsuppgifterna inkluderar inspektioner, felsökning, reparationer samt optimering av turbiner, generatorer och styrsystem. Vattenkraftteknikern samarbetar med driftledare, underhållspersonal och tekniker för att säkerställa en säker och effektiv produktion av elektricitet från vattenkraft. Vattenkrafttekniker har vanligtvis kunskaper inom elkraft, mekanik, styr- och reglerteknik samt säkerhetsrutiner. Källor: Arbetsförmedlingen, jobbannonser på Platsbanken och vakanser.se
broader: Ingenjörer och tekniker inom elektroteknik
related: yhCP AqT tns
related: u6N5 brU TJi
broad match: C3113

Polisaspirant
type: Concept
in scheme: JobTech Taxonomy - Yrke
definition: Polisaspirant
broader: Poliser
related: E7hm BLq fqZ
related: UsBM Mpp Mhs
broad match: C5412

Inköpsassistent
type: Concept
in scheme: JobTech Taxonomy - Yrke
definition: Inköpsassistent stödjer inköpsavdelningen genom att hantera administrativa och koordinerande uppgifter. Arbetsuppgifterna inkluderar hantering och uppdatering av inköpsdatabaser och system, sammanställning av rapporter och analyser av inköpsdata, hantering av inköpsorder och förfrågningar, samt kommunikation med leverantörer. Inköpsassistent sköter även leveransbevakning, hanterar reklamationer och avvikelserapporter, samt assisterar vid lagerinventering och fakturahantering. Rollen innebär nära samarbete med inköpare och andra teammedlemmar för att säkerställa en effektiv och kostnadseffektiv inköpsprocess. Källor: The Pace, Stockholms stad vuxenutbildning, Inköpsdesign
broader: Inköps- och orderassistenter
related: 6mDa oca wPT
related: RPTn bxG ExZ
related: TAky cW5 Kra
related: bbwa gDs oc7
related: 6gic dgu 8vf
related: efv7 cDE qEV
related: bLtH 7Vv 3BX
related: EzEn Sco gdi
related: Yi95 PiF 2wp
related: 6iyN u36 G5j
related: NVN2 2De 6r3
broad match: C4322

Forskare, kriminalvård
type: Concept
in scheme: JobTech Taxonomy - Yrke
definition: Forskare, kriminalvård
broader: Arkeologer och specialister inom humaniora m.m.
related: X82t awd Qyc
broad match: C2632

Kostymör
type: Concept
in scheme: JobTech Taxonomy - Yrke
definition: Kostymör
broader: Övriga designer och formgivare
related: 2W4V jcy BvW
related: u7zK VKN 8Ht
related: 8too bEs 7NU
related: 9puE nYg crq
broad match: C2163

Marknadsförare
type: Concept
in scheme: JobTech Taxonomy - Yrke
definition: Marknadsförare arbetar med att utveckla och genomföra marknadsföringsstrategier för att nå ut till kunder och öka försäljningen. Arbetsuppgifterna inkluderar marknadsanalys, kampanjplanering, skapa innehålls och utvärderaav marknadsföringsinsatser. Marknadsförare använder olika kanaler och verktyg, såsom sociala medier, e-post och event, för att nå ut till målgrupperna. Källa: Arbetsförmedlingen
broader: Marknadsanalytiker och marknadsförare m.fl.
related: cD8B dA8 sax
related: 4yxU nFx Htj
related: UnME tow B2w
related: t9g9 ZqX uwE
related: Y2Q5 VfS 3zh
related: Geus z22 omW
related: eSaZ txv Zb7
related: 1iCA dpv QZE
related: 3Th5 J7Y 9ho
related: maWk KYW nSP
related: vZ1f iT3 1x6
related: o4Hp VcD fYN
related: ucNr Kxu tq4
related: GkTn yT1 jzh
related: CLxd K98 Uxa
related: RPTn bxG ExZ
related: ESeD Hd2 2vv
related: 1fqy Yef ipR
related: SR4J kZX 5Eg
related: edAB uhQ 3Cs
related: z7di YS9 vNg
related: LWvZ GEU 3JJ
related: 8sEx nbw S8T
related: GegB GCc DsU
related: Yb1w sSy Rh9
related: XEmG D37 Zqd
related: 5Nof tHs 7Fr
related: QPt1 EHd Jpc
related: GPBh 6Mt BCn
related: pmcf 4mY HhM
related: RzEz 2Ew ksG
related: og8o Sds Lav
related: F9YB Fzx Pbs
related: PmjU UEM fQf
related: gyom 9p8 LCy
related: o58L R5o dgp
related: 8Pns TgF UKA
related: vPbB Beb PaN
related: kLmW x7s ZgT
related: 4XyY MCb svG
related: mpzx Yaq vgE
related: SpMq J3i SKE
related: 9ErW MtN iHJ
related: WXXg gw3 VvV
related: nGHs pZp ad7
related: uL3G 7mZ BkG
related: L1iA Q1N ES7
related: PHRU 84k 7ab
related: aQn4 n5F yRr
related: jxTD dX3 2PQ
related: nCNf 5NJ MRy
related: 75Sp Bqa 5C1
related: oWLh Q5G FKY
related: oSpj 9ws UwG
related: Axmh JPX s7N
related: NGBg A8V qaZ
broad match: C2431

Hortonom
type: Concept
in scheme: JobTech Taxonomy - Yrke
definition: Hortonom
broader: Specialister och rådgivare inom lantbruk m.m.
related: RPjd EiG hHA
related: 6nbS RdB kzm
related: VuuL 7CH adj
broad match: C2132

Metodstatistiker
type: Concept
in scheme: JobTech Taxonomy - Yrke
definition: Metodstatistiker
broader: Statistiker
related: X82t awd Qyc
broad match: C2120

Fiskodlare
type: Concept
in scheme: JobTech Taxonomy - Yrke
definition: Fiskodlare arbetar praktiskt med odling av fisk. Arbetsuppgifterna inkluderar utfodring, sortering, avelsarbete och dokumentation. Uppfödning innebär även vattenkvalitetskontroller och övervakning av fiskhälsa i samråd med arbetsledare. Det ingår även att underhålla odlingsanläggningar, inklusive rengöring och reparation av utrustning. Beroende på arbetsplats kan man även vara delaktig i slakt, utsättning och transporter. Mycket av den fisk som odlas i Sverige är för utsättning i vattendrag och sjöar. Den största delen som produceras används som livsmedel. Källa: Arbetsförmedlingen, Svenskt vattenbruk, Jordbruksverket
broader: Fiskodlare
related: U6AT XRP 2km
related: aDaF LBh gYT
related: VuuL 7CH adj
related: 3KTF 8m5 jCQ
broad match: C6221

Atomfysiker
type: Concept
in scheme: JobTech Taxonomy - Yrke
definition: Atomfysiker
broader: Fysiker och astronomer
related: kJeN wmw 9wX
broad match: C2111

Veterinärer
type: Concept
in scheme: JobTech Taxonomy - Yrke
definition: Undersöker, ställer diagnos och behandlar sjuka och skadade djur. Ger råd om djurhälsovård och avel. Kontrollerar djurbesättningar och slaktdjur. Ger råd och kontrollerar livsmedelshygien, djurskydd, smittskydd och import av djur och livsmedel.
broader: Veterinärer
related: 3vvC W7M M4h
related: 4UZL UMh qFG
related: FmhN LEM XAM
related: 3uhh iPw fXj
related: wkwA awm s42
related: pdXw hZ7 kQy
related: 2B5H QZF 9WV
related: pqSg n8L qE3
related: 8wT8 y7d SEE
related: 7ZyN G4R rCd
related: Q2tP mtq uN6
related: iSWP AHA BSj
related: VMch jn2 wMQ
related: BtHU 9E5 stY
related: 5KHd EHE Pe6
related: AgGE WPe Zb2
related: UbGZ 9pL wwW
related: m8kz DmE oNh
related: UhYA Vjz 2CL
related: C2250
related: EbcR 8XD Fwi
related: 4inV Cdw wMH
related: PyXu cE2 tRa
related: rbrZ BSm 2BD
related: 1KBz E3j hHg
related: sBa5 xfE GKU
related: NWvX gyZ RxT
related: 3riK eYv VqD
related: shbu GMp Rok
related: bPHw mw8 Mm5
related: i9Fv 9Kv QjR
related: kj4Q nLh u8Q
narrower: Specialistveterinär
narrower: Veterinär
narrower: Veterinärstudent
broad match: NYW6 mP6 vwf

Bostadsförmedlare
type: Concept
in scheme: JobTech Taxonomy - Yrke
definition: En bostadsförmedlare arbetar med att förmedla bostäder mellan fastighetsägare och hyresgäster, ofta inom ramen för en kommunal bostadsförmedling eller ett privat företag. Bostadsförmedlaren matchar hyresgäster med lediga bostäder utifrån köregler, behov och önskemål, hantera ansökningar, kölistor och urval av hyresgäster enligt fastställda rutiner och riktlinjer. Bostadsförmedlaren upprättar och administrerar hyresavtal samt hanterar förlängningar och uppsägningar. Källa: Arbetsförmedlingen, Boverket
broader: Övriga kontorsassistenter och sekreterare
related: iCXA fW8 jfg
related: PDNm NZ2 WRh
related: Mdhd 1H3 jUi
related: X82t awd Qyc
related: tPUz Zrz 9i7
related: p4Qt SKT kBL
related: aapE qGi tbR
related: ZiFi yWQ ah1
broad match: C4110

Reklamtextare
type: Concept
in scheme: JobTech Taxonomy - Yrke
definition: Reklamtextare
broader: Grafiska formgivare m.fl.
related: s73t Qcq wZP
related: 9puE nYg crq
related: WjCH PZv eAC
broad match: C2166

Chefer inom socialt och kurativt arbete
type: Concept
in scheme: JobTech Taxonomy - Yrke
definition: Chefer inom socialt och kurativt arbete
broader: Chefer inom hälso- och sjukvård samt annan samhällsservice
narrower: Chefer inom socialt och kurativt arbete

Kassapersonal m.fl.
type: Concept
in scheme: JobTech Taxonomy - Yrke
definition: Tar betalt för kunders inköp i affärer, stormarknader och andra försäljningsställen. Säljer biljetter till teatrar, bio, konserter, museer, utställningar m.m. Säljer och växlar valuta.
broader: Kassapersonal m.fl.
related: Yufg GC2 LXS
related: UssR m8J XA6
related: R58v 7Db Z6h
related: C4211
related: YXV9 MEq TKG
related: hpFr jXH rg2
related: C5211
related: iZeK amh g8w
related: mRyD DRC 5tT
related: y71S LsF xLV
related: hYpk RYx y3V
related: RFer rtf x6t
related: C5230
narrower: Valutaförsäljare
narrower: Uppräkningspersonal
narrower: Kassapersonal
broad match: RPTn bxG ExZ

Tågvärd
type: Concept
in scheme: JobTech Taxonomy - Yrke
definition: Tågvärdar arbetar ombord på passagerartåg och ansvarar för säkerhet, service och information för passagerare. Tågvärden arbetar i nära samarbete med lokförare. Huvudsakliga arbetsuppgifter är att ge service till passagerare, inklusive biljettkontroll, ge trafikinformation och hantera diverse situationer som kan uppkomma.Tågvärdar kontrollerar också tågets utrustning och inredning är i gott skick samt att dörrar stängs säkert och i rätt tid. Källa: Järnvägsjobb, Arbetsförmedlingen
alternative label: Tågvärdinna
broader: Tågvärdar och ombordansvariga m.fl.
related: pWZH P5A XVV
related: tyGE Lus gg6
related: ASGV zcE bWf
related: 4Jjc 6rA 89L
related: p9zU mZK vnU
related: 2dEx QTK bbN
related: jBsk qM3 5MF
broad match: C5112

Chefer inom hälso- och sjukvård
type: Concept
in scheme: JobTech Taxonomy - Yrke
definition: Chefer inom hälso- och sjukvård
broader: Chefer inom hälso- och sjukvård samt annan samhällsservice
narrower: Chefer inom hälso- och sjukvård

Kassapersonal m.fl.
type: Concept
in scheme: JobTech Taxonomy - Yrke
definition: Kassapersonal m.fl.
broader: Försäljningsyrken inom detaljhandeln m.m.
narrower: Kassapersonal m.fl.

Personskadereglerare
type: Concept
in scheme: JobTech Taxonomy - Yrke
definition: Personskadereglerare
broader: Skadereglerare och värderare
related: X82t awd Qyc
broad match: C3315

Lokförare
type: Concept
in scheme: JobTech Taxonomy - Yrke
definition: Lokförare kör tåg med passagerare eller gods. Lokförare kör tåg med passagerare eller gods. Lokförare är ett självständigt arbete och beroende på typ av tåg förekommer det ensamarbete. Vid körning av persontåg ingår ofta att informera passagerare genom resan via högtalare. Förutom att framföra tåg ingår ingår klargöring av fordon, växlingsarbete, säkerhetssyning, iordningställande av fordon och bromsprovning. Arbetar man på bangård ingår växlingsarbete och rangering i arbetsuppgifterna. Man kan även vidareutbilda sig till tekniska rådgivare eller till instruktör för blivande lokförare. Källa: Järnvägsjobb
broader: Lokförare
related: bRiN ygF qBM
related: 1PWo 3D5 h3C
related: tug6 rpF FQy
related: ASGV zcE bWf
related: H6e2 tre BsF
related: NnDe pdc yfT
related: PSJn yMP R1A
broad match: C8311

Räddningschef
type: Concept
in scheme: JobTech Taxonomy - Yrke
definition: Räddningschef
broader: Övriga chefer inom samhällsservice
related: E7hm BLq fqZ
related: epLc SkD cbT
related: bh3H Y3h 5eD
broad match: C1349

Chefer inom friskvård, sport och fritid
type: Concept
in scheme: JobTech Taxonomy - Yrke
definition: Chefer inom friskvård, sport och fritid
broader: Chefer inom övrig servicenäring
narrower: Chefer inom friskvård, sport och fritid

Akupressör
type: Concept
in scheme: JobTech Taxonomy - Yrke
definition: Akupressör
broader: Terapeuter inom alternativmedicin
related: NYW6 mP6 vwf
related: Uuf1 GMh Uvw
broad match: C3255
broad match: C3230

Butikschef
type: Concept
in scheme: JobTech Taxonomy - Yrke
definition: En butikschef har det övergripande ansvaret för butikens dagliga drift, personal, ekonomi och kundupplevelse. Rollen innebär att leda och coacha butikens personal, inklusive rekrytering, schemaläggning, utbildning och utvecklingssamtal. Butikschefen ansvarar för butikens ekonomi, såsom budgetering, uppföljning av försäljningssiffror, lagerhantering och att butiken når uppsatta försäljningsmål. Det ingår även att planera och genomföra marknadsförings- och reklamaktiviteter, samt säkerställa att butiken är attraktiv och optimerad för kunderna. Källa: Arbetsförmedlingen, Handelsrådet, indeed
broader: Chefer inom handel
related: yzTF XQy haN
related: L4jK 56e MQ3
related: 8EHU DCQ sfa
related: a3MT RWd uo9
related: uXcv phq DXg
related: RPTn bxG ExZ
related: epLc SkD cbT
related: rcMa f5g tJv
related: iRVa dB6 qAy
related: 8Bd2 ot5 dTZ
related: giMu f9S c1N
related: PVta 9Ee xDz
related: bh3H Y3h 5eD
related: qEQu CS7 xmm
related: rqMx HZR o5Q
related: 7Mdg Ld5 QvT
related: v2kD eGN cUN
broad match: C1420

Fordonsingenjör
type: Concept
in scheme: JobTech Taxonomy - Yrke
definition: Fordonsingenjör utvecklar, konstruerar och förbättrar fordon och fordonssystem för personbilar, lastbilar, tåg eller kollektivtrafik. Arbetsuppgifterna omfattar design av motorer och drivlinor, optimering av säkerhetssystem, elektronik och miljöprestanda samt testning, simulering och kvalitetskontroll av nya och befintliga fordon. Fordonsingenjören medverkar i hela utvecklingsprocessen från idé och prototyp till färdig produkt. Arbetet sker ofta i team och involverar samarbete med andra ingenjörer, tekniker och designers, samt användning av digitala verktyg och avancerade simuleringsprogram. Yrkesrollen förekommer både i kontorsmiljö och i testmiljöer inom den teknikintensiva fordonsindustrin.​ Källor: Arbetsförmedlingen, jobbannonser på TNG.se och Platsbanken
broader: Ingenjörer och tekniker inom maskinteknik
related: Bm56 vyS 36c
related: 6Hq3 tKo V57
related: pPgv dYo BBF
related: 5DRu 6Ey ZWS
related: MAS8 ttV BuQ
related: cYLL gty zwq
related: 1CWj fFi xYV
related: 9aEn jPz gJs
related: y2MW Yao UFi
related: ZWhH VZW bQu
related: H9NT oky 6gs
related: N76h 7Vg F6L
related: 6UjM A2j qUu
related: JUL8 tQh L5b
related: CmPh asm iEg
related: 9jG8 YEG nhU
broad match: C3115

Operatör, Polisen
type: Concept
in scheme: JobTech Taxonomy - Yrke
definition: En operatör hos polisen på regionledningscentralen eller en RLC-operatör, är en civilanställd eller polis som arbetar i polisens operativa nav. I arbetsuppgifter ingår att ta emot larmsamtal via 112 och andra kanaler, bedöma situationens allvar och prioritera ärenden samt leda och dirigera polispatruller till olika uppdrag och ser till att rätt resurser är på plats. Operatören dokumenterar information i olika IT-system och skriver händelserapporter och de samverkar med andra myndigheter och organisationer som SOS Alarm, räddningstjänst och ambulans. Källa: Polisen
broader: Övriga kontorsassistenter och sekreterare
related: X82t awd Qyc
related: 76wi XwT gTm
related: b9ot U9c 6jA
related: dPGK FaB qEL
broad match: C4110

Marknadsanalytiker och marknadsförare m.fl.
type: Concept
in scheme: JobTech Taxonomy - Yrke
definition: Utvecklar, planerar och samordnar reklamkampanjer och marknadsföringsstrategier. Samlar in, bearbetar och analyserar data om marknader. Gör prognoser om framtida marknader och trender samt ger råd om försäljningsstrategier. Bedömer marknaden för nya varor och tjänster. Identifierar och utvecklar marknadsmöjligheter för nya och befintliga varor och tjänster.
broader: Marknadsförare och informatörer m.fl.
related: q6QD 6et rcJ
related: tPU1 wJL suB
related: hwhg Wen pyW
related: TvaC Wot Xnz
related: h6B2 Egm LWp
related: 5Gmv EZs BPe
related: E9LX 1eF jDB
related: TEum xLY t4z
related: Z8gz 6SV bKW
related: ATGE 8XW 5oB
related: swyJ kkJ zHd
related: DXNc cU4 j4N
related: zYHW Mtu jqq
related: VANx 32R rU1
related: 37nX cp9 7M8
related: aaQr mcK hgK
related: u3bU va9 8dx
related: GCDk 3Yv nmn
related: C2431
related: q7Mx gjU F9q
related: VfP9 2xd g2h
related: zXNU zXR hGd
related: L7va tCu FCf
related: oCKN G9k zTj
related: zARh YPC Lwk
related: ZrcW W8A ryi
related: znEr hdm RXK
related: dQre aBF 3dE
related: k29D fT4 Wso
related: 8yeu mjf FZD
related: Lz84 K5d CcL
related: Hb14 vsa TwV
related: 5yDE FiQ bMn
related: TzHP 38y mhm
narrower: Marknadskoordinator
narrower: Marknadskommunikatör
narrower: Marknadsplanerare
narrower: Relationsmarknadsförare
narrower: Reklamkonsulent
narrower: Marknadsanalytiker
narrower: Marknadsförare
narrower: Marknadskonsult
narrower: Dataanalytiker
narrower: Webbanalytiker
narrower: Produktchef, marknadsföring
narrower: Projektledare, reklam
narrower: Anbudsansvarig/Bid Manager
broad match: RPTn bxG ExZ

Personlig tränare
type: Concept
in scheme: JobTech Taxonomy - Yrke
definition: Personliga tränare planerar, genomför och följer upp individuella träningsprogram för klienter med fokus på hälsa, fysisk prestation och välmående. Arbetsuppgifterna inkluderar träning inom styrka, kondition och rörlighet, rådgivning kring träningsmetoder samt motiverande stöd. Personlig tränare samverkar med kunder för att nå uppsatta mål och anpassar träningen efter individuella förutsättningar. Källa: Kroppsterapeuternas yrkesförbund, Branschrådet för hälsa, Arbetsförmedlingen
alternative label: PT
broader: Idrottstränare och instruktörer m.fl.
related: sJdm Mbx qz4
related: mrC7 nNQ VW7
related: xVgd 1YT 6U5
related: gURt T1H 7WX
related: QoSt VxH KXr
related: MVqp eS8 kDZ
related: T6SW HGF pqf
related: rHvK mzD CXQ
related: Abys 5p1 Cnq
related: Top6 hAy FBH
related: 9uyP YSc G9e
related: rcoz q9C vda
broad match: C3423

Målare, lackerare och skorstensfejare m.fl.
type: Concept
in scheme: JobTech Taxonomy - Yrke
definition: Målare, lackerare och skorstensfejare m.fl.
broader: Byggnads- och anläggningsyrken
narrower: Lackerare och industrimålare
narrower: Målare
narrower: Saneringsarbetare m.fl.
narrower: Skorstensfejare

Nattchef, redaktion
type: Concept
in scheme: JobTech Taxonomy - Yrke
definition: Nattchef, redaktion arbetar med att leda och samordna redaktionens arbete under kvälls- och nattimmar för att säkerställa att tidningens sidor färdigställs och publiceras enligt deadline. Vanliga arbetsuppgifter är att följa nyhetsflödet, bedöma inkomna tips och pressmeddelanden samt fördela arbetsuppgifter till journalister och redigerare. Arbetsuppgifterna inkluderar också att koordinera med korrekturläsare och andra redaktionsfunktioner för att hantera eventuella problem som uppstår under natten. Källa: Arbetsförmedlingen, Mediekompass, Publicistguiden
broader: Journalister m.fl.
related: pYez WWr Ygt
related: 8too bEs 7NU
related: 9puE nYg crq
broad match: C2642

Fartygsoperatör
type: Concept
in scheme: JobTech Taxonomy - Yrke
definition: Fartygsoperatör samordnar och övervakar den dagliga driften av ett eller flera fartyg inom rederi- eller sjöfartsverksamhet. Arbetsuppgifter kan omfattar planering av rutter, bevakning av lastflöden, bunkring, fartygsunderhåll och bemanningsfrågor. Fartygsoperatören koordinerar kontakt mellan fartyg, hamnar, speditörer, agenter och övriga aktörer som är involverade i transportkedjan. Tjänsten kan även innebära även uppföljning av kostnader, bränsleförbrukning, driftavvikelser samt stöd vid tekniska eller operativa ärenden. Källa: Arbetsförmedlingen
broader: Transportledare och transportsamordnare
related: ASGV zcE bWf
related: r6WT BjA ULi
related: 4CDT dvj oB2
broad match: C4323

Gårdsmästare växtodling
type: Concept
in scheme: JobTech Taxonomy - Yrke
definition: Gårdsmästare inom växtodling leder och organiserar det dagliga arbetet på lantbruk med fokus på växtodling. Arbetsuppgifterna omfattar planering och genomförande av sådd, gödsling, växtskydd och skörd, samt övervakning av grödornas utveckling och kvalitet. Gårdsmästare hanterar maskiner och utrustning för växtodling, sköter dokumentation och underhåller tekniska anläggningar. Beroende på arbetsplats kan många arbetsuppgifter förekomma i andra yrken, inklusive lantbrukare och driftledare. På större lantbruksföretaget kan det vara nödvändigt att det finns gårdsmästare som har en arbetsledande funktion för andra medarbetare. På mindre lantbruksföretag kan detta eventuellt inte vara nödvändigt. Se även yrkena Lantbrukare växtodling och Driftledare växtodling. Gårdsmästare arbetar generellt mer operativt, medan driftledare generellt arbetar mer strategiskt. Källa: Arbetsförmedlingen
alternative label: Rättare, växtodling
broader: Odlare av jordbruksväxter, frukt och bär
related: k4b7 jz6 NbG
related: jKe8 9fP Ski
related: epLc SkD cbT
related: 92qA F1U zBD
related: VuuL 7CH adj
broad match: C6111

Telefonförsäljare
type: Concept
in scheme: JobTech Taxonomy - Yrke
definition: Telefonförsäljare arbetar med att sälja eller väcka intresse för varor och tjänster via telefon. Man kan arbeta med försäljning mot både privatpersoner (B2C) eller företag (B2B). Arbetet innebär att kontakta utvalda kunder, följa upp försäljningsmål och ofta få coachning för att utvecklas. Telefonförsäljare kan arbeta på försäljningsavdelningar, callcenter eller telemarketingföretag. Arbetstiderna varierar, med möjlighet till heltid, deltid och distansarbete. Källa: Kontakta, Arbetsförmedlingen
broader: Telefonförsäljare m.fl.
related: cTXf Lmz dTW
related: 5ino yJe ubM
related: 7rxT Qmd Kvz
related: 6osf djf U5N
related: UdVa jRr 9DE
related: XqkU ee6 1DF
related: tNnC Src Fs3
related: D8Vb Lsp cxH
related: aUuf 9j9 11H
related: 1Kqw V5N g48
related: xDjL 8cA HUK
related: rDcj Tao TJJ
related: yUtq PxF LBN
related: Dz8W qUN cQ2
related: UFm5 U7e c9a
related: kKdm Cmr eb1
related: RPTn bxG ExZ
related: Zqc9 fth vp5
related: TFRi PpK ynn
related: 9XrQ sWD twF
related: Drwy Y4b ShW
related: SMXp F6c ReY
related: 9dtD 8Rp aRj
related: rKJR uVE 9JT
related: pvA9 NMf DVR
related: EKRu iSC wZc
related: NgxS 7gq kg7
related: tBtT TC3 yFL
related: XtMj SwQ mVa
related: hRKB CV9 3bG
related: wHaV UHs pCc
related: FECN C8r pQx
related: wdo4 4Vo PMa
related: 53fJ MzQ WdF
related: D9H5 gmT w1D
related: pVts qdE xFA
related: GgPS R9Z r4q
related: FMfV c4S vQF
related: BsNW Kz5 MrD
related: YJKJ Jrh Qxn
related: F7CX kdc opg
related: HMXx 7ui 1UU
related: jnnn n4y PxV
related: y4XY gz1 FtQ
related: jjxY ExZ pmp
related: VcpL peA i5S
related: gyej EdX JSE
related: vcgk ewh w4t
related: vdmX E4t 1jU
broad match: C5244

Nationalekonomer och makroanalytiker m.fl.
type: Concept
in scheme: JobTech Taxonomy - Yrke
definition: Studerar, analyserar, utvecklar och förklarar ekonomiska drivkrafter utifrån nationalekonomiska teorier och modeller. Jämför samhällsekonomiska teorier och modeller för att analysera och prognostisera beteenden och fenomen på individ-, företags- och samhällsnivå exempelvis arbetslöshet, inflation, investeringar och ekonomisk tillväxt. Analyserar stora världshändelser och länders förhållanden. Föreslår och värderar utfallet av politiska reformer och åtgärder. Utvecklar nya ekonomiska modeller.
broader: Revisorer, finansanalytiker och fondförvaltare m.fl.
related: QP1q fXF b6H
related: XaLb bWT MiC
related: aG4J hrf Mp4
related: Qjxy gSo MgE
related: itYU VkH 9RF
related: AzSy GKo EAa
related: hhf5 GTK vFd
related: dSHV LgN 6WK
related: nTBc s9z JMY
related: SsQy Txc F6F
related: UAWc FNE 2GN
related: BPRm 5g4 N4t
related: FGuh iVi jCA
related: SQ5j FkT zJY
related: wsLu CSk kfb
related: QAaJ QeY Q6P
related: GytV ZXP DQm
related: pzZW Aca aeP
related: 7T35 XRu yXW
related: rWAG dJt 8sL
related: bKTi 8b5 DEM
related: tSVJ LjY mdw
related: C2631
related: X9Kc p8a 1FB
related: TjSB 5x1 UEa
related: W5xB UtF x5v
related: ifpo N4k 7pw
related: DJ28 1Qs Utr
related: SuM8 jNA NVN
related: Je7D RP9 q6V
related: Leez v3g kU1
related: WAPP Aen Eek
related: kx7V fjX AvR
related: DiUQ yUV 5kU
related: qLmv eeK d7z
related: Y4Fw JZQ AcA
related: J5ZD BUb Ses
narrower: Forskningsassistent, ekonomi
narrower: Miljöekonom
narrower: Nationalekonom
narrower: Makroanalytiker
narrower: Samhällsekonom
narrower: Forskare, ekonomi
narrower: Hälsoekonom
broad match: X82t awd Qyc

Projektledare, medicinteknik
type: Concept
in scheme: JobTech Taxonomy - Yrke
definition: Projektledare, medicinteknik
broader: Farmakologer och biomedicinare
related: kJeN wmw 9wX
related: NWWb Qb6 1mA
related: 5XXR gCA Kkv
related: yXSE wvx EAN
related: oy2n ZDE q3L
related: ARxs 8Yt 85i
related: esAo 5sX FPv
broad match: C2131

Arbetsledare inom lager och terminal
type: Concept
in scheme: JobTech Taxonomy - Yrke
definition: Ansvarar, samordnar och leder daglig drift på lager eller terminal.
broader: Lagerpersonal och transportledare m.fl.
related: mczu WBE VSW
related: C4321
related: Xuhg PcG kq2
related: Ahfa KuY 4HZ
related: pGts PKK c8W
related: HeXq amc ABd
related: Zk4h jP4 e85
related: ijHY aHk ADE
related: 2E7x 4v4 9hN
related: tKd2 9Ei PTQ
related: UH9g R5v MCx
related: zf1U Xnn g1Z
related: 1oA3 GfA 82Y
related: GyDU 16x 48U
related: eThQ HCv mY6
related: oKRb tGE xJF
related: j1Yr UhC X16
related: rfqu h1Z ttu
related: Gt5f wdi FSJ
related: CiMi 7ax tXs
related: yXmf iKi 7ci
related: LrLw Ndd fzd
related: ZF9w knj 7cW
related: KwWd Ffq 2kE
related: jPhb feC ypa
related: W6CD Roo RCf
related: rwir xvu 443
related: kJrF R2t t6F
related: E98A 6gA wC5
narrower: Arbetsledare lager och terminal
narrower: Reservdelsansvarig
narrower: Förrådsansvarig
broad match: ASGV zcE bWf

Familjebehandlare/Familjepedagog
type: Concept
in scheme: JobTech Taxonomy - Yrke
definition: Familjebehandlare arbetar med att stödja och vägleda familjer genom olika utmaningar och kriser för att främja en hälsosam och fungerande familjedynamik. Arbetsuppgifterna inkluderar bedömningar av familjens behov, utformning och genomförande av behandlingsplaner samt terapeutiskt stöd i individuella och familjebaserade samtal. Familjebehandlare samarbetar med andra yrkesgrupper som socialtjänst, skolor och hälsovård för att skapa samordnade insatser. Familjepedagog är ett nyare yrke som vuxit fram med fokus på praktiskt stöd i familjers vardag, t.ex. struktur i hemmiljön, samspel och sociala färdigheter. Familjepedagogens arbete är ofta mer inriktat på vardagsnära förändringsarbete snarare än terapi. Källor: Arbetsförmedlingen, Stockholm Stad, Vänersborgs kommun
alternative label: Familjebehandlare
alternative label: Familjepedagog
broader: Socialsekreterare
related: GazW 2TU kJw
related: Tz5C 1eK Rax
broad match: C2635

GIS-utvecklare
type: Concept
in scheme: JobTech Taxonomy - Yrke
definition: GIS-utvecklare
broader: Mjukvaru- och systemutvecklare m.fl.
related: apaJ 2ja LuF
related: KT6P hVH LRD
broad match: C2511

Forskare, språk
type: Concept
in scheme: JobTech Taxonomy - Yrke
definition: Forskare, språk
broader: Översättare, tolkar och lingvister m.fl.
related: X82t awd Qyc
related: PRTZ 3Cx ZDx
related: 9puE nYg crq
broad match: C2643

Verksamhetsarkitekt
type: Concept
in scheme: JobTech Taxonomy - Yrke
definition: Verksamhetsarkitekt
broader: Lednings- och organisationsutvecklare
related: 1Frv avd H4K
related: X82t awd Qyc
related: EaQG XXC cRg
related: Wo8D xys Lew
related: u6f2 EPC qN4
related: EaTa K9R zrw
related: smfJ 1eo dFU
related: fnhW EBh bfJ
related: C5VA ESm F2u
related: ztV9 XPF frL
broad match: C2421

Rehabkoordinator
type: Concept
in scheme: JobTech Taxonomy - Yrke
definition: Rehabkoordinatorer arbetar med att stödja och samordna insatser för sjukskrivna patienter så att de kan återgå i arbete eller inträda i arbetslivet. Vanliga arbetsuppgifter är ge individuellt stöd till patienter i sjukskrivnings- och rehabiliteringsprocessen, upprätta och följa upp rehabiliteringsplaner, samordna insatser internt inom vården och samarbete med externa aktörer som arbetsgivare och Försäkringskassan. Arbetet innebär också att kartlägga patientens behov, hålla i trepartssamtal och vara kontaktperson för vårdenheten i sjukskrivningsärenden. Rehabiliteringskoordinator har ofta en bakgrund som legitimerad vårdpersonal eller socionom. Källa: Arbetsförmedlingen, Försäkringskassan, Region Stockholm
broader: Övriga specialistsjuksköterskor
related: NYW6 mP6 vwf
related: vGgr YUu d1m
related: FfDD gxA Bsr
related: X82t awd Qyc
related: VRtP t6M cnh
related: wsau oAg 7A8
related: QkbT xwG C7P
related: rawP vae SQ9
broad match: C2221

Ergonom
type: Concept
in scheme: JobTech Taxonomy - Yrke
definition: Person som genom personliga konsultationer, kurser och föreläsningar hjälper yrkesverksamma att anpassa sina rörelser och arbetsutrustning för att förhindra att arbetsskador uppstår. Källa: SKR
broader: Arbetsmiljöingenjörer, yrkes- och miljöhygieniker
related: E7hm BLq fqZ
related: 2hZA EhA bJc
related: h8Gx dT9 gqn
broad match: C2263

Livsmedelsinspektör
type: Concept
in scheme: JobTech Taxonomy - Yrke
definition: Livsmedelsinspektör
broader: Miljö- och hälsoskyddsinspektörer
related: kJeN wmw 9wX
related: qp1A 42j Q4i
related: 4eJL Zun nUv
related: KStv 2KU rT1
broad match: C3257

Finmekaniker och konsthantverkare m.fl.
type: Concept
in scheme: JobTech Taxonomy - Yrke
definition: Finmekaniker och konsthantverkare m.fl.
broader: Finmekaniska, grafiska och konsthantverksyrken
narrower: Guld- och silversmeder
narrower: Finmekaniker
narrower: Musikinstrumentmakare och övriga konsthantverkare

Montörer
type: Concept
in scheme: JobTech Taxonomy - Yrke
definition: Montörer
broader: Montörer
narrower: Övriga montörer
narrower: Montörer, träprodukter
narrower: Montörer, elektrisk och elektronisk utrustning
narrower: Montörer, metall-, gummi- och plastprodukter
narrower: Fordonsmontörer

Förvaltnings- och planeringschefer
type: Concept
in scheme: JobTech Taxonomy - Yrke
definition: Formulerar och ansvarar för mål för strategisk planering och policy inom förvaltnings- och planeringsverksamhet inom organisation eller företag. Utformar riktlinjer, följer upp och utvärderar verksamheten mot uppsatta mål. Har personalansvar.
broader: Förvaltnings- och planeringschefer
related: ogdH rrn NWT
related: C1219
related: RGVP 7PH Zx6
related: 9hYy FEc KaX
related: UQod 7GP JXL
related: dyQa idE ToC
related: s5SS 7bW 1Gh
related: C1213
related: ySUN PZC HQW
related: icvA Gu9 EqB
related: YS7V c8n MrS
related: vrSj Kp4 iQT
related: BNas Pf6 5CT
related: Bb7a V49 Da8
related: B3mG SvX RWH
related: G7Qq r7L 5Jo
related: UH9g R5v MCx
related: SmZd Jaa BeY
related: 29MP yhF mjx
related: 8tYq EXD Xwm
related: e9Et nNG 2fq
related: ZzN5 m7B 5CY
related: detQ YNb 9nG
related: eogS 3w5 Rh2
related: 26yR WKq qra
related: 8FGH zU4 fAt
related: Nksx 4oe fEQ
related: eThQ HCv mY6
related: 5PjX 999 uLZ
related: X9Kc p8a 1FB
related: iXbF oGL mPr
related: Wkga 1FL tK7
related: Gt5f wdi FSJ
related: zYxB rdv AyB
related: q7Mx gjU F9q
related: yXmf iKi 7ci
related: D6ev Zwt x83
related: VfP9 2xd g2h
related: zXNU zXR hGd
related: cRpm EWm dK5
related: 4fRg DA4 Dj3
related: stf1 dHR XDT
narrower: Publikchef
narrower: Miljövårdsdirektör
narrower: Omsorgschef
narrower: Affärsområdeschef
narrower: Avdelningschef, kommun
narrower: Utredningschef
narrower: Ambassadråd
narrower: Socialchef/Socialdirektör
narrower: Planeringschef
narrower: Organisationschef, kommun
narrower: Chef inom kyrkogårdsförvaltningen
narrower: Avdelningschef, region
narrower: Kanslichef
narrower: Enhetschef, offentlig förvaltning
narrower: Dekan/Dekanus
narrower: Kostchef inom offentlig förvaltning
narrower: Kyrkokamrer
narrower: VA-chef
narrower: Prefekt
narrower: Länsjägmästare
narrower: Expeditionschef, departement
narrower: Näringslivschef
narrower: Avdelningschef, statlig
narrower: Regionskattechef
broad match: bh3H Y3h 5eD

Verksamhetsanalytiker
type: Concept
in scheme: JobTech Taxonomy - Yrke
definition: Verksamhetsanalytiker
broader: Lednings- och organisationsutvecklare
related: 1Frv avd H4K
related: YWft bBn Jyt
related: X82t awd Qyc
related: Yb1w sSy Rh9
related: Wo8D xys Lew
related: py2k 2rQ 3Ay
related: xEzw 1TB ZXF
related: EaTa K9R zrw
related: 8a1C TZV XSz
related: g3zc G1S 7i9
related: fnhW EBh bfJ
related: jMcZ xpG 4Pa
related: 3YhF Rnv 9ES
related: t21T 1Le LLB
related: 2YrU qjF aZp
broad match: C2421

Flyginstruktör/Flyglärare
type: Concept
in scheme: JobTech Taxonomy - Yrke
definition: Flyginstruktör/Flyglärare
alternative label: Flyginstruktör
alternative label: Flyglärare
broader: Piloter m.fl.
related: ASGV zcE bWf
broad match: C3153

Brandchef
type: Concept
in scheme: JobTech Taxonomy - Yrke
definition: Brandchef
broader: Övriga chefer inom samhällsservice
related: yy1J eY6 HTj
related: E7hm BLq fqZ
related: epLc SkD cbT
related: X462 rdK aPk
related: bh3H Y3h 5eD
related: mGvA FSc 1oR
broad match: C1349

Renhållnings- och återvinningsarbetare
type: Concept
in scheme: JobTech Taxonomy - Yrke
definition: Nedmonterar uttjänta fordon, maskiner, apparater m.m. för att återvinna delar och komponenter. Hämtar, tömmer och sorterar sopsäckar och kärl samt annat avfall och skrot. Sopar, spolar, plogar och sandar gator och vägar. Skottar snö samt röjer parker från löv.
broader: Återvinningsarbetare
related: 8R6B ypK iSj
related: 1aiY zW7 5Gb
related: 1ezP GoJ DES
related: DMNu We1 Z9r
related: Am5W fAR RqU
related: swHZ UXk UaE
related: y36H nW4 H2U
related: C9611
related: Y6jJ tnk HJA
related: C9613
related: KRc7 jYT iwS
related: 7vUk ouq UEq
related: C9612
related: Ty8v puq yxx
related: f8Sz Xaf TEU
related: autP kQ8 Tdx
related: oi8N 7TJ z2p
related: JKP4 rFH Ww8
related: aS2X 4ZL 9h7
related: C5BH gEG 5gV
related: ykyf hFy V5o
related: Stca tVg Kiu
related: XQet 5J6 HGj
related: aKYr dkw hAz
related: rwir xvu 443
related: D5j7 31a adT
related: YYdi Fqb 834
related: 3FMJ axw bJV
related: bdEb 1Mn 9XY
narrower: Medåkare renhållningsbil
narrower: Återvinningsarbetare på ÅVC
narrower: Miljöarbetare anläggning
narrower: Bildemontör
narrower: Demontör återvinning
broad match: whao Q6A ScE

Servicehandläggare
type: Concept
in scheme: JobTech Taxonomy - Yrke
definition: Servicehandläggare ger service och information till medborgare eller interna kunder och hanterar administrativa ärenden inom offentlig verksamhet. Arbetsuppgifter innefattar mottagning av ärenden, registrering, handläggning och svar på frågor, ofta via telefon, e-post eller personliga möten. Servicehandläggare samordnar och följer upp ärenden samt bistår med vägledning i regelverk och rutiner. Rollen innefattar också arbete med dokumenthantering, administrativa system och ibland enklare ekonomiadministration. Källa: Arbetsförmedlingen
broader: Övriga handläggare
related: BJtt w4N vDr
related: X82t awd Qyc
related: wbT7 kG2 wEf
related: GGqZ 6Ew 5Ha
broad match: C3359

Webbansvarig
type: Concept
in scheme: JobTech Taxonomy - Yrke
definition: Webbansvariga planerar, utvecklar och förvaltar organisationers webbplatser. Arbetsuppgifter kan innefatta innehållshantering, uppdatering av webbsidor, analys av webbstatistik, samordning med olika avdelningar samt att implementera förbättringar för användarupplevelse och teknisk funktionalitet. Webbansvarig arbetar med att säkerställa att webbplatsens design och innehåll följer varumärkets profil och att tekniska lösningar fungerar väl. Det är vanligt att använda webbpubliceringssystem, analysverktyg och grundläggande kunskaper i webbutveckling. Källa: Arbetsförmedlingen
alternative label: Webbstrateg
broader: Webbmaster och webbadministratörer
related: U1Fe xjJ zmr
related: oB5o eSY PQd
related: Utkb ATN QkD
related: wD84 9Bc dfk
related: RN2S kAN 17w
related: apaJ 2ja LuF
related: yDfK MAc L1d
related: 7cfP DEe vXm
related: 4yy8 TF9 6fM
related: BRhM PLC nAz
related: 7Wb2 ZCy u42
related: DeET buT fh2
related: ddEb b3E 9JL
related: YCb1 oj6 a47
broad match: C3514

Ortopedingenjör
type: Concept
in scheme: JobTech Taxonomy - Yrke
definition: Ortopedingenjör arbetar med att undersöka, analysera och utforma individuellt anpassade ortopedtekniska hjälpmedel som ersätter eller stödjer kroppsdelar hos personer med funktionsnedsättningar. Ortopedingenjör är en skyddad titel med legitimationskrav. Vanliga arbetsuppgifter är att bedöma och dokumentera behov, konstruera och prova ut proteser eller ortoser och följa upp och justera hjälpmedel vid behov. Arbetet sker ofta i team med andra yrkesgrupper inom vården och styrs av lagar och föreskrifter för medicintekniska produkter. Källa: Arbetsförmedlingen, Socialstyrelsen, Sveriges Ortopedingenjörers Förening
broader: Tandtekniker och ortopedingenjörer m.fl.
related: 6Hq3 tKo V57
related: sqvh gTy 6Sj
broad match: C3214

Trädgårdsanläggare m.fl.
type: Concept
in scheme: JobTech Taxonomy - Yrke
definition: Anlägger och underhåller parker, trädgårdar, kyrkogårdar och golfbanor m.m. Lägger plattor, bygger murar och trappor samt planterar växter och sår gräs. Sköter blommor, träd, buskar och andra växter.
broader: Växtodlare inom jordbruk och trädgård
related: AUrv buc hYw
related: Bjhz qeH rQR
related: 8KkD r8p w2M
related: WStg Eag 4oi
related: F1Mf Yru 39T
related: r2MT yTq xZu
related: s5SS 7bW 1Gh
related: c7Fv prd bBL
related: 95yM 6W4 Zyj
related: LyKu BaG Ars
related: oYDh d6r cSu
related: Bpdo 6yc r2N
related: 9Pxd 4ub Kkt
related: GEEJ kt6 Zcb
related: qGzK fjg N6W
related: 2ZCT iLL F2v
related: yNyX Wa5 X2d
related: gnTF vSG 2Eq
related: VW6p 6bH VUX
related: sURo MBj hGS
related: 6E3h uR9 pxh
related: ZYm2 V9f 6E8
related: zauG HQ3 4So
related: 7bLu kHr bJU
related: RCcY Ccr i1y
related: YsdN Q9t kTY
related: xi3m 2EA yii
related: oDP7 ReX a9j
related: ba8g LRR Sj2
related: FP3w 6C4 kHx
related: L5NR BVS 1kb
related: 74uH 39f D58
related: jqEe ruX oUG
related: tKd2 9Ei PTQ
related: cNtb hfE b1p
related: QuVS jUY uMq
related: n2Xz UYL JYV
related: KZ6t r3k bMU
related: GgcW cvE f4p
related: ZzN5 m7B 5CY
related: D6xD cSH rZN
related: zuXd SyF vPg
related: 6Bnz cWX eZL
related: i1RV bHM rPu
related: za7z fct qC3
related: 8j4P S8v 9jy
related: wtBK LcN D6J
related: xCih Ym5 jwb
related: cSPw e1s iau
related: qs7C 22K 89a
related: eXDv ENc Vhc
related: yKgh gy7 e4M
related: r5Si 2g9 Err
related: mRxb SRc xne
related: GNHJ kNN fLn
related: AJB8 zVZ v9j
related: CiMi 7ax tXs
related: YUDN n3n tdz
related: bsCj 9YH Mbq
related: r6JM xDi BDY
related: HkYw 3Jx 7BH
related: UbMy NsS ZiD
related: pXEi DEw QmR
related: 6Rxx zRM Dqc
related: wfGp ntC qmK
related: L1XQ J64 pUe
related: YDfu xv3 S2j
related: Gano TLF 58d
related: C6113
related: EGxT 93M sB4
related: Y6VX E1a pNH
related: Hnsg Mpz 6KT
related: 8BMH dyx iQH
related: AAaS o41 sEg
related: FSHx ZUd vNG

Podiatriker
type: Concept
in scheme: JobTech Taxonomy - Yrke
definition: Podiatriker undersöker, diagnostiserar och behandlar sjukdomar, skador och problem i fot, fotled och underben. Arbetsuppgifterna inkluderar klinisk fotundersökning, gånganalys, bedömning av blodcirkulation, behandling av fotsår, nageltrång, fotdeformiteter och hudförändringar samt tillverkning och anpassning av ortopediska inlägg och hjälpmedel. Podiatriker informerar och ger råd om förebyggande fotvård till patienter och anhöriga, deltar i rehabilitering samt utför dokumentation och samverkan i vårdteam. Yrkesrollen omfattar också patientundervisning och utvärdering av behandlingar. Källa: Arbetsöfrmedlingen
broader: Övriga specialister inom hälso- och sjukvård
related: czD7 h8r FzR
related: NYW6 mP6 vwf
related: LS68 Spw Som
related: dLSf nYT VTF
broad match: C2269

Överbibliotekarie
type: Concept
in scheme: JobTech Taxonomy - Yrke
definition: Överbibliotekarie
broader: Övriga chefer inom samhällsservice
related: epLc SkD cbT
related: bh3H Y3h 5eD
related: 9puE nYg crq
broad match: C1349

Specialistofficerare
type: Concept
in scheme: JobTech Taxonomy - Yrke
definition: Specialistofficerare
broader: Specialistofficerare
narrower: Specialistofficerare

Technical Operation Manager/TOM
type: Concept
in scheme: JobTech Taxonomy - Yrke
definition: Technical Operation Manager ansvarar för den tekniska driften och kvaliteten vid direktsändningar och produktion av TV-program. Vanliga arbetsuppgifter är planera, koordinera och övervaka teknik under sändningar som inkluderar hantering och underhåll av sändningsutrustning, styrning av teknikteamet, och kommunikation med produktions- och teknikavdelningar för att säkerställa smidiga produktioner. Vanligt är också att bidra med teknisk support vid inspelningar och säkerställa att utrustningen är uppdaterad och fungerande under hela sändningsperioden. Källa: Arbetsförmedlingen, Platsannonser
alternative label: TOM
alternative label: Technical Operation Manager
broader: Bild- och sändningstekniker
related: 8too bEs 7NU
related: 9puE nYg crq
related: d1Ao 9bY 7Kn
broad match: C3521

Flyginspektör
type: Concept
in scheme: JobTech Taxonomy - Yrke
definition: Flyginspektörer arbetar med tillsyn och kontroll inom civil luftfart. Arbetet innebär att granska och inspektera flygbolag, operatörer och andra aktörer såväl nationellt som internationellt. Flyginspektören granskar dokumentation, kontrollsystem och rutiner, hanterar tillståndsärenden samt säkerställer att regelverk och internationella standarder efterlevs. Rollen innebär ofta resor inom Sverige och utomlands. Erfarenhet som trafikflygare inom kommersiell luftfart efterfrågas vanligtvis. Källa: Transportstyrelsen, Arbetsförmedlingen
broader: Säkerhetsinspektörer m.fl.
related: E7hm BLq fqZ
related: yhCP AqT tns
related: kDNx z5C AmY
broad match: C3115

Bartendrar
type: Concept
in scheme: JobTech Taxonomy - Yrke
definition: Serverar drycker på restauranger, hotell, nattklubbar, diskotek eller pubar. Lämnar ut drycker till serveringspersonal efter gästers beställningar. Tillreder och serverar kaffebaserade drycker på kaféer och konditorier.
broader: Hovmästare, servitörer och bartendrar
related: C5132
related: zeB7 Xk7 wZ5
related: SogP 82Z 66E
related: ZdiP HTr Bqk
related: bw5i aVL h7e
related: S4vL AVu s6q
related: ZzN5 m7B 5CY
related: eThQ HCv mY6
related: EcuE BY7 mc4
related: ZvbR g69 jGv
related: UTCj FNR wcp
related: hYpk RYx y3V
narrower: Barchef
narrower: Barista
narrower: Barmästare
narrower: Bartender
broad match: ScKy FHB 7wT

Fordonslackerare
type: Concept
in scheme: JobTech Taxonomy - Yrke
definition: Fordonslackerare återställer och förnyar krock- och lackskadade fordon. Arbetsuppgifterna inkluderar förbehandling av ytor genom slipning, spackling och maskering, följt av applicering av grundfärg och topplack. Man kan även specialisera sig inom till exempel motivlackering och foliering. Man kan även utbilda sig till plastreparatör för att kunna reparera stötfångare, kåpor till motorcyklar, lastbilsdelar och annat. Se även yrket Bilskadereparatör. Källa: Transportföretagen, Lackerarnas yrkesnämnd, Arbetsförmedlingen
broader: Lackerare och industrimålare
related: kbSy Xbm XE3
related: srMW hR5 UxY
related: wTEr CBC bqh
broad match: C7132

Provningsingenjör, el-tele
type: Concept
in scheme: JobTech Taxonomy - Yrke
definition: Provningsingenjör, el-tele
broader: Civilingenjörsyrken inom elektroteknik
related: 6Hq3 tKo V57
related: kDRm Yaa jAB
broad match: C2153

Köksmästare och souschefer
type: Concept
in scheme: JobTech Taxonomy - Yrke
definition: Ansvarar för och leder dagligt arbete i kök i en restaurang eller på ett fartyg. Skapar rätter samt planerar matsedel och menyer.
broader: Köksmästare och souschefer
related: bgC3 M9R 1K4
related: XDok jQC Q7x
related: zMmn 1mh 6D5
related: Eksc iXV Z1S
related: DzNZ 4nW KbU
related: Bb4Q Vou pbq
related: ZzN5 m7B 5CY
related: PRQR oGE 7re
related: S44W QvJ r4m
related: Nksx 4oe fEQ
related: eThQ HCv mY6
related: wQvv ucw Ez5
related: Dxqv 2WA TYt
related: M4ei Uvu Ks7
related: Gt5f wdi FSJ
related: C3434
related: Nxfw cTk qUk
related: eKuz edm kmi
related: JJiW W7Z kgc
related: aAtJ q2r J5n
related: P6te TBF 8fh
related: kj4Q nLh u8Q
related: BjRb NYL cWB
narrower: Souschef
narrower: Köksmästare
broad match: ScKy FHB 7wT

Produktionsingenjör, kemi
type: Concept
in scheme: JobTech Taxonomy - Yrke
definition: Produktionsingenjör, kemi
broader: Ingenjörer och tekniker inom kemi och kemiteknik
related: 6Hq3 tKo V57
related: 5tyY GjC AcD
broad match: C3116

Visual Effects Artist/VFX Artist
type: Concept
in scheme: JobTech Taxonomy - Yrke
definition: Visual Effects Artist/VFX Artist skapar och bearbetar digitala visuella effekter för film, TV, spel och reklam för att förstärka berättelser och visuella uttryck. Vanliga arbetsuppgifter är design och implementering av visuella effekter såsom explosioner, rök, vätskor och miljöanimationer, samt samarbete med produktionsteam och regissörer för att integrera effekterna i produktionen och genomföra nödvändiga justeringar. Källa: Arbetsförmedlingen, Yrkesnämnden för Film och TV
alternative label: VFX Artist
alternative label: Visual Effects Artist
broader: Bild- och sändningstekniker
related: 9iVF 2L6 r6f
related: 8too bEs 7NU
related: 9puE nYg crq
related: d1Ao 9bY 7Kn
related: SNWh rcR 7VB
broad match: C3521

Robotmontör
type: Concept
in scheme: JobTech Taxonomy - Yrke
definition: Robotmontörer monterar industrirobotar. Robotmontörer arbetar med montering av industrirobotar, inom tillverkning eller ute hos kund. Arbetsuppgifterna inkluderar att följa tekniska ritningar, montera mekaniska och elektroniska komponenter. Beroende på arbetsplats kan visst installationsarbete även ingå. Se även yrket Robottekniker som avser installation och underhåll av industrirobotar. Källa: Arbetsförmedlingen
broader: Montörer, metall-, gummi- och plastprodukter
related: wTEr CBC bqh
related: 3vNk 83L bMK
broad match: C8219

Produktionstekniker, maskin/Produktionstekniker, verkstad
type: Concept
in scheme: JobTech Taxonomy - Yrke
definition: Produktionstekniker, maskin/Produktionstekniker, verkstad
alternative label: Produktionstekniker, maskin
alternative label: Produktionstekniker, verkstad
broader: Ingenjörer och tekniker inom maskinteknik
related: 6Hq3 tKo V57
related: qF6f kg7 ZsB
related: 9aEn jPz gJs
related: 6daN boV Zni
broad match: C3115

Civilingenjör, organisationsutveckling
type: Concept
in scheme: JobTech Taxonomy - Yrke
definition: Civilingenjör, organisationsutveckling
broader: Lednings- och organisationsutvecklare
related: X82t awd Qyc
related: Wo8D xys Lew
broad match: C2421

Informationsspecialist
type: Concept
in scheme: JobTech Taxonomy - Yrke
definition: Informationsspecialist
broader: Bibliotekarier och arkivarier
related: QcRS JV2 E7v
related: RPTn bxG ExZ
related: D6zC nPP 22M
related: MuWB yxD ZeH
related: Yb1w sSy Rh9
related: SH29 CGh qJo
related: 9puE nYg crq
related: 1294 9nq gb1
related: T6a5 cF1 83G
related: 8LoC N2e gKy
related: tnCK bT3 a6w
related: 6C4e wvo oaZ
related: kabR KzV Wx2
related: vZJq 56R jub
related: VEg5 dNn FJH
broad match: C2622

Stuntkoordinator
type: Concept
in scheme: JobTech Taxonomy - Yrke
definition: Stuntkoordinator arbetar med att planera, organisera och leda alla stuntinslag under film-, tv- och scenproduktion för att säkerställa säkerhet och kvalitet i actionsekvenser. Vanliga arbetsuppgifter är att analysera manus för att identifiera riskmoment, utforma och koreografera stunt, riskbedöma och föreslå skyddsåtgärder samt välja ut och leda stuntutövare. Stuntkoordinatorn ansvarar för säkerhetsgenomgångar, repetitioner och att rätt skyddsutrustning används under inspelning. Källa: Arbetsförmedlingen, Prevent Arbetsmiljö i Samverkan, Voodoo Film
broader: Inspicienter och scriptor m.fl.
related: 8too bEs 7NU
related: 9puE nYg crq
broad match: C3435

Arkitekt
type: Concept
in scheme: JobTech Taxonomy - Yrke
definition: Arkitekter planerar, formger och utvecklar miljöer, så att de blir fina att se och uppleva och fungerar för de som ska vistas där. Målet för arkitekten är en hållbar kvalitet utifrån hur platsen, huset eller rummet ser ut, är konstruerat och hur miljön fungerar för de som ska bo, arbeta eller umgås där. Yrket handlar om att förverkliga idéer och önskemål och återskapa detta till exempelvis en byggnad. I arbetet väger arkitekten samman idéer, önskemål och krav. En arkitekt måste kunna argumentera för sina avväganden och förslag i ord och bild. Källa: Arbetsförmedlingen
broader: Arkitekter m.fl.
related: 6Hq3 tKo V57
related: WxoA VCS NpB
related: DM5v Yuq qg6
related: Bttp J6E wbR
related: j7Cq ZJe GkT
related: fRp2 KgS v3B
related: 8nWp mBH J77
related: 7LN7 R1W Q9E
related: r2wS XSr uox
related: zYPx hz9 fpy
related: SGKN BFt a15
related: W34w At4 5fW
related: ja7J P8X YC9
related: LDe5 fFt cHq
related: ycAe 6u2 ket
related: bGXH bxX z7S
related: 2osr 3Xr PcV
related: gJyi BnB U9L
broad match: C2161

Planeringsingenjör, el-tele
type: Concept
in scheme: JobTech Taxonomy - Yrke
definition: Planeringsingenjör, el-tele
broader: Civilingenjörsyrken inom elektroteknik
related: 6Hq3 tKo V57
related: kDRm Yaa jAB
related: ibqa c8P izX
broad match: C2153

Biluthyrare
type: Concept
in scheme: JobTech Taxonomy - Yrke
definition: Biluthyrare hyra ut fordon till kunder, både privatpersoner och företag. Arbetsuppgifterna inkluderar att ta emot bokningar, hantera hyreskontrakt och försäkringsfrågor samt genomföra skadekontroller på fordon. Råd om val av fordon och tilläggstjänster ingår även. Beroende på arbetsplats ingår även att kontrollera fordon vid återlämning och inför uthyrning samt leverans och hämtning av fordon. Källa: Arbetsförmedlingen
broader: Uthyrare
related: UdVa jRr 9DE
related: RPTn bxG ExZ
related: 1VAw jGd RRf
related: ZcNN QLU fgM
related: iKhk jBV PEG
related: yuwc fpG Snw
related: ZiFi yWQ ah1
broad match: C5249

Restaurangchef
type: Concept
in scheme: JobTech Taxonomy - Yrke
definition: Restaurangchef
broader: Restaurang- och kökschefer
related: ns8i eYJ qhG
related: qkYn ks5 uEB
related: Uzc7 n8s d1L
related: epLc SkD cbT
related: GxrC Xdh wzC
related: bh3H Y3h 5eD
related: SwH3 39b H49
related: ScKy FHB 7wT
related: eXpU 8A6 7q1
related: EkJ8 CEp xm7
related: Gv2q DMp Nye
related: tac4 m2R 7ja
related: zXKs J7L xax
broad match: C1412

Arbetsförmedlare
type: Concept
in scheme: JobTech Taxonomy - Yrke
definition: Arbetsförmedlare
broader: Arbetsförmedlare
related: MJGZ uAK TiZ
related: xppf 1Pa MKZ
related: X82t awd Qyc
related: LZsp bUY EXW
related: JK5v hNd kJF
related: yUVK gPS ETF
related: KWeC Smo USa
related: 4CbJ tcB Ntr
related: DMzY bzx DFE
related: GX7G uNc n9Q
related: sqot 91T dPA
related: sJdz Gvm 56P
related: XMWF nSA twj
related: tkzW L4n c2N
related: bpwb 9yZ oDS
related: LLgh 9aw G37
related: arcr oUY yq6
related: Hw7f 5Md 9LG
related: qUsJ dJ2 169
related: JYQZ Gyn 75r
related: UEdq jAr 6M5
broad match: C3333

Kriminalvårdsdirektör
type: Concept
in scheme: JobTech Taxonomy - Yrke
definition: Kriminalvårdsdirektör
broader: Övriga chefer inom samhällsservice
related: viyD BxR 2SU
related: E7hm BLq fqZ
related: epLc SkD cbT
related: bh3H Y3h 5eD
broad match: C1349

Drönaroperatör/Drönarpilot
type: Concept
in scheme: JobTech Taxonomy - Yrke
definition: Drönaroperatör/Drönarpilot
alternative label: Drönaroperatör
alternative label: Drönarpilot
broader: Piloter m.fl.
related: Wmbg 9Ge np8
related: G61s Uu2 VG6
related: ujje yBg L7P
related: ASGV zcE bWf
related: zWVh RQc tuL
related: JbL7 bgq hym
broad match: C3153

Eventsäljare och telefonförsäljare m.fl.
type: Concept
in scheme: JobTech Taxonomy - Yrke
definition: Eventsäljare och telefonförsäljare m.fl.
broader: Försäljningsyrken inom detaljhandeln m.m.
narrower: Telefonförsäljare m.fl.
narrower: Eventsäljare och butiksdemonstratörer m.fl.

Elevassistenter m.fl.
type: Concept
in scheme: JobTech Taxonomy - Yrke
definition: Hjälper, stödjer och stimulerar elever i grund- och gymnasieskola med behov av särskilt stöd i skolarbetet, enskilt och i gruppsammanhang. Bistår lärare i undervisningen. Hit hör inte Barnskötare (5311)
broader: Barnskötare och elevassistenter m.fl.
related: CGBF fgA qnj
related: bCVZ ziY KHC
related: Cg3t mwF yoD
related: 1MZ8 Wjc wvE
related: TsH1 ePz fpf
related: yMpX hfE xgc
related: tcgM 8bo yiv
related: 2sGi rhe wet
related: tg1e QpF xdX
related: qMfa U8e Lto
related: Aq3e Bdv v45
related: nLJN byo zWa
related: C5312
related: w2ok LT3 BXa
related: 1dHC SwK 1ge
related: 55EM sdj hja
related: rwir xvu 443
related: eaKe 7Xi Aoo
narrower: Modersmålspedagog
narrower: Lärarassistent
narrower: Elevassistent
narrower: Skolvärd
broad match: MVqp eS8 kDZ

Hälsoplanerare
type: Concept
in scheme: JobTech Taxonomy - Yrke
definition: Hälsoplanerare
broader: Planerare och utredare m.fl.
related: Kivp s2z KMe
related: X82t awd Qyc
related: TZe9 NsN uce
broad match: C2422

Metallhantverks- och reparatörsyrken
type: Concept
in scheme: JobTech Taxonomy - Yrke
definition: Metallhantverks- och reparatörsyrken
broader: Yrken inom byggverksamhet och tillverkning
narrower: Gjutare, svetsare och plåtslagare m.fl.
narrower: Smeder och verktygsmakare m.fl.
narrower: Fordonsmekaniker och reparatörer m.fl.

Kranförare m.fl.
type: Concept
in scheme: JobTech Taxonomy - Yrke
definition: Manövrerar och styr kranar och lyftanordningar. Sköter och övervakar linbanor och skidliftar m.m.
broader: Maskinförare
related: pESU 6WD qhR
related: gSAz 16e oTu
related: BkyM xnu 6pm
related: fNce 6z3 G4v
related: PELm cH9 AE9
related: Q7eC B7g QiU
related: w2ch nk6 kqc
related: m7n5 f6v b1D
related: M7C1 DAy UTK
related: fhcp fFw Lbj
related: GtgX uTj fXP
related: ynWd oCo o61
related: xeoH rao GgZ
related: fhu6 H74 uuN
related: yFGR X3G cq9
related: WLAi BDr 5fW
related: KfEn V5y npV
related: MVc4 jmh wE4
related: wJUD v8j Aep
related: HmXd ehy QT9
related: QRS4 6U2 qGi
related: C8343
related: qn22 kbi Mwa
related: oZDs ScF hwS
related: NCP4 Fmi 2LC
related: LhvF NZc r6N
related: wzfZ xQE 6Y1
related: LqSr CPu orF
narrower: Containerkranförare
narrower: Lärling, tornkranförare
narrower: Lifttekniker
narrower: Tornkranförare
narrower: Lärling, mobilkranförare
narrower: Mobilkranförare
broad match: j7Cq ZJe GkT

Infrastrukturarkitekt
type: Concept
in scheme: JobTech Taxonomy - Yrke
definition: Infrastrukturarkitekt
broader: Systemanalytiker och IT-arkitekter m.fl.
related: apaJ 2ja LuF
related: D1nc 84U Byf
related: QG7p MQ4 zf2
related: qBsw ikL hZ2
related: XrxN gaw ak8
broad match: C2511

Chefer inom IT, logistik, FoU, fastighetsbolag, bygg- och ingenjörsverksamhet samt tillverkning m.m.
type: Concept
in scheme: JobTech Taxonomy - Yrke
definition: Chefer inom IT, logistik, FoU, fastighetsbolag, bygg- och ingenjörsverksamhet samt tillverkning m.m.
broader: Chefsyrken
narrower: IT-chefer
narrower: Produktionschefer inom tillverkning
narrower: Chefer inom arkitekt- och ingenjörsverksamhet
narrower: Förvaltare inom skogsbruk och lantbruk m.fl.
narrower: Inköps-, logistik- och transportchefer
narrower: Fastighets- och förvaltningschefer
narrower: Forsknings- och utvecklingschefer
narrower: Driftchefer inom bygg, anläggning och gruva

Civilingenjörsyrken inom bygg och anläggning
type: Concept
in scheme: JobTech Taxonomy - Yrke
definition: Utvecklar konstruktionsmetoder, produkter, tjänster och material inom byggnadsteknik samt väg- och vattenbyggnadsteknik. Leder och planerar projekterings- och konstruktionsarbete samt genomförande av bygg- och anläggningsprojekt. Ansvarar för besiktning och kontroller av byggande, material m.m. Utarbetar riktlinjer och metoder för kvalitetssäkring. Hit hör inte Yrken inom bygg och anläggning med arbetsuppgifter motsvarande ingenjör- eller teknikernivå (3112)
broader: Civilingenjörsyrken
related: iggK cuN iSD
related: tCER yDZ XnW
related: JQRo XJx YX9
related: uvcb DuX NW8
related: MUh1 LJt EBw
related: g7bY vJ5 XC8
related: W5A6 NGs aM9
related: Z6GN aCQ MDc
related: xEQs n1U Een
related: 4VUm JpJ LWr
related: ah7i FKc KGU
related: 8YxM PWA RNH
related: eHy7 eMm 1mG
related: Uige jQo uZ4
related: CbKj Tme k2U
related: tg8L maz wMN
related: sA2V erA 3WN
related: 61zA BvK zDd
related: uw7i bUK eex
related: d4fX YoT QQc
related: n5Ww Cc9 xYG
related: 6MJf 3Va KQD
related: oaiv GsB AFK
related: QB7Z 7mE fx2
related: 11rR H3J EQQ
related: BV5y wau Zxz
related: t3fW PJW LzP
related: 74Mw JUN VKx
related: K5JR yfk 8oj
related: sc9x MMP woB
related: 5YfK Qik mBW
related: YK2s pxn YWW
related: Xpix Jg8 81T
related: C2142
related: cqQu U4C ZTc
related: 5FMU Dt4 2hF
related: 1JaM 2oZ iQ3
related: YSVk ZwM xm4
related: yFgG g8k r6r
related: yMp7 AwC zqx
related: YAdb Wwj b3N
related: HW3B CwN pst
related: M3tL 3Qr oeB
related: DsHp orw 8Xb
related: Bh9h t3B M8h
related: HSSe f2H 7uF
related: zRtu fYj XC4
related: mpwi 6BM SbV
related: jSAi QKc JQk
related: u8ZW NcV 2zS
related: BrdZ oPC Kft
related: oFXV XTh H6w
related: hH5E rGv 7vN
related: jt4y g5c GXy
related: rUFy uF1 xEZ
related: M7C1 DAy UTK
related: ND2K ivB 6RA
related: oPP6 byU yyn
related: WXkX o6j FYv
related: 1VVe BBY rpQ
related: E67G PGy fiG
related: D6xD cSH rZN
related: MsNS 1ea u4p
related: ZPBk FiE qTG
related: ofzH ikr 67D
related: YqX1 qhL cBm
related: ATGE 8XW 5oB
related: woCn NVG HCt
related: qbEp sGf jyZ
related: nF6J MNc ZxS
related: U1JW vPG Dqk
related: 2rqG WLp em4
related: HPrg bZM zh2
related: fFAM jC1 ur5
related: oDKx 7bc sfk

Tryckare
type: Concept
in scheme: JobTech Taxonomy - Yrke
definition: Sköter, ställer in och anpassar tryckpressen. Övervakar, mäter och kontrollerar tryckprocessen.
broader: Prepresstekniker, tryckare och bokbindare m.fl.
related: sGwE DSL mX1
related: VPF1 UZM 9Kd
related: 8ntq a4w 7mH
related: NRxg Kvo HrM
related: oXx9 dMz j5N
related: rS8J fGk tCp
related: wXRm Aq3 9D8
related: J2Sq XTY MMi
related: dTK5 R7G p56
related: d92a euk ZPi
related: pGts PKK c8W
related: qQ61 EQR rcz
related: VTwt 5Fe 6bW
related: yYfG SfY Jfj
related: nWDu Phn q7L
related: vSry 1wJ PPt
related: E8uW GK1 AQi
related: gMcc J9t oSo
related: Xxmf z4h CBn
related: KDzy Hra iVr
related: 9uX1 5vL LR3
related: 4z3c rYn W6S
related: KkF3 qoE mN8
related: z7Z3 6Ju AJg
related: PQXh 1eM Rgu
related: GaTy U4j HQd
related: FHVr swq yGh
related: C7322
related: a8dJ Ac9 Hri
related: DENZ NiU TVN
related: ke74 dtN 2FR
related: uenm 75h fEh
related: SZh8 D7y Gqy
related: dWbY gXC Frx
related: ggL4 R3q TPw
related: 1yhG DsU vPx
related: bPLT Mr1 6bh
related: jVrt anX M8R
narrower: Maskinoperatör tryckeri
narrower: Digitaltryckare
broad match: wTEr CBC bqh

Hydrolog
type: Concept
in scheme: JobTech Taxonomy - Yrke
definition: Hydrolog
broader: Geologer och geofysiker m.fl.
related: kJeN wmw 9wX
related: hay1 KVv 6S4
broad match: C2114

Onlinemarknadsförare
type: Concept
in scheme: JobTech Taxonomy - Yrke
definition: Onlinemarknadsförare
broader: Informatörer, kommunikatörer och PR-specialister
related: WRmw pVw jC3
related: pR5W iRK KUn
related: AMYC cXM g5M
related: gfm4 K76 izc
related: gVPG HaV V8L
related: ir6B RMU GUN
related: DJDx Hka J1X
related: yYDx wA8 vig
related: RPTn bxG ExZ
related: YZo4 C5C jwe
related: X82t awd Qyc
related: Jb6H P4n gou
related: LZkP MtS FMQ
related: 2ZZt rCA FWz
related: Ks99 g1v 1kL
related: deWE eKT 1xC
related: PsSD MX6 D91
related: EGGi uCA oHZ
related: RHXe Lx4 3QY
related: vwxR MbC XjW
related: RLyM P81 gMS
related: czQT q9g gzX
related: dJpP FbT maE
related: GXEZ kNz AKz
related: VXdq Vkj rhA
related: nDBX iSx yz1
related: 88K8 MXg fkg
related: Lxcw kwe af8
related: gRbC FCu JmN
broad match: C2432

Flygtekniker
type: Concept
in scheme: JobTech Taxonomy - Yrke
definition: Flygtekniker utför underhåll, tillsyn och reparationer på flygplan och helikoptrar. Flygtekniker har i stort sett samma arbetsuppgifter som en flygmekaniker, men flygteknikern har större ansvar och utför mer avancerade uppgifter. Flygtekniker är ofta arbetsledande och leder flygmekaniker. Flygtekniker arbetar även med nytillverkning av flygplan och flygmotorer samt felsökningar och inspektioner. För att få arbeta som flygtekniker behövs vidareutbildning från flygmekaniker. Det är möjligt att som flygtekniker inrikta sig mer på flygplan respektive helikopter. Källa: Transportfackens Yrkes- och Arbetsmiljönämnd, Arbetsförmedlingen
broader: Flygtekniker
related: 6Hq3 tKo V57
related: Gxjx 6Uj ToT
broad match: C3155

Receptarier
type: Concept
in scheme: JobTech Taxonomy - Yrke
definition: Bereder, expedierar, marknadsför och kvalitetskontrollerar läkemedel inom exempelvis apotek, läkemedelsindustri och sjukhus. Ger råd om läkemedel och hälsa.
broader: Biomedicinska analytiker, tandtekniker och laboratorieingenjörer m.fl.
related: onsq 9NH AnV
related: u47A 7yp rvf
related: WM8A Yp3 TUS
related: wu3w XsW e72
related: C3213
related: R85L 23s y4M
related: iSWP AHA BSj
related: xAbn Wt7 ySS
related: 26DW RVn 42Q
related: a1Sf mey gVk
related: uXQ6 kcq dkZ
related: 9kw3 UiG 7VA
narrower: Receptarie
broad match: NYW6 mP6 vwf

Naturvärdesinventerare
type: Concept
in scheme: JobTech Taxonomy - Yrke
definition: Naturvärdesinventerare
broader: Växt- och djurbiologer
related: kJeN wmw 9wX
related: X82t awd Qyc
broad match: C2131

Stensättare
type: Concept
in scheme: JobTech Taxonomy - Yrke
definition: Stensättare lägger kantsten och gatsten samt sten- och betongplattor på gång- och körbanor, ofta i stadsmiljöer eller andra offentliga miljöer. Stensättare arbetar med olika sorters material såsom betong, granit och skiffer. Stensättaren ansvarar för att underlaget är rätt utfört för stenläggning. Källa: Arbetsförmedlingen
broader: Anläggningsarbetare
related: j7Cq ZJe GkT
related: StEB 7ik HNc
related: ja7J P8X YC9
related: upbS QFL YQP
broad match: C7119

Process- och maskinoperatörer
type: Concept
in scheme: JobTech Taxonomy - Yrke
definition: Process- och maskinoperatörer
broader: Yrken inom maskinell tillverkning och transport m.m.
narrower: Maskinoperatörer, kemiska och farmaceutiska produkter m.m.
narrower: Drifttekniker och processövervakare
narrower: Maskinoperatörer, gummi-, plast- och pappersvaruindustri
narrower: Processoperatörer, trä- och pappersindustri
narrower: Process- och maskinoperatörer, vid stål- och metallverk
narrower: Maskinoperatörer, textil-, tvätt- och läderindustri m.m.
narrower: Malmförädlingsyrken och brunnsborrare m.fl.
narrower: Andra process- och maskinoperatörer
narrower: Maskinoperatörer, livsmedelsindustri

Attributmakare
type: Concept
in scheme: JobTech Taxonomy - Yrke
definition: Attributmakare arbetar med att tillverka rekvisita för teater, film och TV. Rekvisita för produktioner kan vara allt från mindre till större föremål som används för att skapa effekter, till exempel attrapper eller rörliga objekt. Attributmakare har breda kunskaper inom hantverk, till exempel måleri, skulptering, formtagning, snickeri och patinering. De har även kunskaper i el och mekanik. Det är vanligt att arbeta som egenföretagare på enskilda produktioner. Vissa arbetar även som anställda av teatrar eller produktionsbolag. Källa: Arbetsförmedlingen
broader: Fin-, inrednings- och möbelsnickare
related: hYAA Ajt N1F
related: 9puE nYg crq
broad match: C7522

Skådespelare
type: Concept
in scheme: JobTech Taxonomy - Yrke
definition: Skådespelare gestaltar och uttrycker hur människor tänker, känner och handlar under olika omständigheter, oftast inom teater, film, TV och radioproduktioner. Vanliga arbetsuppgifter är att läsa och tolka manus, memorera repliker, öva och repetera scener, samt anpassa skådespeleriet till olika roller. Det är inte ovanligt att skådespelare medverkar i inspelningar för talböcker, dubbning eller reklam, har oregelbundna arbetstider med projektanställningar eller frilansuppdrag. Källa: Arbetsförmedlingen, Saco
broader: Skådespelare
related: hxsE exL hdN
related: u7zK VKN 8Ht
related: dCwQ vAK 6Sf
related: 8too bEs 7NU
related: 9puE nYg crq
broad match: C2655

Industridesigner
type: Concept
in scheme: JobTech Taxonomy - Yrke
definition: Industridesigner tar fram och vidareutvecklar produkter och tjänster som ofta tillverkas i stora serier för många användare. Vanliga arbetsuppgifter är att skapa lösningar utifrån användarnas behov, anpassa produkten till produktionsmetoder, göra tekniska beskrivningar och ta hänsyn till miljö- och kostnadsaspekter. Arbetet sker ofta i nära samarbete med företagsledning, tekniker, marknadsförare och tillverkare. Industridesignern ansvarar för hela processen från idé till färdig produkt eller tjänst, inklusive behovsanalys, konceptskapande, skiss- och prototyputveckling samt presentation för kund och samarbetspartner. Källa: Arbetsförmedlingen, Lunds Tekniska Högskola
broader: Industridesigner
related: ezWn GsE UHv
related: R3ki im4 ZPE
related: uSfv 2KA skB
related: du85 Dr4 Gje
related: Bz2K 5q1 DWF
related: Rzrn RRQ bsn
related: N99r Z5t g7w
related: PX1B UXW pi7
related: iyzT 6dw jaq
related: 8too bEs 7NU
related: 9puE nYg crq
related: LHQh gpF Czn
related: 5Dh5 Wj8 Daa
related: TvYn jYg wXc
related: SDx2 SCr Ytc
related: Zoct dAo oBb
related: pACC G2R M2d
broad match: C2163

Bagare/Konditor
type: Concept
in scheme: JobTech Taxonomy - Yrke
definition: Bagare och konditorer bakar bland annat matbröd, bullar, kakor, tårtor eller andra bakverk. Idag arbetar de flesta både som bagare och konditorer. Som bagare gör man ofta många olika sorters matbröd eller kaffebröd. Man väger man upp ingredienser, jäser degar och formar bröd och eller kakor som gräddas. Arbetet sker både för hand och med hjälp av maskiner. En konditor bakar och tillverkar olika kakor, tårtor eller bakelser. Man arbetar på större bagerier och säljer vidare bakverk till bland annat restauranger och livmsedelsbutiker. Vid industribagerier övervakar man maskinell, automatiserad bakning. Källa: Sveriges bagare och konditorer, Arbetsförmedlingen
alternative label: Bagare
alternative label: Konditor
broader: Bagare och konditorer
related: Xppo bFA 49m
related: cYc4 EDp EX6
related: ESBU ckd Zkg
related: wzui uwT UKa
related: bG5o 9qw Qw4
related: UczQ X6o uyZ
related: Apsz wFz S2U
related: QheZ qQZ 3UG
related: hAQC UgX Shf
related: NAmo T49 Zdf
related: aZ1r 1Kq Z3Y
related: yzuB 1T7 ark
related: ANdy H8E AQg
related: KP9K BXU ivJ
related: bxmD KLH 2L6
related: PaxQ o1G wWH
related: zfMB 4s4 1Tw
related: ScKy FHB 7wT
related: uUaz uFQ k8P
related: ZVwV wyv zeN
related: SK7Y UJH UJf
related: ouFE iUC 5Ek
related: dDbv oNm mkv
related: bB5v ENC j89
related: WiPh pKQ s2v
related: 9eUp dFG fmQ
related: 4A6L aNM oqz
related: 7fUp Czn FhP
related: DtS3 Zh9 ytz
related: NzVV yNz qE5
related: b6Vm SAS 7p9
broad match: C7512

Rabbin
type: Concept
in scheme: JobTech Taxonomy - Yrke
definition: Rabbin
broader: Präster
related: GazW 2TU kJw
broad match: C2636

Specialister och rådgivare inom lantbruk m.m.
type: Concept
in scheme: JobTech Taxonomy - Yrke
definition: Utvecklar teorier och metoder, samt bedriver försök och ger råd inom agronomi och trädgårdsvetenskap. Analyserar och värderar data. Utvecklar och utformar praktiska tillämpningar inom jordbruk, livsmedelskedjan och trädgårdsodling.
broader: Biologer, farmakologer och specialister inom lant- och skogsbruk m.fl.
related: r6uV Vr4 Qnv
related: JsAw WWK wbb
related: Bjhz qeH rQR
related: vAS3 M5r RUx
related: WStg Eag 4oi
related: eox4 5Lc W7C
related: r2MT yTq xZu
related: s5SS 7bW 1Gh
related: ph2f wuM ae1
related: wkwA awm s42
related: 9Pxd 4ub Kkt
related: qGzK fjg N6W
related: yNyX Wa5 X2d
related: rEpz 5Pn TAT
related: hZDG iqA bka
related: f6pC XWR WZU
related: FCcX k8U M6g
related: VW6p 6bH VUX
related: sURo MBj hGS
related: 6E3h uR9 pxh
related: ZYm2 V9f 6E8
related: zauG HQ3 4So
related: RCcY Ccr i1y
related: xi3m 2EA yii
related: oDP7 ReX a9j
related: ctn3 Kvt 7Q2
related: jpcR F1P 8Wr
related: 3aJZ gGC HzV
related: upaJ 42d WtR
related: hRQ8 wvB wnr
related: yMp7 AwC zqx
related: 74uH 39f D58
related: 1ZEw qMv JHU
related: kmBX uX9 oQF
related: qh6a 8VG LLs
related: uwev L2n fpz
related: C2132
related: n2Xz UYL JYV
related: Vig6 18E ZVA
related: Uao8 SYL 5av
related: FGuh iVi jCA
related: TKoo ucY 7Xh
related: 5KHd EHE Pe6
related: oPP6 byU yyn
related: i1RV bHM rPu
related: ZM9h 6ip qdZ
related: NXwB MUp XA6
related: qs7C 22K 89a
related: GKfd eHz HWB
related: eXDv ENc Vhc
related: evqS BsZ p78
related: DnL5 sXM WRb
related: 6nLi H4q 9ZX
related: GNHJ kNN fLn
related: nVax pj9 CrG
related: eHN2 mra VzK
related: XdUe 8cB Hwb
related: SNjy Mqa UYh
related: yK4r ToR zg7
related: P3T4 G7P Sta
related: yXmf iKi 7ci
related: VfP9 2xd g2h
related: sLZX 5ZG ujh
related: c2YE oK3 f1u
related: XRfU bRB DwH
related: EGxT 93M sB4
related: BGJc YEv aPK
related: CWfM RL9 V4t
related: 37ZU mdJ hhK
related: C3142
related: qjsN zZ2 KwE
related: BkCz fjg Am7
related: CQCp gX8 zQJ
related: 3suA kDu QDY
related: TFCa CfD LdU

Befälhavare, Kustbevakningen
type: Concept
in scheme: JobTech Taxonomy - Yrke
definition: Befälhavare, Kustbevakningen
broader: Tull- och kustbevakningstjänstemän
related: E7hm BLq fqZ
broad match: C3351

Specialistläkare, barn- och ungdomsmedicin
type: Concept
in scheme: JobTech Taxonomy - Yrke
definition: Specialistläkare, barn- och ungdomsmedicin är en specialiserad legitimerad läkare med en djupare kunskap och kompetens inom sitt område. Specialistläkare är en skyddad titel och bara den som har bevis om specialistkompetens får kalla sig specialist i sin specialitet. Specialistläkare ansvarar för att diagnostisera, behandla och förebygga sjukdomar inom sin specialitet. Vanliga arbetsuppgifter är mottagningsarbete med patientbesök, rondarbete på avdelning, handledning av yngre läkare samt konsultationer till andra yrkesgrupper och specialiteter. Specialistläkare ansvarar även för att följa och leda utvecklingen inom sitt medicinska område och utför omfattande medicinsk dokumentation och administration. Källa: Arbetsförmedlingen, Karolinska Institutet, Socialstyrelsen, Sveriges Kommuner och Regioner, Sveriges läkarförbund
broader: Specialistläkare
related: k8EP Ssk dZ2
related: wAfT MqP qLm
related: YcYd 1Xn j4D
related: NYW6 mP6 vwf
related: qSbw XHD Ycd
related: TChC u37 rt2
related: 3HW5 XC1 Hm1
related: USn2 Gp2 RsG
related: EBX9 7gC eLt
related: vFjb AHi a54
related: jFHU uSj 4ke
related: KALC VvK 17U
related: xZ7L Su4 1AU
related: QSeQ MpU wpW
related: 89LR AwA UqR
broad match: C2212

Flygmäklare
type: Concept
in scheme: JobTech Taxonomy - Yrke
definition: Flygmäklare
broader: Speditörer och transportmäklare
related: RPTn bxG ExZ
related: ASGV zcE bWf
broad match: C3324

Slipare metall
type: Concept
in scheme: JobTech Taxonomy - Yrke
definition: Slipare bearbetar metallytor genom slipning, med hjälp av handverktyg och maskiner. Som slipare arbetar man ofta i en mekanisk verkstad. Arbetsuppgifterna innefattar bland annat olika typer av slipning, så som hålslipning, rundslipning och planslipning. Man arbetar även med polering och ytfinish av produkter. Vanligtvis bearbetas mekaniska komponenter och andra metallprodukter. Beroende på arbetsplats kan även oförstörande provningar och underhåll av maskiner förekomma. Källa: Arbetsförmedlingen
broader: Slipare m.fl.
related: H8Ci UeU oCW
related: MF2d ZY6 88r
related: GfzA mpG aAK
related: GQHt 3PE 2Eq
related: XF24 Nm3 m5Y
related: oXbE icP KcZ
related: MBiS Jfb p4S
related: Mx63 FTN LSk
related: wTEr CBC bqh
broad match: C7224

Fiskal
type: Concept
in scheme: JobTech Taxonomy - Yrke
definition: Fiskal är en jurist inom domstolsväsendet som genomgår domarutbildning och arbetar med rättsutredningar, handläggning av mål och utformning av förslag till domar och beslut. Fiskal förbereder mål genom att analysera rättsläget, ta fram underlag och skriva förslag till beslut. Under tjänstgöringstiden arbetar fiskal självständigt med dömande uppgifter i domstol, leder och protokollför förhandlingar samt utformar domskäl och domar. Rollen innebär ofta handledaruppgifter för tingsnotarier. Efter fullgjord fiskalsutbildning kan fiskal gå vidare till tjänst som assessor. Yrket finns både i allmän domstol och förvaltningsdomstol. Källa: Sveriges Domstolar, Domarbloggen, Kammarrätten i Sundsvall
broader: Domare
related: hYMH VZL eYp
related: X82t awd Qyc
related: x4Wi NWW ogB
related: hENE g8a j3L
related: Abcb QtH isZ
broad match: C2612

Säljledare, resebyrå
type: Concept
in scheme: JobTech Taxonomy - Yrke
definition: Säljledare, resebyrå
broader: Resesäljare och trafikassistenter m.fl.
related: RPTn bxG ExZ
related: ASGV zcE bWf
broad match: C4221

Hundtrimmare
type: Concept
in scheme: JobTech Taxonomy - Yrke
definition: Hundtrimmare
broader: Uppfödare och skötare av sällskapsdjur
related: ATkc FM3 GRB
related: VuuL 7CH adj
broad match: C5164

Ställningsbyggare
type: Concept
in scheme: JobTech Taxonomy - Yrke
definition: Monterar och demonterar byggnadsställningar på byggarbetsplatser.
broader: Snickare, murare och anläggningsarbetare
related: v3d9 u2H pnf
related: nuRM zb9 2wV
related: Ytcy v8N P2w
related: aHCV VsV LiD
related: eJzW Jd1 2t2
related: c9RM Fuc oEw
related: PELm cH9 AE9
related: Q7eC B7g QiU
related: Trb3 sP7 BVq
related: EZb7 wBA okA
related: bnMZ Nt5 o48
related: C7119
related: M7C1 DAy UTK
related: f8Sz Xaf TEU
related: fhcp fFw Lbj
related: 6VeN XR4 Zuj
related: nkhA jPz pcE
related: ynWd oCo o61
related: xeoH rao GgZ
related: fhu6 H74 uuN
related: 6BpN oXk 7SL
related: mwmt 9hq DEH
related: WLAi BDr 5fW
related: KfEn V5y npV
related: 5Av7 qB2 msb
related: HmXd ehy QT9
narrower: Ställningsbyggare, utan yrkesbevis
narrower: Ställningsbyggare
narrower: Lärling, ställningsbyggare
broad match: j7Cq ZJe GkT

Scenmästare
type: Concept
in scheme: JobTech Taxonomy - Yrke
definition: Scenmästare leder, planerar och samordnar all scenteknisk verksamhet i produktioner som teatrar, konserter och evenemang och ser till att ljus, ljud och scenografi fungerar enligt krav. Vanliga arbetsuppgifter är planera och utföra scentekniska konstruktioner, dekorbyggen, transport och demontering enligt schema. Det ingår också arbetsledning av teknisk personal och extrainhyrd personal på scenen, säkerhetsansvar för publik och medverkande samt turnéplanering och ledning av produktioner på turné. Källa: Arbetsförmedlingen, Platsannonser
broader: Ljus-, ljud- och scentekniker
related: 8too bEs 7NU
related: 9puE nYg crq
related: d1Ao 9bY 7Kn
broad match: C3435

Övriga ekonomer
type: Concept
in scheme: JobTech Taxonomy - Yrke
definition: Utför annat ekonomiskt specialistarbete än inom 2411-2415. Exempel på arbetsuppgifter: Budget- och skuldrådgivning, fastighetsvärdering m.m. Hit hör inte Fastighetsmäklare (3334)
broader: Revisorer, finansanalytiker och fondförvaltare m.fl.
related: xSLo P6B 2AF
related: DJgq zBj bKt
related: FYk9 RXp 7c5
related: hVq9 mTt xkv
related: eox4 5Lc W7C
related: QKMc eKX sUE
related: aUr6 Rjg ja2
related: C2412
related: vD77 b9G AEe
related: h8Z3 Fq9 ohg
related: h6B2 Egm LWp
related: 7tVG 9zf 7mw
related: 3HjW 1BP k3S
related: NVfN 26P KUU
related: dSoQ LXG Eh7
related: pAcX ugi X4j
related: 3vYj Rhf Voh
related: 5X5B xr3 VSY
related: cmrN Uff Nyc
related: Uv9y v2g efa
related: gn9Y yYC LiH
related: Tmps QPE g3V
related: P1Zc ZkT K8y
related: dc2G fUp wZN
related: nrpg m4R PEa
related: awjU C3D XEJ
related: UH9g R5v MCx
related: 3vyB YMf qJm
related: PFWV Si2 w7i
related: C2413
related: QAaJ QeY Q6P
related: NUC3 y1C Scg
related: ZQux yii D4Q
related: 1qn1 fsa hZm
related: Ygao Vsn eJ2
related: xwAq e21 98L
related: cw2M p2W SuJ
related: z9qQ ei6 Mjs
related: WnFA bt8 kPs
related: 34kt 5uy oYz
related: LQX6 t5s aro
related: 5t9z 7Sc 1bz
related: jjfg y9o zwQ
related: FfWB f5U 9NB
related: W7Qf aRY FEo
related: BsBK j8o Guh
related: 8m5V 7k8 wJ3
related: s6Ui k2K kf2
related: dYqT JBz NZE
related: 5wab aFK gdL
related: wCxc kMg keR
related: WNnT qrt M77
related: PVnT yGT SMb
related: c52V CGT Gbb
related: qtHa AsU Cfo
related: hTcc jPm dwc
related: Nig2 2pU GT8
related: A5jq Gnu 8tG
related: ibzL TeE YqA
related: Gt5f wdi FSJ
related: 4yr7 byG sX3
related: C2P6 nsE tTa
related: BQRS U7c PTG
related: LmAP e75 pc6
related: q7Mx gjU F9q
related: nfdN dwW 6PE
related: 7scD 9YP iwV
related: VfP9 2xd g2h
related: H2yF VoB Pxi
related: cRLv eAB 8eH
related: bHQT Bhn w3S
related: jcpA Zfs nSz
related: Lq2i vZo BEx
related: e47M NXa 4NG
related: RB7E jE5 MZ3

Konsumentvägledare
type: Concept
in scheme: JobTech Taxonomy - Yrke
definition: Konsumentvägledare
broader: Planerare och utredare m.fl.
related: X82t awd Qyc
related: oUbn kdS keM
related: TZe9 NsN uce
related: hf6G 74V CVE
broad match: C2422

Blåsinstrumentmakare
type: Concept
in scheme: JobTech Taxonomy - Yrke
definition: Blåsinstrumentmakare bygger och reparerar blåsinstrument i mässing eller trä. Exempel på bleckblåsinstrument är trumpet, althorn, tuba och kornett. Exempel på träblåsinstrument är blockflöjt, piccolaflöjt, spilåpipa, klarinett och saxofon. Musikinstrumentmakare är ett hantverksyrke, där viktiga kunskaper är bland annat materialkunskap, verktygsvård, maskinbearbetning, ritning och uppmätning samt ytbehandling. Källa: Hantverksakademin, Hantverkslärling, Arbetsförmedlingen
broader: Musikinstrumentmakare och övriga konsthantverkare
related: PaxQ o1G wWH
related: gTgT 3D6 trb
related: vYww Vjn fmG
broad match: C7312

Processansvarig, ITIL
type: Concept
in scheme: JobTech Taxonomy - Yrke
definition: Processansvarig, ITIL
broader: Övriga IT-specialister
related: uyFj yMV PMS
related: apaJ 2ja LuF
broad match: C2519

Arkivchef
type: Concept
in scheme: JobTech Taxonomy - Yrke
definition: Arkivchef
broader: Övriga chefer inom samhällsservice
related: epLc SkD cbT
related: bh3H Y3h 5eD
related: 9puE nYg crq
broad match: C1349

Special Effects Artist/SFX Artist
type: Concept
in scheme: JobTech Taxonomy - Yrke
definition: Special Effects Artist skapar och applicerar praktiska och digitala specialeffekter för film, TV, teater och andra. Vanliga arbetsuppgifter är att skapa karaktärsproteser, specialmasker, sår och skador, samt digitala visuella effekter med hjälp av 3D-modellering, animation och compositing. SFX-artister arbetar nära regissörer, maskörer och tekniker. Källa: Arbetsförmedlingen, Yrkesnämnden för Film och TV
alternative label: SFX Artist
alternative label: Special Effects Artist
broader: Ljus-, ljud- och scentekniker
related: 8too bEs 7NU
related: 9puE nYg crq
related: d1Ao 9bY 7Kn
broad match: C3521

Restaurang- och kökschefer
type: Concept
in scheme: JobTech Taxonomy - Yrke
definition: Restaurang- och kökschefer
broader: Chefer inom övrig servicenäring
narrower: Restaurang- och kökschefer

Skogsarbetare, fiskodlare och fiskare
type: Concept
in scheme: JobTech Taxonomy - Yrke
definition: Skogsarbetare, fiskodlare och fiskare
broader: Yrken inom lantbruk, trädgård, skogsbruk och fiske
narrower: Fiskodlare och fiskare
narrower: Skogsarbetare

Packare
type: Concept
in scheme: JobTech Taxonomy - Yrke
definition: Packare arbetar med att packa och emballera varor enligt anvisning. Beroende på arbetsplats och typ av produkt kommer arbetet skilja sig åt. Arbetet kan till stor del ske för hand, men även med maskinella verktyg, till exempel bandningverktyg eller sträckfilmsmaskin. Man kan förutom packning och emballering även arbeta med plock av produkter som ska packas i samma emballage och förbereda för leverans, t ex på ett lager. Tunga lyft och truckkörning kan även ingå. Yrket är skiljer sig från maskinoperatörer inom förpackning. Källa: Arbetsförmedlingen
broader: Handpaketerare och andra fabriksarbetare
related: djy1 NiQ jek
related: capC Uge 2rS
related: UdVa jRr 9DE
related: roYK jPK hNj
related: ffdw K7v pAc
related: eTDt Hsq Ey5
related: 8aRN xaW 5H8
related: Uqrg KkG aVc
related: Ngm7 xkL M5J
related: oUTq kte Txs
related: iHiJ ag9 4gk
related: JTiG 9o7 jGZ
related: XQiU Dkg RTM
related: kLaK pwm R4d
related: 5i3d E25 Z5n
related: S5n5 cuf A67
related: UFqL 1qY vxm
related: L6Fk 3hM 9Uz
related: Spbe B7e 5sM
related: i2mY Y4e Rmq
related: wTEr CBC bqh
related: GYzB wRf mce
related: K7a3 gr5 HRS
broad match: C9321

Elingenjör, fartyg/Fartygseltekniker
type: Concept
in scheme: JobTech Taxonomy - Yrke
definition: En elingenjör på fartyg har hand om och planerar underhållet av fartygets elektriska utrustning och har till sin hjälp fartygets underhållssystem. Elingenjören har även ansvaret för kommunikationsutrustningen för telefoni och dataöverföring. Elingenjören är inköpsansvarig för reservdelar och förbrukningsmaterial i elavdelningen samt sköter underhållet av fartygets hissar. För att arbeta som fartygseltekniker/elingenjör krävs Fartygseltekniker behörighet Källa: Satsa på sjöfart
alternative label: Elingenjör, fartyg
alternative label: Fartygseltekniker
broader: Maskinbefäl
related: dRFw Rcu dX7
related: gs65 ynn fcr
related: ASGV zcE bWf
related: XouD cCj HZN
related: isig f6Z rjG
broad match: C3151

Arrangör, musik
type: Concept
in scheme: JobTech Taxonomy - Yrke
definition: Arrangör inom musik planerar, organiserar och genomför musikaliska evenemang och konserter. Vanliga arbetsuppgifter är att koordinera olika delar av produktionen, skaffa tillstånd och musiklicenser, marknadsföra evenemanget och hantera ekonomi och budget. Källa: Arbetsförmedlingen, Musikalliansen, Stim
broader: Musiker, sångare och kompositörer
related: 8too bEs 7NU
related: 9puE nYg crq
broad match: C2652

Arbetsledare städ
type: Concept
in scheme: JobTech Taxonomy - Yrke
definition: Arbetsledare inom städ leder och planerar det dagliga arbetet inom lokalvård. Arbetsuppgifterna omfattar schemaläggning, introduktion av nya medarbetare, kvalitetskontroller, arbetsfördelning samt kontakt med kund eller beställare. Övriga arbetsuppgifter som kan ingå är att följa upp arbetsresultat enligt, beställning av material och medverkan vid upphandling av städtjänster.
alternative label: Husfru
alternative label: Städledare
broader: Städledare och husfruar
related: whao Q6A ScE
related: Nu85 gb2 rqf
related: B4r3 zyr Pty
related: bEb4 9jd zAB
related: hju4 3va pKB
related: hQL9 ySD kgs
related: iSxM oBw xa4
related: pWjX XVS un8
related: 9GRZ NXS bhZ
related: tLQq qin PDn
related: oDwE P8y Rtc
related: CmkN Uyf iQV
related: ZxJd JNi piz
related: gtDL gFP hEW
related: ga5z Thh Roc
broad match: C5151

Handläggare, offentlig förvaltning/Utredare, offentlig förvaltning
type: Concept
in scheme: JobTech Taxonomy - Yrke
definition: Handlägger och utredare inom offentlig förvaltning utvecklar och analyserar riktlinjer för utformning, genomförande och förändring av statlig och affärsmässig verksamhet och planering. Handläggare och utredare inom offentlig förvaltning kan arbeta med en stor mängd olika arbetsuppgifter beroende på arbetsgivare. Bland arbetsuppgifterna ingår att undersöka sociala, ekonomiska och branschmässiga trender, att gå igenom verksamhet och styrande dokument för att säkerställa att de stämmer överens med organisationens policy och att driva igenom förändringar och utvärdera effekter och konsekvenser av dem. Källa: ISCO, SSYK
alternative label: Handläggare, offentlig förvaltning
alternative label: Utredare, offentlig förvaltning
broader: Planerare och utredare m.fl.
related: 3sUb Lb1 n1r
related: PLK4 sfW sxV
related: MJGZ uAK TiZ
related: CPNn w69 WND
related: F89F 36z 39z
related: Pr7v T8X 83X
related: n47n jv7 X1U
related: Z9dy AL5 jd1
related: w5CS VQY ZxS
related: DH6s 1GU JCb
related: dsHM bVL 6pH
related: 4oGf oK9 sFN
related: pWJ2 PLs nz5
related: oJ53 jJM 9jP
related: Wwq9 sMR JBH
related: pyHz 13A 7Zz
related: omaX gxR qVk
related: X82t awd Qyc
related: NzV9 D6X nEx
related: CqTB U6G BLA
related: vvNb WLX cs2
related: ZKGx bdr gKH
related: Q4VU WMW mGo
related: JB9X 9cQ D2U
related: ytPL aYH Xi9
related: 7auk ut6 zBC
related: M8aD wSe ZAm
related: 7MM3 hTb QPn
related: LTnF MWT m1A
related: Yb1w sSy Rh9
related: 73YC nov Gbo
related: ugF5 CGZ waC
related: raJf Bes 5oj
related: zGPj 43B aZo
related: BKkq gL9 r3v
related: AYJW FZ2 Xfv
related: uQc9 HNC uri
related: 2jez W8G rk1
related: XrN5 cGA aV1
related: kiKP 5E4 BCA
related: u1jw i1i BUM
related: 9h9Z F7p thT
related: wKEV 7J3 9aD
related: B6FY LLH uis
related: nSNx ZVx dEg
related: zu1T wHN eNQ
related: Uvg3 X1P DiK
related: umNa bqd JXW
related: amtW GSB Sv7
related: RPE5 qTv Wnz
related: WRBB gRA nC6
related: fe5C MHF DT6
related: okHv 8gQ QG4
related: KoAo fhM a8u
related: 2k6m xPE NuE
related: TZe9 NsN uce
related: bBJm BZt Rr4
related: 1qxB 9q9 4LM
related: TmKc v72 dXG
related: LGZt eE9 zoq
related: DQ4M 3Vn zyF
related: 3Gy2 jzK eZj
related: WwVr fju AHZ
related: Lrtv N1X hB4
related: hnSy We9 9Xe
related: 9mtU yz2 WAP
related: kRrh ZWV XgA
related: h5Q1 BAk riz
related: A48z rec sU9
related: gvHg buN a2g
related: 3Dua qFT knn
related: ucXL ySA JC8
related: gkeu JVz Tmr

Planeringsingenjör, textil, trä, glas, förpackningar
type: Concept
in scheme: JobTech Taxonomy - Yrke
definition: Planeringsingenjör, textil, trä, glas, förpackningar
broader: Övriga ingenjörer och tekniker
related: 6Hq3 tKo V57
related: ibqa c8P izX
broad match: C3119

Apotekare
type: Concept
in scheme: JobTech Taxonomy - Yrke
definition: Apotekare är experter på läkemedel och arbetar inom hela läkemedelskedjan, från forskning och utveckling till rådgivning och expediering av läkemedel på apotek. Apotekare är en skyddad titel med legitimationskrav. Vanliga arbetsuppgifter är att ge råd till patienter och hälso- och sjukvårdspersonal om läkemedelsanvändning, ansvara för att apoteket följer lagar och kvalitetskrav samt delta i läkemedelsförsörjning på sjukhus. Apotekare kan också arbeta med forskning, utveckling, tillverkning och kvalitetskontroll inom läkemedelsindustrin eller på myndigheter med tillsyn och utvärdering av läkemedel. Källa: Arbetsförmedlingen, Socialstyrelsen, Sveriges Farmaceuter
broader: Apotekare
related: CpFD aoS pkZ
related: TTZS zyT Rvt
related: NYW6 mP6 vwf
related: 98YM kmP Ajr
related: 5G4D 4o1 Ykg
related: sqvh gTy 6Sj
related: GKYn 3aH ZtR
related: bYxq oaU M34
related: fjQ7 HYh 448
related: Hmin oBt JZa
related: YbP7 i8t FD8
related: LWcu ARm NHp
related: usDD Wuh oSU
related: QECF XYN coT
related: fM7t axJ RNN
related: cjHZ KCa 33v
related: VGJ5 gqb i6n
related: Tx6a oCT hvs
related: HtLK Adh Qsy
broad match: C2262

Croupierer och oddssättare m.fl.
type: Concept
in scheme: JobTech Taxonomy - Yrke
definition: Leder olika kasinospel. Säljer spelbrickor och ropar ut nummer under bingospelets gång. Beräknar matematiska sannolikheter och tar fram statistik för oddssättning.
broader: Croupierer och inkasserare
related: aBcd BQi Qyd
related: C4212
related: Tnkg aTP vCV
related: ViJX bdZ Ygf
related: KGfG 5HT T1c
related: sKWc 1r1 yve
related: hYpk RYx y3V
related: 2dWo Gof Pyc
related: Lav8 mDm QRQ
related: wgzB u3o 4ZM
related: sGky Wqy QvZ
narrower: Bingovärd
narrower: Croupier
narrower: Kasinopersonal
narrower: Oddssättare
narrower: Inspector dealer
broad match: ScKy FHB 7wT

Operationssjuksköterska
type: Concept
in scheme: JobTech Taxonomy - Yrke
definition: Operationssjuksköterska ansvarar för patientens omvårdnad före, under och efter en operation eller kirurgisk undersökning. Sjuksköterska är en skyddad titel med legitimationskrav. En operationssjuksköterska med specialistsjuksköterskeexamen får använda benämningen specialistsjuksköterska inom operationssjukvård. Arbetsuppgifterna omfattar att ansvara för och förbereda och kontrollera operationssal, instrument och medicinteknisk utrustning, samt att upprätthålla strikta hygien- och aseptiska rutiner för att förebygga infektioner. Under operationen leder operationssjuksköterskan andra sjuksköterskor och undersköterskor i operationssalen, assisterar kirurgen och övervakar patientens tillstånd. Källa: Arbetsförmedlingen, Högskolan i Borås, Karolinska Universitetssjukhuset, Region Örebro län, Socialstyrelsen, Umeå universitet
broader: Operationssjuksköterskor
related: 3oGz D7u fKD
related: NYW6 mP6 vwf
related: ytRi QuA XLX
related: NCsR SAy nFx
related: NgG1 5qR MDs
related: 9pJh A2H qGE
related: AdDb mgp 77V
related: 1f7B E5K sh3
broad match: C2221

Dekorsnickare/Teatersnickare
type: Concept
in scheme: JobTech Taxonomy - Yrke
definition: Dekorsnickare, även kallat teatersnickare, konstruerar, bygger, förbereder, anpassar och utför underhåll på scenelement som används på scener eller vid inspelning av filmer eller tv-program. I yrket arbetar man med många olika material, såsom trä, stål, aluminium och plast. Arbetet bygger på konstnärliga visioner, skalenliga modeller, skisser och planritningar. Man arbetar i nära samarbete med formgivare och kan även bygga mässmontrar och konstruktioner för karnevaler och andra evenemang. Källa: Arbetsförmedlingen
alternative label: Dekorsnickare
alternative label: Teatersnickare
broader: Fin-, inrednings- och möbelsnickare
related: hYAA Ajt N1F
related: 8too bEs 7NU
related: 9puE nYg crq
related: PaxQ o1G wWH
related: 1pQC nBB hp4
broad match: C7522

Butikssäljare, fackhandel
type: Concept
in scheme: JobTech Taxonomy - Yrke
definition: Säljer sällanköpsvaror i affärer, varuhus och andra försäljningsställen. Informerar kunder om varor och priser samt ger råd om användning och skötsel. Beställer, packar upp, prismärker, fyller på och tar betalt för varor. Hit hör inte Reservdelsspecialist/Bildelsspecialist (7231) Optikerassistent (5224)
broader: Butikspersonal
related: f4z4 xDq bgg
related: M2cJ Jwf ute
related: KG9j WxP ym2
related: 5TwE JEt pWX
related: ib92 FER 3Dd
related: wzAA SXS jz7
related: XxwR 9MV LCy
related: yMbg bQt caE
related: nPhE Q9x sbs
related: tPU1 wJL suB
related: vVXb pYT E1z
related: LEVN eV2 yrf
related: Si9Z xEr pjq
related: nuRM zb9 2wV
related: soG2 nq2 bii
related: wbAz fL9 jgx
related: Y4Rx MXD hws
related: ZwMD W5K sTY
related: Y6jJ tnk HJA
related: 2TTj ZkN aMq
related: Lg8S VBi zQz
related: 5Ne3 Jir 6Ph
related: wJXm pi7 5xW
related: SJdE JXJ vw3
related: Yufg GC2 LXS
related: UssR m8J XA6
related: iKeJ 2nr wzA
related: heEF tHa RJw
related: mb59 QW5 Ho2
related: JLwb cTV Fqp
related: yLGS 738 rt8
related: bPCR BeT Jo2
related: knpH jqV M24
related: GNUT FGM V4z
related: wpc8 XQz R5C
related: DimQ Lfo ndJ
related: S4vL AVu s6q
related: cvBd G8U Wxk
related: L1cE 7rz c6R
related: Sh5W Ha8 cjQ
related: GyDU 16x 48U
related: BQsM qds 7ff
related: s7Ws nCx wtm
related: 8Wtz Hxe Yz2
related: tRt4 sjf YTG
related: C5223
related: Ggsh 4Q4 wrQ
related: Y2VQ P7u GB4
related: 15CG P9S 4vS
related: jWqZ gyq di9
related: tKej gjg Gyu
related: iJUp 1mo igt
related: KJDw DLX RcX
related: agGK Zte X2y
related: papq 5Z4 rqj
related: EL7g UQG QVd
related: SEKb 8gv cAz
related: 7BQm Uvm fcX
related: 39K7 BJ8 FNp
related: oH6C 9w6 dUY
related: B4fG pK5 84H
related: WYMJ xx1 dYK
related: QPQS oPf 9RU
related: wzCn 6o9 xee
related: YUDN n3n tdz
related: zaFd wXf E5Z
related: Td4F YtH u6S
related: mRyD DRC 5tT
related: xrds 8Cq rzm
related: af2G bUf zNz
related: Bc4A Z6e Pq1
related: y71S LsF xLV
related: QLkp kzy iXV
related: i4NX CUm hgF
related: 1Bou FhG MdL

IT-säkerhetschef/IT security manager
type: Concept
in scheme: JobTech Taxonomy - Yrke
definition: Ansvarar för en organisations cybersäkerhetsstrategi och dess implementering för att säkerställa att digitala system, tjänster och tillgångar är tillräckligt säkra och skyddade. Källa: ENISA (European Union Agency for Cybersecurity)
alternative label: IT security manager
alternative label: IT-säkerhetschef
broader: IT-säkerhetsspecialister
related: zSHH RL1 Kky
related: 46y9 y56 uNo
related: epLc SkD cbT
related: TRPL 5av hN9
related: apaJ 2ja LuF
related: hVRc MaQ ZWp
related: CA7f Z9y mCq
related: wBWf EL1 1xi
broad match: C2529

Civilingenjör, kemi
type: Concept
in scheme: JobTech Taxonomy - Yrke
definition: Civilingenjör, kemi
broader: Civilingenjörsyrken inom kemi och kemiteknik
related: CpFD aoS pkZ
related: 6Hq3 tKo V57
related: jNZf Q14 BqP
related: VKBs Xue wfv
related: fM7t axJ RNN
broad match: C2145

Biografmaskinist
type: Concept
in scheme: JobTech Taxonomy - Yrke
definition: Biografmaskinist
broader: Bild- och sändningstekniker
related: 5QVP 4Ua 2na
related: jAJe N1n J5n
related: 9puE nYg crq
related: yhCP AqT tns
related: d1Ao 9bY 7Kn
related: iB5f svE 7BE
broad match: C3521

Trafikvärd
type: Concept
in scheme: JobTech Taxonomy - Yrke
definition: Trafikvärdar arbetar med att ge service till passagerare på stationer, hållplatser och terminaler. Vid arbete på tågstationen kallas yrket främst Stationsvärd, på bussterminaler och inom kollektivtrafik Trafikvärd respektive Taxivärd vid taxistation. Arbetsuppgifterna är ofta varierande, men avser främst att ge service till passagerare. Detta inkluderar bland annat information och vägledning till resenärer, att bistå vid ombordstigning och avstigning samt säkerställa att resenärer hittar rätt färdmedel. Andra arbetsuppgifter kan vara biljettförsäljning, biljettkontroll, hantera trafiklogistik i samråd med trafikledning, upprätthålla ordning bland förare och resenärer samt rapportera regelefterlevnad och avvikelser. Ytterligare arbetsuppgifter kan inkludera att hjälpa resenärer med särskilda behov, hantera enklare störningsinformation och bidra till en trygg och säker reseupplevelse. Se även yrkena Bussvärd, Trafikvakt och Parkeringsvakt. Källa: Arbetsförmedlingen
broader: Resesäljare och trafikassistenter m.fl.
related: UdVa jRr 9DE
related: qnEy cCM VPM
related: 8wR1 QuG b4i
related: sHWP aXJ CHq
related: KEzo ohY rka
related: mjYe 1Gf 96C
related: ASGV zcE bWf
related: EYud iQc vyU
related: Em4j EFB Lw4
related: un7V 4WC deB
related: naLV fHw i48
related: uFS5 1pY 1ER
related: 3v6A uEM pN5
related: eG4d 7sk HHz
related: MM3V 9RL wHp
broad match: C4221

Utvecklingsingenjör, elkraft
type: Concept
in scheme: JobTech Taxonomy - Yrke
definition: Utvecklingsingenjör, elkraft
broader: Civilingenjörsyrken inom elektroteknik
related: 6Hq3 tKo V57
related: oJpj NWm Xwh
related: VPut b9f rVd
broad match: C2151

Universitets- och högskoleadjunkt
type: Concept
in scheme: JobTech Taxonomy - Yrke
definition: Universitets- och högskoleadjunkt
broader: Övriga universitets- och högskolelärare
related: ZfhM VD8 cVi
related: MHUb 2gP UGx
related: sf37 e2C Bqm
related: SQGb fTz QNS
related: aPq9 aww b5w
related: sczL FCS bNW
related: MVqp eS8 kDZ
related: HR1h VU7 VK8
related: dz3T e4P WCg
broad match: C2310

Garderobiär
type: Concept
in scheme: JobTech Taxonomy - Yrke
definition: Garderobiärer, även kallade garderobvaktmästare, tar hand om besökares ytterkläder och accesoarer. Arbetet innebär i huvudsak att ta hand om besökares ytterkläder och andra accesoarer, så som väskor. Kläder hängs upp i en garderob och lämnas ut när besökare ber om det. Klädgarderober finns vanligtvis på restauranger eller tillställningar där ytterkläder inte bör eller fås ta med in. Beroende på arbetsplats kan det även ingå att ta betalt för garderobsservice och ge allmän service till besökare, till exempel hjälpa till med borttappade saker och hittegods. Källa: Arbetsförmedlingen
broader: Vaktmästare m.fl.
related: hEAs 6vG zQ3
related: UdVa jRr 9DE
related: dB1y ffn iHZ
related: Ky3v Yf2 mNa
related: GeEF krm XtA
related: ScKy FHB 7wT
related: 6S3L zPX LXu
broad match: C9629

Akustikingenjör
type: Concept
in scheme: JobTech Taxonomy - Yrke
definition: Akustikingenjör
broader: Övriga civilingenjörsyrken
related: 6Hq3 tKo V57
related: j7Cq ZJe GkT
related: EQRV MTU DzS
related: RsJh Lez Tax
broad match: C2149

Personalutvecklare
type: Concept
in scheme: JobTech Taxonomy - Yrke
definition: Personalutvecklare
broader: Personal- och HR-specialister
related: usge aLF qhF
related: NcmU ikB PTu
related: YWft bBn Jyt
related: mo7X 9N5 d6u
related: X82t awd Qyc
related: pyNJ Xcf xzg
related: hVA6 N2f 2nd
related: bdco F5r XSY
related: spn8 Tpd 6eK
broad match: C2423

Maskinoperatörer, ytbehandling
type: Concept
in scheme: JobTech Taxonomy - Yrke
definition: Styr och övervakar maskiner och utrustning som putsar, pläterar eller ytbehandlar metall eller metallföremål i syfte att öka motståndskraften mot frätning och förslitning, för dekorativa ändamål eller för att ge metall elektriska eller magnetiska egenskaper. Hit hör inte Lackerare (7132) Träförgyllare (7521)
broader: Process- och maskinoperatörer, vid stål- och metallverk
related: VPF1 UZM 9Kd
related: BS77 TnW HWC
related: 3bqR e7r uFs
related: 2pjc Vto TGH
related: JGec TZr qMo
related: QMMu P2D 7os
related: pGts PKK c8W
related: gNrx CYA kZS
related: C8122
related: aF3J SgE uck
related: oZmV VcV sHi
related: qQ61 EQR rcz
related: VTwt 5Fe 6bW
related: R91W 7gr 4bE
related: NH9F mNJ Lz1
related: MHvC fXs YWQ
related: KDzy Hra iVr
related: sbYJ XwB o8X
related: ohUU nf8 B1U
related: Rbju P7i 12U
related: X4EU ZC7 QmK
related: AiwS Mhv ttk
related: s14J jjD yWe
related: uenm 75h fEh
related: MT1a Nyq DGQ
related: dWbY gXC Frx
related: awAG VaE bya
narrower: Maskinoperatör ytbehandling av metall
broad match: wTEr CBC bqh

Hamnkapten
type: Concept
in scheme: JobTech Taxonomy - Yrke
definition: Hamnkapten
broader: Inköps-, logistik- och transportchefer
related: ASGV zcE bWf
related: bh3H Y3h 5eD
broad match: C1324

Containerkranförare
type: Concept
in scheme: JobTech Taxonomy - Yrke
definition: Containerkranförare manövrerar en kran för lastning och lossning av containrar i hamnar. Som containerkranförare manövrerar man en containerkran, på engelska kallat Ship-to-shore Gantry Crane eller STS-kran. Containrar lastas och lossas på och av fartyg med hjälp av containerkran. Kranföraren samarbetar med annan personal i hamnen för att urföra sitt arbete. Kranförar rekryteras och utbildas oftast internt vid hamnar. Källa: Arbetsförmedlingen
broader: Kranförare m.fl.
related: humc xuw qCY
related: j7Cq ZJe GkT
related: HUR5 WxP s4N
related: kNgL kWb YjB
related: Tx7S 3nk Da3
related: vtY3 TC1 Hg6
related: ovhJ CK3 b57
broad match: C8343

Försäkringsutredare, försäkringskassa
type: Concept
in scheme: JobTech Taxonomy - Yrke
definition: Försäkringsutredare på Försäkringskassan arbetar med kvalificerade utredningar inom socialförsäkringen och fattar beslut utifrån lagar och regelverk. Man kan arbeta med olika delar av socialförsäkringen, till exempel assistansersättning eller sjukpenning. Arbetet innebär tät kontakt med de försäkrade för att hjälpa dem att förstå socialförsäkringen och vilka regler som gäller. Man fattar beslut, dokumenterar och kommunicerar. Källa: Försäkringskassan
broader: Socialförsäkringshandläggare
related: X82t awd Qyc
related: Yb1w sSy Rh9
broad match: C3353

Pressekreterare
type: Concept
in scheme: JobTech Taxonomy - Yrke
definition: Pressekreterare
broader: Informatörer, kommunikatörer och PR-specialister
related: X82t awd Qyc
related: vwxR MbC XjW
broad match: C2432

Planeringschef
type: Concept
in scheme: JobTech Taxonomy - Yrke
definition: Planeringschef
broader: Förvaltnings- och planeringschefer
related: ncRb Krk Jdu
related: X82t awd Qyc
related: epLc SkD cbT
related: bh3H Y3h 5eD
related: 7B89 9Ja 8kG
related: j8zr wP4 Gzk
broad match: C1213

Lagerpersonal och transportledare m.fl.
type: Concept
in scheme: JobTech Taxonomy - Yrke
definition: Lagerpersonal och transportledare m.fl.
broader: Yrken inom materialförvaltning m.m.
narrower: Arbetsledare inom lager och terminal
narrower: Lager- och terminalpersonal
narrower: Transportledare och transportsamordnare

Kurator
type: Concept
in scheme: JobTech Taxonomy - Yrke
definition: Kurator ger råd, stöd och vägledning till personer i olika livssituationer för att hjälpa dem hantera sociala och psykosociala problem. Vanliga arbetsuppgifter är att genomföra stödsamtal individuellt eller i grupp, utreda klienters behov, samordna insatser och samarbeta med andra yrkesgrupper och myndigheter. Det kan också förekomma krisbearbetning, handledning av personal och förebyggande insatser för att främja psykisk hälsa och förebygga sociala problem. För att kunna arbeta som kurator förväntas ofta en socionomexamen. Källa: Arbetsförmedlingen, Föreningen Sveriges Kommuner och Regioner
broader: Kuratorer
related: aExL HM4 sJC
related: a2kC CSA VWh
related: GazW 2TU kJw
related: Zpkh iHu QTB
related: bgpk YBu Rja
related: E5ir Die JDw
related: jSE9 2mp k9q
related: HfvF Ezq Wpa
related: nrtC fNv jH6
related: Tz5C 1eK Rax
related: z7S5 oKo MtN
related: kA5T 8hq nhi
related: EmEj jMs YnG
related: FUQb jEW z7L
related: w2ne V5n 9M3
related: Uj3y 3Zp g99
related: HEJU jwj jja
related: TVTr Sdo 4DR
related: vRwS Bvj 2an
related: ereB HrR PUh
related: AwhR sP9 r5h
broad match: C2635

Data Warehouse specialist
type: Concept
in scheme: JobTech Taxonomy - Yrke
definition: Data Warehouse specialist
broader: Mjukvaru- och systemutvecklare m.fl.
related: oCXg Phg FZD
related: apaJ 2ja LuF
related: CrLh Wq1 cKe
related: rJv1 Gfx NXj
related: KT6P hVH LRD
broad match: C2521

Applikationsingenjör
type: Concept
in scheme: JobTech Taxonomy - Yrke
definition: Applikationsingenjör
broader: Civilingenjörsyrken inom elektroteknik
related: 6Hq3 tKo V57
related: kDRm Yaa jAB
related: VD14 X7i Lg9
broad match: C2153

Byggledare
type: Concept
in scheme: JobTech Taxonomy - Yrke
definition: Byggledarens huvudsakliga uppgift är att leda byggprocessen och säkerställa att projektet genomförs enligt avtalade tidsramar, ekonomi och kvalitetskrav. Byggledaren är byggherrens, även kallad beställarens, representant på byggarbetsplatsen. Byggledaren medverkar i upphandling och fungerar som kontaktpunkt mellan entreprenörer, myndigheter och projektledningen. Under byggskedet ansvarar byggledaren för administration, ekonomistyrning och kvalitetssäkring, med fokus på att säkerställa god framdrift genom hela projektet. En byggledare bör ha både byggteknisk kompetens och god förhandlingsvana för att kunna hantera de specifika utmaningarna på byggarbetsplatsen. Källa: Arbetsförmedlingen
broader: Ingenjörer och tekniker inom bygg och anläggning
related: j7Cq ZJe GkT
related: ja7J P8X YC9
related: qi2i YX2 C6b
related: ZjCw 9JF b8s
broad match: C3112

Briefing Officer, luftfart
type: Concept
in scheme: JobTech Taxonomy - Yrke
definition: Briefing Officer, luftfart
broader: Flygledare
related: 5LU4 W6d RQD
related: ASGV zcE bWf
related: n4xU 5ff M4q
broad match: C3154

Maskinoperatör pappersvaruindustri
type: Concept
in scheme: JobTech Taxonomy - Yrke
definition: Maskinoperatörer inom pappersvaruindustri sköter maskiner för industriell tillverkning av pappersvaror. Arbetsuppgifter inkluderar att ställa in, justera och övervaka maskiner under tillverkningsprocess. Övriga arbetsuppgifter som materialtillförsel, kvalitetskontroll, provtagning och enklare maskinunderhåll förekommer också. Beroende på arbetsplats förekommer även truckkörning, lagerarbete och förberedelse för leverans av produkter. somjusterar tillverkningsprocess. Arbetsuppgifer kan vara att lösa produktionsstörningar, utföra provtagning och kontroll av producerade varor samt utföra maskinunderhåll. Beroende på arbetsplats kan även truckkörning ingå. Källa: Arbetsförmedlingen
broader: Maskinoperatörer, pappersvaruindustri
related: joN2 gk5 rS8
related: ULwj Una wFC
related: pshT wjW ZfR
related: CFAS ydd mCW
related: SBrx Rzi wNg
related: Kwbq 6nA VUF
related: MWTk Si6 AqL
related: 27Yk 4q7 rU4
related: JHdh Bwn Aap
related: SPPz uQN SDp
related: dpM4 eS2 nqM
related: gJgU kut erA
related: CW2C Cy9 Q6S
related: VQRf tBX 5nW
related: ytP2 gMS J63
related: wTEr CBC bqh
broad match: C8143

Underhållsanalytiker, elkraft
type: Concept
in scheme: JobTech Taxonomy - Yrke
definition: Underhållsanalytiker, elkraft
broader: Civilingenjörsyrken inom elektroteknik
related: 6Hq3 tKo V57
related: 9Dgc r5a AmY
related: VPut b9f rVd
broad match: C2151

Chief Operations/CO, flygledning
type: Concept
in scheme: JobTech Taxonomy - Yrke
definition: Chief Operations/CO, flygledning
alternative label: CO, flygledning
alternative label: Chief Operations
broader: Inköps-, logistik- och transportchefer
related: ASGV zcE bWf
related: 8aZx 4JB Ev9
broad match: C1324

Naturvårdsingenjör
type: Concept
in scheme: JobTech Taxonomy - Yrke
definition: Naturvårdsingenjör
broader: Specialister inom miljöskydd och miljöteknik
related: kJeN wmw 9wX
related: 4ff1 4gB Dew
broad match: C2143

Utvecklingsingenjör, kemi
type: Concept
in scheme: JobTech Taxonomy - Yrke
definition: Utvecklingsingenjör, kemi
broader: Civilingenjörsyrken inom kemi och kemiteknik
related: CpFD aoS pkZ
related: 6Hq3 tKo V57
related: fM7t axJ RNN
broad match: C2145

Cell- och molekylärbiologer m.fl.
type: Concept
in scheme: JobTech Taxonomy - Yrke
definition: Utvecklar teorier, modeller och metoder som behandlar cellens beståndsdelar och struktur. Samlar in och analyserar cellprover för att studera hur molekyler och system i cellen interagerar, hur olika substanser påverkar cellers utveckling och hur processerna regleras. Studerar funktionerna hos olika delar av arvsmassa. Utvecklar och kvalitetssäkrar mikro- och molekylärbiologiska analysmetoder. Hit hör inte Farmakolog (2133) Biomedicinare (2133)
broader: Biologer, farmakologer och specialister inom lant- och skogsbruk m.fl.
related: Y9Ri R6u 82T
related: vusR W4m dRq
related: DcY9 nMk QsT
related: 6de1 7CM XL6
related: JYKn PRX tif
related: hZDG iqA bka
related: iknU zh1 EzK
related: Nejp cbg 7Xh
related: ARgB D2j 2s5
related: 7PNw YD7 CJZ
related: PryY ETL JEW
related: nA5p Ske 4zb
related: BroT juN Spe
related: PrA4 KwY YcV
related: nBDv ZQf RpH
related: dMEF pvp rFw
related: 9bH5 MYw HbH
related: DnL5 sXM WRb
related: RJ3G xEf vxV
related: DYnx H7B w7z
related: o6h8 hBG QHm
related: c2YE oK3 f1u
related: 6RWb VsD Hmw
related: q76x Dbx vqr
related: wAQ9 vmK Fua
related: 7rqs dJb gjc
related: 17Uy FAd BRr
related: C2131
related: CYVV Vw9 mkS
related: n9EN kBV XrN
related: Nx8H ZET y3g
related: C2265
related: ezVu GhE b3b
related: 5jZo oN5 xFM
related: BC1U Xti GK9
narrower: Bakteriolog
narrower: Bioinformatiker
narrower: Mikrobiolog
narrower: Forskare, genetik
narrower: Nutritionist/Näringsfysiolog
narrower: Immunolog
narrower: Molekylärbiolog
narrower: Forensiker, biologi
narrower: Näringsforskare
narrower: Civilingenjör, bioteknik
narrower: Forskare, cell- och molekylärbiologi
narrower: Genetiker
narrower: Forskare, bakteriologi
narrower: Embryolog
narrower: Toxikolog
narrower: Forskningsassistent, biologi
narrower: Virolog
narrower: Biolog
narrower: Forskare, bioteknik
narrower: Forskare, mikrobiologi
narrower: Forskare, immunologi
narrower: Forskare, virologi
broad match: kJeN wmw 9wX

Konferenschef
type: Concept
in scheme: JobTech Taxonomy - Yrke
definition: Konferenschef
broader: Hotell- och konferenschefer
related: epLc SkD cbT
related: Vsrd g6a hgv
related: bh3H Y3h 5eD
related: ABRJ j6K 1Ma
related: ScKy FHB 7wT
related: D7LR PaQ ddN
broad match: C1411

Steriltekniker
type: Concept
in scheme: JobTech Taxonomy - Yrke
definition: Steriltekniker arbetar med att vårda och sterilisera sjukvårdsinstrument, göra funktionskontroller och paketera instrument. Steriltekniker startar och övervakar desinfektions- och steriliseringsprocesser med hjälp av olika maskiner. Steriltekniker bidrar till att operationer och kirurgiska ingrepp kan utföras säkert och inga vårdrelaterade infektioner uppstår. Källa: Västra Götalandsregionen
broader: Undersköterskor, vård- och specialavdelning och mottagning
related: NYW6 mP6 vwf
related: dscp gNH aTU
related: 3sua z6f 5Y3
broad match: C5321

Installations- och industrielektriker m.fl.
type: Concept
in scheme: JobTech Taxonomy - Yrke
definition: Installations- och industrielektriker m.fl.
broader: Installations- och serviceyrken inom el och elektronik
narrower: Distributionselektriker
narrower: Industrielektriker
narrower: Installations- och serviceelektriker

Städare
type: Concept
in scheme: JobTech Taxonomy - Yrke
definition: Städar och rengör lokaler som t.ex. affärer, bostäder, hotell, industrier, kontor, restauranger och skolor. Städar fordon som t.ex. bussar, tunnelbane- och järnvägsvagnar samt fartyg och flygplan. Hit hör inte Fönsterputsare (9120)
broader: Städare och hemservicepersonal m.fl.
related: 6XRu MQm 4NK
related: C9111
related: GN1z Mve mR4
related: 7NM4 ArB Zy2
related: M8Ht hND Hsi
related: h65W AEU vjL
related: Ljxo 4Zn ygo
related: y4sg zUA mPz
related: BQPp SQs dtc
related: 1sDa 6s5 Wjc
related: x3Z7 Bhq oFv
related: zMmn 1mh 6D5
related: T4gk cvU TWk
related: 5nv3 Ei4 1Xh
related: iu18 YyQ hmh
related: PNwF wJR fmW
related: a7hz cu6 rW2
related: SHkX Qc7 Xx3
related: N9ho NPL JBg
related: PRQR oGE 7re
related: beHF mum ANM
related: S44W QvJ r4m
related: 1AhX Du2 VPY
related: VZ1e t7d Thg
related: M4ei Uvu Ks7
related: AZRV EcW F6Q
related: rr6L J63 yjv
related: iLB3 qb9 a1D
related: C9112
related: GuFR GfS fQ6
related: u1Wz DtQ 1Zm
related: Nxfw cTk qUk
related: fZdk vbt LhP
related: Miuh whd fBh
related: T7dX M3r SDj
related: JJiW W7Z kgc
related: 1eLz WvR kRA
related: aAtJ q2r J5n
related: rwir xvu 443
related: YNMg BHR zZM
related: P6te TBF 8fh
narrower: Fartygsstädare
narrower: Sjukhusstädare
narrower: Cabin stewardess/Hyttvärdinna
narrower: Byggstädare
narrower: Industristädare
narrower: Städare
broad match: whao Q6A ScE

Grundutbildade sjuksköterskor
type: Concept
in scheme: JobTech Taxonomy - Yrke
definition: Behandlar och vårdar samt ansvarar för den medicinska omvårdnaden och läkemedelshantering.
broader: Sjuksköterskor
related: 9ntP jdL 3iG
related: NbjJ WBY FoA
related: TuUX 3Jo wyq
related: 4QAE wtY gJh
related: KA8k U3Q q6h
related: bsQx dCg 52v
related: C1qR L83 nzh
related: F9MX NWR 7CQ
related: hAZR 5Ho Jdw
related: 9Fna GUm HWL
related: Mmxs Qrv cpG
related: 73kE uFW vvT
related: 1eKe zFj QAa
related: 7kSj Wcg 9F3
related: R85L 23s y4M
related: dJa5 Nao mDS
related: mNUF J2A H8c
related: Lqnz Zqw nQ9
related: Phrk 2XZ MWq
related: VnZM dXx wD7
related: F7nJ k5s L29
related: UNoc yo1 ob9
related: zMr8 cTC PCB
related: Ektq nPz 4YF
related: wBPu wTW RgG
related: aS2X 4ZL 9h7
related: MR4H FFT mTj
related: NpcY f4G L1H
related: BvGm Zuj VLF
related: 2GuF gtz xfW
related: rVUL AgV ZTH
related: p2ap C7f WWC
related: C2221
related: GYz6 5Jt Wmy
related: AmSg wbt ZzD
related: 5agw dEi Ag4
related: 5Kym 2ad Pqi
related: jxKr BmN CcQ
related: pGBH BkG qJa
related: FJjr 4pF LEY
narrower: Sjuksköterskestuderande
narrower: Uroterapeut
narrower: Sjuksköterska, grundutbildad
narrower: Stomiterapeut
broad match: NYW6 mP6 vwf

Miljörevisor
type: Concept
in scheme: JobTech Taxonomy - Yrke
definition: Miljörevisor
broader: Specialister inom miljöskydd och miljöteknik
related: kJeN wmw 9wX
related: 4ff1 4gB Dew
related: wtmQ 4M2 1ub
broad match: C2133

Matematiker och aktuarier
type: Concept
in scheme: JobTech Taxonomy - Yrke
definition: Utvecklar och tillämpar matematiska teorier, modeller och metoder. Utvecklar beräkningsmodeller och löser beräkningsproblem. Utformar och förvaltar premie-, pensions- och andra försäkringssystem m.m. Hit hör inte Underwriter (3321)
broader: Matematiker, aktuarier och statistiker
related: bL3H Rpp 8fF
related: e2Bn ric CQZ
related: GRHS 65k hqp
related: Tnkg aTP vCV
related: vfic sMY J8d
related: PCPb DdU pqw
related: NZge Hj3 tP1
related: itDT 5bK hjR
related: 7T35 XRu yXW
related: C2120
narrower: Aktuarie/Försäkringsaktuarie/Försäkringsmatematiker
narrower: Matematiker
broad match: kJeN wmw 9wX

Chefer inom arkitekt- och ingenjörsverksamhet
type: Concept
in scheme: JobTech Taxonomy - Yrke
definition: Chefer inom arkitekt- och ingenjörsverksamhet
broader: Chefer inom IT, logistik, FoU, fastighetsbolag, bygg- och ingenjörsverksamhet samt tillverkning m.m.
narrower: Chefer inom arkitekt- och ingenjörsverksamhet

Affischuppsättare
type: Concept
in scheme: JobTech Taxonomy - Yrke
definition: Affischuppsättare monterar och plockar ned affischer. Arbetet innebär i huvudsak att montera och plocka ned affischer och annat reklammaterial på offentliga platser, såsom köpcentra och bussar. Det är ett relativt fysiskt arbete som utförs både inomhus och utomhus. Källa: Arbetsförmedlingen
broader: Övriga servicearbetare
related: 3HnH nBU 1jM
related: zbpg ZSh rXi
related: UdVa jRr 9DE
related: RPTn bxG ExZ
related: xp85 rYZ ELA
related: spKa cB9 dCu
broad match: C9510

Konsertmästare
type: Concept
in scheme: JobTech Taxonomy - Yrke
definition: Konsertmästare är den främste violinisten i en orkester och fungerar som länken mellan dirigenten och musikerna, med ansvar för att leda stråkinstrumentgruppen och orkesterns tekniska och praktiska arbete. Vanliga arbetsuppgifter är att stämma orkestern inför repetitioner och konserter, leda stråkmusikerna, bestämma stråkteknik, spela solopartier samt koordinera och anpassa arbetet efter dirigentens tolkning. Källa: Arbetsförmedlingen, Malmö SymfoniOrkester
broader: Musiker, sångare och kompositörer
related: 8too bEs 7NU
related: 9puE nYg crq
related: XWW1 PM4 agy
broad match: C2652

Kemitekniker
type: Concept
in scheme: JobTech Taxonomy - Yrke
definition: Kemitekniker
broader: Ingenjörer och tekniker inom kemi och kemiteknik
related: 6Hq3 tKo V57
related: zU2i 2tm TAk
related: 5tyY GjC AcD
broad match: C3116

Serietecknare
type: Concept
in scheme: JobTech Taxonomy - Yrke
definition: Serietecknare skapar tecknade berättelser och bildsekvenser, ofta för publicering i tidningar, böcker, webb och digitala plattformar. Vanliga arbetsuppgifter är att skapa serierutor, skriva dialog och samverka med redaktörer eller författare. Källa: Arbetsförmedlingen
broader: Bildkonstnärer m.fl.
related: 8too bEs 7NU
related: cY8u uvi ZEd
related: 9puE nYg crq
broad match: C2651

Enhetschef, hälso- och sjukvård
type: Concept
in scheme: JobTech Taxonomy - Yrke
definition: En enhetschef inom hälso- och sjukvård leder, utvecklar och ansvarar för en enhets verksamhet, personal, ekonomi och arbetsmiljö. Rollen är både operativ och strategisk och innebär att säkerställa att enheten når uppsatta mål och håller hög kvalitet och patientsäkerhet. I arbetsuppgifterna ingår att följa upp, analysera och rapportera verksamhetens resultat och vidta förbättringsåtgärder vid behov. Källa: Arbetsförmedlingen
broader: Chefer inom hälso- och sjukvård
related: djoJ 5nv ACd
related: u1Jk mHW yMo
related: PVco zJV 9ru
related: NYW6 mP6 vwf
related: TZcA xys UFd
related: epLc SkD cbT
related: fif3 uFW ffh
related: pEcB S8o 8U8
related: bh3H Y3h 5eD
related: KQUX kug Ujm
related: KeWz CZr usk
broad match: C1342

Biolog
type: Concept
in scheme: JobTech Taxonomy - Yrke
definition: Biolog
broader: Cell- och molekylärbiologer m.fl.
related: CpFD aoS pkZ
related: kJeN wmw 9wX
related: GvB1 Crm 1NA
related: 1fAr V18 eSy
related: xXow 1H2 Rrq
related: TXx8 Mgv BGZ
related: 7Sa8 6sV uFf
related: r4rS HmX YpW
related: fM7t axJ RNN
broad match: C2131

Skolassistenter m.fl.
type: Concept
in scheme: JobTech Taxonomy - Yrke
definition: Hanterar personal- och elevregister, diarieföring, arkivering, statistik, posthantering och frånvarohantering vid förskolor eller skolor. Beställer läromedel och förbrukningsmaterial. Assisterar förskolechef eller rektor.
broader: Kontorsassistenter och sekreterare
related: xSLo P6B 2AF
related: S2pg pcs tXu
related: DJgq zBj bKt
related: 7H4j dRM Vbo
related: uic8 7Ar HEA
related: bwjW 1SE XWZ
related: 2FAo yky ogG
related: aUr6 Rjg ja2
related: 3HjW 1BP k3S
related: 3vYj Rhf Voh
related: Uv9y v2g efa
related: Tmps QPE g3V
related: 5WVG LVw ZgL
related: NUC3 y1C Scg
related: t6vN tjT 7JA
related: cw2M p2W SuJ
related: dYqT JBz NZE
related: 5wab aFK gdL
related: US4W Foa CSg
related: Fiq4 siu LXn
related: PVnT yGT SMb
related: qtHa AsU Cfo
related: Nig2 2pU GT8
related: LmAP e75 pc6
related: 7scD 9YP iwV
related: jcpA Zfs nSz
related: RB7E jE5 MZ3
related: 2ZFC 6de YSB
related: B1rc wCc vne
related: C4110
related: w8bU wHe omF
related: 73gL 4uv p9J
related: 1xHU W9z CT9
related: 8u7A ze1 bvd
related: 6Ei3 fZV YKM
narrower: Skolassistent
broad match: X82t awd Qyc

Personbilsmekaniker
type: Concept
in scheme: JobTech Taxonomy - Yrke
definition: Personbilsmekanikern gör felsökningar och utför service och reparationer på personbilar. Arbetet som personbilsmekaniker handlar om att serva, felsöka och reparera lätta fordon, främst personbilar. Man arbetar både med mekaniska och digitala verktyg. Personbilsmekaniker har kunskaper i mekanik, elektronik och IT för att kunna utföra sitt arbete. Fordonsbranschen är teknikintensiv vilket att nya material, metoder och produkter löpande förändrar arbetet för mekaniker. En snabbt ökande andel av bilarna i Sverige utgörs av elbilar. Bilens elektronik är till största delen datorstyrd varför elektronisk test- och mätutrustning är nödvändig. Källa: Arbetsförmedlingen - Hitta yrken, Transportföretagen
broader: Motorfordonsmekaniker och fordonsreparatörer
related: 91TH FX3 o2E
related: n5AP Wt8 cig
related: xbJq U8u Zd1
related: APn5 s5G gTQ
related: EFzD wtS UEs
related: rKzi Tsx Uxx
related: fpzq pB8 akZ
related: ELB7 66R phn
related: bJef 5du gS7
related: 1Aeq ZhN 3hU
related: dSBg PZr 2z1
related: C8gq RJp UcA
related: aXHj 879 YMv
related: ffLz scy WA2
related: nVqr zMY Bsv
related: Z3ws mFJ MBT
related: sLWL 8gv hoa
related: 15CE JQ4 tJL
related: cWUM AD1 y4i
related: 5TEq FgD fkv
related: Sc4a UUK PSR
related: 9YS8 1gw nfB
related: m1NK 3F6 sve
related: 7BWA Mvc J4x
related: hQ51 x3L xeW
related: iDM5 uFU FE1
related: JjeK EBF 9zg
related: smex mZZ g13
related: cFmS NZM qoP
related: 9DLL 8W5 Q1J
related: rTAd kpt 8Mo
related: yhCP AqT tns
related: 7eE4 ijf NWp
related: 9cXQ uZ2 MjB
related: QWG1 eGU QBh
related: pxwK AHZ Rmh
related: Xp1Q AWe rEZ
related: sWty oxv jx5
related: KzTK vq5 JYJ
related: 4b6a zNR uQN
related: pcmW Zmm C4c
related: jr5S F5u rH6
related: Y2MH Px3 VR5
related: z7qp RLA AjZ
related: EtAZ kR1 RAd
related: KdeH Htx ni9
related: MxQW WNX JNW
related: 4HsZ BJB Lsj
related: shMZ N35 3gj
related: KYGh LjP TWj
related: Xitj Snk omM
related: oD7u Wvt AkP
related: PWQW 2fk wzx
related: j6gv foG x26
related: Kzxx phK QSg
related: yDrx Gio GJP
related: hQWy oaB SGy
broad match: C7231

Socialförsäkringshandläggare
type: Concept
in scheme: JobTech Taxonomy - Yrke
definition: Handlägger, utreder och informerar samt fattar beslut om olika socialförsäkringar.
broader: Skatte- och socialförsäkringshandläggare m.fl.
related: uhWZ TgN 3VT
related: zkwp b3X jLZ
related: aMyW hB7 TpU
related: uA7X Pqn n9a
related: TSpk V3M 58x
related: itYU VkH 9RF
related: t59S 14G MhK
related: QAaJ QeY Q6P
related: HYvR JFw C21
related: C3353
related: Qcp3 Ptz 73U
related: 2NaL 4cS T1V
related: 4rSF Rqo pDj
related: 1quq y8e 2xA
related: 3i8p YXT 3B5
related: jeez NbC wXf
narrower: Försäkringsutredare, försäkringskassa
narrower: Försäkringshandläggare, försäkringskassa
narrower: Handläggare, arbetslöshetskassa/Utredare, arbetslöshetskassa
broad match: X82t awd Qyc

Möbel- och inredningsmontör
type: Concept
in scheme: JobTech Taxonomy - Yrke
definition: Möbel- och inredningsmontörer sätter samman komponenter till färdiga möbler och annan inredning. Möbel- och inredningsmontörer sätter samman komponenter till färdiga möbler och annan inredning. Beroende på arbetsplats sker montering i fabrik eller på plats hos kund. Vanliga arbetsplatser är företag som säljer eller hyr ut till exempel kontorsinredning, så som skrivbord, stolar och förvaringsmöbler. Källa: Arbetsförmedlingen
alternative label: Inredningsmontör
alternative label: Möbelmontör
broader: Montörer, träprodukter
related: 6YHo 9Y4 YZw
related: mVWA TLQ Aqg
related: NXjG hxD y3o
related: yLaZ 7xt HUm
related: D1Sd Fj4 oLz
related: wTEr CBC bqh
broad match: C8219

Textilkonstnär
type: Concept
in scheme: JobTech Taxonomy - Yrke
definition: Textilkonstnär skapar konstverk och föremål av textila material såsom tyg, garn, tråd och fiber med fokus på både estetiska och funktionella uttryck. Vanliga arbetsuppgifter är design och tillverkning av textila konstobjekt med hjälp av vävning, broderi, färgning och textiltryck. Textilkonstnären planerar och utvecklar sina projekt från idé till färdig produkt. Det kan också ingå att arrangera utställningar eller samarbeta med andra inom konst- och hantverksområdet. Källa: Arbetsförmedlingen, Konstfack och Nordiska Textilakademin
broader: Bildkonstnärer m.fl.
related: 8too bEs 7NU
related: 9puE nYg crq
related: oxXE LVR T6F
related: sSgV 5dU JXM
broad match: C2651

Stationstekniker, elkraft
type: Concept
in scheme: JobTech Taxonomy - Yrke
definition: En stationstekniker inom elkraft arbetar med provning, drift, service och underhåll av elanläggningar och stationer inom spannet 0,4 till 400 kV. Yrket innefattar arbete med hög- och lågspänningsutrustning som brytare, transformatorer, reläskydd och likströmssystem. Du är delaktig i både ny- och ombyggnationer av ställverk och kraftstationer samt utför kopplingsarbeten och mindre entreprenader. Arbetet kombinerar praktiskt eltekniskt montage med dokumentation och kommunikation om projektets utveckling. Källa: Arbetsförmedlingen
broader: Distributionselektriker
related: hqDB f6P yGe
related: WWbx 1yT hEr
related: yhCP AqT tns
related: DFiv aeo Rmo
related: jmt1 Psh Zfj
broad match: C7413

ST-läkare, reumatologi
type: Concept
in scheme: JobTech Taxonomy - Yrke
definition: Specialisttjänstgöring, ST, är den vidareutbildning som legitimerade läkare genomför för att uppnå specialistkompetens. ST-läkare reumatologi arbetar under handledning för att fördjupa sina medicinska kunskaper och färdigheter med målet att bli specialistläkare inom sitt område. ST-läkaren arbetar självständigt med patientutredningar, diagnostik och behandling, men alltid med stöd av specialister och enligt ett individuellt utbildningsprogram. Vanliga arbetsuppgifter är att ta medicinskt ansvar för patienter, delta i jourverksamhet, genomföra medicinska undersökningar och behandlingar samt dokumentera och följa upp vårdinsatser. Tjänsten omfattar också kontinuerlig kompetensutveckling, sidotjänstgöring inom närliggande områden och aktivt deltagande i handledning och utbildningsinsatser för kollegor och studenter. Källa: Arbetsförmedlingen, Karolinska Universitetssjukhuset, Sveriges läkarförbund, Region Kronoberg, Region Skåne.
broader: ST-läkare
related: NYW6 mP6 vwf
related: UtCj yMj ubw
broad match: C2211

Drifttekniker värmeverk
type: Concept
in scheme: JobTech Taxonomy - Yrke
definition: Drifttekniker vid värmeverk övervakar och underhåller system för produktion av fjärrvärme och fjärrkyla. Drifttekniker arbetar vid värmeverk för produktion av fjärrvärme och fjärrkyla. Vid kraftvärmeverk produceras även el. Arbetsuppgifter innefattar att övervaka drift från ett kontrollrum, utföra rondering för att inspektera utrustning och identifiera eventuella driftstörningar. Driftteknikern genomför också rutinmässigt underhåll, felsökning och åtgärder för att optimera anläggningens effektivitet och säkerhet. Arbetet sker i samarbete med en driftingenjör, vilken styr och övervakar produktionen. Källa: Sobona, Arbetsförmedlingen
broader: Drifttekniker vid värme- och vattenverk
related: MUJT snx 7cg
related: HPKY qWB TKr
related: yhCP AqT tns
related: yMTX 3XU maS
related: UrKr SDh 3Q9
related: MY1P T5j 5y2
broad match: C3131

VVS-montör
type: Concept
in scheme: JobTech Taxonomy - Yrke
definition: En VVS-montör monterar rör, värmepum¬par, värmepannor, varmvattenberedare, element och det som ingår i ett badrum, i bostäder och allmänna byggnader som t.ex. sjukhus, kontor och affärslokaler. VVS-montören kan arbeta med service och har en servicebil med de verktyg och delar som behövs för att utföra jobbet eller på ett bygge och är med från början och bygger från grunden och får oftast samsas med flera andra arbetsgrupper som t.ex. snickare och målare. Yrket har utvecklats med ny teknik, t.ex. används ofta datorer i värme- och kylanläggningar, kvar finns även det traditionella hantverket där en VVS-montör måste kunna läsa ritningar, behärska olika material som förekommer och tänka kreativt för att hitta de bästa lösningarna. VVS-montören får sitt VVS-certifikat efter ett branschprov som avslutar lärlingsanställningen och den teoretiska grundutbildning Källa: VVSYN
broader: VVS-montörer m.fl.
related: wryK eNF 2y5
related: csVL 4B5 xg5
related: QA1t f1n gjM
related: BqKK 4v4 176
related: vBds GZ3 N2A
related: 1onV rFJ mAU
related: j7Cq ZJe GkT
related: irTi k6r Fm2
related: Thzd jiq 7SF
related: Ypn4 TLR Z2Q
related: tvZ5 D14 VLG
related: aJt4 z6N X1X
related: UQtL JVa mbs
related: dTCd beA dDd
related: 52BS j5e Wvk
related: o6D5 imB EMc
related: ja7J P8X YC9
related: Deab dkx G9P
related: ZUNa cut Dwh
related: R1Xy yWs jMb
related: anqH Jqa 8pA
related: unKx 3W3 16Z
broad match: C7126

Taktilterapeut
type: Concept
in scheme: JobTech Taxonomy - Yrke
definition: Taktilterapeut
broader: Terapeuter inom alternativmedicin
related: NYW6 mP6 vwf
related: Uuf1 GMh Uvw
broad match: C3230

Underhållsplanerare
type: Concept
in scheme: JobTech Taxonomy - Yrke
definition: Underhållsplanerare
broader: Ingenjörer och tekniker inom gruvteknik och metallurgi
related: 6Hq3 tKo V57
related: QEzA A6C 5NY
related: aDBS UCw EgA
related: YCdz Hke ijb
broad match: C3117

Placeringsrådgivare
type: Concept
in scheme: JobTech Taxonomy - Yrke
definition: Placeringsrådgivare
broader: Finansanalytiker och investeringsrådgivare m.fl.
related: RbsF qLv jeg
related: LuSq c2D r8u
related: RPTn bxG ExZ
related: X82t awd Qyc
related: SwA7 BKN pip
related: JLhQ LZq bTP
related: bQ7U hk3 7rz
broad match: C2412

Sjukhuspräst
type: Concept
in scheme: JobTech Taxonomy - Yrke
definition: Sjukhuspräst
broader: Präster
related: GazW 2TU kJw
broad match: C2636

Processoperatör bioraffinaderi
type: Concept
in scheme: JobTech Taxonomy - Yrke
definition: Processoperatörer vid bioraffinaderier styr och övervakar industriell tillverkning vid bioraffinaderier. Processoperatörer vid bioraffinaderi styr och övervakar industriell tillverkning av bland annat drivmedelsetanol, biogas och cellulosa. Arbetet sker främst från kontrollrum. Förurom drift och övervakning är andra vanligt förekommande arbetsuppgifter provtagning, kvalitetskontroll, dokumentation, tillsyn och underhåll. En viktig del i arbetet avser säker hantering och processteg enligt instruktioner. Truckkörning är även förekommande. Källa: Arbetsförmedlingen
broader: Processövervakare, kemisk industri
related: yhCP AqT tns
broad match: C3134

Lärarassistent
type: Concept
in scheme: JobTech Taxonomy - Yrke
definition: Lärarassistenter ger administrativt och pedagogiskt stöd i klassrummet och i övriga delar av skolverksamheten, i syfte att avlasta lärare så att de ska kunna ägna sig åt undervisning och uppgifter som hör till undervisningen. Arbetsuppgifterna kan omfatta förberedelse av undervisningsmaterial, dokumentation, närvaroregistrering och att vara ett praktiskt stöd för lärare under lektioner. Lärarassistenter kan finnas som stöd på raster och i handledning av elever enskilt eller i mindre grupper, efter lärarens instruktion. Källa: Skolverket, Arbetsförmedlingen
broader: Elevassistenter m.fl.
related: Jo3g Z7k W58
related: t2AB 7dQ rY5
related: QvUx zt6 HhB
related: MVqp eS8 kDZ
related: WenE yjC 9ho
related: qeuA hXf 2wa
related: DvLw tdL Lzt
broad match: C5312

Butikskonsulent
type: Concept
in scheme: JobTech Taxonomy - Yrke
definition: Butikskonsulenter arbetar ute i butiker för att säkerställa att produkter från ett eller flera varumärken exponeras på ett attraktivt och säljande sätt. Butikskonsulenter arbetar vanligtvis för ett eller flera företag. Arbetsuppgifter inkluderar att fylla på varor, fronta varor, bygga hyllpresentationer, genomföra kampanjer, ge utbildning till butikspersonal och följa upp försäljningsresultat. Källa: Arbetsförmedlingn
broader: Övriga förmedlare
related: RPTn bxG ExZ
broad match: C3339

Museiassistent
type: Concept
in scheme: JobTech Taxonomy - Yrke
definition: En museiassistent har en bred roll och stöttar den dagliga driften av ett museum. Arbetsuppgifterna kan inkludera allt från praktisk hantering av samlingar och utställningar till kundservice och administrativa uppgifter, t ex att katalogisera, arkivera, packa upp och packa ner föremål, samt att se till att de förvaras på rätt sätt. Källa: Sveriges Museer
broader: Arkiv- och biblioteksassistenter m.fl.
related: X82t awd Qyc
related: BqQ1 jAH cLG
related: UB4g Ki2 ADc
broad match: C4415

Inspicient
type: Concept
in scheme: JobTech Taxonomy - Yrke
definition: Inspicient ansvarar för att samordna och leda det praktiska arbetet bakom scenen i teater-, TV- och andra scenproduktioner. Vanliga arbetsuppgifter är att koordinera repetitioner, föreställningar och inspelningar, hantera kontakter mellan regissörer, skådespelare och teknisk personal, samt leda arbetet backstage med scenografi, ljus, ljud och rekvisita. Källa: Arbetsförmedlingen, Malmö Stadsteater
broader: Inspicienter och scriptor m.fl.
related: PMXV yio AMn
related: 8too bEs 7NU
related: 9puE nYg crq
related: 6Au6 tEe Mjy
broad match: C3435

Yrkesfiskare
type: Concept
in scheme: JobTech Taxonomy - Yrke
definition: Yrkesfiskare bedriver kommersiellt fiske. Fiske sker i kust- och havsområden och vissa inlandsvatten. Arbetsuppgifterna inkluderar att sätta och lyfta fiskeredskap såsom trål, garn eller burar, hantera och sortera fångst samt underhålla båt, motor och fiskeredskap. Yrket kräver god kunskap om fiskbestånd, hållbart fiske och gällande regelverk. Fisket kan bedrivas enskilt eller i arbetslag, ofta under krävande väderförhållanden. Yrkesfiskare sköter även ofta försäljning och leverans av fångst. Källa: Jordbruksverket, Havs- och vatten
broader: Fiskare
related: dAkB o3S bKt
related: mPn4 ZgK 2ho
related: Gy5G ZB1 SsX
related: VuuL 7CH adj
broad match: C6222

Naturvårdshandläggare
type: Concept
in scheme: JobTech Taxonomy - Yrke
definition: Naturvårdshandläggare
broader: Planerare och utredare m.fl.
related: ZF64 7Y1 hUW
related: szyr S7C KEo
related: X1aG jwE PKK
related: dQai cWk ZyZ
related: bPiS x1d Ahc
related: X82t awd Qyc
related: kaJZ oMJ bSF
related: RHMf esb Sw1
related: TZe9 NsN uce
related: haqd WKr BnJ
related: itKM 9HR tNo
related: xbj3 oJD 3zB
related: sXU2 TvN mXv
related: JsXX 5Ye KrV
broad match: C2422

Fritidsledare
type: Concept
in scheme: JobTech Taxonomy - Yrke
definition: Fritidsledare planerar, leder och utvecklar fritidsaktiviteter för barn, ungdomar och äldre. Arbetet innebär att vara närvarande, bygga relationer, skapa trygghet och gemenskap samt stötta deltagare i personlig utveckling och samarbete. Fritidsledaren fungerar som förebild och coach, uppmuntrar deltagarna att prova nya saker och bidrar till en meningsfull fritid. Arbetet innefattar också samarbete med kollegor och andra yrkesgrupper, administration, kontakt med föräldrar samt förebyggande insatser mot exempelvis mobbning. Man kan även arbeta med specifika projekt och ha mer av en samordnande roll. Fritidsledare arbetar oftast inom kommunal verksamhet på skolor, fritidsgårdar, dagcenter för äldre eller i föreningar. Källa: Arbetsförmedlingen
broader: Fritidsledare m.fl.
related: Gu83 hq7 Pot
related: yXfb BPp Z6c
related: uhqs R1P D3p
related: ewyM YdG 4pv
related: Wmvr gDD G2S
related: jYu2 26h 1Zb
related: GazW 2TU kJw
related: U67X 3Wz TnP
related: kEkp 5of 2Vk
related: qdp8 yfu UPP
related: QPgf GiL Wu3
related: SKst FiK 4Gv
related: feN5 bm7 4Zq
related: B9wb Vwc VFz
related: nnX6 B6W vjM
related: exPE LKx DuH
related: pjZn UMZ WPH
related: 3S61 oeq c99
related: vV1T ynn c2T
related: aBub GJD deV
related: xy76 m4c JQr
related: FqL3 GDs Lfh
related: HXJt KqJ K2L
related: GbZr 4qp KuW
related: 9N2e Zjw SyF
related: hEnm CJc 94f
related: HkGw N8j bxy
related: ow2B LPT XVk
related: DosM ArY xZ7
related: Thef 9ro t6R
related: Cf21 p2g vJ3
related: 5ARN PB7 vGy
related: MM3V 9RL wHp
related: 5v7h GLe skv
broad match: C3423

Lantbrukare blandad drift
type: Concept
in scheme: JobTech Taxonomy - Yrke
definition: Lantbrukare inom blandad drift bedriver kombinerat växtodling och djuruppfödning på ett lantbruksföretag. Arbetsuppgifter omfattar planering och genomförande av utfodring, skötsel och hälsokontroll av lantbrukets husdjur, så väl som markberedning, sådd, gödsling, bevattning, växtskydd, skörd och lagring av jordbuksväxter. Man kan arbeta både som egenföretagare och som anställd i ett lantbruksföretag. Rollen innefattar ofta många andra arbetsuppgifter, så som underhåll av ekonomibyggnader samt kontakt med leverantörer och kunder. Arbetsuppgifter kan överlappa med andra roller, särskilt på mindre företag. Källa: Jobbagrönt, Arbetsförmedlingen
broader: Växtodlare och djuruppfödare, blandad drift
related: EJNt V1Y ji9
related: 8U7p UrJ 4Ft
related: eiWT iup CTY
related: pe4a Ktg XFx
related: ersH YC7 yZo
related: VuuL 7CH adj
broad match: C6130

Placeringssamordnare
type: Concept
in scheme: JobTech Taxonomy - Yrke
definition: Placeringssamordnare söker och följer upp externa placeringar inom social- och omsorgsförvaltningar, ofta kopplade till områden som funktionsnedsättning, socialpsykiatri och äldreomsorg. Arbetsuppgifter innefattar kartläggning av behov, matchning mellan placeringsalternativ och brukare samt löpande uppföljning av placeringarnas kvalitet och funktion. Placeringssamordnaren samverkar med familjehem, behandlingshem, myndigheter och interna enheter för att säkerställa att placeringarna fungerar enligt mål och regelverk. Källa: Arbetsförmedlingen
broader: Socialsekreterare
related: GazW 2TU kJw
broad match: C2635

Förbundsordförande
type: Concept
in scheme: JobTech Taxonomy - Yrke
definition: Förbundsordförande
broader: Chefstjänstemän i intresseorganisationer
related: epLc SkD cbT
related: bh3H Y3h 5eD
broad match: C1114

Odlingsarbetare trädgård
type: Concept
in scheme: JobTech Taxonomy - Yrke
definition: Odlingsarbetare inom trädgård arbetar med odling av köksväxter, prydnadsväxter och blommor. Odling innefattar bland annat sådd, plantering, omplantering, bevattning, ogräsrensning och växtskyddskontroll. Under skördesäsong innebär arbetet ofta plockning, packning och leverans. Vanliga arbetsplatser är plantskolor och handelsträdgårdar. Arbetet kan både ske i utomhusodlingar och i växthus. Se även yrkena Växtskötare, Plantskolearbetare samt Park- och trädgårdsarbetare. Källa: Arbetsförmedlingen
broader: Trädgårdsodlare
related: k4b7 jz6 NbG
related: K9dP NSH me4
related: iFUU A2a dfo
related: XATX FUj QjU
related: djPa ioN tV6
related: CTs6 2oM Use
related: xCom bE5 PBy
related: EXAF MEN HyQ
related: dvH9 zKx bQN
related: essi JZo Pt7
related: zsmD B3H BpC
related: VuuL 7CH adj
broad match: C6113

Affärsutvecklare
type: Concept
in scheme: JobTech Taxonomy - Yrke
definition: Affärsutvecklares ansvarar för utveckling av affärsdrivande verksamhet och processer. Typiska arbetsuppgifter är att utveckla och optimera vissa processer eller affärsområden, identifiera och ta fram nya produkter eller tjänster eller anpassa befintliga till efterfrågan som finns på marknaden. Analys är en stor del av arbetet och fokus för mål är ofta lönsamhet, innovation, kundnytta och kunder. Affärsutvecklare samarbetar med avdelningar eller affärsområden i verksamheten och har även många externa kontakter. Arbetet är oftast både operativt och strategiskt, en stor del av arbetet sker i olika affärs- och analyssystem samt i digitala kanaler. Källa: Handelsrådet
broader: Lednings- och organisationsutvecklare
related: ayEJ t6B Fte
related: AwPg EbE FX4
related: hAnC Y3p f5K
related: uBns Rdp k5T
related: sXfH wMW bAz
related: RAjB DgD tub
related: HNBr BQq v1w
related: 7LQW iKY nGE
related: rQ4P mXk dT9
related: kfLp g1y JLU
related: FDTd sEu tRr
related: TaXm KJ8 FhM
related: X82t awd Qyc
related: k2H8 yf6 316
related: vw7i 55Q xxT
related: ug8t 3Cs A8k
related: qe3s qYZ FT6
related: YE8T 8vt w94
related: EMcq 5ED VXg
related: LWze V2p gCm
related: 6cTP HjZ sov
related: 4rX5 nzb NjT
related: Wo8D xys Lew
related: 695N nxj 7Wd
related: i1if wjb HAt
related: hhUb xkn 7Ab
related: GHx2 RkU RGS
related: EQPs 7Py q85
related: JGvW vrv 5Ty
related: hEP4 skR 1CM
related: eDmc ZGF YGH
related: h32t Asp yMj
related: kmQd bei CmR
related: 1jXr 3nD 7QS
related: Bcjf 5sT fRa
related: geiA swv kfJ
related: kJ7N xSJ N4S
related: WSrg 6pQ ANT
related: jBMV UHp QBc
related: DQCB V9A q1e
related: JoEd NcG Zav
related: CuSU d7h jhD
related: JEka 9XR pA6
related: sSaQ Q9B kMN
related: y1tB Wek E81
related: MqLx uPt UJr
related: T369 K1b d5M
related: SVfD YoT oFF
related: PWqk iCR opv
broad match: C2421

Företagsrådgivare
type: Concept
in scheme: JobTech Taxonomy - Yrke
definition: Företagsrådgivare
broader: Finansanalytiker och investeringsrådgivare m.fl.
related: RbsF qLv jeg
related: GGWH 9cQ K8Q
related: X82t awd Qyc
related: Uskc 15y rKk
broad match: C2412

Fastighetsassistent
type: Concept
in scheme: JobTech Taxonomy - Yrke
definition: Fastighetsassistent
broader: Fastighetsförvaltare
related: 6Hq3 tKo V57
related: WDoL Rzs 4G1
related: LZt1 f9p G7e
related: t215 jMb oH3
related: uQzL oU2 T1o
broad match: C3334

Organisationskonsult
type: Concept
in scheme: JobTech Taxonomy - Yrke
definition: Organisationskonsult
broader: Lednings- och organisationsutvecklare
related: YWft bBn Jyt
related: X82t awd Qyc
related: Yb1w sSy Rh9
related: Wo8D xys Lew
related: fnhW EBh bfJ
broad match: C2421

Hörselvårdstekniker
type: Concept
in scheme: JobTech Taxonomy - Yrke
definition: Person som utför reparation av hörapparater samt reparation och installation av hörseltekniska hjälpmedel i hem och skolor. Enligt egen utredning.
broader: Tandtekniker och ortopedingenjörer m.fl.
related: 6Hq3 tKo V57
related: 67Gs Ugp NUp
broad match: C3214

Plasmafysiker
type: Concept
in scheme: JobTech Taxonomy - Yrke
definition: Plasmafysiker
broader: Fysiker och astronomer
related: kJeN wmw 9wX
broad match: C2111

Virkesköpare/Virkesinköpare
type: Concept
in scheme: JobTech Taxonomy - Yrke
definition: Virkesköpare/Virkesinköpare
alternative label: Virkesinköpare
alternative label: Virkesköpare
broader: Specialister och rådgivare inom skogsbruk
related: RPTn bxG ExZ
related: WGAZ xaM gUE
related: VuuL 7CH adj
related: wJyM nNx Ujq
broad match: C2132

Orkesterchef
type: Concept
in scheme: JobTech Taxonomy - Yrke
definition: Orkesterchef leder och utvecklar en symfoniorkester. Vanliga arbetsuppgifter är personalansvar för musiker, rekrytering och provspelningar, planering och koordinering av orkesterns verksamhet, arbetsledning och kompetensutveckling samt ansvar för budget och arbetsmiljöfrågor. Orkesterchefen samarbetar med konstnärliga ledare och företräder arbetsgivaren i samverkansprocesser. Källa: Arbetsförmedlingen, Gävle Symfoniorkester, Svensk Scenkonst
broader: Verkställande direktörer m.fl.
related: 8too bEs 7NU
related: 9puE nYg crq
related: KhQ9 r6T Xit
broad match: C1120

Kanslijurist
type: Concept
in scheme: JobTech Taxonomy - Yrke
definition: Kanslijurist
broader: Förvaltnings- och organisationsjurister
related: X82t awd Qyc
related: x4Wi NWW ogB
related: 17K3 fWg 4ff
related: Abcb QtH isZ
broad match: C2619

Bärodlare/Fruktodlare
type: Concept
in scheme: JobTech Taxonomy - Yrke
definition: Bärodlare och fruktodlare odlar och skördar bär och frukt på friland, i växthus eller i odlingstunnlar. Arbetsuppgifter omfattar markberedning, plantering, gödsling, bevattning, växtskydd, gallring, uppbindning, beskärning och skörd av bär och frukt, inklusive druvor på vinodlingar. I arbetet ingår även sortering, packning och lagring av skörden samt underhåll av maskiner, redskap och ekonomibyggnader. Odlingssäsongen planeras utifrån sortval, marknadens efterfrågan och klimatförhållanden. Odlingsmetoder kan variera från småskalig till storskalig produktion och kan kombineras med odling av andra grödor. Arbetet innebär ofta en kombination av handarbete och maskinanvändning. Källa: Gröna arbetsgivare, Arbetsförmedlingen
broader: Odlare av jordbruksväxter, frukt och bär
related: 62Xf rx3 wNJ
related: whmn m4D uWQ
related: Low4 zAr tX3
related: HbUn 5HV ZrS
related: VuuL 7CH adj
related: V25B 1wE 1DW
broad match: C6112

Hantverksyrken inom trä, textil m.m.
type: Concept
in scheme: JobTech Taxonomy - Yrke
definition: Hantverksyrken inom trä, textil m.m.
broader: Yrken inom byggverksamhet och tillverkning
narrower: Skräddare, tapetserare och läderhantverkare m.fl.
narrower: Ytbehandlare, trä och möbelsnickare m.fl.

Elektronikkonstruktör
type: Concept
in scheme: JobTech Taxonomy - Yrke
definition: Elektronikkonstruktör designar elektroniska system, kretsar och komponenter, ofta med hjälp av CAD-program. Elektronikkonstruktör skapar tekniska ritningar, scheman och annan dokumentation för att beskriva designen och produktionen. Det kan även innebära att vara involverade i att skapa prototyper av produkter för att testa och verifiera funktionen. Elektronikkonstruktör hjälper till med att felsöka och testa elektroniska system för att säkerställa att de fungerar som de ska. Källa: Arbetsförmedlingen
broader: Ingenjörer och tekniker inom elektroteknik
related: s27u 1Zz CGy
related: 6Hq3 tKo V57
related: Ex79 E8G 8fW
related: uYAb VwU EGb
related: cwm8 LUA rCf
related: SvAW coW dGN
related: KWNv oWK 5E2
related: Wtv2 FDg 4xh
related: 4r1S YQV 2zP
related: Cphg xxs rAF
related: vxcR j7Y CGF
related: T2kN Gdg 8Q1
related: C41S vox 2gE
related: Co6J hfK WQZ
broad match: C3114

Kostrådgivare
type: Concept
in scheme: JobTech Taxonomy - Yrke
definition: Kostrådgivare ger rådgivning och stöd till individer för livsstilsförändringar med fokus på kost och hälsa. Arbetsuppgifterna omfattar samtal för att motivera och guida till hälsosammare matvanor, analysera kostregistreringar, samt planera förändringar utifrån individens förutsättningar. Kostrådgivare tillämpar metoder för beräkning och analys av energi- och näringsvärde samt bedömer kostens påverkan utifrån hälsa, prestation och miljö. Källa: Branschrådet för hälsa, Arbetsförmedlingen
broader: Friskvårdskonsulenter och hälsopedagoger m.fl.
related: GazW 2TU kJw
broad match: C3423

Civilingenjör, kvalitet, kemiteknik
type: Concept
in scheme: JobTech Taxonomy - Yrke
definition: Civilingenjör, kvalitet, kemiteknik
broader: Civilingenjörsyrken inom kemi och kemiteknik
related: URmQ CnY QK7
related: dVjD g4V 7hA
related: AtPP RgP PuR
related: Hfg4 e6Q tL6
related: 6Hq3 tKo V57
related: uFSD ZDy QaZ
related: GrCu LeV tyL
related: Cuqg bdr ZxQ
related: q57E v9W Fju
related: W3rj 3KL 5k7
related: ZbU8 LHh 92U
related: 6Q4r 1Wm rf9
related: w5WE UNP jrY
related: TkUb zbB axJ
related: ZYkR iLg 2uk
broad match: C2145

Processoperatör papper
type: Concept
in scheme: JobTech Taxonomy - Yrke
definition: Processoperatörer inom pappersindustri styr och övervakar tillverkning av färdigt papper, kartong och papp. Arbetet sker från operatörsrum där man följer och justerar tillverkningsprocess. Arbetsuppgifer kan vara att lösa produktionsstörningar, utföra provtagning och kontroll av producerade varor samt utföra maskinunderhåll. Beroende på arbetsplats kan även truckkörning ingå. Källa: Arbetsförmedlingen - Hitta yrken
broader: Processoperatörer, papper
related: eh38 vsD mur
related: i9cX khm zUN
related: 7vEn Zyk 5p6
related: Ly75 nWC 2mN
related: ezhd 1ij RSC
related: K3gB xaF Qej
related: Jky2 ert cko
related: jA5Z cEz JrG
related: muGg 1Tx onW
related: u8yo BSS nPJ
related: qjJW a3i dSB
related: wTEr CBC bqh
related: y88b 5Bw iHP
broad match: C8171

Industrielektriker
type: Concept
in scheme: JobTech Taxonomy - Yrke
definition: Installerar, underhåller och reparerar elektriska anläggningar i exempelvis industrilokaler. Underhåller och utför felsökning av utrustningar som styr olika processer inom industrin. Felsöker och reparerar elsystem i fordon, flygplan och på fartyg. Hit hör inte Distributionselektriker (7413) Installationselektriker (7411)
broader: Installations- och industrielektriker m.fl.
related: 7qAg AP3 WwV
related: ZG3L BCe WYv
related: JYAn p1X 6sb
related: FqWP 6FQ Wz5
related: XNLN wwW x6h
related: wBLK nWZ 7ek
related: 42Zw EBR Yu7
related: fJdB viK AaA
related: YVDE 9ZG gfE
related: iU2t rNR YFX
related: aHCV VsV LiD
related: tqRJ 2Ds GJG
related: rmuF Dce PPS
related: ax2t Yyg 2Sy
related: fjyp Sft A2M
related: eVwv pwi 6Gj
related: dgwT VhN kVh
related: LDpW xuo jZp
related: 8ZhW wNv 5k9
related: zMmn 1mh 6D5
related: 1YZS 1ch vDZ
related: FmHS DMU bcA
related: PELm cH9 AE9
related: Q7eC B7g QiU
related: pirE EKx TV4
related: GUw2 Ek8 CY7
related: 4qzk GDo 1ow
related: vQTv Fio W9o
related: 73yg gLU Y3s
related: CGse R52 oTM
related: moJc yZC sjN
related: hxAR yMs 9Z9
related: NQVA bUW n1F
related: fjoN ZHr XG4
related: PRQR oGE 7re
related: fhcp fFw Lbj
related: S44W QvJ r4m
related: 8pwJ sfn cAx
related: nkhA jPz pcE
related: dW6y neZ EFs
related: TKAU zFL fd3
related: ynWd oCo o61
related: 5JSC d5R Em9
related: M4ei Uvu Ks7
related: C7412
related: eojD i4f 4f6
related: GCYi 9tC 1pP
related: Uya4 Qvw hmw
related: c14d Mgx MFA
related: WLAi BDr 5fW
related: zYzY NTD VoE
related: KymG vW5 bjG
related: KfEn V5y npV
related: jP5Q FH2 Xb1
related: Nxfw cTk qUk
related: EnWr NZH zoz
related: AEgv 4gP ndv
related: HxYt DAb sK2
related: wJuu o2B q7L
related: Sbs4 dpg Y2B
related: JJiW W7Z kgc
related: kzto Ymy cPC
related: pSTA VfB 7eA
related: wZpC X9a xzG
related: MT1a Nyq DGQ
related: aAtJ q2r J5n
related: 4mNF 7vZ vCx
related: xShN Vkr s7D
related: P6te TBF 8fh
related: Uytu hWi 5nh
related: S7LZ tzK qSg
related: ZTk2 7eo CUb
related: bG9S mns 7q9
related: S19v XVu iL8
related: jZzL yV6 PmA

Djursjukskötare och veterinärassistenter
type: Concept
in scheme: JobTech Taxonomy - Yrke
definition: Djursjukskötare och veterinärassistenter
broader: Yrken med krav på högskolekompetens eller motsvarande inom hälso- och sjukvård samt laboratorium
narrower: Djursjukskötare m.fl.

Civilingenjör, forskning inom bygg och anläggning
type: Concept
in scheme: JobTech Taxonomy - Yrke
definition: Civilingenjör, forskning inom bygg och anläggning
broader: Civilingenjörsyrken inom bygg och anläggning
related: j7Cq ZJe GkT
related: anYS 5AR JRk
broad match: C2142

Länsbibliotekarie
type: Concept
in scheme: JobTech Taxonomy - Yrke
definition: Länsbibliotekarie
broader: Övriga chefer inom samhällsservice
related: epLc SkD cbT
related: bh3H Y3h 5eD
related: 9puE nYg crq
broad match: C1349

Pizzabagare m.fl.
type: Concept
in scheme: JobTech Taxonomy - Yrke
definition: Bakar pizzor och tillreder andra maträtter exempelvis på pizzeria eller gatukök.
broader: Snabbmatspersonal, köks- och restaurangbiträden m.fl.
related: DmFL vHQ j7e
related: Dywf BPg usG
related: dNA9 T9K JXF
related: C9411
related: Dxqv 2WA TYt
related: dmi6 Jfs pso
related: 8kEC R2V CcV
related: 1Zwa X6Q Dyk
related: 1abT LRk fg2
related: xgpz 5A1 B2g
related: hYpk RYx y3V
narrower: Gatuköksbiträde
narrower: Grillkock snabbmat
narrower: Pizzabagare
broad match: ScKy FHB 7wT

Borrledare, petroleumutvinning
type: Concept
in scheme: JobTech Taxonomy - Yrke
definition: Borrledare, petroleumutvinning
broader: Ingenjörer och tekniker inom gruvteknik och metallurgi
related: 6Hq3 tKo V57
broad match: C3117

Fritidsledare m.fl.
type: Concept
in scheme: JobTech Taxonomy - Yrke
definition: Planerar, organiserar och leder fritidsverksamhet för barn, ungdomar och äldre på fritidsgårdar, föreningar, organisationer, företag, inom äldreomsorg eller församlingar.
broader: Idrottsutövare och fritidsledare m.fl.
related: pni3 zFs Gzi
related: kb9z LG1 CZE
related: FkEt JyE oJ7
related: 1gdf dsH cFZ
related: TKBk pkx 4He
related: LK7B LX7 vjo
related: iknU zh1 EzK
related: TsH1 ePz fpf
related: ny4K VqD Kbj
related: ooLP cHi X9L
related: gPrk b7K vXy
related: TWVh dKc MK4
related: Qecp WbB vyj
related: Aq3e Bdv v45
related: noNn 1sa PEt
related: Dw5E saX brz
related: Ni1Z NRJ dzs
related: XZbe Z7P jiL
related: tF2o oZj kqE
related: w2ok LT3 BXa
related: L1Xk Q2g 1zm
related: Uebh 9f1 YJy
related: irju S7Y Xbr
related: C4Cp CmY QJh
related: C3423
related: 9CLK TYc cud
related: mpL2 UvN LnK
related: hLkC wwg kmg
related: wJyX enH EP1
related: 9VJ1 rdc oCi
related: MTEU oaF 9CD
related: tbnD CoQ 2b9
related: yRaA b6w MJP
narrower: Församlingspedagog
narrower: Fritidsledare i församling
narrower: Assistent i församlingsarbete
narrower: Fritidskonsulent
narrower: Fritidsledare
broad match: GazW 2TU kJw

Civilingenjör, lantmäteri
type: Concept
in scheme: JobTech Taxonomy - Yrke
definition: Civilingenjör inom lantmäteri arbetar med att mäta, kartlägga och analysera mark, fastigheter och byggnader. Arbetsuppgifterna omfattar fastighetsbildning, detaljplanering, geodatahantering, utveckling och uppdatering av kartor samt rådgivning kring markanvändning och samhällsplanering. Civilingenjören genomför fältmätningar, bearbetar geografisk information digitalt, planerar markanvändning och samverkar med myndigheter, företag och privatpersoner. Tjänsten innebär även att utvärdera och tolka flygfoton, satellitbilder och övrig mätdata samt medverka vid avtal och förhandlingar kring fastighetsfrågor. Arbetsrollen kombinerar teknik, juridik och ekonomi samt kräver både fältarbete och kontorsarbete. Källa: SACO, Lantmäteriet, Lunds tekniska högskola
broader: Lantmätare
related: X82t awd Qyc
related: kzpd qqP fmB
broad match: C2165

Specialistläkare, allmänmedicin
type: Concept
in scheme: JobTech Taxonomy - Yrke
definition: Specialistläkare, allmänmedicin är en specialiserad legitimerad läkare med en djupare kunskap och kompetens inom sitt område. Specialistläkare är en skyddad titel och bara den som har bevis om specialistkompetens får kalla sig specialist i sin specialitet. Specialistläkare ansvarar för att diagnostisera, behandla och förebygga sjukdomar inom sin specialitet. Vanliga arbetsuppgifter är mottagningsarbete med patientbesök, rondarbete på avdelning, handledning av yngre läkare samt konsultationer till andra yrkesgrupper och specialiteter. Specialistläkare ansvarar även för att följa och leda utvecklingen inom sitt medicinska område och utför omfattande medicinsk dokumentation och administration. Källa: Arbetsförmedlingen, Karolinska Institutet, Socialstyrelsen, Sveriges Kommuner och Regioner, Sveriges läkarförbund
broader: Specialistläkare
related: yr6a UxY KZk
related: NYW6 mP6 vwf
related: qSbw XHD Ycd
related: TChC u37 rt2
related: k9UU Jyh iSw
related: EBX9 7gC eLt
related: vFjb AHi a54
related: jFHU uSj 4ke
related: KALC VvK 17U
related: vhaA jS2 C9x
related: QSeQ MpU wpW
related: 89LR AwA UqR
broad match: C2212

Socionom
type: Concept
in scheme: JobTech Taxonomy - Yrke
definition: Socionom är en yrkestitel för den som har socionomexamen, och det är en bred utbildning som ger behörighet till många olika yrkesroller inom socialt arbete. En socionom arbetar med socialt arbete och har som huvudsaklig uppgift att ge stöd, hjälp och vägledning till människor i olika livssituationer, ofta när de befinner sig i utsatthet eller behöver förändra sin livssituation. Socionomer kan arbeta inom en rad olika områden och roller, till exempel som socialsekreterare, kurator, biståndshandläggare, familjerådgivare, inom äldre- och handikappomsorg, kriminalvård, skola eller ideella organisationer. Källa: Arbetsförmedlingen, SACO, Stockholms universitet
broader: Socialsekreterare
related: bqoN BCy RVq
related: Nj9T X6B yU6
related: J8mY Jru 4hG
related: zXQ5 zG5 1xS
related: v5gi Qw7 zV7
related: iwYg Wkm BaS
related: D6qb nn9 mm9
related: JHSM jJM DWa
related: ffMR DPG xst
related: ieHX 7ac 4vW
related: Z7tu RDd 6A3
related: 9VQA X2Q U7T
related: VwPV 4KH GCo
related: GazW 2TU kJw
related: iyZQ dYA rrx
related: rAiU du5 TFg
related: hMfi yxJ reK
related: sbfS eFt dip
related: TQ3Y EKP Vyq
related: CytA Ay3 4Pt
related: FEQD PnT 3ig
related: Qgf6 D5b kaW
related: 9fEG RSg 9hn
related: f4PH oQZ YM8
related: Xp6v yRY n8x
related: ckyp qmj wjj
related: cup9 yGh ZF6
related: 3TJC mke Eqy
related: N8Un uRg wXh
related: iHFe WLN SMi
related: C4qL CZF PWN
related: R1T1 xM6 jm6
related: kwpH EcP gQG
related: PHJZ uFa nkn
related: hsX3 8jV yVW
related: JC6k 3uE UEW
related: f6Wj KEu hst
related: EFWW 9Sz 4L5
related: MwJP HL9 rUL
related: Y8MW Dbi kGu
related: 9ryJ pin Sis
related: hF3K 4FT HjR
related: tjes UnB ZFk
related: CRJB PKn gxL
related: 7dSE thJ Af7
related: 4A6N ZPh jXm
related: akY4 ErS YQB
related: ecgK 6X9 45B
related: Pc4e Uyg tMV
related: TCRj Etr NPi
related: 9yju cWp RCD
related: DpaV UG4 bDB
related: 52R8 HcD 8jc
related: Y51B Dda ndj
related: 98L4 ryR T1j
related: uC8g KRW Yry
related: qUsJ dJ2 169
related: ns4y iJ6 eBy
related: Tbtb uVp ZB2
related: e9MT 1GQ bEF
related: Lg3T DGm k1e
related: V8my 9Qv wRU
related: 1Tg9 tSY x6v
related: ggJ3 5FY 8V1
broad match: C2635

Mönsterkonstruktionsassistent
type: Concept
in scheme: JobTech Taxonomy - Yrke
definition: Mönsterkonstruktionsassistent
broader: Skräddare och ateljésömmerskor m.fl.
related: nuYq ze9 XAX
related: kqau D4r 4fE
related: PaxQ o1G wWH
broad match: C7532

Yrken med krav på högskolekompetens eller motsvarande inom IT, ljud- och ljusteknik m.m.
type: Concept
in scheme: JobTech Taxonomy - Yrke
definition: Yrken med krav på högskolekompetens eller motsvarande inom IT, ljud- och ljusteknik m.m.
broader: Yrken med krav på högskolekompetens eller motsvarande
narrower: Bild-, ljud- och ljustekniker m.fl.
narrower: Drift-, support- och nätverkstekniker m.fl.

Musikinstrumentmakare och övriga konsthantverkare
type: Concept
in scheme: JobTech Taxonomy - Yrke
definition: Utför övrigt arbete inom finmekanik och konsthantverk än inom 7311-7312. Exempel på arbetsuppgifter: Tillverkar, reparerar och stämmer musikinstrument. Tillverkar bruks- eller prydnadsföremål av glas, keramik, trä, halm, garn, läder, sten, horn m.m. på hantverksmässigt sätt. Slöjdar, täljer, stickar, broderar, väver, knypplar etc.
broader: Finmekaniker och konsthantverkare m.fl.
related: gwkj bjE 1Kj
related: 6Ko1 83Q 2Tf
related: tFaJ a6p PFP
related: wjwY 9wu nUH
related: 3qke qKV BMk
related: auBB 2b4 FV5
related: 9bUZ 8ez RqS
related: hKvn pif W3d
related: Qg8J Y3i sW3
related: EmPd sYg gz3
related: M5f1 xKf eN9
related: 3Wyn 9XD 7KC
related: iUC3 EuQ nPd
related: TDBP nyK iKL
related: aHCV VsV LiD
related: JGec TZr qMo
related: 1Zae yeU Rvn
related: wChN 7nd SFk
related: ZquN fRR SeX
related: EgKX hJK QXW
related: Lbay sxT ecP
related: iyJw JGa E8x
related: w8NU 5VT um5
related: C7318
related: wvPt 3SZ B69
related: C7316
related: sZpK 32h kP5
related: JpuU BdH xpt
related: bvkC EXE s66
related: sz2m Qr5 TGP
related: i9fn XPE R1K
related: SxZy 3gn xFg
related: M5XE jrH Nya
related: VbMZ dtZ q7d
related: AoDq myk Q2c
related: C7314
related: MZBs 1JW bwV
related: yax8 gqV zWi
related: JicT TuW wa9
related: U1Sv Vr1 2Qz
related: N9hd jGt BQJ
related: C7319
related: tZ5p xTP DTx
related: U5w7 jZt E2N
related: JxYa BwX Bjy
related: C7312
related: t7W6 z2g 1mv
related: C7315
related: i7C3 SGF iyc
related: usHp qT7 1Tr
related: 9pbg Tmp 2m4
related: bP5N ekQ V9Y
related: itNP 1RB zbj
related: ZLR1 9go yF3
related: bU9D LiX wuY
related: Geqz 5PD Mrw
related: ztus Zgk K8j
related: Eiuj DZF BeB
related: TJ8G gZg 5tL
related: GQ6T 5zY 6C1
related: GUEj nmk EnB
related: yQUA ck9 2Ji
related: oura s7r eut
related: fpja yMN 6y9
related: r3An KPy x4G
related: FGsT 5Xi 2rR
related: 2XGY TET niQ
related: hGQs KwA hhj
related: 1cFK b3Z 9rk
related: 2Ysy iaq atg
related: C7317
related: 5pUD Jvh xqS
related: Z3nB Ecc B6h
related: pErc Mnn xQm
related: ngu7 WqK e2E

Brevbärare
type: Concept
in scheme: JobTech Taxonomy - Yrke
definition: Brevbärare sorterar och delar ut post och paket till mottagare inom ett bestämt område. Arbetsuppgifterna omfattar att hämta, sortera och leverera försändelser med hjälp av bil, cykel, moped eller till fots, beroende på område och rutt. Brevbärare arbetar ofta självständigt och utför sina arbetsuppgifter utomhus i varierande väderförhållanden. Arbetet innebär fysiskt aktivitet och kan omfatta tunga lyft. Källa: Arbetsförmedlingen
broader: Brevbärare och postterminalarbetare
related: UdVa jRr 9DE
related: xn6H ksq PLV
related: ASGV zcE bWf
related: FQrs nBT FvH
broad match: C4412

Överdirektör
type: Concept
in scheme: JobTech Taxonomy - Yrke
definition: Överdirektör
broader: General-, landstings- och kommundirektörer m.fl.
related: epLc SkD cbT
related: bh3H Y3h 5eD
broad match: C1112

Motorelev, fartyg
type: Concept
in scheme: JobTech Taxonomy - Yrke
definition: Motorelev är en nybörjarbefattning i fartygets maskinavdelning. Motoreleven arbetar med drift, underhåll och reparationer i fartygets maskinavdelning under uppsikt av handledare. För att arbeta som motorelev krävs Basic Safety Källa: Satsa på sjöfart
broader: Underhållsmekaniker och maskinreparatörer
related: dRFw Rcu dX7
related: gs65 ynn fcr
related: ynFn k8s Em6
related: ASGV zcE bWf
related: XouD cCj HZN
related: yhCP AqT tns
broad match: C7233

Teckenspråkstolk/Dövblindtolk
type: Concept
in scheme: JobTech Taxonomy - Yrke
definition: Teckenspråkstolk/Dövblindtolk
alternative label: Dövblindtolk
alternative label: Teckenspråkstolk
broader: Översättare, tolkar och lingvister m.fl.
related: MQxT hpL qqy
related: 95UG kDi BQY
related: zR8J 5Pw Gqk
related: cspa Mji BMS
related: 9puE nYg crq
related: S5qg gKk 2UF
related: CbCc dC7 XJN
broad match: C2643

Ljustekniker
type: Concept
in scheme: JobTech Taxonomy - Yrke
definition: En ljustekniker är en yrkesperson som ansvarar för att rigga, justera och hantera ljusutrustning inför och under en föreställning, konsert, filminspelning eller annan liveproduktion. Ljusteknikern arbetar praktiskt med att sätta upp, programmera och underhålla ljusutrustningen, och ser till att ljussättarens design genomförs korrekt på scen eller inspelningsplats. Ljustekniker finns inom teater, film, tv, konserter och andra liveevenemang, där de ofta samarbetar nära med ljussättare för att säkerställa att ljusdesignen fungerar som planerat. Källa: Stagepool
broader: Ljus-, ljud- och scentekniker
related: u7zK VKN 8Ht
related: 8too bEs 7NU
related: 9puE nYg crq
related: yhCP AqT tns
related: d1Ao 9bY 7Kn
broad match: C3435

Kyrkogårdsarbetare
type: Concept
in scheme: JobTech Taxonomy - Yrke
definition: Kyrkogårdsarbetare sköter och underhåller kyrkogårdar och begravningsplatser. Arbetsuppgifterna inkluderar gräsklippning, häckklippning, ogräsrensning och allmän grönyteskötsel. Plantering och vård av blommor, buskar och träd förekommer också. Särskilt för yrket är skötsel och grävning av gravar. Beroende på arbetsplats kan det även ingå att hjälpa till vid gravsättningar. Källa: Arbetsförmedlingen
broader: Trädgårdsanläggare m.fl.
related: j7Cq ZJe GkT
related: bNGW pCK idv
related: db47 pvA AoU
related: KMYm Swy 7Lm
related: VuuL 7CH adj
broad match: C6113

Mäklare inom finans
type: Concept
in scheme: JobTech Taxonomy - Yrke
definition: Köper och säljer för kunders räkning valuta, aktier, optioner, obligationer, stadsskuldväxlar och andra värdepapper.
broader: Banktjänstemän och redovisningsekonomer m.fl.
related: f8or GuS bxL
related: aSt1 LXQ MCx
related: gPan jwg TFf
related: vD77 b9G AEe
related: YTUj vai cLw
related: JjS2 Ydq YzA
related: pAcX ugi X4j
related: Zh3x tjz rHy
related: 4eqV qmr T5t
related: k9Nm QoR adg
related: R58v 7Db Z6h
related: H89g Bxx cV9
related: zzSp k6L WgN
related: iAvB Z7P qyX
related: 4uf3 dsw Cy8
related: nfdN dwW 6PE
related: g2NT MEv e91
related: ZkjX Hk2 Cty
related: jotv Rzp qzL
related: Txr9 WCt 9Z5
related: k4De 7U3 wS7
related: C3311
narrower: Aktiemäklare
narrower: Penningmarknadsmäklare
narrower: Valutahandlare
narrower: Kundmäklare
narrower: Valutamäklare
narrower: Institutionsmäklare
broad match: X82t awd Qyc

Informatör/Kommunikatör
type: Concept
in scheme: JobTech Taxonomy - Yrke
definition: Informatör/Kommunikatör
alternative label: Informatör
alternative label: Kommunikatör
broader: Informatörer, kommunikatörer och PR-specialister
related: p9Vv UZu jG8
related: 7jcM hjn UM1
related: ARpo Mv6 cJ5
related: wtfH efq jQG
related: UbG4 uMv f1A
related: e3Hk Tin Ugu
related: 9wc2 j8q Wc4
related: 4qMT 8Lt U7q
related: xPR4 dKA 9LZ
related: t4UW HeU Xmk
related: AtfB eXo yXm
related: 58yt Vui Zx1
related: A57x 83k qcN
related: adHg Ypk Ccs
related: fosB Pgr 3x9
related: BJwx zwG Zz1
related: aCCc yWt 1zr
related: X82t awd Qyc
related: hSpM D7g 9A5
related: 8s4g fMS QcD
related: rYwo PCq NJN
related: rpNb 9LH C8k
related: Yukm yii kd7
related: kPtJ 6LU 9Gw
related: XxB1 VsV 5LQ
related: VSbg 2dm z8r
related: Yb1w sSy Rh9
related: cbEe zjJ oJL
related: rzfW mWw Uwp
related: vvbz WB1 r22
related: omQF u4U mqb
related: XGKr AAj tQo
related: 3USu 81C bHS
related: gqJW ggC NXc
related: oBG8 Y2k cXm
related: w7mF mJg XH1
related: FBZ6 rAs oK9
related: vwxR MbC XjW
related: MLac DCZ AuT
related: hBvs 34x Fy6
related: hLLv 2Fo efw
related: SbWf wak 7J3
related: VPWR 495 vQs
related: 6LXn 7Wc xbq
related: UHc4 j2K 6Rx
related: VnEW 5eX Bvu
related: J6gw 1K7 dvw
related: w7Yv 7vA pd2
related: JPM7 DLw k4G
related: hYrx mvW REq
related: g9TF p7F SGs
related: Lv8c 5hC aGZ
related: xi4m Sie 36s
related: Qse3 VXz 7Hn
related: Mrvk 1cW QxR
broad match: C2432

Maskinoperatörer, påfyllning, packning och märkning
type: Concept
in scheme: JobTech Taxonomy - Yrke
definition: Styr och övervakar maskiner som tappar på flaskor, försluter, emballerar, packar, väger samt märker och fäster fraktsedlar m.m. på produkter, förpackningar och behållare. Hit hör inte Handpaketerare (9320) Varumärkare (9320)
broader: Andra process- och maskinoperatörer
related: VPF1 UZM 9Kd
related: 2pjc Vto TGH
related: fuFA Qda mVx
related: vxPE JG2 5Kz
related: pGts PKK c8W
related: qQ61 EQR rcz
related: bwCe tVQ dZ3
related: KDzy Hra iVr
related: sbYJ XwB o8X
related: C8183
related: Rbju P7i 12U
related: X4EU ZC7 QmK
related: AiwS Mhv ttk
related: ry2Y iBU iNx
related: BKYD AEo maF
related: QXtH PsM npR
related: uenm 75h fEh
related: MT1a Nyq DGQ
related: dWbY gXC Frx
narrower: Emballerare
narrower: Maskinoperatör förpackning och påfyllning
broad match: wTEr CBC bqh

Församlingspedagog
type: Concept
in scheme: JobTech Taxonomy - Yrke
definition: En församlingspedagog arbetar inom Svenska kyrkan och har som huvuduppgift att bedriva pedagogiskt och kristendomsdidaktiskt arbete. Detta innebär att undervisa, berätta och samtala om tro, samt att utveckla lärandet och undervisningen i församlingen i samarbete med anställda och medlemmar. Församlingspedagogen har ofta kontakt med barn, ungdomar, konfirmander och föräldrar och kan arrangera läger, kurser och seminarier. Källa: Svenska kyrkan
broader: Fritidsledare m.fl.
related: dct4 2KA ppu
related: PKAy 1hP Vqn
related: SEFy tZb 1p6
related: GazW 2TU kJw
related: SKst FiK 4Gv
broad match: C3423

Kiropraktorer och naprapater m.fl.
type: Concept
in scheme: JobTech Taxonomy - Yrke
definition: Undersöker, diagnostiserar och behandlar i syfte att återställa normal funktion i leder, muskler och nervsystem. Behandlar ryggbesvär, muskelbesvär, huvudvärk, nackspärr, ischias, idrottsskador och arbetsrelaterade besvär m.m. Återställer funktionen och lindrar smärta genom manuella tekniker som manipulation, stretching och massage.
broader: Naprapater, sjukgymnaster och arbetsterapeuter m.fl.
related: oKbA wEE pxf
related: C2269
related: 7mSe Ndj bNG
related: YuEb eNX YFZ
related: QQuL 2Pe YDE
related: pUog HYA f73
related: CfrU sA9 rfA
related: aoVs Qfu U3j
related: FA5q xhN VwG
related: bf1f 57g 2Bo
narrower: Kiropraktor
narrower: Osteopat
narrower: Naprapat
broad match: NYW6 mP6 vwf

Civil brottsutredare
type: Concept
in scheme: JobTech Taxonomy - Yrke
definition: Civil brottsutredare
broader: Planerare och utredare m.fl.
related: k3fa Avf jtt
related: X82t awd Qyc
related: L59G 3JK wiY
related: TZe9 NsN uce
broad match: C2422

Matematiker
type: Concept
in scheme: JobTech Taxonomy - Yrke
definition: Matematiker
broader: Matematiker och aktuarier
related: kJeN wmw 9wX
broad match: C2120

Receptarie
type: Concept
in scheme: JobTech Taxonomy - Yrke
definition: Receptarie expedierar recept och ger information och rådgivning kring receptbelagda och receptfria läkemedel på apotek och inom hälso- och sjukvård. Receptarie är en skyddad titel med legitimationskrav. Vanliga arbetsuppgifter är att expediera läkemedel, informera patienter och vårdpersonal om läkemedelsanvändning och bereda specialläkemedel till patienter. Receptarien kan också arbeta inom läkemedelsindustrin med bland annat läkemedelsinformation, marknadsföring, kvalitetskontroll och kliniska studier. Vid en myndighet kan arbetsuppgifterna vara kvalitetskontroll och värdering av dokumentation kring läkemedel. Källa: Arbetsförmedlingen, SACO, Socialstyrelsen, Umeå universitet
broader: Receptarier
related: NYW6 mP6 vwf
related: 5G4D 4o1 Ykg
related: sqvh gTy 6Sj
related: Rs6M jk4 Lxu
related: fjQ7 HYh 448
related: usDD Wuh oSU
related: rzdt s3W 4AT
related: 5bV3 UjK aQE
related: HtLK Adh Qsy
broad match: C3213

Badföreståndare/Simhallsföreståndare
type: Concept
in scheme: JobTech Taxonomy - Yrke
definition: Badföreståndare/Simhallsföreståndare
alternative label: Badföreståndare
alternative label: Simhallsföreståndare
broader: Chefer inom friskvård, sport och fritid
related: E7hm BLq fqZ
related: epLc SkD cbT
related: bh3H Y3h 5eD
related: M9T2 7qb 3Tw
related: UzVe 5mg DVL
related: xb81 82H eeA
broad match: C1431

Renhållningsmaskinförare
type: Concept
in scheme: JobTech Taxonomy - Yrke
definition: En renhållningsmaskinförare lastar, lossar, sorterar och hanterar avfall på en återvinningsstation med hjälp av maskiner som hjullastare, materialhanterare, kross och sikt. Daglig skötsel och underhåll av maskiner, utrustning och själva anläggningen ingår ofta i arbetsuppgifterna. Källa; Arbetsförmedlingen
broader: Anläggningsmaskinförare m.fl.
related: j7Cq ZJe GkT
related: r3Kn zgU hHg
related: fWf5 Mt8 Txw
related: Mxyf t2J iLA
related: 2Ljq vQP TpM
broad match: C8342

Forskare, agronomi
type: Concept
in scheme: JobTech Taxonomy - Yrke
definition: Forskare, agronomi
broader: Specialister och rådgivare inom lantbruk m.m.
related: 6nbS RdB kzm
related: VuuL 7CH adj
related: Rnr2 UgN DEH
broad match: C2132

Ekotoxikolog
type: Concept
in scheme: JobTech Taxonomy - Yrke
definition: Ekotoxikolog
broader: Farmakologer och biomedicinare
related: kJeN wmw 9wX
related: esAo 5sX FPv
broad match: C2131

Flygplanselektriker
type: Concept
in scheme: JobTech Taxonomy - Yrke
definition: En flygplanselektriker ansvarar för installation, modifiering och underhåll av flygplanens elsystem. En flygplanselektriker kan arbeta inom Försvarsmakten, hos privata flygbolag eller inom flygindustrin. Felavhjälpande- och underhållande insatser på flygplanen görs både inomhus i en flyghangar eller på en landningsbana. Källa: Trafikverket
broader: Industrielektriker
related: 44Az E7Q bDQ
related: ASGV zcE bWf
related: yhCP AqT tns
broad match: C7412

Antropolog
type: Concept
in scheme: JobTech Taxonomy - Yrke
definition: Antropolog
broader: Arkeologer och specialister inom humaniora m.m.
related: kJeN wmw 9wX
broad match: C2632

Gjutare, svetsare och plåtslagare m.fl.
type: Concept
in scheme: JobTech Taxonomy - Yrke
definition: Gjutare, svetsare och plåtslagare m.fl.
broader: Metallhantverks- och reparatörsyrken
narrower: Svetsare och gasskärare
narrower: Gjutare
narrower: Stålkonstruktionsmontörer och grovplåtsslagare
narrower: Tunnplåtslagare
narrower: Byggnads- och ventilationsplåtslagare

Vattenbrukstekniker
type: Concept
in scheme: JobTech Taxonomy - Yrke
definition: Vattenbrukstekniker utvecklar och optimerar produktion vid vattenbruk. Arbetet liknar arbetsuppgifterna för fiskodlare, så som att kontrollera vattenkvalitet, utfodra fisk, övervaka fiskhälsa, rengöra och underhålla odlingsanläggningar samt hantera utrustning. Vattenbruksteknikern har även en mer strategisk och analyserande roll. Arbetsuppgifterna inkluderar att övervaka vattenbrukssystem för att säkerställa optimal produktion, dokumentera produktionsdata och samordna arbete med säkerhets- och miljöföreskrifter. Källa: Svenskt vattenbruk, Jordbruksverket, Arbetsförmedlingen
broader: Fiskodlare
related: tBYs qkH Jxv
related: VuuL 7CH adj
broad match: C6221

Återvinningsarbetare, tidningsdistributörer och övriga servicearbetare
type: Concept
in scheme: JobTech Taxonomy - Yrke
definition: Återvinningsarbetare, tidningsdistributörer och övriga servicearbetare
broader: Yrken med krav på kortare utbildning eller introduktion
narrower: Tidningsdistributörer, vaktmästare och övriga servicearbetare
narrower: Återvinningsarbetare

Chefstjänstemän i intresseorganisationer
type: Concept
in scheme: JobTech Taxonomy - Yrke
definition: Planerar, leder och samordnar verksamhet i intresseorganisationer. Svarar för förhandlingar, intressebevakning och information. Representerar organisationen och dess medlemmar i utredningar, uppvaktningar, remisser och dyl.
broader: Politiker och högre ämbetsmän
related: icvA Gu9 EqB
related: L1aY QoZ 317
related: UH9g R5v MCx
related: Mw7Y 2pY itu
related: 8tYq EXD Xwm
related: ZzN5 m7B 5CY
related: detQ YNb 9nG
related: Nksx 4oe fEQ
related: w7J6 vmA z5h
related: iXbF oGL mPr
related: Gt5f wdi FSJ
related: Pf9j cL7 VGd
related: C1114
related: q7Mx gjU F9q
related: D6ev Zwt x83
related: zXNU zXR hGd
related: 4fRg DA4 Dj3
narrower: Organisationschef
narrower: Förbundsordförande
narrower: Generalsekreterare
narrower: Kassaföreståndare, arbetslöshetskassa
narrower: Förbundsdirektör
narrower: Förbundschef
broad match: bh3H Y3h 5eD

Språkkonsult
type: Concept
in scheme: JobTech Taxonomy - Yrke
definition: En språkkonsult är en expert på språk som arbetar med att förbättra och effektivisera kommunikation, både skriftlig och muntlig. Språkkonsulten kan hjälpa till med allt från korrekturläsning och textgranskning till att skapa tydliga och begripliga texter, ge råd om språkliga riktlinjer och hålla utbildningar i språkfrågor. Källa: Arbetsförmedlingen, språkkonsult.se
broader: Översättare, tolkar och lingvister m.fl.
related: oCbh jyA ihM
related: mcUq PVY 5wu
related: X82t awd Qyc
related: wujU VnH 8WM
related: ff3r BTQ XGY
related: 9puE nYg crq
related: tLoD 23s Rwk
related: Jip4 8d6 gCo
broad match: C2643

Geologassistent
type: Concept
in scheme: JobTech Taxonomy - Yrke
definition: Geologassistent
broader: Laboratorieingenjörer
related: 6Hq3 tKo V57
related: EsWG kHG oXZ
broad match: C3111

SSA-sekreterare
type: Concept
in scheme: JobTech Taxonomy - Yrke
definition: SSA-sekreterare
broader: Studie- och yrkesvägledare
related: MVqp eS8 kDZ
related: qGhq K1j saV
broad match: C2423

Båtsman/Bås
type: Concept
in scheme: JobTech Taxonomy - Yrke
definition: Båtsman är den som praktiskt leder arbetet så som målningsarbete och rostknackning, som utförs av en eller flera matroser och lättmatroser. Båtsman planerar arbetet på däck tillsammans med överstyrmannen. Till arbetsuppgifterna hör också att hantera trossar vid förtöjning och avfärd, vara utkik på bryggan och gå säkerhetsrundor Källa: Ålands sjöfart
alternative label: Bås
alternative label: Båtsman
broader: Matroser och jungmän m.fl.
related: dRFw Rcu dX7
related: gs65 ynn fcr
related: ASGV zcE bWf
related: XouD cCj HZN
related: QQJR 11D LXL
broad match: C8350

Övrig bevaknings- och säkerhetspersonal
type: Concept
in scheme: JobTech Taxonomy - Yrke
definition: Utför annat bevaknings- och säkerhetsarbete än inom 5411-5414. Exempel på arbetsuppgifter: Bevakar stränder och simbassänger för att förhindra olyckor och rädda individer från att drunkna. Bistår personer i nöd till fjälls. Kontrollerar att parkeringsbestämmelser följs.
broader: Andra bevaknings- och säkerhetsyrken
related: C3411
related: iV6x 3LJ 8ZK
related: SRnA JN2 Rrc
related: GJho f1V YbF
related: mwCM MmB 6Ks
related: uqjq ZDE 7BH
related: KnFB 6m1 4Gm
related: HPfU aG2 m9r
related: 1YZS 1ch vDZ
related: Sqt7 DiY L4Q
related: cff9 N6N c4o
related: Q7eC B7g QiU
related: W8Vw 5oR 7EV
related: nRKR dqf vsv
related: YcVX EcT cCg
related: WtGk Hi4 NEr
related: myz9 nz9 hTL
related: TDLR Gus U5u
related: ykkZ S9T tb4
related: drj3 CKp Mpp
related: C5419
related: imVM 9XE Rrm
related: sxer JSL 7Bv
related: NpgK VPX JNP
related: 9fKd eRm Mxr
related: b5or aJS Tn3
related: irju S7Y Xbr
related: g2dL AqN JFC
related: xPv8 Z62 2dF
related: qsCj EhM fyT
related: R8HU 9i4 LF3
related: hFN6 Rbb Apq
related: FABn RTJ 1xT
related: EDQD 51c yTB
related: nu52 VXq 5MD
related: 7CRV X9r 4gG
narrower: Skidpatrullör
narrower: Brand- och säkerhetsvakt
narrower: Sjöfarts- och hamnskyddskontrollant
narrower: Badvakt
narrower: Parkeringsvakt
narrower: Trafikvakt
broad match: E7hm BLq fqZ

Internrevisionschef
type: Concept
in scheme: JobTech Taxonomy - Yrke
definition: Internrevisionschef
broader: Ekonomi- och finanschefer
related: hR5y 37T feL
related: X82t awd Qyc
related: bh3H Y3h 5eD
broad match: C1211

Webbredaktör
type: Concept
in scheme: JobTech Taxonomy - Yrke
definition: Webbredaktör
broader: Journalister m.fl.
related: bAFN SkH DGF
related: zL4W 8Ek 5yT
related: pYez WWr Ygt
related: Nb4k eZQ 8TW
related: U9HD u6w bKt
related: ebRM NYP vga
related: 6Gyg NGV y4f
related: GSFo USr eGV
related: 3UXa Fjr dvz
related: t8pW vwu B14
related: k6qM Xxk ErL
related: nkcq 5C9 sKt
related: RN2S kAN 17w
related: WDGc GS8 GqK
related: yDfK MAc L1d
related: 2FoB m5Y Lrd
related: 3weC gs9 WYi
related: 9puE nYg crq
related: 7Vzu chy cn1
related: aBV4 W8p Lnr
related: dCX5 Hwx 39b
related: yvVn BxA FUN
related: cqZp Sr2 7Ss
broad match: C2642

Vårdkoordinator
type: Concept
in scheme: JobTech Taxonomy - Yrke
definition: Vårdkoordinator samordnar och planerar vårdinsatser för patienter med många och komplexa vårdkontakter. Vanliga arbetsuppgifter är att vara eller utse fast vårdkontakt, samordna vårdinsatser mellan olika vårdgivare, hantera remisser och boka tider samt hålla kontakt med patienter och närstående. Rollen innebär också att identifiera behov av insatser, följa upp vårdplaner, styra patientflöden och samverka med olika aktörer inom vård och omsorg. Vårdkoordinator har ofta en bakgrund inom hälso- och sjukvård. Källa: Arbetsförmedlingen, Region Kronoberg, Socialstyrelsen
broader: Medicinska sekreterare, vårdadministratörer m.fl.
related: ew7k ch5 zdb
related: S4ww ULm vt3
related: NYW6 mP6 vwf
related: FfDD gxA Bsr
related: 1q9Y LGj Up6
related: X82t awd Qyc
related: 5H2x GD5 UNE
broad match: C3344

Andra bevaknings- och säkerhetsyrken
type: Concept
in scheme: JobTech Taxonomy - Yrke
definition: Andra bevaknings- och säkerhetsyrken
broader: Andra bevaknings- och säkerhetsyrken
narrower: Brandmän
narrower: Kriminalvårdare
narrower: SOS-operatörer m.fl.
narrower: Övrig bevaknings- och säkerhetspersonal
narrower: Väktare och ordningsvakter

Produktionsingenjör, elektronik
type: Concept
in scheme: JobTech Taxonomy - Yrke
definition: Produktionsingenjör inom elektronik planerar, optimerar och övervakar tillverkningsprocesser för elektroniska komponenter och produkter. Arbetsuppgifterna innefattar processutveckling, kvalitetskontroll, produktionsplanering samt problemlösning vid produktionstekniska utmaningar. Produktionsingenjören arbetar med att förbättra produktionseffektivitet, minska produktionskostnader och säkerställa att produkterna uppfyller tekniska specifikationer. I arbetet ingår ofta samarbete med inköp, kvalitet, produktutveckling och produktionsteknik. Produktionsingenjörer inom elektronik har vanligtvis kunskaper inom elektronikproduktion, automatisering, kvalitetsmetoder och produktionsstyrning. Källor: Arbetsförmedlingen, SACO, jobbannonser på Platsbanken och vakanser.se, företagswebbplatser inom elektronikindustrin (exempelvis Ericsson, ABB)
broader: Ingenjörer och tekniker inom elektroteknik
related: 6Hq3 tKo V57
related: R6XH eVv zXo
related: SvAW coW dGN
broad match: C3114

Laboratorieingenjör, metallurgi
type: Concept
in scheme: JobTech Taxonomy - Yrke
definition: Laboratorieingenjör, metallurgi
broader: Ingenjörer och tekniker inom gruvteknik och metallurgi
related: 6Hq3 tKo V57
related: hBzg sf4 HHU
broad match: C3117

Bildterapeut
type: Concept
in scheme: JobTech Taxonomy - Yrke
definition: Person som arbetar med bildterapi (konstutövning som en form av sysselsättningsterapi vid behandling av nervsjukdomar, psykiska sjukdomar eller beteendestörningar). Källa: SKR
broader: Övriga specialister inom hälso- och sjukvård
related: NYW6 mP6 vwf
broad match: C2269

Maskinoperatör skotillverkning
type: Concept
in scheme: JobTech Taxonomy - Yrke
definition: Maskinoperatörer inom skotillverkning sköter maskiner för maskinell tillverkning av skor. Arbetet innebär att förbereda material, justera och köra maskiner samt kontrollera kvalitet på tillverkade skor. Beroende på arbetsplats kan man arbete i delar eller hela produktionskedjan, där man roterar mellan olika maskiner och arbetsmoment. Truckkörning, lagerarbete, leveransförberedelser och enklare maskinunderhåll kan även ingå. Källa: Arbetsförmedlingen
broader: Övriga maskinoperatörer, textil-, skinn- och läderindustri
related: Log3 28u 3rx
related: kF6L 5d3 cGS
related: wTEr CBC bqh
related: X81Q WuY 7U8
broad match: C8156

Civilingenjör, bygg
type: Concept
in scheme: JobTech Taxonomy - Yrke
definition: En civilingenjör inom bygg arbetar inom olika funktioner med att planera, bygga, utveckla och förvalta fastigheter. Arbetsplatsen finns inom privat såväl som offentlig sektor, allt från mindre konsultfirmor till stora entreprenadföretag. Källa: Arbetsförmedlingen
broader: Civilingenjörsyrken inom bygg och anläggning
related: j7Cq ZJe GkT
related: anYS 5AR JRk
related: ja7J P8X YC9
broad match: C2142

Psykiatrisjuksköterskor
type: Concept
in scheme: JobTech Taxonomy - Yrke
definition: Behandlar och vårdar patienter inom psykiatrisk vård på avdelning, mottagning, behandlingshem m.m.
broader: Sjuksköterskor
related: TuUX 3Jo wyq
related: 4QAE wtY gJh
related: C1qR L83 nzh
related: 9Fna GUm HWL
related: ckhF ACN GqU
related: Mmxs Qrv cpG
related: X9N9 QGi 9Ym
related: FJgD TNa SE6
related: 5JNC VaM zve
related: dJa5 Nao mDS
related: Lqnz Zqw nQ9
related: eThQ HCv mY6
related: Phrk 2XZ MWq
related: 2jpJ qwQ 7Kd
related: F7nJ k5s L29
related: Ektq nPz 4YF
related: LMx4 LbA vxB
related: wBPu wTW RgG
related: oQm8 Ucv eSp
related: QoMt T8x WTS
related: 2GuF gtz xfW
related: rF7s hX1 ECH
related: KTet tgJ tmg
related: rVUL AgV ZTH
related: C2221
related: GYz6 5Jt Wmy
related: 5Kym 2ad Pqi
related: jxKr BmN CcQ
related: pGBH BkG qJa
related: yV9B PxJ TxS
related: 47LN 8Ac dX8
related: LwTt 3Ns mGH
related: PntN 4N3 TAE
related: xLxq sQ7 RzR
related: Gtff Yfu Qag
narrower: Psykiatrisjuksköterska
broad match: NYW6 mP6 vwf

Lärling, tak- och tätskiktsmontör
type: Concept
in scheme: JobTech Taxonomy - Yrke
definition: En lärling är anställd för att slutföra sin kvalificeringstid till tak- och tätskiktsmontör innan ett yrkesbevis kan utfärdas. Under kvalificeringstiden får du lärlingslön enligt avtal. Kvalificeringstiden tillsammans med teoretisk grundutbildning leder till yrkesbeviset. Ett lärlingsavtal mellan branschorganisation och företag tecknas. Källa: BYN
broader: Takmontörer
related: j7Cq ZJe GkT
related: ja7J P8X YC9
broad match: C7121

Laboratorieingenjörer
type: Concept
in scheme: JobTech Taxonomy - Yrke
definition: Utför experiment, analys- och kontrollarbete vid kemiskt och fysikaliskt industri- eller forskningslaboratorium. Kontrollerar, testar och analyserar råvaror och produkter. Assisterar vid utformning och utförande av experiment. Hit hör inte Biomedicinsk analytiker (3212) Civilingenjörsyrken inom kemi (2145) Ingenjörsyrken inom kemi (3115) Kemitekniker (3115) Laboratoriebiträde (5349)
broader: Biomedicinska analytiker, tandtekniker och laboratorieingenjörer m.fl.
related: mg8h fe2 kDM
related: JsAw WWK wbb
related: LzrR Kpb s64
related: pqjF 8wN GsW
related: 48zu t6j A28
related: H75h 4ob Y7p
related: HBEU dvp 7ZD
related: kyJH awk 15m
related: 7GaA 87a uE5
related: 74Mw JUN VKx
related: AQtr C7f Dyt
related: z6zn oa6 E3d
related: cqQu U4C ZTc
related: Bh9h t3B M8h
related: nA5p Ske 4zb
related: Tnb9 91i XC8
related: VQHQ ScF Fr5
related: 7rJH cCp ccc
related: 3i6s BB6 E3X
related: C3111
related: 1dVh cZS Exw
related: Rf1n 6Sj exu
related: DnL5 sXM WRb
related: PEty jNu Uqd
related: aS2X 4ZL 9h7
related: G84U eAD CiF
related: kTdr kZC 6uX
related: qEQz Mbj kQP
related: X17H xss KtU
related: 7rqs dJb gjc
related: 5vfN sNS Ltq
related: 4y7C Lsh EPM
related: SmU2 is4 1go
related: C3142
related: PKWj Pej iE1
related: h6Tu oFS KDH
related: Nb1A Sca LbP
related: QQJy UXD DZC
narrower: Instrumentingenjör, fysik
narrower: Mättekniker, fysik
narrower: Laborant, biologi
narrower: Laboratorietekniker, kemi
narrower: Laboratorieingenjör, fysik
narrower: Laboratorieingenjör, kemi
narrower: Laboratorietekniker, fysik
narrower: Forskningslaborant, kemi
narrower: Laborant, kemi
narrower: Laborant, fysik
narrower: Materialprovare, fysik
narrower: Forskningslaborant, fysik
narrower: Mättekniker, kemi
narrower: Geologassistent
narrower: Mikroskopist
broad match: 6Hq3 tKo V57

Elektronikreparatörer och kommunikationselektriker m.fl.
type: Concept
in scheme: JobTech Taxonomy - Yrke
definition: Elektronikreparatörer och kommunikationselektriker m.fl.
broader: Installations- och serviceyrken inom el och elektronik
narrower: Elektronikreparatörer och kommunikationselektriker m.fl.

Programpresentatör
type: Concept
in scheme: JobTech Taxonomy - Yrke
definition: Programpresentatör
broader: Övriga yrken inom kultur och underhållning
related: 8too bEs 7NU
related: 9puE nYg crq
related: ExiK pKN i6P
broad match: C2656

Framtidsforskare
type: Concept
in scheme: JobTech Taxonomy - Yrke
definition: Framtidsforskare
broader: Arkeologer och specialister inom humaniora m.m.
related: X82t awd Qyc
broad match: C2633

Croupierer och inkasserare
type: Concept
in scheme: JobTech Taxonomy - Yrke
definition: Croupierer och inkasserare
broader: Kundserviceyrken
narrower: Croupierer och oddssättare m.fl.
narrower: Inkasserare och pantlånare m.fl.

Processoperatör smältverk
type: Concept
in scheme: JobTech Taxonomy - Yrke
definition: Processoperatörer vid smältverk övervakar och styr industriell framställning av metaller genom smältning. Processoperatör vid ett smältverk övervakar smältprocessen för metaller och ser till att temperaturen och andra processparametrar hålls inom angivna gränser. Arbetsuppgifter inkluderar att hantera och justera maskiner och utrustning för att säkerställa att smältning sker effektivt och säkert. Man tar regelbundna prover, analyserar resultat och justerar processer för att upprätthålla produktkvalitet. Vid avvikelser ingår felsökning och åtgärder för att minimera produktionsstopp och säkerhetsrisker. Källa: Arbetförmedlingen
broader: Processövervakare, metallproduktion
related: yhCP AqT tns
related: d3wq c4j sjj
broad match: C3135

Gjuterioperatör
type: Concept
in scheme: JobTech Taxonomy - Yrke
definition: Gjuterioperatörer förbereder, övervakar och kvalitetssäkrar gjutningsprocesser för att tillverka metalldetaljer. Vid industriella gjuterier tillverkas gjutgods för bland annat fordonsindustrin och maskinindustrin. Arbetsuppgifterna inkluderar att enligt anvisning och ritning förbereda råmaterial, styra maskiner och utföra avsyning samt mätkontroller för att säkerställa att produkterna uppfyller specifikationer. Underhåll och rengöring av utrustning samt enklare felsökningar och reparationer förekommer. Krankörning och truckkörning är också vanligt förekommande. Omställning av maskiner mellan produkter och planering av produktion kan även ingå beroende på arbetsplats. Källa: Svenska Gjuteriföreningen, Arbetsförmedlingen
broader: Övriga maskin- och processoperatörer vid stål- och metallverk
related: Mfp9 Jnc SQb
related: pym4 AUa rCB
related: 7dfp e7n G7K
related: z2QL xmk hhi
related: npB1 2C2 xRg
related: zaah rRZ Ecy
related: jxic FNn J4B
related: SyqF 4hx APM
related: Wmia 3nJ 4P9
related: M5Jv MxG HSM
related: F52X ZtD cBr
related: wTEr CBC bqh
related: tuf7 LJB PMT
related: h9QB 996 Pa4
broad match: C8121

Digital Imaging Technician/DIT/Loggare
type: Concept
in scheme: JobTech Taxonomy - Yrke
definition: Ansvarig för att övervaka och säkerställa högkvalitativa digitala filminspelningar och fildistribution under inspelningen. Källa: YNFT
alternative label: DIT
alternative label: Digital Imaging Technician
alternative label: Loggare
broader: Bild- och sändningstekniker
related: 8too bEs 7NU
related: 9puE nYg crq
related: d1Ao 9bY 7Kn
broad match: C3521

Arbetsledare, kundtjänst/Gruppledare, kundtjänst
type: Concept
in scheme: JobTech Taxonomy - Yrke
definition: Arbetsledare och gruppledare inom kundtjänst leder, planerar och samordnar det dagliga arbetet för kundtjänstpersonal. Rollen innebär i huvudsak att fördela arbetsuppgifter, stödja medarbetare i deras arbete och säkerställa att verksamheten fungerar effektivt och kundnära. Arbetsledaren fungerar ofta som en länk mellan medarbetare och annan ledning, och har vanligtvis ansvar för att säkerställa god intern och extern kommunikation. Arbetsuppgifterna inkluderar bland annat schemaläggning, personalplanering, kundkontakt, uppföljning av arbetsflöden och kvalitet samt stöd vid arbetsmiljöfrågor. Arbetsledaren kan även ha ansvar för att följa upp kostnader, avtal och serviceavtal samt bidra till att utveckla arbetsprocesser. Källa: Arbetsförmedlingen
alternative label: Arbetsledare, kundservice
alternative label: Arbetsledare, kundtjänst
alternative label: Gruppledare, kundservice
alternative label: Gruppledare, kundtjänst
broader: Gruppledare för kontorspersonal
related: Kra2 QdG m5i
related: anUW kwx AJ3
related: ur42 GTW CPw
related: X82t awd Qyc
related: VSQM 1Ww AtD
related: nHje LMN eAQ
related: 2Nkn d6R 5td
related: SudS 8MA dd3
related: kj1a qeL kFa
related: dcxw zqe joV
related: o47A aXZ FcQ
related: nHCZ Sr1 T7S
related: XeQL pKw gYe
related: Axci MTB pCn
broad match: C3341

Produkttekniker konfektion
type: Concept
in scheme: JobTech Taxonomy - Yrke
definition: Produkttekniker inom konfektion säkerställer kvalitet, funktion och produktionseffektivitet för kläder och textila produkter. Yrket innebär både teknisk expertis kring produktionsprocesser och samarbete med designers, mönsterkonstruktörer och leverantörer. Vanliga arbetsuppgifter är att granska måttlistor och mönster, testa och utvärdera material, samordna med leverantörer och produktionsenheter samt utföra kvalitetskontroller. Källa: Arbetsförmedlingen
broader: Skräddare och ateljésömmerskor m.fl.
related: kqau D4r 4fE
related: PaxQ o1G wWH
broad match: C7532

Undersköterska, hemtjänst, äldreboende och habilitering
type: Concept
in scheme: JobTech Taxonomy - Yrke
definition: Undersköterskor inom äldreomsorg ger individuell vård och omsorg till äldre i eget hem eller i särskilt boende. Undersköterska är en skyddad titel. I äldreomsorgen är undersköterskan en del av vård- och omsorgstagarens vardag. Undersköterskan har medicinska arbetsuppgifter, vilket bland annat innebär att ge medicin, lägga om sår, linda ben, sondmata, kontrollera puls, temp och blodtryck samt hantera katetrar. På ett boende arbetar undersköterskan i ett team tillsammans med sjuksköterskor, fysioterapeut, arbetsterapeut och dietist. Källa: Arbetsförmedlingen, Göteborgs stad
broader: Undersköterskor, hemtjänst, hemsjukvård, äldreboende och habilitering
related: w3gW JZm kfX
related: Fd6M zif dGJ
related: NYW6 mP6 vwf
related: 1Qt4 jtL YLp
related: wmCW qp5 EV2
related: 3qma Dx7 ZTG
related: 8FTr VAt oMo
related: zzPn tQb DDT
related: oR71 Vk4 Rn5
related: qUG9 b1W n9P
related: bu6h 6aD Htq
related: 5Mm5 W49 kCh
broad match: C5321

Hemförsäljare
type: Concept
in scheme: JobTech Taxonomy - Yrke
definition: Hemförsäljare säljer produkter eller tjänster direkt till kunder i deras hem. Arbetet innebär att knacka dörr, boka och genomföra kundbesök, demonstrera produkter, ge rådgivning samt anpassa erbjudanden utifrån kundens behov. Källa: Arbetsförmedlingen
broader: Eventsäljare och butiksdemonstratörer m.fl.
related: Pvoj TCq J7T
related: UdVa jRr 9DE
related: EDZf 8F7 XKZ
related: Acqm FJr qfT
related: rDcj Tao TJJ
related: RPTn bxG ExZ
related: cVNN ogF WKw
related: Ai6U aNw Lh4
broad match: C5243

Förrättningsassistent fastighetsbildning
type: Concept
in scheme: JobTech Taxonomy - Yrke
definition: Förrättningsassistenter inom fastighetsbildning ger administrativt och juridiskt stöd till förrättningslantmätare och mätningsingenjörer. Arbetsuppgifter inkluderar diarieföring, dokumenthantering, arkivering, fakturering och utskick av handlingar. Förrättningsassistenten deltar i olika delar av förrättningsprocessen, såsom protokollskrivande, framtagande av kartor och andra underlag, enklare utredningar, registrering i fastighetsregistret, delgivning och kollegiegranskning. Arbetsuppgifter omfattar även kontakt med sakägare och andra myndigheter, samt framtagande av fastighetsförteckningar och registrering av planer och bestämmelser i fastighetsregistret. Källa: Lantmäteriet, Arbetsförmedlingen
broader: Domstols- och juristsekreterare m.fl.
related: X82t awd Qyc
related: iqbe 6nJ aW4
broad match: C3411

Lantbrukare djuruppfödning
type: Concept
in scheme: JobTech Taxonomy - Yrke
definition: Lantbrukare inom djuruppfödning bedriver verksamhet med uppfödning av lantbrukets husdjur som nötkreatur, grisar, får eller fjäderfä. Arbetsuppgifter omfattar planering och genomförande av utfodring, skötsel och hälsokontroll. Vidare ingår avelsarbete och att assistera vid förlossningar samt utför enklare vårdåtgärder. En viktig del av arbetet är att hantera och underhålla lantbruksmaskiner, redskap och tekniska system kopplat till djuruppfödning. Man kan arbeta både som egenföretagare och som anställd i ett lantbruksföretag. Rollen innefattar ofta många andra arbetsuppgifter, så som underhåll av ekonomibyggnader samt kontakt med leverantörer och kunder. Arbetsuppgifter kan överlappa med andra roller, särskilt på mindre företag. Se även yrkena Djurskötare lantbruk och Förman djuruppfödning. Källa: Jobbagrönt, Arbetsförmedlingen
broader: Uppfödare och skötare av lantbrukets husdjur
related: m8cV a7M oSp
related: TtcQ 3QY urX
related: 8U7p UrJ 4Ft
related: W53s ce1 PtZ
related: eiWT iup CTY
related: 52iz HXR 9Xi
related: pe4a Ktg XFx
related: ersH YC7 yZo
related: rp5n Qhx E7H
related: VuuL 7CH adj
broad match: C6121

Sjuksköterska, grundutbildad
type: Concept
in scheme: JobTech Taxonomy - Yrke
definition: Sjuksköterskornas arbetsuppgifter och arbetsplatser varierar, men innebär framförallt att främja hälsa samt förebygga sjukdom och ohälsa. Sjuksköterskan är omvårdnadsexperten i patientens närhet. Det innebär att sjuksköterskan ansvarar för att medicinska ordinationer blir genomförda och att patienterna får den omvårdnad de behöver. Sjuksköterskan leder och planerar omvårdnadsarbetet, sköter medicinering, provtagning, undersökningar och för journalanteckningar över patienternas tillstånd. Utför arbetsuppgifter för vilka det inte krävs vidare-/specialistutbildning. Sjuksköterska är en skyddad yrkestitel enligt Socialstyrelsen. Legitimation krävs för yrket. Källa: Arbetsförmedlingen, Sveriges kommuner och regioner
broader: Grundutbildade sjuksköterskor
related: sDYj V81 jXE
related: 491P Vmq zac
related: NYW6 mP6 vwf
related: VrG2 HjC 8iw
related: sqvh gTy 6Sj
related: ypqZ xsY vPV
related: wzN9 tF3 g5C
related: TYX8 Ccd QRk
related: jrjV wcz fxg
related: XwyS yoC V97
related: AgFB tpx xMo
related: 86Z2 JB8 Fyw
related: QpuH j7Y eGh
related: SPtV q9d rTR
related: RqWx Zg7 yrV
related: KJLV h2y PG9
related: WaaW tvH Fd4
related: Di1F DqA Cjr
related: WTWQ Fy2 yaV
related: SPys fMh nRW
related: LooY 3kn fXw
related: F51J 8ck ihx
related: XJ3q 4FX ZLi
related: 61hk xkb a6H
related: 1f7B E5K sh3
broad match: C2221

Kundmottagare/Arbetsledare bilverkstad
type: Concept
in scheme: JobTech Taxonomy - Yrke
definition: Kundmottagare och arbetsledare på bilverkstäder tar emot och ger råd till kunder på bilverkstäder, samt planerar arbetet för personbilsmekaniker. Arbetet innebär att fungera som kundens första kontakt och ansvarar bland annat för bokning av service- och reparationsbesök, mottagande och utlämning av fordon, rådgivning och betalningar. Som arbetsledare ingår även lagerhållning av reservdelar, administration i verkstadens datasystem samt planering och uppföljning av arbetet för personbilsmekaniker. Källa: Transportföretagen, Arbetsförmedlingen
alternative label: Verkmästare bilverkstad
broader: Övriga förmedlare
related: rGju 6AF tQJ
related: JZPV XES nqK
related: RPTn bxG ExZ
related: 9Zk1 GDT YSF
related: 9QeQ VFc yUr
related: BYDG CtW BsV
related: S23Z j1s TaR
related: 5YXX PES M6V
related: wdTb Ws6 n39
related: RBGx z2m RjE
related: Yiiv b1a WLs
broad match: C3339

Byggnads- och ventilationsplåtslagare
type: Concept
in scheme: JobTech Taxonomy - Yrke
definition: Monterar tak- och fasadbeklädnader av plåt. Tillverkar och monterar plåtdetaljer efter ritningar eller egna måttagningar. Utför underhållskontroller av tidigare utförda plåtarbeten på tak och fasader. Installerar ventilationssystem i byggnader. Monterar ventilationskanaler med tillhörande fläktar och aggregat, utför service och reparerar systemen. Kontrollerar till- och frånluftsventilation.
broader: Gjutare, svetsare och plåtslagare m.fl.
related: eA4L AMV QZg
related: sKfH MGG 3CS
related: L9Ng g1T Sot
related: 3kAh 9uB QwN
related: qwR4 VM5 2Cd
related: T2Jq bco 6Dc
related: bsy7 dqD NBo
related: GHrt TJi 62K
related: nuRM zb9 2wV
related: Y2fZ kGv yUx
related: 9nyH icP Qxt
related: Ytcy v8N P2w
related: aHCV VsV LiD
related: tqNp SBC LSx
related: c5t5 ucu nrT
related: CUNr DA7 Fjr
related: hu4P Rdt hxR
related: JUpW QCd vCM
related: DSyz mEy sWT
related: PELm cH9 AE9
related: Q7eC B7g QiU
related: zKsE iKK v99
related: bABh HN5 u4v
related: 7coz KQN G7U
related: bnMZ Nt5 o48
related: M7C1 DAy UTK
related: y3yv k5d NB4
related: f8Sz Xaf TEU
related: WBnc JXj MvY
related: fhcp fFw Lbj
related: nkhA jPz pcE
related: zVKm f79 DtU
related: ynWd oCo o61
related: Q1D1 Pdc rnT
related: xeoH rao GgZ
related: fhu6 H74 uuN
related: UfwF qpM LEj
related: 6BpN oXk 7SL
related: aENT QTu v8Y
related: NYYQ Hp4 FFo
related: seev JQ5 q5W
related: WLAi BDr 5fW
related: KfEn V5y npV
related: 5Av7 qB2 msb
related: SpsE Fzz yiX
related: C7213
related: HmXd ehy QT9
related: C5av 941 jnP
related: D22m xCt cwN
related: VdMH Tm8 CAa
related: BKYD AEo maF
related: 4y7C Lsh EPM
related: GgZs WNA Z8z
related: iQfJ Crz aEJ
related: QUkC SMY 78S
related: xKww RKP MBQ
related: rwir xvu 443
related: xShN Vkr s7D
related: u1bJ gvt ECc
related: bBEQ oAd M9B
narrower: Ventilationsplåtslagare
narrower: Byggnadsplåtslagare
narrower: Lärling byggnadsplåtslagare
narrower: Lärling, ventilationsplåtslagare
broad match: j7Cq ZJe GkT

Underwriter
type: Concept
in scheme: JobTech Taxonomy - Yrke
definition: Underwriter
broader: Försäkringssäljare och försäkringsrådgivare
related: X82t awd Qyc
related: 4PNG jiG rmL
related: qgvw hs4 sUv
broad match: C3321

Kommunhandläggare
type: Concept
in scheme: JobTech Taxonomy - Yrke
definition: Kommunhandläggare
broader: Planerare och utredare m.fl.
related: 52e1 Hjt Lry
related: QtVa Msr T1h
related: D9ce 2aN mGJ
related: L21z DDN aYr
related: X82t awd Qyc
related: 8Ghd cU6 Fct
related: ju5w JF7 Xtd
related: Yb1w sSy Rh9
related: kre1 TPt A7D
related: TZe9 NsN uce
related: jGLV UDS xLW
related: A4kX CVe zJ8
related: qVrM NB1 gZd
related: WwpD 3X3 LvM
related: n8hm EcE A3K
broad match: C2422

Hotellreceptionister m.fl.
type: Concept
in scheme: JobTech Taxonomy - Yrke
definition: Tar emot, checkar in och checkar ut gäster på hotell, konferensanläggning, vandrarhem eller campingplats m.m. Informerar om bl.a. anläggningens service samt sevärdheter och nöjesevenemang. Gör i ordning konferenslokaler och ansvarar för att den tekniska utrustningen fungerar och att förtäring serveras enligt beställningen.
broader: Resesäljare, kundtjänstpersonal och receptionister m.fl.
related: S2pg pcs tXu
related: ZuYj ADn tk7
related: 7H4j dRM Vbo
related: XyNa nvJ k8w
related: Ljxo 4Zn ygo
related: vtVE rrX hhD
related: H73b dCy CTT
related: fn7z KSK YAg
related: wKHJ NDQ sSg
related: v4Jn mjt f4H
related: UH9g R5v MCx
related: dNA9 T9K JXF
related: 7ys5 wTJ aqV
related: ZzN5 m7B 5CY
related: Vrfm UET aZT
related: R1Yt c9y JDD
related: sqd6 4Kk b4w
related: f2B8 cXY G2N
related: M7Sn U9s HSx
related: fbNJ NMc P8R
related: eThQ HCv mY6
related: Fiq4 siu LXn
related: HQPe PkY RLF
related: C4224
related: Gt5f wdi FSJ
related: cFAq 2xo uqw
related: VNjs Chg 2Gc
related: ySGC R1c Dcu
related: hYpk RYx y3V
related: vXs9 j1u JiX
related: fHsh dGi uPY
related: S3Pj Law 3Xy
related: n1no RNy Jdo
related: 1xHU W9z CT9
related: sGky Wqy QvZ
narrower: Campingvärd/Stugvärd
narrower: Eventpersonal
narrower: Konferensvärd
narrower: Hotellvärd
narrower: Hotellreceptionist
narrower: Receptionschef hotell
narrower: Föreståndare camping/stugby/vandrarhem
broad match: ScKy FHB 7wT

Anläggningsarbetare
type: Concept
in scheme: JobTech Taxonomy - Yrke
definition: Lägger ner och sammanfogar rör av betong, metall eller plast till vatten- och avloppsledningar, fjärrvärme och fjärrkyla. Lägger ut asfalt eller betong på vägbanor m.m. Lägger ut räls, utför spårjustering och monterar växlar. Sätter kantsten och gatsten eller lägger sten- och betongplattor på gång- och körbanor. Monterar lekredskap, trappor och stödmurar samt räcken, skyltar och andra vägmarkeringar.
broader: Snickare, murare och anläggningsarbetare
related: v3d9 u2H pnf
related: fx1Q VHN isf
related: sKfH MGG 3CS
related: yc3o fvU E6V
related: tQr7 pSR XWn
related: zvz6 UYf RJr
related: tqiy Mb2 FnL
related: Q6ez byQ HQj
related: 95yM 6W4 Zyj
related: 3xxK yks 8RB
related: nuRM zb9 2wV
related: wv7t xyY xhn
related: tDV6 t9r ugg
related: Ytcy v8N P2w
related: aHCV VsV LiD
related: ax3A WDM 1ZP
related: 1zUh Hb7 ozh
related: aF9x AVw bUj
related: NLiw MkJ y4e
related: gCa2 BuT UVE
related: rBz4 QSX yfw
related: HPfU aG2 m9r
related: njeW wb3 Zry
related: 1YZS 1ch vDZ
related: 5LhV Kg4 hCv
related: PELm cH9 AE9
related: Q7eC B7g QiU
related: qMEt GoN pPM
related: 73Fc LgF Equ
related: iLUr RJV 3xW
related: 34hP 27C pMv
related: EZb7 wBA okA
related: ad5t 3Go CeS
related: bnMZ Nt5 o48
related: C7119
related: M7C1 DAy UTK
related: D6xD cSH rZN
related: f8Sz Xaf TEU
related: 2TC1 Ucy s32
related: 8Poz jP8 KFB
related: EwT4 Jtg AQf
related: fhcp fFw Lbj
related: u6a1 zni wa3
related: NFVU tyu JsA
related: 6VeN XR4 Zuj
related: N5fX k6E yVE
related: 7jFS 6oq ZGv
related: nkhA jPz pcE
related: y1ig 6kP WMa
related: ynWd oCo o61
related: ReaM tTr eNz
related: drj3 CKp Mpp
related: xeoH rao GgZ
related: etet pgR rN2
related: ZnK8 2ss R6q
related: fhu6 H74 uuN
related: 6BpN oXk 7SL
related: E7ax HKq oPy
related: skwD Rbi tZt
related: vbx1 Q4d zrT
related: VF7G q33 456
related: ztAc cLZ vtf
related: gdTC 3Eh PMv
related: 6CXz QqA 9SW
related: WLAi BDr 5fW
related: KfEn V5y npV
related: okWm b6M hyS
related: 2SCx 2dX M79
related: 5Av7 qB2 msb
related: oxd3 phB 77Q
related: Je6r Y6g 8fj
related: HmXd ehy QT9
related: GhKv 2Uf 17o
related: Rw7P Usj 7Mk
related: hFN6 Rbb Apq

Orkesterledare
type: Concept
in scheme: JobTech Taxonomy - Yrke
definition: Orkesterledare leder och samordnar en orkester eller musikalisk ensemble vid repetitioner och framträdanden inom olika musikgenrer. Vanliga arbetsuppgifter är val och arrangemang av repertoar, planering av repetitioner och samarbete med solister och andra artister. I vissa fall ingår också administrativt ansvar för orkesterns verksamhet och kontakt med arrangörer eller publik. Källa: Arbetsförmedlingen, Kungliga Musikhögskolan
broader: Musiker, sångare och kompositörer
related: 8too bEs 7NU
related: 9puE nYg crq
related: jBT9 o24 esi
broad match: C2652

Charkuterist
type: Concept
in scheme: JobTech Taxonomy - Yrke
definition: Charkuterister arbetar med tillverkning av charkuterivaror/charkvaror, så som korvar och pastejer. Arbetet innebär att arbeta med tillverkning av charkvaror. Arbetet är till stor del maskinellt där det ingår att förbereda råvaror och ingredienser. Kvalitetskontroll och regelefterlevnad är också förekommande. Förutom produktion så ingår vanligtvis packning och att förbereda för leverans. Källa: Kött- och charkföretagen, Arbetsförmedlingen - Hitta yrken
broader: Slaktare och styckare m.fl.
related: Pz6Z 2K4 JpD
related: Nihq JRJ SQc
related: zRPS Fh8 DiZ
related: GyQM 3WG 5BN
related: CGwH VVx kdZ
related: 3ZNN 9P3 ZkN
related: rU8B bzn NxP
related: wTEr CBC bqh
related: s1vi 4gT Y6G
related: P7ep daz Wvi
related: HruE GEE dKh
broad match: C7511

Vältförare
type: Concept
in scheme: JobTech Taxonomy - Yrke
definition: En vältförare kör en vält som används för att komprimera material som jord, asfalt och grus vid olika bygg- och anläggningsprojekt. Vältföraren är en anläggningsmaskinförare och har yrkesbevis i ett eller flera maskinslag. I arbetet ingår att sköta underhåll och enklare reparationer av maskinens kringutrustning. Anläggningsmaskinföraren kan ansöka om sitt yrkesbevis efter teoretisk grundutbildning och lärlingsanställning. Källa: Arbetsförmedlingen
broader: Anläggningsmaskinförare m.fl.
related: j7Cq ZJe GkT
related: ja7J P8X YC9
related: Mxyf t2J iLA
broad match: C8342

Kvalitetsingenjör, el-tele
type: Concept
in scheme: JobTech Taxonomy - Yrke
definition: Kvalitetsingenjör, el-tele
broader: Civilingenjörsyrken inom elektroteknik
related: 6Hq3 tKo V57
related: kDRm Yaa jAB
broad match: C2153

Servicetekniker, elkraft
type: Concept
in scheme: JobTech Taxonomy - Yrke
definition: En Servicetekniker inom elkraft arbetar med elnätets kraftledningar, kontrollsystem, ställverk och transformatorer där felsökning och reparation är de primära arbetsuppgifterna. En servicetekniker inom elkraft jobbar även med vindkraft, solceller, batterisystem och elbilarnas laddningssystem. Källa: Åsbro kursgård
broader: Distributionselektriker
related: RqDA 3Pq Bz3
related: P5Ru ThL 62u
related: yhCP AqT tns
related: kM9L Lp6 cTv
broad match: C7413

Möbelrenoverare/Möbelrestauratör
type: Concept
in scheme: JobTech Taxonomy - Yrke
definition: Möbelrenoverare/Möbelrestauratör
alternative label: Möbelrenoverare
alternative label: Möbelrestauratör
broader: Bildkonstnärer m.fl.
related: 9puE nYg crq
related: PaxQ o1G wWH
broad match: C2651

Renhållningsförare
type: Concept
in scheme: JobTech Taxonomy - Yrke
definition: Renhållningsförare hämtar och transporterar hushållssopor och returmaterial. Renhållningsförare arbetar ofta inom den kommunala renhållningen och hämtar hushållssopor inom ett specifikt geografiskt område. De kan också köra specialbyggda renhållningsbilar för att samla in returmaterial, såsom papper och plåtförpackningar, från både företag och privatpersoner. Arbetet kräver god fysik och organisationsförmåga för att hantera olika typer av material och transporter. Föraren behöver även ha kunskap om material som ska återvinnas och korrekt hantering av dessa. Källa: Transportfackens yrkes- och arbetsmiljönämnd
broader: Lastbilsförare m.fl.
related: 3gFN eUg BuG
related: fNJK tk7 V7J
related: FdR3 GdM nTW
related: zGjD M5a HCX
related: 81Do 5GL bQD
related: d68E e74 a59
related: h5Vv MFR Pzt
related: 4rMv ux4 7V1
related: hhb7 1hV t7R
related: ASGV zcE bWf
related: 483u hVx psa
related: sXvz bNz FtK
related: h6Co oKV PfV
related: Ejj7 zCP c5c
related: 9wnn PAV q12
related: 3NAe dkU brL
related: yv2S sZX g8a
broad match: C8332

Lärling, golvläggare
type: Concept
in scheme: JobTech Taxonomy - Yrke
definition: En lärling är anställd för att slutföra sin kvalificeringstid till golvläggare innan ett yrkesbevis kan utfärdas. Under kvalificeringstiden får du lärlingslön enligt avtal. Kvalificeringstiden tillsammans med teoretisk grundutbildning leder till yrkesbeviset. Ett lärlingsavtal mellan branschorganisation och företag tecknas. Källa: Arbetsförmedlingen
broader: Golvläggare
related: j7Cq ZJe GkT
related: ja7J P8X YC9
broad match: C7122

Produktionschef, tillverkning
type: Concept
in scheme: JobTech Taxonomy - Yrke
definition: Produktionschef, tillverkning
broader: Produktionschefer inom tillverkning
related: sf31 Sn5 FVV
related: NYH3 WXk 9Ce
related: R11C X2e BA6
related: ES89 xQ5 kMu
related: QpRa KDF 7Ys
related: Lvyd 9SU uQD
related: epLc SkD cbT
related: bh3H Y3h 5eD
related: EEru WX7 nb9
related: FCrS Amr 4bx
related: 3oJa UL6 6ip
related: v6S7 xhn 5Kc
related: wTEr CBC bqh
broad match: C1321

Personal- och HR-specialister
type: Concept
in scheme: JobTech Taxonomy - Yrke
definition: Planerar och organiserar rekrytering, utveckling omplacering och avveckling av personal. Upprättar personalbudget och utbildningsplaner. Deltar i förhandlingar om löner, anställningsvillkor samt tolkar och informerar om arbetsrättsliga lagar och avtal. Hit hör inte Personalansvarig (2423)
broader: Organisationsutvecklare, utredare och HR-specialister m.fl.
related: xSLo P6B 2AF
related: nt4p 6kN Lt2
related: m4zm ts4 Wy5
related: DJgq zBj bKt
related: 4hwd 4fh RD7
related: E13X ZF3 PAb
related: yfTA ncB DSc
related: ySUJ ZKQ G2U
related: pTEm Nhr fFq
related: C2423
related: LsGo Kh2 3kH
related: aUr6 Rjg ja2
related: R9MA bax BHa
related: kjop UjM GNT
related: RwCa yJR Y5V
related: t59S 14G MhK
related: 3HjW 1BP k3S
related: cDU5 op5 Tuk
related: 3vYj Rhf Voh
related: eome z2j iv4
related: Uv9y v2g efa
related: Tmps QPE g3V
related: hcdL zcK zgq
related: fmGj KZi C9x
related: UHaA wGd jgx
related: TZcg h4T aMT
related: 29MP yhF mjx
related: 8tYq EXD Xwm
related: 4Ya1 1Rv EB3
related: Aasw 39M r6u
related: NUC3 y1C Scg
related: cw2M p2W SuJ
related: Y3B6 QRV zGk
related: FuRR uys fcp
related: oTKR GSK e9B
related: EU8B Vir DXH
related: eThQ HCv mY6
related: DfC4 KjK LTC
related: dYqT JBz NZE
related: pmgB Pvx 9fK
related: U4tf ZBt Xu1
related: 5wab aFK gdL
related: 2Mtp uhe wmS
related: fiLT BSW HCb
related: HxKb aYu Sif
related: PVnT yGT SMb
related: qtHa AsU Cfo
related: Nig2 2pU GT8
related: A5jq Gnu 8tG
related: CHKu 2Kb 1Q2
related: jfd3 4zS fjt
related: LmAP e75 pc6
related: q7Mx gjU F9q
related: pxZi bWS MSr
related: 91Ef 58Y jX4
related: 7scD 9YP iwV
related: ispD kdf oQ4
related: z7wE 9xb 3jX
related: n72g UEM zTH
related: jcpA Zfs nSz
related: Ggsm 7px yvJ
related: 9MoM m8y Em5
related: cULS KHX WUY
related: RB7E jE5 MZ3
related: 5NCy xRP RJK
related: Betk ZCh mY9
related: ATTh Zwh Guk
related: K5j7 sjo LYB
related: 2ZFC 6de YSB
related: CaXq Bbe T3X
related: B1rc wCc vne
related: w8bU wHe omF
related: uNtd ZYt HFA
related: M43v ZfW wod
related: 73gL 4uv p9J

Verkstadsingenjör
type: Concept
in scheme: JobTech Taxonomy - Yrke
definition: Verkstadsingenjör
broader: Ingenjörer och tekniker inom maskinteknik
related: 6Hq3 tKo V57
related: 9aEn jPz gJs
broad match: C3115

Markförhandlare
type: Concept
in scheme: JobTech Taxonomy - Yrke
definition: Markförhandlare
broader: Lantmätare
related: RPTn bxG ExZ
related: X82t awd Qyc
related: kzpd qqP fmB
broad match: C2165

Handpaketerare och andra fabriksarbetare
type: Concept
in scheme: JobTech Taxonomy - Yrke
definition: Handpaketerare och andra fabriksarbetare
broader: Andra yrken inom bygg, tillverkning och godshantering
narrower: Handpaketerare och andra fabriksarbetare

Grävlastarförare, anläggning
type: Concept
in scheme: JobTech Taxonomy - Yrke
definition: Grävlastarförare kör grävlastare som används för mindre grävarbeten, till exempel kabelgrävning, gatuunderhåll och dikning, där mobilitet och flexibilitet spelar större roll än ren grävningskapacitet. Grävlastarförare är en anläggningsmaskinförare som kör maskiner för grävning och jordförflyttning vid byggandet av hus, bostadsområden, vägar och anläggningar. I arbetet ingår att sköta underhåll och enklare reparationer av maskinens kringutrustning. Ibland hjälper anläggningsmaskinföraren också till med markarbeten utanför maskinen. Anläggningsmaskinföraren har yrkesbevis i ett eller flera maskinslag. Anläggningsmaskinföraren kan ansöka om sitt yrkesbevis efter teoretisk grundutbildning och lärlingsanställning. Källa: Arbetsförmedlingen
broader: Anläggningsmaskinförare m.fl.
related: DyxJ MiH V3p
related: j7Cq ZJe GkT
related: sRa5 6YZ cn9
related: Ee7W dUJ 4qn
related: ja7J P8X YC9
related: Mxyf t2J iLA
broad match: C8342

Inspektör, Polisen
type: Concept
in scheme: JobTech Taxonomy - Yrke
definition: Inspektör, Polisen
broader: Poliser
related: E7hm BLq fqZ
related: iMqo ath xRX
related: KcQD 8ww HkE
broad match: C3355

Bryggeritekniker
type: Concept
in scheme: JobTech Taxonomy - Yrke
definition: Bryggeritekniker arbetar med produktion av drycker. Man kan arbeta i hela eller delar av produktionskedjan, från beredning av råvaror till färdig produkt. Arbetsuppgifterna inkluderar bryggning, tappning, kvalitetsanalyser, underhåll av maskiner samt rengöring av utrustning. Man kan arbeta med både alkoholhaltiga och alkoholfria drycker, samt på destillerier med destillering och produktutveckling. Vanliga arbetsplatser är bryggerier eller livsmedelsproducenter. Beroende på arbetsplats kan lager- och leveransarbete även förekomma. Källa: Arbetsförmedlingen
broader: Övriga maskinoperatörer, livsmedelsindustri m.m.
related: Aspw HyJ 5eX
related: 3rrM fAg k7r
related: SdK4 Tsu QJF
related: XttF 8nh 8u8
related: 1KMx Xpc riv
related: tE8k 8ot 1Xs
related: wTEr CBC bqh
broad match: C8160

Väg- och anläggningsarbetare, utan yrkesbevis
type: Concept
in scheme: JobTech Taxonomy - Yrke
definition: Som väg- och anläggningsarbetare bygger du broar, kajer, tunnlar, gator, vägar, parker, trädgårdsanläggningar med stensättningar och mycket mer. Jobbet kan ibland vara fysiskt, men till din hjälp har du olika maskiner och tekniskt avancerade specialinstrument, där allt från asfaltering till olika rörledningar i mark ingår i arbetsuppgifterna. Väg- och anläggningsarbetare finns både inom den privata och offentliga sektorn. Källa: BYN
broader: Anläggningsarbetare
related: j7Cq ZJe GkT
related: Cdke otX mf5
related: CdFy j8y meP
related: ja7J P8X YC9
related: MMqS zDF RQ4
broad match: C7119

Filmelektriker/TV-elektriker
type: Concept
in scheme: JobTech Taxonomy - Yrke
definition: Filmelektriker/TV-elektriker
alternative label: Filmelektriker
alternative label: TV-elektriker
broader: Ljus-, ljud- och scentekniker
related: 8too bEs 7NU
related: 9puE nYg crq
related: yhCP AqT tns
related: d1Ao 9bY 7Kn
related: tDh6 Gi6 XTF
related: cXni cHS Nxp
broad match: C3521

Övriga jurister
type: Concept
in scheme: JobTech Taxonomy - Yrke
definition: Utför annat juridiskt specialistarbete än inom 2611-2615. Exempel på arbetsuppgifter: Ansvarar för indrivning av skatter, böter och andra allmänna medel samt verkställande av domar och beslut i enskilda mål. Handlägger juridiska ärenden inom försvaret eller kyrkan. Tar fram föreskrifter och ger råd i hur man ska tolka miljölagar och förordningar. Genomför förhandlingar och utför juridisk rådgivning.
broader: Jurister
related: xSLo P6B 2AF
related: DJgq zBj bKt
related: nZMQ bGf Xou
related: 7JTy BCE 1dx
related: aUr6 Rjg ja2
related: C2619
related: TSpk V3M 58x
related: 3HjW 1BP k3S
related: hqDp WRd i9s
related: YaHy ShR uo4
related: UBgX VLG mTK
related: 1U6i pFi GcN
related: w9kF 5oy ySz
related: oDP7 ReX a9j
related: 3vYj Rhf Voh
related: DkcA 2io BNv
related: Uv9y v2g efa
related: Tmps QPE g3V
related: aMrn LR6 Eat
related: UapV Lk5 DZr
related: AqoH owh Lac
related: KZb6 UBs gP9
related: BrdZ oPC Kft
related: SmZd Jaa BeY
related: t4Ek voQ zD3
related: fXeR XX6 cBe
related: QAaJ QeY Q6P
related: NUC3 y1C Scg
related: TFCj pyW JR2
related: detQ YNb 9nG
related: cw2M p2W SuJ
related: nF6J MNc ZxS
related: STa2 hti QFw
related: iqT9 zoW Pj5
related: EU8B Vir DXH
related: pLfm Uff BsM
related: VDem uq7 xxc
related: Jjgt 4oU 3Ba
related: dYqT JBz NZE
related: 5wab aFK gdL
related: yPmK 7b8 L3H
related: AW8R baL eV1
related: fiLT BSW HCb
related: PVnT yGT SMb
related: qtHa AsU Cfo
related: Nig2 2pU GT8
related: 2RDK rgU P6R
related: rXST u2H Ujo
related: qWPT Ygb CKr
related: 312J k9G TJK
related: 4RbW Kwb whi
related: LmAP e75 pc6
related: crJp F6t Ho7
related: WJa2 cQS naH
related: q7Mx gjU F9q
related: 7scD 9YP iwV
related: D6ev Zwt x83
related: NYbU buD WVZ
related: jcpA Zfs nSz
related: Juia j2p bAj
related: QFsa CfY 1Ly
related: R5ce 7aY mEs
related: RB7E jE5 MZ3
related: mD1c 2NB pDo
related: p5Fe yDP tZs
related: 4fRg DA4 Dj3
related: 2m2o hEw kee
related: MWUm KkJ Vzs
related: DNuY aoK i1h
related: Jd1D jKD qaD
related: 2ZFC 6de YSB
related: Tu3a CQh nGG
related: ZSXe KXh TzJ
related: B1rc wCc vne
related: JB36 JaY mB2

Friluftssamordnare
type: Concept
in scheme: JobTech Taxonomy - Yrke
definition: Friluftssamordnare
broader: Planerare och utredare m.fl.
related: 9rwT 8fe Z2v
related: zivz 1BQ fxJ
related: X82t awd Qyc
related: VSAf VfC hKy
related: TZe9 NsN uce
related: B7hB AUU 7eC
broad match: C2422

Seismolog
type: Concept
in scheme: JobTech Taxonomy - Yrke
definition: Seismolog
broader: Geologer och geofysiker m.fl.
related: kJeN wmw 9wX
broad match: C2114

Hälsoekonom
type: Concept
in scheme: JobTech Taxonomy - Yrke
definition: Hälsoekonom
broader: Nationalekonomer och makroanalytiker m.fl.
related: X82t awd Qyc
broad match: C2631

Super cargo
type: Concept
in scheme: JobTech Taxonomy - Yrke
definition: Super cargo
broader: Speditörer och transportmäklare
related: RPTn bxG ExZ
related: ASGV zcE bWf
related: Gmmk 3Pk bcW
broad match: C3324

Intimitetskoordinator
type: Concept
in scheme: JobTech Taxonomy - Yrke
definition: Intimitetskoordinator arbetar nära skådespelare, regissörer och produktionsbolag för att planera, instruera och trygga arbetsprocesser vid inspelning av intima scener i film och tv. Vanliga arbetsuppgifter är att riskbedöma manus, hålla individuella samtal med skådespelare, skapa tydlig koreografi för intima moment och tillhandahålla skyddande intimitetsplagg när det behövs. Intimitetskoordinatorn ansvarar för att skådespelarnas gränser respekteras från förproduktion till färdig film, och att arbetsmiljön är så trygg och professionell som möjligt för samtliga inblandade. Källa: Arbetsförmedlingen, Göteborgs Stadsteater, SVT
broader: Inspicienter och scriptor m.fl.
related: 8too bEs 7NU
related: 9puE nYg crq
broad match: C3435

Ramppersonal, flyttkarlar och varupåfyllare m.fl.
type: Concept
in scheme: JobTech Taxonomy - Yrke
definition: Packar, lastar och lossar gods, möbler, maskiner och andra artiklar. Tankar flygplan och hanterar bagage. Fyller på och staplar varor. Hit hör inte Godshanterare, truckförare (8344)
broader: Hamnarbetare och ramppersonal m.fl.
related: EirM Asx dUb
related: oYw1 ABR UMH
related: 5And Mn6 F6p
related: C9333
related: ws2R MBQ svX
related: Ahfa KuY 4HZ
related: tWch mrP ECi
related: n2h6 u14 dh1
related: tKd2 9Ei PTQ
related: 6upz 2TF Ah2
related: dJhh agZ YWE
related: rfUG tUK 4cc
related: Emrj oG2 D7b
related: J455 EA8 ZxD
related: KNSe z5R LLq
related: Ty8v puq yxx
related: 1oA3 GfA 82Y
related: C9334
related: ENrQ eiN i3i
related: BcdB x4v jpy
related: HnQ2 FhC xgt
related: 8GZn XsP qg8
related: CiMi 7ax tXs
related: C5cf P6E hhT
related: rYxp wbM YSG
related: jPhb feC ypa
related: XQet 5J6 HGj
related: v3dQ 9We tK5
related: rwir xvu 443
related: Rq1w yrE 3Xu
narrower: Roddare/Roadie
narrower: Flygplatstekniker
narrower: Vitvarumontör/Hemelektronikinstallatör
narrower: Flygplanslastare
narrower: Stagehand
narrower: Packmästare flytt
narrower: Expressarbetare/Flyttkarl/Stadsbud
broad match: ASGV zcE bWf

Idéhistoriker
type: Concept
in scheme: JobTech Taxonomy - Yrke
definition: Idéhistoriker
broader: Arkeologer och specialister inom humaniora m.m.
related: X82t awd Qyc
broad match: C2633

Grundskollärare, fritidspedagoger och förskollärare
type: Concept
in scheme: JobTech Taxonomy - Yrke
definition: Grundskollärare, fritidspedagoger och förskollärare
broader: Yrken med krav på fördjupad högskolekompetens inom utbildning
narrower: Grundskollärare
narrower: Fritidspedagoger
narrower: Förskollärare

Förgyllare
type: Concept
in scheme: JobTech Taxonomy - Yrke
definition: Förgyllare belägger föremål med guld eller andra guldfärgade material. Man förgyller till exempel möbler, keramik, metall, böcker och konsthantverk. Förgyllare är ett hantverksyrke som främst utförs med manuella tekniker men kan även göras med elektroplätering. Man kan arbeta både med restaurering och ny design. Källa: Folkuniversitetet, Hantverkslärling, Statens fastighetsverk
broader: Musikinstrumentmakare och övriga konsthantverkare
related: j1Zf iZS 4qp
related: PaxQ o1G wWH
broad match: C7316

Arbetsledare lager och terminal
type: Concept
in scheme: JobTech Taxonomy - Yrke
definition: Arbetsledare inom lager och terminal leder den dagliga verksamheten vid lager och terminaler. Arbetsuppgifter kan omfattar planering och fördelning av arbetsuppgifter inom till exempel godsmottagning, plock, lastning, lossning och utleverans. Arbetsledaren samordnar personal, följer upp logistikflöden och säkerställer att arbetsmiljö- och säkerhetsrutiner efterlevs. Kontakter med chaufförer, driftledning och externa parter ingår vanligtvis. Yrkesrollen är bred och kan förekomma i olika typer av företag och organisationer, till exempel logistikföretag, grossistverksamheter och distributionscentraler. Källa: Arbetsförmedlingen
broader: Arbetsledare inom lager och terminal
related: 9MJS WS8 wvk
related: imm1 Lsm Xey
related: B2Gy 2EF 8Sp
related: 9aE8 Emo 9Nu
related: gVyz umr eYi
related: M8J3 2cD wBv
related: ASGV zcE bWf
related: iNEi p1Y kB6
related: LJ9Z H85 QN9
related: Mwz8 GER ms3
related: ozsr 7rF tTy
broad match: C4321

Försäkringsrådgivare
type: Concept
in scheme: JobTech Taxonomy - Yrke
definition: En försäkringsrådgivare arbetar med att hjälpa privatpersoner och företag att välja rätt försäkringslösningar utifrån deras behov och ekonomiska förutsättningar. Rollen innebär både rådgivning och försäljning, där målet är att kunden ska känna sig trygg och ha ett anpassat försäkringsskydd. I arbetsuppgifterna ingår att marknadsföra och sälja försäkringar till nya och befintliga kunder, både privatpersoner och företag samt hantera försäkringsansökningar, ändringar i befintliga försäkringar och enklare skadeärenden. Källa: Arbetsförmedlingen, Folksam
broader: Försäkringssäljare och försäkringsrådgivare
related: rDcj Tao TJJ
related: RPTn bxG ExZ
related: 6ffa jMG sz1
related: X82t awd Qyc
related: N5ex tgk 4Yy
related: MwiT KuV D7N
related: HVWy YY5 wDB
broad match: C3321

Linjeproducent
type: Concept
in scheme: JobTech Taxonomy - Yrke
definition: Linjeproducent arbetar med att planera, leda och följa upp hela genomförandet av en film- eller tv-produktion, med särskilt ansvar för budget, tidsplan och resurser. Vanliga arbetsuppgifter är att budgetera, göra inspelningsplaner, anställa personal och avdelningschefer, följa upp kontrakt samt övervaka att produktionen sker säkert, inom givna ramar och enligt schema. Linjeproducenten samverkar med avdelningschefer och rapporterar fortlöpande till producenten om produktionens status. Källa: Arbetsförmedlingen, Film i Väst, Yrkesnämnden för Film och TV
broader: Regissörer och producenter av film, teater m.m.
related: 8too bEs 7NU
related: 9puE nYg crq
related: oo3x 5Ws Pks
broad match: C2654

Ordermottagare
type: Concept
in scheme: JobTech Taxonomy - Yrke
definition: Ordermottagare tar emot och registrerar kundorder via telefon, e-post eller digitala system. Arbetsuppgifterna inkluderar kontroll av orderdata, skapande av offerter, uppföljning av leveranstider och samordning med lager och transportavdelningar. Ordermottagare hanterar kundkontakter kring orderstatus, reklamationer och leveransfrågor samt uppdaterar system med aktuell orderinformation. Rollen involverar även administration av returer och samarbete med inköp och sälj för att säkerställa att kundernas behov tillgodoses. Källor: Manpower, Simplex, Jobbannonser på Platsbanken
broader: Inköps- och orderassistenter
related: 7Awi KFf pTC
related: RPTn bxG ExZ
related: aTxE AcE 2uc
related: 82Te 1qp EBf
broad match: C4322

Hjälpmedelstekniker
type: Concept
in scheme: JobTech Taxonomy - Yrke
definition: Hjälpmedelstekniker arbetar med service, underhåll och anpassning av hjälpmedel för personer med funktionsnedsättning. Hjälpmedelstekniker arbetar ofta på en hjälpmedelscentral. Man bör ha stort intresse för människor och teknik när man arbetar med service, underhåll och anpassning av hjälpmedel. Man kan även arbeta med anpassning av bostäder och arbetsplatser. Hjälpmedlen ges efter personliga behov, beslutet fattas av hälso- och sjukvårdspersonal. En viktig del av verksamheten är därför att rengöra och rekonditionera återlämnade hjälpmedel till ett sådant skick att de funktionellt och säkerhetsmässigt fungerar som nya. Hjälpmedelsteknikern bedömer också om det är lönsamt att reparera hjälpmedlet eller om det ska kasseras. Källa: SKR, Arbetsförmedlingen - Hitta yrken
broader: Finmekaniker
related: jMM8 2bu 4B2
related: XbGF kTp xiq
related: PaxQ o1G wWH
related: QYfx Av4 D6Z
broad match: C7311

Fiskodlare
type: Concept
in scheme: JobTech Taxonomy - Yrke
definition: Odlar och inplanterar fisk och skaldjur.
broader: Fiskodlare och fiskare
related: r6uV Vr4 Qnv
related: udcE w1u UMV
related: C6221
related: hZDG iqA bka
related: Cpc1 jj9 ekk
related: j53D o7U Xkm
related: BroT juN Spe
related: qh6a 8VG LLs
related: xgsu yik m2g
related: asMM i6X ZH5
related: cq8M 44D imS
related: vu45 MJL MvR
related: nxrb AWm cWR
related: uHrY uuQ Req
related: FJgj J85 A7t
related: P3T4 G7P Sta
related: V2rV j2c aJ8
related: rarR CnP wRC
related: rMQS C1f Q1i
related: Fnfm j5U wTX
related: bPHw mw8 Mm5
related: 8J8j asn 6zc
narrower: Vattenbruksarbetare
narrower: Fiskodlare
narrower: Vattenbrukstekniker
broad match: VuuL 7CH adj

Arbetsledare, rivning
type: Concept
in scheme: JobTech Taxonomy - Yrke
definition: Arbetsledare inom rivning planerar och samordnar rivningsprojekt från start till slut. Arbetsuppgifterna inkluderar att fördela arbetsuppgifter till teamet, följa säkerhetsföreskrifter, koordinera med beställare och underentreprenörer samt säkerställa att tidsplaner hålls. Arbetsledaren övervakar arbetsplatsen för att arbetet ska utföras effektivt och säkert, och anpassar arbetsmetoder vid behov. Rollen innebär ofta kontakt med byggnadsingenjörer, arkitekter och kunder för att projektet ska fortlöpa enligt plan. Arbetsledare inom rivning arbetar ofta i varierande miljöer med skiftande arbetsförhållanden. Källa: Arbetsförmedlingen
broader: Arbetsledare inom bygg, anläggning och gruva
related: j7Cq ZJe GkT
broad match: C3123

Stadssekreterare
type: Concept
in scheme: JobTech Taxonomy - Yrke
definition: Stadssekreterare
broader: Planerare och utredare m.fl.
related: X82t awd Qyc
related: x4Wi NWW ogB
broad match: C2422

Rostskyddsmålare
type: Concept
in scheme: JobTech Taxonomy - Yrke
definition: Rostskyddsmålare utför skyddsbehandling av olika ytor, främst metall. Arbetet innebär i huvudsak att först förbereda ytor genom blästring följt av rostskyddsmålning. Applicering av rostskydd kan ske manuellt med pensel och roller samt maskinellt med högtryckssprutning och konvetionell sprutning. Källa: Auktorisation för Rostskyddsmålning, Arbetsförmedlingen
broader: Lackerare och industrimålare
related: rqpp fMn pZY
related: sRZj z3F wUj
related: Nd2Y 1oF zTW
related: srMW hR5 UxY
related: KEq2 gmq iNa
related: jFhY 7dT aDj
related: gHPg qgB 9z5
related: Twrb 8dj sXh
related: wTEr CBC bqh
broad match: C7132

Fartygskonstruktör
type: Concept
in scheme: JobTech Taxonomy - Yrke
definition: Fartygskonstruktör
broader: Civilingenjörsyrken inom maskinteknik
related: SuAn oH9 xNc
related: 6Hq3 tKo V57
related: dRFw Rcu dX7
related: JN5M w1U nqz
related: ubDn yfa EhM
related: jVzr aQ3 cWg
related: ANzB 5LA q1N
broad match: C2144

Trafikingenjör
type: Concept
in scheme: JobTech Taxonomy - Yrke
definition: Trafikingenjör
broader: Ingenjörer och tekniker inom bygg och anläggning
related: j7Cq ZJe GkT
related: ZjCw 9JF b8s
broad match: C3112

Beredskapsdirektör
type: Concept
in scheme: JobTech Taxonomy - Yrke
definition: Beredskapsdirektör
broader: General-, landstings- och kommundirektörer m.fl.
related: X82t awd Qyc
broad match: C1112

Systemförvaltare m.fl.
type: Concept
in scheme: JobTech Taxonomy - Yrke
definition: Ansvarar för och sköter IT-system som är i drift. Underhåller och förbättrar IT-system.
broader: IT-arkitekter, systemutvecklare och testledare m.fl.
related: eTW8 AY5 tpe
related: abgV e4C gwj
related: CtvK s26 dNs
related: sq2c q5d zXN
related: pWTc PxX xX6
related: wynY a5Q F6t
related: NnaR bCQ hK1
related: XVip VKv Ac4
related: juME 7Ek CBR
related: igAK 9XZ E2a
related: oRCp wLd dWd
related: W4Ud Do3 B6S
related: LeES iac 1Qx
related: pwNB ces 8hN
related: vzMh qW9 hHg
related: UGqj u6c Tog
related: qVjQ w6H dns
related: 4f1v w91 qVM
related: Bjvt 4Ji iHn
related: N8Tu Tsn 2VD
related: ZxHj Wvj 39H
related: C69V W4p i5E
related: wTxT qvv sDA
related: Zd17 7XH myf
related: 2iX4 8EH V5W
related: KAVh Qyx GPu
related: voRm aoU cKB
related: Lrrv HyL PzJ
related: bdQe ReZ Bs4
related: ifWk o4W Gir
related: xwT1 oxn Dwq
related: 7d2G KP4 eFb
related: eGP4 984 S1u
related: oisM 5jo EVb
related: gWt1 3JZ 56u
related: VLaA on6 CMq
related: 3nRt vck Jrv
related: bCPt NW1 v2o
related: Ss2A BH7 YrK
related: xAbu uKA Jeu
related: 4Dqo LPf qrU
related: NQmD sAK eFA
related: L4sY nSE UsH
related: bKM3 9g1 WWC
related: T4Fs ix5 kkv
related: eKtc 9pz qch
related: nYAH rZC a2F
related: G7Qq r7L 5Jo
related: BKRi T8q VUy
related: 8Qjp Myj xnv
related: JNqq 4GY 5Kc
related: WQdS Jtu qPC
related: 44NU bjv f3M
related: j3wL CdZ Rz6
related: HQJ2 68A AiZ
related: uED7 pyd cK5
related: Egmd U5i sRA
related: cH7n Y7S UP4
related: eLre uPr fuC
related: qktt D6R UnN
related: G7so 7Ax 7dW
related: nf2k RuW WEC
related: wFXj Qjg eK5
related: gtoY Bwt 23m
related: XuRf F2y Vcq
related: 3H7m pt8 7b2
related: muKv rHW 7ES
related: XRzZ xWE BNx
related: bre7 QmH U8U
related: pYJh yqM cfy
related: SVcH j46 hJZ
related: nhXC MeA vzi
related: kJyW TcC r2e
related: a1Sf mey gVk
related: cScr 7z5 gAg

Revisorer, finansanalytiker och fondförvaltare m.fl.
type: Concept
in scheme: JobTech Taxonomy - Yrke
definition: Revisorer, finansanalytiker och fondförvaltare m.fl.
broader: Yrken med krav på fördjupad högskolekompetens inom ekonomi och förvaltning
narrower: Övriga ekonomer
narrower: Traders och fondförvaltare
narrower: Controller
narrower: Finansanalytiker och investeringsrådgivare m.fl.
narrower: Revisorer m.fl.
narrower: Nationalekonomer och makroanalytiker m.fl.

Formbestämmare/Surface designer
type: Concept
in scheme: JobTech Taxonomy - Yrke
definition: Formbestämmare/Surface designer
broader: Ingenjörer och tekniker inom maskinteknik
related: 6Hq3 tKo V57
related: HzCa HXX 9Fu
related: 9aEn jPz gJs
broad match: C3115

Stålbyggnadsmontör
type: Concept
in scheme: JobTech Taxonomy - Yrke
definition: Stålbyggnadsmontörer monterar stålbyggnader. Man monterar ofta större byggnader, vanligtvis hallar för olika ändamål så som inom lager och industri. Arbetet innefattar montering av balkar, pelare och beklädnad enligt ritning. Delar till stålbyggnader tillverkas vanligtvis i verkstad och körs sedan ut till kund där de monteras på plats. Montören svetsar och bultar samman delarna till färdig byggnad. Beroende på arbetsplats kan andra tillhörande arbetsuppgifter ingå, så som montering av fönster och dörrar samt visst grundläggningsarbete. Källa: Arbetsförmedlingen
broader: Stålkonstruktionsmontörer och grovplåtsslagare
related: TmZi Jm7 Ba4
related: GG51 GRK VZD
related: kiCJ gpS wyf
related: wTEr CBC bqh
broad match: C7214

Chief Information Officer/CIO/IT-chef
type: Concept
in scheme: JobTech Taxonomy - Yrke
definition: Chief Information Officer/CIO/IT-chef
alternative label: CIO
alternative label: Chief Information Officer
alternative label: IT-chef
broader: IT-chefer
related: nUAy GrX HKo
related: epLc SkD cbT
related: ZfJC hPx SPi
related: apaJ 2ja LuF
related: bh3H Y3h 5eD
related: Y2Py kJt zEG
related: gryG HFt 192
related: v12o onp cKS
related: xWB1 aot FUp
related: EEVn Q3t 1gs
related: HP3B X72 AVs
related: WXLe DEU 9jw
broad match: C1330

Sjömätare
type: Concept
in scheme: JobTech Taxonomy - Yrke
definition: Sjömätare utför operativ fältverksamhet inom sjömätning, geodetisk mätning och vattenståndsmätning. Sjömätarna arbetar både ute till havs på sjömätningsfartygen men även med kontroll och bearbetning av data. Källa: Sjöfartsverket
broader: GIS- och kartingenjörer
related: 6Hq3 tKo V57
broad match: C3118

Chefer inom hälso- och sjukvård samt annan samhällsservice
type: Concept
in scheme: JobTech Taxonomy - Yrke
definition: Chefer inom hälso- och sjukvård samt annan samhällsservice
broader: Chefsyrken
narrower: Chefer och ledare inom trossamfund
narrower: Övriga chefer inom samhällsservice
narrower: Chefer inom socialt och kurativt arbete
narrower: Chefer inom äldreomsorg
narrower: Chefer inom hälso- och sjukvård

Isoleringsmontörer
type: Concept
in scheme: JobTech Taxonomy - Yrke
definition: Isolerar värme-, ventilations- och sanitetsanläggningar, pannor, cisterner och rörsystem. Skär ut och monterar ytbeklädnad som skydd för isolering. Monterar reglar på tak och husfasader och isolerar med t.ex. mineralull samt sprutar isoleringsmassa i väggar.
broader: Takmontörer, golvläggare och VVS-montörer m.fl.
related: RJYu zhD Wcv
related: jA7U EuF ibi
related: Kxs2 SWY MjX
related: BV5y wau Zxz
related: aHCV VsV LiD
related: 1JaM 2oZ iQ3
related: DSyz mEy sWT
related: 7MXH rPV NHQ
related: Q7eC B7g QiU
related: qCUQ 2ZH rKU
related: M7C1 DAy UTK
related: 2TC1 Ucy s32
related: fhcp fFw Lbj
related: 7jFS 6oq ZGv
related: nkhA jPz pcE
related: ynWd oCo o61
related: xeoH rao GgZ
related: WAjq Yeb hx3
related: fhu6 H74 uuN
related: iuea pUX v6z
related: C7124
related: WLAi BDr 5fW
related: KfEn V5y npV
related: p6PZ 4XW VgH
related: LYc3 9bi VVq
related: AEgv 4gP ndv
related: HmXd ehy QT9
related: tRk4 jrS sdH
related: xd6u xAv i1z
related: 33Lf vKJ 3U3
narrower: Lärling, isoleringsplåtslagare
narrower: Lösullsinstallatör
narrower: Isoleringsplåtslagare
narrower: Lärling, VVS-isolerare
narrower: VVS-isolerare
broad match: j7Cq ZJe GkT

ST-läkare, psykiatri
type: Concept
in scheme: JobTech Taxonomy - Yrke
definition: Specialisttjänstgöring, ST, är den vidareutbildning som legitimerade läkare genomför för att uppnå specialistkompetens. ST-läkare psykiatri arbetar under handledning för att fördjupa sina medicinska kunskaper och färdigheter med målet att bli specialistläkare inom sitt område. ST-läkaren arbetar självständigt med patientutredningar, diagnostik och behandling, men alltid med stöd av specialister och enligt ett individuellt utbildningsprogram. Vanliga arbetsuppgifter är att ta medicinskt ansvar för patienter, delta i jourverksamhet, genomföra medicinska undersökningar och behandlingar samt dokumentera och följa upp vårdinsatser. Tjänsten omfattar också kontinuerlig kompetensutveckling, sidotjänstgöring inom närliggande områden och aktivt deltagande i handledning och utbildningsinsatser för kollegor och studenter. Källa: Arbetsförmedlingen, Karolinska Universitetssjukhuset, Sveriges läkarförbund, Region Kronoberg, Region Skåne.
broader: ST-läkare
related: NYW6 mP6 vwf
related: UtCj yMj ubw
broad match: C2211

Kompositör
type: Concept
in scheme: JobTech Taxonomy - Yrke
definition: Kompositör skapar, arrangerar och ibland dirigerar musikaliska verk för olika ändamål såsom scenproduktioner, film, TV och konserter. Vanliga arbetsuppgifter är att komponera originalmusik utifrån uppdrag och idéer, arrangera musik för olika ensembler, samarbeta med producenter, regissörer och musiker samt delta i repetitioner och inspelningar. Kompositören kan också behöva anpassa musiken efter produktionens behov och ibland delta i projektledning och produktion av musik. Källa: Arbetsförmedlingen, Musiksverige, StagePool
broader: Musiker, sångare och kompositörer
related: 8too bEs 7NU
related: 9puE nYg crq
related: Jb1Q yKG jbv
broad match: C2652

Sjukhusfysiker
type: Concept
in scheme: JobTech Taxonomy - Yrke
definition: Sjukhusfysiker är experter på strålning och arbetar framför allt med diagnostik och behandling av sjukdomar som cancer inom vården. Sjukhusfysiker är en skyddad titel med legitimationskrav. Arbetsuppgifterna kan till exempel handla om strålbehandling av cancer, strålskydd för personal och patienter eller medicinsk bilddiagnostik. Sjukhusfysiker samarbetar nära läkare och annan vårdpersonal och kan arbeta med utbildning, metodutveckling eller forskning inom medicinsk strålningsfysik. Sjukhusfysiker kan även arbeta som strålskyddsexpert inom kärnkraftsindustrin eller som produktutvecklare på medicintekniska företag. Källa: Arbetsförmedlingen, Lunds universitet, Socialstyrelsen, Stockholms universitet
broader: Fysiker och astronomer
related: kJeN wmw 9wX
related: sqvh gTy 6Sj
related: QpP5 M9d oVt
broad match: C2111

Kundserviceingenjör, tillverkningsindustri
type: Concept
in scheme: JobTech Taxonomy - Yrke
definition: Kundserviceingenjör, tillverkningsindustri
broader: Ingenjörer och tekniker inom maskinteknik
related: 6Hq3 tKo V57
related: 9aEn jPz gJs
broad match: C3115

Ställningsbyggare
type: Concept
in scheme: JobTech Taxonomy - Yrke
definition: En ställningsbyggare bygger och monterar byggnadsställningar som används när nya hus byggs eller gamla hus och fasader renoveras. Ställningsbyggarna bygger hela ställningar från grunden med stålrör och träplank eller monterar ihop färdiga ställningssystem. Byggnadsställning behövs inte bara vid byggprojekt, utan även vid t ex anläggningsprojekt och inom industri. Ställningsbyggaren kan ansöka om sitt yrkesbevis efter teoretisk grundutbildning och lärlingsanställning. Källa: STIB
broader: Ställningsbyggare
related: RQbr SzR 2B6
related: j7Cq ZJe GkT
related: PGen 9SG bp7
related: 3GmV tGm sYD
related: y4MY jNh NiM
related: ja7J P8X YC9
broad match: C7119

Skolvaktmästare
type: Concept
in scheme: JobTech Taxonomy - Yrke
definition: Skolvaktmästare arbetar med praktisk service, reparation och drift av skolmiljöer, både inomhus och utomhus. Arbetsuppgifter omfattar tillsyn, enklare reparationer, montering av möbler och utrustning, nyckel- och larmsystemhantering samt beställning av material. Skolvaktmästare iordningsställer lokaler, bidrar till skolans arbetsmiljöarbete (SAM) och systematiska brandskyddsarbete (SBA) samt utför enklare fastighetsunderhåll. En viktig del av arbetet är teknisk service kopplad till skolans IT-miljö. Skolvaktmästare ger praktiskt stöd till elever och personal vid problem med datorer, digitala hjälpmedel och mobiltelefoni. Arbetet sker ofta i nära kontakt med elever, skolpersonal och externa leverantörer. Källa: Arbetsförmedlingen
broader: Fastighetsskötare
related: gxGb Vxg x98
related: dBK6 pTn VE8
related: yhCP AqT tns
related: pdzu y9D d5K
related: jsjP qTj 39X
broad match: C5153

Revisorer m.fl.
type: Concept
in scheme: JobTech Taxonomy - Yrke
definition: Utreder, granskar och bedömer företags, organisationers och myndigheters redovisning och förvaltning. Ger råd i boksluts-, redovisnings-, skatte-, finansierings- och försäkringsfrågor. Leder företags eller grupp av företags ekonomistyrning. Ansvarar för uppläggning och uppföljning av budget samt analyserar resultat. Bedömer om ledningens intentioner följs och om företagets resurser utnyttjas effektivt. Granskar och utvärderar företagets rutiner och interna kontroll. Hit hör inte Redovisningskonsult (3313)
broader: Revisorer, finansanalytiker och fondförvaltare m.fl.
related: xSLo P6B 2AF
related: DJgq zBj bKt
related: FYk9 RXp 7c5
related: M58q o8J LLV
related: hVq9 mTt xkv
related: eox4 5Lc W7C
related: aUr6 Rjg ja2
related: h8Z3 Fq9 ohg
related: h6B2 Egm LWp
related: 7tVG 9zf 7mw
related: 3HjW 1BP k3S
related: NVfN 26P KUU
related: dSoQ LXG Eh7
related: 3vYj Rhf Voh
related: 5X5B xr3 VSY
related: dBC3 Rwt Mue
related: cmrN Uff Nyc
related: Uv9y v2g efa
related: gn9Y yYC LiH
related: Tmps QPE g3V
related: TGBA zbs yvD
related: P1Zc ZkT K8y
related: dc2G fUp wZN
related: zfcy UAZ FGp
related: awjU C3D XEJ
related: UH9g R5v MCx
related: PFWV Si2 w7i
related: QAaJ QeY Q6P
related: NUC3 y1C Scg
related: ZQux yii D4Q
related: 1qn1 fsa hZm
related: Ygao Vsn eJ2
related: iyhf Cm4 cWw
related: xwAq e21 98L
related: cw2M p2W SuJ
related: z9qQ ei6 Mjs
related: ytD5 G1i 2y5
related: WnFA bt8 kPs
related: 34kt 5uy oYz
related: jjfg y9o zwQ
related: FfWB f5U 9NB
related: W7Qf aRY FEo
related: BsBK j8o Guh
related: s6Ui k2K kf2
related: dYqT JBz NZE
related: faxn t27 sGY
related: 5wab aFK gdL
related: wCxc kMg keR
related: WNnT qrt M77
related: PVnT yGT SMb
related: c52V CGT Gbb
related: qtHa AsU Cfo
related: hTcc jPm dwc
related: Nig2 2pU GT8
related: A5jq Gnu 8tG
related: ibzL TeE YqA
related: Gt5f wdi FSJ
related: 4yr7 byG sX3
related: C2P6 nsE tTa
related: BQRS U7c PTG
related: LmAP e75 pc6
related: nfdN dwW 6PE
related: 7scD 9YP iwV
related: H2yF VoB Pxi
related: bHQT Bhn w3S
related: jcpA Zfs nSz
related: xNEH ZYt xZ3
related: Lq2i vZo BEx
related: e47M NXa 4NG
related: RB7E jE5 MZ3
related: LAFL 9mg crP
related: 4fRg DA4 Dj3
related: CVTD iab JgP
related: DxyA A72 J4a
related: 7um4 89D Cr7

Byggnads- och anläggningsyrken
type: Concept
in scheme: JobTech Taxonomy - Yrke
definition: Byggnads- och anläggningsyrken
broader: Yrken inom byggverksamhet och tillverkning
narrower: Takmontörer, golvläggare och VVS-montörer m.fl.
narrower: Snickare, murare och anläggningsarbetare
narrower: Målare, lackerare och skorstensfejare m.fl.

Ledande montör, el
type: Concept
in scheme: JobTech Taxonomy - Yrke
definition: En ledande montör inom el är en elektriker med arbetsledaransvar och utförandeansvar för el- och teleinstallationer vid ny- och ombyggnader. Ledande montören deltar vid resursplanering av material och personal, resultat- och budgetarbete. Den ledande montören leder och fördelar arbetet med ansvar för mellan fem och tio installatörer och är kontakten mellan arbetslaget och projektledaren. Källa: Arbetsförmedlingen
broader: Installations- och serviceelektriker
related: CSf3 WS4 FQG
related: yhCP AqT tns
related: ja7J P8X YC9
broad match: C7411

Inspelningsassistent
type: Concept
in scheme: JobTech Taxonomy - Yrke
definition: Inspelningsassistent ansvarar för praktisk och logistisk support på inspelningsplatser inom film- och medieproduktioner. Vanliga arbetsuppgifter är att organisera och se till att luncher och fikapauser fungerar smidigt för team och statister, assistera med enklare ärenden på inspelningsplatsen, samt hantera material och utrustning enligt produktionens behov. B-körkort är ett vanligt krav då arbetet ofta inkluderar transporter. Källa: Arbetsförmedlingen, Film i Väst
broader: Inspicienter och scriptor m.fl.
related: 8too bEs 7NU
related: 9puE nYg crq
related: 1AG8 8NB CZw
broad match: C3435

Produktområdeschef, järnväg
type: Concept
in scheme: JobTech Taxonomy - Yrke
definition: Produktområdeschef, järnväg
broader: Inköps-, logistik- och transportchefer
related: epLc SkD cbT
related: NgHF ivo DwS
related: ASGV zcE bWf
related: bh3H Y3h 5eD
broad match: C1324

Cisterntekniker
type: Concept
in scheme: JobTech Taxonomy - Yrke
definition: Cisterntekniker utför besiktningar, underhåll och rekonditionering av drivmedelscisterner. Förutom cisterner kan arbetet även innebära underhåll av tillhörande rörledningar. Arbetsuppgifterna inkluderar bland annat tömning, rengöring, täthetsprovning och protokollföring. Arbetet omfattar även blästring, applicering av beläggningar i glasfiber och plast samt hantering av kemiska och brandfarliga ämnen, ofta på bensinstationer eller andra anläggningar med cisterner. Källa: Arbetsförmedlingen
broader: Tunnplåtslagare
related: JLiA an5 j8T
related: 16wX BTq SNV
related: wTEr CBC bqh
related: LJ2x LHC Sce
broad match: C7213

Malmförädlingsyrken och brunnsborrare m.fl.
type: Concept
in scheme: JobTech Taxonomy - Yrke
definition: Malmförädlingsyrken och brunnsborrare m.fl.
broader: Process- och maskinoperatörer
narrower: Bergsprängare
narrower: Processoperatörer, stenkross- och malmförädling
narrower: Brunnsborrare m.fl.
narrower: Maskinoperatörer, cement-, sten- och betongvaror
narrower: Gruv- och stenbrottsarbetare
narrower: Stenhuggare m.fl.

Universitets- och högskolelektorer
type: Concept
in scheme: JobTech Taxonomy - Yrke
definition: Undervisar samt deltar i utvecklingen av grund- och forskarutbildning. Handleder och examinerar studerande inom grundutbildning. Handleder doktorander. Deltar i internt ledningsarbete. Planerar och genomför forskningsverksamhet.
broader: Universitets- och högskolelärare
related: snfZ N1g wrT
related: siJz YEX fvq
related: GtgF ir3 duv
related: ddzL 9as rZt
related: SWxu SnV 3oi
related: 9Ra9 2yh jH4
related: tzJA VZj 7ED
related: BvuG XdH tSq
related: Zffc M4R Gws
related: SpRR JX9 6o6
related: PZiV Lwg guL
related: tYTv fLA EV5
related: C2310
related: gN4Z uRf LQp
related: FZpm KGY GrH
related: T93s ayM mop
related: Qc3r bM8 HsQ
related: 4hm5 UQk gGm
related: 5hrX ckd X8x
related: H6C4 BcN XAx
related: uwXg zmB Pdk
related: 2zkr pfv Wrk
related: UTCS daw 58F
related: jfmZ FfR NFm
related: hDvV ryY gUm
related: B7WE aJZ 3rn
related: mHaL zth 6R8
related: 9wjT WBC ppy
related: xE6k qAE vrk
related: pamn k5z ByJ
related: JYk8 qUB VcF
related: LswY aiM UT8
related: c2YE oK3 f1u
related: NRJn rU6 zUQ
related: 9kKp C7D Qme
related: BGCr oNQ WRD
related: ppnH 9N4 FE2
related: SYis puJ kXV
related: ezVu GhE b3b
related: QEfk 7p4 yCb
narrower: Universitets- och högskolelektor
narrower: Biträdande universitetslektor/Biträdande högskolelektor
broad match: MVqp eS8 kDZ

Nät- och kraftsystemsanalytiker, elkraft
type: Concept
in scheme: JobTech Taxonomy - Yrke
definition: Nät- och kraftsystemsanalytiker, elkraft
broader: Civilingenjörsyrken inom elektroteknik
related: 6Hq3 tKo V57
related: Twmz TGb UeT
related: kEn1 Bqc 5kh
related: VPut b9f rVd
broad match: C2151

Värderingsassistent
type: Concept
in scheme: JobTech Taxonomy - Yrke
definition: Värderingsassistent
broader: Skadereglerare och värderare
related: hu2N pYc 8eB
related: X82t awd Qyc
broad match: C3315

VA-strateg
type: Concept
in scheme: JobTech Taxonomy - Yrke
definition: VA-strateg
broader: Civilingenjörsyrken inom bygg och anläggning
related: j7Cq ZJe GkT
related: anYS 5AR JRk
broad match: C2142

Verkstadstekniker
type: Concept
in scheme: JobTech Taxonomy - Yrke
definition: Verkstadstekniker arbetar i mekaniska verkstäder med att tillverka, reparera och underhålla mekaniska produkter. Arbetet sker både manuellt och maskinellt. Beroende på arbetsplats kan arbetet vara mer specialiserat, till exempel protoptyptillverkning. Arbetet kan även vara mer brett, till exempel vid kommuners underhållsavdelningar. Yrket skiljer sig från maskinställare/maskinoperatör som främst avser tillverkning i större skala. Yrket avser inte arbete i fordonsverkstad, se istället yrkena Personbilsmekaniker och Maskinmekaniker. Källa: Arbetsförmedlingen
broader: Maskinställare och maskinoperatörer, metallarbete
related: eHdx ARt M5J
related: RYMX LvY s1s
related: A5qC Jz6 UTy
related: SPmo 4nb DW9
related: qpjb iL4 K68
related: tvpK HZe tXw
related: XF24 Nm3 m5Y
related: 3c7R gMz qnr
related: FeAv WV7 ipR
related: 49zZ ks3 2DN
related: v3YU NdG Jy3
related: bRLB FDz tVP
related: giQv D5z FqX
related: wTEr CBC bqh
broad match: C7223

Arbetsledare inom grönyteskötsel och trädgårdsanläggning
type: Concept
in scheme: JobTech Taxonomy - Yrke
definition: Arbetsledare som planerar och leder andra inom grönyteskötsel och trädgårdsanläggning. Arbetsuppgifterna inkluderar att schemalägga och organisera arbetslag, kvalitetssäkra arbete, hantera kundkontakter och framställa offerter. Arbetsledaren deltar också praktiskt i grönyteskötsel och trädgårdsanläggningsarbeten, varför en bakgrund inom trädgård oftast är ett krav. Arbetsledaren har ofta ansvar för att arbetsmiljöregler och skyddsföreskrifter följs under arbetet. Vanliga arbetsplatser är på kommuner och kyrkogårdar men även privata företag. Se även yrkena parkarbetare, kyrkogårdsarbetare och trädgårdsanläggare. Källa: Arbetsförmedlingen
broader: Trädgårdsanläggare m.fl.
related: b3jm UZQ ZyL
related: QsEn 41z 5Xn
related: vk6y 67Z U14
related: vGTv SQQ Yor
related: Ba8W wqH R9g
related: 8dkE tyh 15s
related: NynS 2Da 63p
related: VuuL 7CH adj
related: KirQ PN3 YAt
broad match: C6113

Solcellsmontör
type: Concept
in scheme: JobTech Taxonomy - Yrke
definition: En solcellsmontör ansvarar för att installera och montera solpaneler på tak eller andra ytor. Arbetet innebär att sätta upp fästen, montera solpanelerna. Montören ser till att installationen följer gällande säkerhetsstandarder och att systemet fungerar optimalt. Rollen kräver både teknisk kunskap och praktiska färdigheter för att säkerställa en säker och effektiv installation av solcellssystem. Källa: Arbetsförmedlingen
broader: Montörer, elektrisk och elektronisk utrustning
related: VyCf D1P c6g
related: PzKE 8MT mSX
related: yhCP AqT tns
related: EukC Jfb PQK
broad match: C8212

Underhållsmekaniker
type: Concept
in scheme: JobTech Taxonomy - Yrke
definition: Underhållsmekaniker utför förebyggande och avhjälpande underhåll på industrimaskiner och mekanisk utrustning. Arbetet innebär till exempel att underhålla och felsöka maskiner för att förhindra driftstopp, till exempel inom tillverkningsindustri. Förutom underhållsmekanik har underhållsmekaniker även kunskap i robotik, elteknik, mätteknik, hydraulik och svetsteknik. Yrket liknar, men är inte detsamma som Underhållstekniker som finns i yrkesgruppen Ingenjörer och tekniker inom maskinteknik. Yrket kan även misstas för maskinmekaniker, som dock arbetar med fordon. Källa: Arbetsförmedlingen
broader: Underhållsmekaniker och maskinreparatörer
related: ByQe EBf zGv
related: 4m9V wrG D2V
related: m4fW Z9K GWo
related: bzvZ t5y SeJ
related: R4G2 Y5A ETy
related: RhHe Yo7 3Rx
related: 8iA5 u7o QFq
related: Jjqy BZj udk
related: Bg4x bwW sUF
related: p9uD eHB LAc
related: ynFn k8s Em6
related: L2rm XBQ cE6
related: N8is HXL 9d5
related: qdeu D8m kuU
related: duPo D9Y mhd
related: cSQD MFv 6rK
related: yhCP AqT tns
related: BkqT MVP FHF
related: R3xC Cq4 fYY
related: 9FyS gkK 2kX
related: J6wK q6c wDn
related: Va15 JKN kWz
related: wcqc AwY 2bX
related: AiKj 1DA gWi
related: ZpVH jkq 1T9
related: YYSo QxB As3
related: WZ6M RaK 3qV
related: DZBx TEh GGa
related: Hazh gwS Rkh
related: vfpF 58s BtS
related: oBCZ Wvq 8YB
related: rkdU tsa ifX
related: QUuK xD3 tEj
related: 75LY 72v 7um
related: Rjqd 8YV mBn
broad match: C7233

Projektledare, ventilation
type: Concept
in scheme: JobTech Taxonomy - Yrke
definition: Projektledare, ventilation
broader: Ingenjörer och tekniker inom maskinteknik
related: 6Hq3 tKo V57
related: j7Cq ZJe GkT
related: 9aEn jPz gJs
related: yXSE wvx EAN
broad match: C3115

Tandsköterska
type: Concept
in scheme: JobTech Taxonomy - Yrke
definition: Tandsköterskor assisterar tandläkare och tandhygienister vid undersökningar och behandlingar. Arbetsuppgifterna omfattar förberedelse och sterilisering av instrument, röntgenfotografering, bedövning samt vissa självständiga behandlingar. Förebyggande tandvård och patientinformation ingår också i rollen. Administrativa uppgifter såsom tidsbokning, journalhantering och betalningshantering är vanligt förekommande. Källa: Sveriges kommuner och regioner, Arbetsförmedlingen
broader: Tandsköterskor
related: NYW6 mP6 vwf
related: ZUeb s1b ruF
related: ox1c sMN j7e
related: CK2i U7C t5N
related: oVgU d95 9yU
related: pX15 36C NP2
related: bjon frz M51
related: sjd2 DWG gRr
related: R6GW B8B jCP
related: NgG1 5qR MDs
related: Rihi M8A xqi
related: 63BC wGB 4tQ
broad match: C3251

Chefer inom äldreomsorg
type: Concept
in scheme: JobTech Taxonomy - Yrke
definition: Formulerar och ansvarar för mål och strategier för verksamhet inom äldreomsorg. Utformar riktlinjer, följer upp och utvärderar verksamheten mot uppsatta mål. Svarar för budget samt fördelar resurserna inom verksamheten. Har personalansvar.
broader: Chefer inom äldreomsorg
related: 27CA XhE faC
related: C1343
related: Yt2Z 1pY MNz
related: YS7V c8n MrS
related: G7Qq r7L 5Jo
related: UH9g R5v MCx
related: SmZd Jaa BeY
related: 8tYq EXD Xwm
related: ZzN5 m7B 5CY
related: detQ YNb 9nG
related: SfoE zq7 ADN
related: Nksx 4oe fEQ
related: eThQ HCv mY6
related: 5PjX 999 uLZ
related: Gt5f wdi FSJ
related: D6ev Zwt x83
related: zXNU zXR hGd
related: gHBQ WJe ijx
narrower: Områdeschef, omsorg
narrower: Enhetschef, hemtjänst
narrower: Föreståndare, äldreboende
narrower: Äldreomsorgschef
narrower: Servicehusföreståndare
broad match: bh3H Y3h 5eD

Mimskådespelare
type: Concept
in scheme: JobTech Taxonomy - Yrke
definition: Mimskådespelare
broader: Skådespelare
related: 9puE nYg crq
broad match: C2655

Systemsäljare
type: Concept
in scheme: JobTech Taxonomy - Yrke
definition: Systemsäljare
broader: Företagssäljare
related: jCmQ 7oc juc
related: NjV2 7Nq 24V
related: HsPw CXL 8A6
related: nKuT FZs Dtw
related: WUny tLP QyC
related: aip7 bDY myF
related: rDcj Tao TJJ
related: Co1K QQN gF6
related: pqH4 FBy 591
related: RPTn bxG ExZ
related: LR8A F7w 9C4
related: m3BM 2Ta Jax
related: GpFr nFv xgG
related: CquG Qa6 uY4
related: YL5b VEu 8os
related: XcCs 7np RBP
related: tdxQ q6Z Vir
related: sbn1 RNV VbJ
related: Yfqq aRX C5K
related: YhUd XVU vWt
related: SPn2 XdE iD3
related: KGtt xor Dk3
related: L4qx DwU bAR
related: 7K81 R43 xBJ
related: eiQU ktH SoS
related: Dc3s mJg 5pq
related: er65 RH7 WVM
related: kpa4 bXi Azd
related: A1yR 9Nw Ngz
broad match: C3322

Operationssjuksköterskor
type: Concept
in scheme: JobTech Taxonomy - Yrke
definition: Samordnar och leder arbetet i en operationssal och ansvarar för omvårdnad av patienter. Ställer i ordning och kontrollerar medicinteknisk apparatur och utrustning samt ansvarar för hygien och aseptik.
broader: Sjuksköterskor (fortsättning)
related: 4QAE wtY gJh
related: 2KV1 FD8 vGp
related: C1qR L83 nzh
related: 9Fna GUm HWL
related: Mmxs Qrv cpG
related: UbGZ 9pL wwW
related: dJa5 Nao mDS
related: Lqnz Zqw nQ9
related: eThQ HCv mY6
related: F7nJ k5s L29
related: Ektq nPz 4YF
related: LMx4 LbA vxB
related: wBPu wTW RgG
related: aS2X 4ZL 9h7
related: BvGm Zuj VLF
related: 2GuF gtz xfW
related: rF7s hX1 ECH
related: rVUL AgV ZTH
related: C2221
related: GYz6 5Jt Wmy
related: 6z3x TVy dAU
related: 5Kym 2ad Pqi
related: jxKr BmN CcQ
related: pGBH BkG qJa
related: yV9B PxJ TxS
narrower: Operationssjuksköterska
broad match: NYW6 mP6 vwf

BT-läkare
type: Concept
in scheme: JobTech Taxonomy - Yrke
definition: BT-läkare är en legitimerad läkare som arbetar under handledning med kliniskt patientarbete inom olika delar av svensk hälso- och sjukvård som en första del av specialiseringstjänstgöringen (ST). Vanliga arbetsuppgifter är att diagnostisera och handlägga akuta och icke akuta sjukdomstillstånd inom primärvård, akut sjukvård, psykiatri och ofta geriatrik, samt att inleda och följa upp behandlingar. BT-läkaren arbetar självständigt men alltid med stöd av handledare, och tjänstgöringen omfattar vanligtvis 12 månader med placeringar på flera enheter. Under BT (bastjänstgöring) ingår även att delta i utbildningar och seminarier. Källa: Arbetsförmedlingen, Sveriges läkarförbund, Region Uppsala, Region Stockholm, Region Skåne
broader: ST-läkare
related: NYW6 mP6 vwf
related: hVyF RPn zqF
broad match: C2212

Inredningssnickare/Specialsnickare
type: Concept
in scheme: JobTech Taxonomy - Yrke
definition: Inredningssnickare tillverkar inredningsdetaljer, ofta i småskalig produktion. Yrket kallas även specialsnickare, då man ofta jobbar med specialbeställningar av inredning för en specifik kund. Man tillverkar till exempel butiksinredning, offentliga inredningar, köksinredningar, och fordonsinredningar. Yrket liknar möbelsnickare på det sättet att man ofta arbetar med hela processen, från kundens idé till färdig och installerad/monterad produkt. Inredningssnickare/Specialsnickare har framför allt goda kunskaper i finsnickeri. Men arbete med mer automatiska maskiner, till exempel CNC-maskiner, kan förekomma beroende på vad som ska tillverkas. Arbetet innebär ofta kontakter med kund. Källa: Arbetsförmedlingen - Hitta yrken, Trä- och möbelföretagen
alternative label: Inredningssnickare
alternative label: Specialsnickare
broader: Fin-, inrednings- och möbelsnickare
related: hYAA Ajt N1F
related: vWgL zQi YoY
related: oWZf tJQ AQ5
related: ppoM zgg Yhk
related: PaxQ o1G wWH
related: 6C82 SQD 5M7
broad match: C7115

Hållbarhetschef
type: Concept
in scheme: JobTech Taxonomy - Yrke
definition: Hållbarhetschef
broader: Forsknings- och utvecklingschefer
related: vEXZ 6tU pJ6
related: bh3H Y3h 5eD
related: rTR8 uuX Lnm
related: kY2A b5p SzN
related: bxmN 2BB SPV
broad match: C1223

Fortbildningskonsulent
type: Concept
in scheme: JobTech Taxonomy - Yrke
definition: Fortbildningskonsulent
broader: Speciallärare och specialpedagoger m.fl.
related: 3pyE aAA TFD
related: MVqp eS8 kDZ
broad match: C2351

Kultursekreterare
type: Concept
in scheme: JobTech Taxonomy - Yrke
definition: Kultursekreterare
broader: Planerare och utredare m.fl.
related: m1aP pNG nRN
related: X82t awd Qyc
related: JYo2 pJ6 6fB
related: jDrA 8ra iF5
related: SGEM fnp rdm
related: Wmfh htT QGD
related: TZe9 NsN uce
broad match: C2422

Städchef
type: Concept
in scheme: JobTech Taxonomy - Yrke
definition: Städchef
broader: Övriga administrations- och servicechefer
related: whao Q6A ScE
related: pDzk EtE ef5
related: pTNB UBX yPc
related: epLc SkD cbT
related: bh3H Y3h 5eD
broad match: C1219

Yrken med krav på fördjupad högskolekompetens inom ekonomi och förvaltning
type: Concept
in scheme: JobTech Taxonomy - Yrke
definition: Yrken med krav på fördjupad högskolekompetens inom ekonomi och förvaltning
broader: Yrken med krav på fördjupad högskolekompetens
narrower: Marknadsförare och informatörer m.fl.
narrower: Organisationsutvecklare, utredare och HR-specialister m.fl.
narrower: Revisorer, finansanalytiker och fondförvaltare m.fl.

Barnvakt
type: Concept
in scheme: JobTech Taxonomy - Yrke
definition: Barnvakter ansvarar för att ta hand om barn i olika åldrar Barnvakter tar hand om barn på uppdrag av barnens vårdnadshavare. Arbetet sker ofta på deltid utanför ordinarie verksamheter för barnen som skola och förskola. Vanliga arbetsuppgifter är att anordna lekar och aktiviteter, laga och servera barnen mat, tvätta barn och byta blöjor samt i vissa fall även hjälp med läxor eller annat skolarbete. Barnvakter kan även ha specifikt efterfrågade kompetenser, till exempel tala ett visst språk med barnen eller ha erfarenhet av att arbeta med barn med särskilda behov. Källa: Arbetsförmedlingen
broader: Övrig hemservicepersonal m.fl.
related: UdVa jRr 9DE
related: GazW 2TU kJw
related: T6a7 ijC zgo
related: q8UB 1gQ Ju5
broad match: C5311

Uroterapeut
type: Concept
in scheme: JobTech Taxonomy - Yrke
definition: Uroterapeut utreder, behandlar och följer upp patienter med blås- och tarmdysfunktion, såsom inkontinens, tömningssvårigheter och trängningar hos både barn och vuxna. Vanliga arbetsuppgifter är utreda och kartlägga symtom och orsaker, instruera och motivera patienter till egenvård och utprovning och förskrivning av hjälpmedel. Uroterapeuten samarbetar ofta med andra specialister. En uroterapeut har legitimation som sjuksköterska/barnmorska, fysioterapeut eller läkare. Källa: Arbetsförmedlingen, Uroterapeutisk förening
broader: Grundutbildade sjuksköterskor
related: NYW6 mP6 vwf
related: TYX8 Ccd QRk
related: 1f7B E5K sh3
broad match: C2221

Ambulanssjuksköterska
type: Concept
in scheme: JobTech Taxonomy - Yrke
definition: Ambulanssjuksköterska arbetar med akutsjukvård på plats i människors hem, på olycksplatser och under transporten till sjukhus eller annan vårdinrättning. Sjuksköterska är en skyddad titel med legitimationskrav. En ambulanssjuksköterska med specialistsjuksköterskeexamen får använda benämningen specialistsjuksköterska inom ambulanssjukvård. Vanliga arbetsuppgifter är att bedöma patienters tillstånd, ge avancerad akutsjukvård, administrera läkemedel samt prioritera och hänvisa patienter till rätt vårdnivå. Ambulanssjuksköterskan är medicinskt ansvarig i ambulansen och leder och organisera arbetet på skadeplatsen och under transporten. Arbetet är ibland fysiskt krävande. Källa: Arbetsförmedlingen, Högskolan i Borås, Region Örebro län, Socialstyrelsen, Svensk sjuksköterskeförening
broader: Ambulanssjuksköterskor m.fl.
related: 4ymz Gar dqj
related: NYW6 mP6 vwf
related: URRW c9p RLm
related: 8z2T msU s35
related: s5Eo LYM A8P
related: c6Yd mwp PQ5
related: qV32 GKw irK
related: ytRi QuA XLX
related: WwSS 9nm ZEX
related: 1f7B E5K sh3
broad match: C2221

Provsmakare och kvalitetsbedömare
type: Concept
in scheme: JobTech Taxonomy - Yrke
definition: Undersöker, avsmakar och bedömer jordbruksprodukter, matvaror och drycker.
broader: Slaktare, bagare och livsmedelsförädlare m.fl.
related: LzrR Kpb s64
related: 3uhh iPw fXj
related: BvCR wvx Bpa
related: VYzu X57 UoC
related: UFfC aC2 MiC
related: pqSg n8L qE3
related: qQ61 EQR rcz
related: VTwt 5Fe 6bW
related: MyJV jV3 hZZ
related: PwmG Fa9 KQA
related: o55U zgY GQF
related: uenm 75h fEh
related: C7515
related: kj4Q nLh u8Q
narrower: Kvalitetsbedömare livsmedel
narrower: Livsmedelskontrollant
broad match: wTEr CBC bqh

Familjerättssekreterare
type: Concept
in scheme: JobTech Taxonomy - Yrke
definition: Familjerättssekreterare arbetar med rådgivning och samarbetssamtal till separerade föräldrar och andra familjemedlemmar. Arbetsuppgifterna inkluderar utredningar och yttranden i vårdnads-, boende- och umgängesfrågor på uppdrag av tingsrätten. De hanterar juridiska ärenden inom familjerätten genom att samla in information, dokumentera och följa upp ärenden. Arbetet innebär nära samarbete med berörda parter, myndigheter och juridiska instanser. Familjerättssekreterare har vanligtvis goda kunskaper om familjerätt, juridik och socialt arbete. Källa: Arbetsförmedlingen, Platsbanken,
broader: Socialsekreterare
related: GazW 2TU kJw
related: 9fEG RSg 9hn
related: XYT9 hYV Xvv
related: CSzW 8rn v1c
related: DpaV UG4 bDB
broad match: C2635

Zoolog
type: Concept
in scheme: JobTech Taxonomy - Yrke
definition: Zoolog
broader: Växt- och djurbiologer
related: kJeN wmw 9wX
broad match: C2131

Livsmedelsförädlare
type: Concept
in scheme: JobTech Taxonomy - Yrke
definition: Livsmedelsförädlare
broader: Yrken inom byggverksamhet och tillverkning
narrower: Slaktare, bagare och livsmedelsförädlare m.fl.

Jaktvårdskonsulent/Jaktvårdsrådgivare
type: Concept
in scheme: JobTech Taxonomy - Yrke
definition: Jaktvårdskonsulent/Jaktvårdsrådgivare
alternative label: Jaktvårdskonsulent
alternative label: Jaktvårdsrådgivare
broader: Specialister och rådgivare inom skogsbruk
related: X6kT VSc 2g3
related: WGAZ xaM gUE
related: VuuL 7CH adj
broad match: C2132

Kuratorer
type: Concept
in scheme: JobTech Taxonomy - Yrke
definition: Ger information om samhällets olika möjligheter att ge hjälp och stöd till människor i behov av råd, stöd och hjälp. Undersöker olika lösningar för att förbättra hjälpsökandes livssituation.
broader: Socialsekreterare och kuratorer m.fl.
related: xSLo P6B 2AF
related: DJgq zBj bKt
related: kb9z LG1 CZE
related: kojv fm9 4JL
related: zkwp b3X jLZ
related: 79ET nqi vBf
related: aUr6 Rjg ja2
related: Hh2K Seb wZQ
related: fksd G23 wke
related: 3HjW 1BP k3S
related: YaHy ShR uo4
related: MjPH 341 Zmc
related: KEuh v8d chE
related: 3vYj Rhf Voh
related: tpCZ pHV n3v
related: Uv9y v2g efa
related: Tmps QPE g3V
related: btyH 9au jQS
related: C2635
related: QAaJ QeY Q6P
related: NUC3 y1C Scg
related: oJiB gms Rm7
related: Ehqx 9Z4 Kbb
related: cw2M p2W SuJ
related: SfoE zq7 ADN
related: VDem uq7 xxc
related: dYqT JBz NZE
related: 5wab aFK gdL
related: rbka PL5 MRM
related: PVnT yGT SMb
related: qtHa AsU Cfo
related: Nig2 2pU GT8
related: jgN6 BGi Xot
related: 3Y9v Urp QGn
related: LmAP e75 pc6
related: 7scD 9YP iwV
related: jcpA Zfs nSz
related: crbK d4m D6r
related: RB7E jE5 MZ3
related: DRdR HTS giu
related: ZjBN Pwc L61
related: 2fvt a2y shZ
related: jxKr BmN CcQ
related: 2ZFC 6de YSB
related: MJBg yfx HK7
related: BCCY ZqV imt
related: ekyT YFq zJs
related: B1rc wCc vne
related: 47LN 8Ac dX8
related: w8bU wHe omF
related: 73gL 4uv p9J
related: 8u7A ze1 bvd
related: 6Ei3 fZV YKM
narrower: Kurator
narrower: Hälso- och sjukvårdskurator
broad match: GazW 2TU kJw

Lackerare och industrimålare
type: Concept
in scheme: JobTech Taxonomy - Yrke
definition: Underbehandlar och lackerar produkter av olika slag och material. Förser ytor med emalj eller annat ytlager. Hit hör inte Målare (7131) Träförgyllare (7521) Maskinoperatör, ytbehandling (8121)
broader: Målare, lackerare och skorstensfejare m.fl.
related: QNLd mhp STv
related: EPc1 cdD 2fP
related: abPL tcw h2f
related: VPF1 UZM 9Kd
related: 5LdD NqJ 9P7
related: DKfP skK MFK
related: h65W AEU vjL
related: 8Xuo Ss8 8cE
related: 2E7x 4v4 9hN
related: qQ61 EQR rcz
related: VTwt 5Fe 6bW
related: PELm cH9 AE9
related: Q7eC B7g QiU
related: eWYX EW3 RMj
related: RVmz Ev4 rYr
related: 6qAU LAU Ldo
related: 7coz KQN G7U
related: xAbn Wt7 ySS
related: 7yG9 yE5 AYZ
related: HmD1 TwX zgW
related: Mq79 RZr RK8
related: KDzy Hra iVr
related: brda 5pJ 8cu
related: Co7V AQ3 AJn
related: 7ZBy rjJ BC3
related: fhcp fFw Lbj
related: 2PSK NAG sDa
related: bP5N ekQ V9Y
related: zVKm f79 DtU
related: C7132
related: VKz9 kEu Fm1
related: 6BpN oXk 7SL
related: 6mFg qFb Dyh
related: XuaE d1d quB
related: 6Eju UXW 3Ct
related: sDuC 8so Dhv
related: th9p nWW Ycb
related: UmrF gc3 XBh
related: ZJvR 2nd oep
related: AEgv 4gP ndv
related: 5uDy cV5 BZC
related: HS8J FaG 3AG
related: wn7T k1d TBe
related: GzaG UuH EdY
related: BKYD AEo maF
related: Dyar wic vHe
related: 7ZVu zsV ZKD
related: YBY5 2Np HQH
related: rr11 hRs CNU
related: UPx7 WPj h9V
related: uenm 75h fEh
related: dWbY gXC Frx
related: LNus 4sf eFc
related: oga6 JsL gc9
narrower: Fordonslackerare
narrower: Lackerare
narrower: Möbellackerare
narrower: Folierare
narrower: Emaljerare, lackering
narrower: Dopplackerare
narrower: Takmålare plåttak
narrower: Rostskyddsmålare
narrower: Rostskyddsbehandlare
narrower: Industrilackerare
narrower: Brandskyddsmålare
broad match: wTEr CBC bqh

Arbetsledare inom tillverkning
type: Concept
in scheme: JobTech Taxonomy - Yrke
definition: Samordnar, leder och följer upp arbete vid tillverkningsprocesser.
broader: Arbetsledare inom bygg och tillverkning m.m.
related: N4f3 cLE ygk
related: t52d tkg NZ3
related: tg8L maz wMN
related: D14A syC i23
related: 74Mw JUN VKx
related: aHCV VsV LiD
related: YK2s pxn YWW
related: C3122
related: Veoy TRu rDY
related: EboV hrY Y9z
related: X9oL 76D P7S
related: ZzN5 m7B 5CY
related: 1vX4 pj1 yao
related: MuoH pDL nFJ
related: a1Sf mey gVk
related: G2E9 yG4 zBW
related: U1JW vPG Dqk
related: Y3B6 QRV zGk
related: 2rqG WLp em4
related: zVKm f79 DtU
related: Q6DB h8V mc7
related: eThQ HCv mY6
related: AepF hH2 pT7
related: Rf1n 6Sj exu
related: W4er Syp Wrt
related: jnLy 6Ns KpH
related: kvLG 4uo M5p
related: MMmf fS3 L5R
related: 9ikw xMV uTJ
related: t9Um wBh Cb4
related: NB2C zFs C9F
related: AiwS Mhv ttk
related: BKYD AEo maF
related: 4y7C Lsh EPM
related: 3Sj1 uuL y1A
related: dWbY gXC Frx
related: 3zgs 61Q etM
related: kj4Q nLh u8Q
narrower: Arbetsledare, tillverkning kemiska produkter
narrower: Arbetsledare, tryckeri
narrower: Arbetsledare, tillverkning, elkrafttekniska produkter
narrower: Packmästare, tillverkning
narrower: Arbetsledare, tillverkning, textil- och träprodukter
narrower: Brännmästare
narrower: Avdelningschef, smältverk
narrower: Bryggmästare
narrower: Arbetsledare, tillverkning, elektroniska produkter
narrower: Arbetsledare, maskintillverkning, verkstadsprodukter
broad match: wTEr CBC bqh

Barmästare
type: Concept
in scheme: JobTech Taxonomy - Yrke
definition: Barmästare tillreder och serverar drycker, utvecklar dryckesmenyer samt leder kvalitetsarbetet i barer. Barmästare har bakgrund som bartender, men lång erfarenhet och djupare kunskaper. Arbetsuppgifterna omfattar även att hantera råvaror, ge dryckesrekommendationer, kvalitetsarbete och utbildning av barpersonal. Yrket förekommer främst i cocktailbarer och restauranger med högt dryckesfokus. Beroende på arbetsplats kan även personalansvar ingå i yrket. Barmästare arbetar med dryckeshantverk, medan barchef har ett övergripande organisatoriskt ansvar. Källa: Arbetsförmedlingen
broader: Bartendrar
related: Ckm8 sHx aow
related: j3gF W64 Kr6
related: umky diq 9dt
related: ScKy FHB 7wT
broad match: C5132

Parkchef
type: Concept
in scheme: JobTech Taxonomy - Yrke
definition: Parkchef
broader: Chefer inom friskvård, sport och fritid
related: epLc SkD cbT
related: bh3H Y3h 5eD
related: VuuL 7CH adj
broad match: C1431

Professor
type: Concept
in scheme: JobTech Taxonomy - Yrke
definition: Professor
broader: Professorer
related: wzfu dxv 31x
related: MVqp eS8 kDZ
related: AGYq JEm 6sk
broad match: C2310

Hamnarbetare
type: Concept
in scheme: JobTech Taxonomy - Yrke
definition: Hamnarbetare arbetar i hamnar med att att angöra, lasta och lossa fartyg. Som hamnarbetare växlar man ofta mellan flera arbetsuppgifter, bland annat köra truck, kran, och hjullastare. Det finns flera funktioner inom hamnarbete som behöver utföras, så som signalman, trafikvakt, lastkopplare och stuffare. Beroende på vilken typ av hamn man arbetar på kan arbetet se olika ut, som containerhamnar, oljehamnar, bulkhamnar och färjehamnar. Källa: Transportfackens yrkes- och arbetsmiljönämnd
broader: Hamnarbetare
related: 2Zqv HWJ JMt
related: VWFN cRj KJh
related: ASGV zcE bWf
related: LfMQ tUx uA2
related: iUzH s87 sM1
broad match: C9333

Övriga förmedlare
type: Concept
in scheme: JobTech Taxonomy - Yrke
definition: Utför annat förmedlingsarbete än inom 3331 – 3335. Exempel på arbetsuppgifter: Säljer varor eller fast egendom på auktion. Bokar engagemang och förhandlar kontrakt m.m. för artister, musiker, författare, idrottsutövare m.fl. Säljer annonser i media. Ger råd om butiksekonomi och marknadsföring.
broader: Förmedlare m.fl.
related: S2pg pcs tXu
related: cDgT iEt XKn
related: mczu WBE VSW
related: yMbg bQt caE
related: nPhE Q9x sbs
related: UQod 7GP JXL
related: dRWb Mgx yJf
related: LkPR 3sC Ejv
related: cmLz gTS eje
related: hb3b fH2 bvK
related: MQ4P 6mN DqC
related: LPur bRn 5XD
related: eJxw HZY 6hi
related: aMyW hB7 TpU
related: MXGG RL9 ZPB
related: mQ8D hKU img
related: JxuB Xi5 Yqw
related: QXtd jG5 BgH
related: 7tVG 9zf 7mw
related: uGJt 4qS 3RF
related: 2J9N dsk s3H
related: 3SWC q3G uvC
related: MrnB onr FxX
related: 4vZx NLd txd
related: YJdu yog DN6
related: SmZd Jaa BeY
related: kMR7 idH Jwq
related: auyj rRt P6h
related: moJc yZC sjN
related: ATGE 8XW 5oB
related: GyDU 16x 48U
related: C3339
related: DXNc cU4 j4N
related: zYHW Mtu jqq
related: rbDq 9SG BjC
related: czR7 FQn xu4
related: i7kk zcd MiW
related: Fiq4 siu LXn
related: Gmdz YQ7 QZv
related: eAam bTc exb
related: 3WBf TaE ZYu
related: KHTv qqM psR
related: jnLy 6Ns KpH
related: Td4F YtH u6S
related: q7Mx gjU F9q
related: Q5Gj qVb 1AY
related: Ap4N kTp 3K5
related: 2KH5 1dw QQF
related: 4fRg DA4 Dj3
related: ZF9w knj 7cW
related: AwhJ eLD xpG
related: np3s PZj fpt
related: v3dQ 9We tK5
related: 8yeu mjf FZD
related: FJBT yzk BWe
related: hkJW PWy ge8
related: HaJH my4 BRb
related: 5yDE FiQ bMn
narrower: Teateragent
narrower: Kundmottagare/Arbetsledare bilverkstad
narrower: Konsertarrangör
narrower: Turnéläggare
narrower: Auktionist
narrower: Servicechef, bilverkstad
narrower: Mediasäljare
narrower: Manager/Agent inom idrott
narrower: Butikskonsulent
narrower: Prissättare fordon
narrower: Turnéledare
narrower: Manager/Agent inom kultur och underhållning
broad match: RPTn bxG ExZ

Planarkitekt
type: Concept
in scheme: JobTech Taxonomy - Yrke
definition: Planarkitekt arbetar med planering och utformning av fysiska miljöer såsom stadsområden, bostadsområden och offentliga platser. Arbetsuppgifterna inkluderar att skapa och utveckla detaljplaner, analysera markanvändning, bedöma miljö- och samhällspåverkan samt samordna med myndigheter, intressenter och allmänhet. Planarkitekten tar fram förslag och underlag för beslut i planprocesser och deltar i projektledning samt workshops och samråd. Yrkesrollen kombinerar teknisk planering med kreativ lösningsförmåga för att skapa långsiktigt hållbara och funktionella miljöer. Källor: Sveriges Arkitekter, Boverket, Arbetsförmedlingen, branschorganisationer,
broader: Planeringsarkitekter m.fl.
related: 6Hq3 tKo V57
related: W5DQ 5vV E49
related: RH9A aen jnj
broad match: C2164

Försöksdjurstekniker
type: Concept
in scheme: JobTech Taxonomy - Yrke
definition: Försöksdjurtekniker sköter den dagliga omsorgen om försöksdjur som används i forskning och läkemedelsutveckling. Arbetsuppgifterna inkluderar utfodring, rengöring av burar, tillsyn av djurens hälsa och välbefinnande samt att dokumentera observationer och djurens beteende. Försöksdjurtekniker administrerar ofta medicinering och utför enklare procedurer som injektioner och provtagningar. Arbetsmiljön kan variera från laboratorier till utomhusanläggningar och innebär regelbundna rutiner för hygien och säkerhet. Källa: djurforsok.info
broader: Övriga djuruppfödare och djurskötare
related: wLi8 yoJ B2x
related: VuuL 7CH adj
related: tdk5 T3S qLK
related: BQoN mn9 wbx
broad match: C5164

Fytoterapeut/Örtterapeut
type: Concept
in scheme: JobTech Taxonomy - Yrke
definition: Fytoterapeut/Örtterapeut
alternative label: Fytoterapeut
alternative label: Örtterapeut
broader: Terapeuter inom alternativmedicin
related: NYW6 mP6 vwf
related: Uuf1 GMh Uvw
broad match: C3230

Förbundssekreterare
type: Concept
in scheme: JobTech Taxonomy - Yrke
definition: Förbundssekreterare
broader: Planerare och utredare m.fl.
related: X82t awd Qyc
related: TZe9 NsN uce
broad match: C2422

Audionomstuderande
type: Concept
in scheme: JobTech Taxonomy - Yrke
definition: Audionomstuderande är en student som utbildar sig till audionom. Vanliga arbetsuppgifter är att genomföra hörseltester, utreda hörselproblem och anpassa hörhjälpmedel under handledning. Källa: Arbetsförmedlingen, Sveriges Kommuner och Regioner
broader: Audionomer och logopeder
related: NYW6 mP6 vwf
broad match: C2266

General-, landstings- och kommundirektörer m.fl.
type: Concept
in scheme: JobTech Taxonomy - Yrke
definition: Organiserar, leder och svarar för att politiska beslut verkställs. Planerar, leder och samordnar myndigheters, kommuners och landstings verksamhet. Ger den politiska ledningen råd i sakfrågor.
broader: Politiker och högre ämbetsmän
related: icvA Gu9 EqB
related: WteW WcE Qdn
related: B3mG SvX RWH
related: UH9g R5v MCx
related: Mw7Y 2pY itu
related: 8tYq EXD Xwm
related: ZzN5 m7B 5CY
related: detQ YNb 9nG
related: w7J6 vmA z5h
related: X9Kc p8a 1FB
related: Gt5f wdi FSJ
related: kc8y NaY RTC
related: q7Mx gjU F9q
related: D6ev Zwt x83
related: zXNU zXR hGd
related: C1112
related: cRpm EWm dK5
related: 9FQn 9us Q74
narrower: Länsråd
narrower: Generaldirektör
narrower: Riksantikvarie
narrower: Landshövding
narrower: Förvaltningsdirektör, statlig
narrower: Riksgäldsdirektör
narrower: Rikspolischef
narrower: Kommunchef/Kommundirektör/Stadsdirektör
narrower: Riksbibliotekarie
narrower: Generalkonsul
narrower: Departementsråd
narrower: Riksarkivarie
narrower: Överdirektör
narrower: Beredskapsdirektör
narrower: Kabinettsekreterare
narrower: Regiondirektör
narrower: Ambassadör
broad match: bh3H Y3h 5eD

Anhörigkonsulent
type: Concept
in scheme: JobTech Taxonomy - Yrke
definition: Anhörigkonsulenter ger stöd och råd till anhöriga som vårdar eller hjälper närstående med långvarig sjukdom, funktionsnedsättning eller psykisk ohälsa. Arbetsuppgifer innefattar att informera om rättigheter och stödinsatser, organisera och leda anhöriggrupper, föreläsningar och utbildningar för anhöriga, samt att arrangera friskvårdsaktiviteter som främjar anhörigas hälsa. Anhörigkonsulenten arbetar med uppsökande och informationsspridande verksamhet för att nå anhöriga i behov av stöd. Arbetet innebär samverkan med olika aktörer inom kommune, sjukvård och civilsamhället. Arbetet kan kombinerar direkt stöd till individer med strategiskt utvecklingsarbete. Källa: Stockholms stad, Anhörigas riksförbund, Arbetsförmedlingen
broader: Behandlingsassistenter och socialpedagoger m.fl.
related: GazW 2TU kJw
related: ZRxL XFw w9p
related: pvYo LK3 rX1
related: kyXt tGL BDp
related: o57J R1a cfx
related: sr4N 5x3 F4v
related: zgKK RPn Cmx
related: Ltai Hw9 dFd
related: fCzi 1rx 4Tf
broad match: C3412

Fastighetsskötare
type: Concept
in scheme: JobTech Taxonomy - Yrke
definition: Övervakar, sköter och underhåller fastigheters inre och yttre miljö. Kontrollerar ventilations- och värmeanläggningar. Utför mindre reparationer och svarar för service till hyresgäster och besökare.
broader: Städledare och fastighetsskötare m.fl.
related: sKfH MGG 3CS
related: wVLZ NqT 2Z1
related: 5aBK qBH WZY
related: txb5 eet Huj
related: wBLK nWZ 7ek
related: dpBU 3E1 JAx
related: TFQD onf Tid
related: oYDh d6r cSu
related: fT3m z6J So9
related: GEEJ kt6 Zcb
related: h65W AEU vjL
related: Am5W fAR RqU
related: tqNp SBC LSx
related: jXSx Bm8 bNX
related: LK7B LX7 vjo
related: 8wuS ceN nBu
related: gVEW baK Mpk
related: 7bLu kHr bJU
related: FP3w 6C4 kHx
related: L5NR BVS 1kb
related: rm5H xiU 5bN
related: jqEe ruX oUG
related: PELm cH9 AE9
related: cNtb hfE b1p
related: CzZc 7tx B9C
related: GgcW cvE f4p
related: E6uE hqh VZW
related: gaCj QVT Uf1
related: fG9j hFZ Vm5
related: fjoN ZHr XG4
related: i1RV bHM rPu
related: za7z fct qC3
related: 8j4P S8v 9jy
related: PyWn fb6 NPQ
related: EL7g UQG QVd
related: t17v Hrq yLk
related: 4XyZ 6t8 TWq
related: r5Si 2g9 Err
related: GCYi 9tC 1pP
related: c14d Mgx MFA
related: L1XQ J64 pUe
related: N3ne mkz PtQ
related: YDfu xv3 S2j
related: Y6VX E1a pNH
related: AEgv 4gP ndv
related: 8BMH dyx iQH
related: AAaS o41 sEg
related: J5Xc doF TUR
related: JN6h juH 8FP
related: 9qgQ QyK VVh
related: YNqd JMH kh7
related: smAW 9De 1rq
related: w3vG ygN 1Dt
related: C5153
related: 4mNF 7vZ vCx
related: YYdi Fqb 834
related: X51E Edf cfG
related: bdEb 1Mn 9XY
related: CibV iV1 wz4
related: Ji2V Gh1 Ti8
related: crzp WfW wWC
related: LzY8 vM7 i1Y
related: jZzL yV6 PmA
narrower: Fastighetsvärd
narrower: Kapellvaktmästare
narrower: Fastighetsskötare
narrower: Idrottsplatsvaktmästare
narrower: Skolvaktmästare
narrower: Fastighetstekniker
narrower: Kyrkvaktmästare
broad match: yhCP AqT tns

Speciallärare
type: Concept
in scheme: JobTech Taxonomy - Yrke
definition: Speciallärare ger individuellt anpassad undervisning till elever som har behov av särskilt stöd, ofta inom områden som språk-, läs- och skrivutveckling, matematik eller utvecklingsstörning. Lärare är ett reglerat yrke med legitimationskrav för att kunna bli tillsvidareanställd och sätta betyg. För att kunna arbeta som speciallärare behövs också speciallärarexamen. Vanliga arbetsuppgifter är att kartlägga elevers behov, genomföra enskild undervisning eller stöd i klassrummet samt att planera och följa upp anpassningar och särskilt stöd. Specialläraren deltar också i utredningar, dokumenterar insatser och fungerar som samtalspartner till arbetslag och elever. Källa: Arbetsförmedlingen, Skolverket, Socialstyrelsen
broader: Speciallärare och specialpedagoger m.fl.
related: pksL JMC cku
related: y5Pr Gdr VZJ
related: jyaU 9iR nhm
related: 3pyE aAA TFD
related: UCWN n4a yty
related: MVqp eS8 kDZ
related: zjc1 vyS eRs
related: w1mR A2B 4Tr
related: dg5a eu2 9Yr
broad match: C2352

Forskare, kulturgeografi
type: Concept
in scheme: JobTech Taxonomy - Yrke
definition: Forskare, kulturgeografi
broader: Arkeologer och specialister inom humaniora m.m.
related: X82t awd Qyc
broad match: C2632

Specialistofficerare
type: Concept
in scheme: JobTech Taxonomy - Yrke
definition: Deltar i planering och genomförande av militära operationer, nationellt och internationellt. Utbildar samt är specialist inom sitt tjänsteområde inom teknisk tjänst, sjöstrid, luftstrid, markstrid, ledning eller logistik. Leder lägre militära förband.
broader: Specialistofficerare
related: iJBH bGT 71w
related: cWLT gvA VTX
related: axUd pBC gpK
related: TNqJ vKz kQo
related: sZpG fhF BD7
related: 8Lg4 LKc sor
related: Es1j gwu mzB
related: Pecg Gxd 8z6
related: gwsz Nnz mFQ
related: evRP Yoi Dd4
related: Rttn 7Xw wUk
related: AMx9 HRj Ssp
related: C0210
related: JjHn wR7 Zdg
related: sGky Wqy QvZ
related: yvHV XWN 2aQ
narrower: Specialistofficer
broad match: bH5L uXD ZAX

Länsråd
type: Concept
in scheme: JobTech Taxonomy - Yrke
definition: Länsråd
broader: General-, landstings- och kommundirektörer m.fl.
related: bh3H Y3h 5eD
broad match: C1112

Maskinrådgivare/Maskinkonsulent
type: Concept
in scheme: JobTech Taxonomy - Yrke
definition: Maskinrådgivare/Maskinkonsulent
alternative label: Maskinkonsulent
alternative label: Maskinrådgivare
broader: Specialister och rådgivare inom lantbruk m.m.
related: 6nbS RdB kzm
related: VuuL 7CH adj
broad match: C2132

Växtskyddsspecialist
type: Concept
in scheme: JobTech Taxonomy - Yrke
definition: Växtskyddsspecialist
broader: Specialister och rådgivare inom lantbruk m.m.
related: 6nbS RdB kzm
related: VuuL 7CH adj
broad match: C2132

Näringslivschef
type: Concept
in scheme: JobTech Taxonomy - Yrke
definition: Näringslivschef
broader: Förvaltnings- och planeringschefer
related: Fk2b Mq3 gdt
related: epLc SkD cbT
related: msV3 Udd y2j
related: bh3H Y3h 5eD
broad match: C1213

Lärling, installationselektriker
type: Concept
in scheme: JobTech Taxonomy - Yrke
definition: En lärlingsanställning är en färdigträning till installationselektiker som sker efter grundläggande teoretisk och praktisk utbildning. Som lärling använder du dina kunskaper på en arbetsplats under vägledning av en handledare. Lärlingstiden är 1 600 timmar Källa: ECY
broader: Installations- och serviceelektriker
related: yhCP AqT tns
related: ja7J P8X YC9
broad match: C7411

HR-generalist/HR-partner
type: Concept
in scheme: JobTech Taxonomy - Yrke
definition: HR-generalist/HR-partner
alternative label: HR-generalist
alternative label: HR-partner
broader: Personal- och HR-specialister
related: G98a nE5 BBj
related: tRKt wq7 SES
related: X82t awd Qyc
related: fYyo axC rCh
related: Un9a jDu M3K
related: yDnY DV7 8an
related: Thoe V2G SKQ
related: pyNJ Xcf xzg
related: aPsm YVx nwb
related: XQdc 5ka Si5
broad match: C2423

Farmakologer och biomedicinare
type: Concept
in scheme: JobTech Taxonomy - Yrke
definition: Utvecklar teorier, modeller och metoder inom farmakologi. Genomför försök, analyserar och värderar information om hur läkemedel och andra ämnen verkar i celler, organ, djur och människor, samt vilken effekt de har. Utvecklar och formar praktiska tillämpningar inom farmaci och medicin. Informerar, ger råd och utfärdar anvisningar om läkemedel.
broader: Biologer, farmakologer och specialister inom lant- och skogsbruk m.fl.
related: 3SSP AZw 3TS
related: 8J5k b1M 39R
related: vusR W4m dRq
related: DcY9 nMk QsT
related: 6de1 7CM XL6
related: Nejp cbg 7Xh
related: Zffc M4R Gws
related: VW6p 6bH VUX
related: cegr WSz Fm2
related: nA5p Ske 4zb
related: PrA4 KwY YcV
related: PzDN Tzu s2m
related: kHg1 bRT s1u
related: DnL5 sXM WRb
related: aS2X 4ZL 9h7
related: DYnx H7B w7z
related: c2YE oK3 f1u
related: xxeG XxB sqG
related: EGxT 93M sB4
related: DyjA N1c STb
related: 7rqs dJb gjc
related: C2131
related: n9EN kBV XrN
related: Nx8H ZET y3g
related: ezVu GhE b3b
related: 5jZo oN5 xFM
related: BC1U Xti GK9
narrower: Forskare, beräkningsbiologi
narrower: Läkemedelsinspektör
narrower: Forskare, farmakologi
narrower: Regulatorisk handläggare/Regulatory affairs specialist
narrower: Projektledare, medicinteknik
narrower: Ekotoxikolog
narrower: Forskningsassistent, medicin
narrower: Biomedicinare
narrower: Forskare, läkemedel
narrower: Forskare, medicin
broad match: kJeN wmw 9wX

Operatör läkemedelstillverkning
type: Concept
in scheme: JobTech Taxonomy - Yrke
definition: Operatörer inom läkemedelstillverkning sköter och övervakar maskiner för tillverkning av läkemdel. Yrket liknar maskinoperatör, kemisktekniska produkter. Arbetet innebär i huvudsak att övervaka och justera en eller flera maskiner så att produktionen når sin fulla kapacitet och att åtgärda problem som kan leda till driftstopp. Arbetet är starkt automatiserat och många produktionslinjer är robotiserade. Som maskinoperatör kan du behöva göra grundläggande robotprogrammering för att ställa in maskinerna. Det ingår också vanligtvis att kontrollera, avvikelserapportera och dokumentera enligt anvisningar. Ibland ingår också att göra förebyggande underhåll, packa den färdiga produkten och att köra truck. Skiftarbete är vanligt förekommande. Källa: Arbetsförmedlingen
broader: Maskinoperatörer, farmaceutiska produkter
related: 5hSf 1Ja suH
related: UdVa jRr 9DE
related: DRJx 9h1 JSJ
related: 1taY Gdb eFi
related: WGEx rgb Czn
related: p4Wy ycQ Z73
related: WXuG wHh q4y
related: wTEr CBC bqh
broad match: C8131

Arbetsterapeutstuderande
type: Concept
in scheme: JobTech Taxonomy - Yrke
definition: Arbetsterapeutstuderande är en student som utbildar sig till arbetsterapeut. Vanliga arbetsuppgifter observera och delta i utredningar, träning av dagliga aktiviteter, prova ut hjälpmedel och dokumentera insatser under handledning. Källa: Arbetsförmedlingen, Sveriges Kommuner och Regioner
broader: Arbetsterapeuter
related: NYW6 mP6 vwf
broad match: C2269

Maskinoperatör träindustri
type: Concept
in scheme: JobTech Taxonomy - Yrke
definition: Maskinoperatörer inom träindustri sköter maskiner för vidareförädling av sågat trä, till exempel för tillverkning av plywood, trägolv och spånskivor. Det är vanligt att rotera mellan olika maskiner, till exempel för sågning, hyvling, limning, slipning och pressning. Trävaror som tillverkas är bland annat plywood, spånskivor, trägolv, parkett och faner. Utöver att sköta maskiner kan även underhåll av maskiner ingå. Truckkörning kan även förekomma. Källa: Arbetsförmedlingen
broader: Operatörer inom sågverk, hyvleri och plywood m.m.
related: 7493 tq2 fhN
related: t2KQ uEi tUE
related: rJu5 d5M qvp
related: 7i3F JBS qo4
related: Ndwf ccV NJV
related: wTEr CBC bqh
broad match: C8172

Logistikingenjör
type: Concept
in scheme: JobTech Taxonomy - Yrke
definition: Logistikingenjör
broader: Civilingenjörsyrken inom logistik och produktionsplanering
related: 6Hq3 tKo V57
related: EvuM nu2 NV8
related: iwds EZE gU5
related: xH2m GB1 r1a
related: wEDm uJF sY1
broad match: C2141

Hiss- och rulltrappstekniker
type: Concept
in scheme: JobTech Taxonomy - Yrke
definition: Hiss- och rulltrappstekniker installerar, moderniserar, servar och reparerar hissar, rulltrappor, rullbanor och ibland automatiska dörrar. Arbetsuppgifterna sker på plats med nyinstallation, testning, felsökning och utbyte av både elektriska och mekaniska komponenter. Hiss- och rulltrappstekniker utför regelbundet förebyggande underhåll, genomför akuta reparationer och hanterar kontroll av säkerhet och funktion. Arbetet innefattar även dokumentation av genomförda åtgärder samt kommunikation med fastighetsägare, hyresgäster och kollegor. Källor: Hissförbundet, Studentum/Xenter, Arbetsförmedlingen, Motum,
alternative label: Hisstekniker
alternative label: Rulltrappstekniker
broader: Industrielektriker
related: 44Az E7Q bDQ
related: uJXo PbC pcM
related: SJdo cZF 7Nu
related: yhCP AqT tns
related: xCLT rTs 4Vw
broad match: C7412

Montör träprodukter
type: Concept
in scheme: JobTech Taxonomy - Yrke
definition: Montör träprodukter sätter samman komponenter till färdiga produkter. Montörer av träprodukter sätter samman komponenter till färdiga produkter, antingen manuellt eller med hjälp av olika verktyg och maskiner. Källa: Arbetsförmedlingen
broader: Montörer, träprodukter
related: B63C oEo eLd
related: NXjG hxD y3o
related: uab1 EH1 ab2
related: YEje MDz ifK
related: yLaZ 7xt HUm
related: wTEr CBC bqh
related: ReV5 DdJ Zos
broad match: C8219

Intensivvårdssjuksköterskor
type: Concept
in scheme: JobTech Taxonomy - Yrke
definition: Vårdar patienter med svåra sjukdomstillstånd på intensivvårdsavdelning och postoperativa avdelningar.
broader: Sjuksköterskor
related: 4QAE wtY gJh
related: 2KV1 FD8 vGp
related: C1qR L83 nzh
related: F9MX NWR 7CQ
related: 9Fna GUm HWL
related: Mmxs Qrv cpG
related: 9Ysm nvM YBu
related: ZzN5 m7B 5CY
related: dJa5 Nao mDS
related: Lqnz Zqw nQ9
related: eThQ HCv mY6
related: F7nJ k5s L29
related: Ektq nPz 4YF
related: LMx4 LbA vxB
related: wBPu wTW RgG
related: aS2X 4ZL 9h7
related: MR4H FFT mTj
related: 2GuF gtz xfW
related: rF7s hX1 ECH
related: rVUL AgV ZTH
related: WUoy Yua 8Mr
related: azXF rgu EWv
related: C2221
related: GYz6 5Jt Wmy
related: 5Kym 2ad Pqi
related: jxKr BmN CcQ
related: pGBH BkG qJa
related: yV9B PxJ TxS
related: 47LN 8Ac dX8
narrower: Intensivvårdssjuksköterska
broad match: NYW6 mP6 vwf

Hovrättslagman
type: Concept
in scheme: JobTech Taxonomy - Yrke
definition: Hovrättslagman leder en av hovrättens avdelningar och kombinerar chefsansvar med dömande verksamhet i andra instans. Arbetsuppgifterna omfattar att leda och samordna avdelningens arbete, fördela mål och ärenden, hålla och leda förhandlingar samt fatta avgörande beslut i komplexa rättsfall. Hovrättslagman deltar även i hovrättens ledningsgrupp, driver utvecklingsarbete och ansvarar för handledning och stöd till andra domare samt kvalitetssäkring av rättskipningen. Titeln används idag inom hovrätterna i Sverige och utgör en central chefsroll under hovrättspresidenten. Källa: Sveriges Domstolar
broader: Domare
related: X82t awd Qyc
related: x4Wi NWW ogB
related: Abcb QtH isZ
broad match: C2612

Databasdesigner
type: Concept
in scheme: JobTech Taxonomy - Yrke
definition: Databasdesigner
broader: Mjukvaru- och systemutvecklare m.fl.
related: apaJ 2ja LuF
related: KT6P hVH LRD
broad match: C2521

Finmekaniker
type: Concept
in scheme: JobTech Taxonomy - Yrke
definition: Tillverkar, installerar, justerar och reparerar tekniska och vetenskapliga precisionsinstrument. Tillverkar och reparerar lås och vapen. Justerar och reparerar hjälpmedel och utrustning för personer med funktionsnedsättning. Monterar och utför service på lås och inpasseringssystem samt dyrkar upp lås och tillverkar nycklar. Reparerar, rengör, justerar och säljer ur.
broader: Finmekaniker och konsthantverkare m.fl.
related: h2x7 D6x Uxf
related: Afof 1HW 26N
related: CGUo FTz Mvr
related: txb5 eet Huj
related: gQSZ aSc BeU
related: Vzh9 TQ3 tvZ
related: btbx pYC XDK
related: ECs4 p2b JiU
related: r2wb jxD g7h
related: KEdX Wjn XHn
related: aHCV VsV LiD
related: c5t5 ucu nrT
related: C7222
related: yZVr FkQ yTB
related: uoyo 7gt 3CV
related: PpQM 12A gFU
related: oLd3 61W b7r
related: 816X rWV fUP
related: gWng mvP eRv
related: Q7eC B7g QiU
related: TjCE 9Tf Vr2
related: pTyA qkK vo7
related: W728 Hze 9kk
related: C7311
related: Msi7 dJ1 mtD
related: hw2n 2ru umh
related: vQTv Fio W9o
related: GMdw jj7 iDB
related: 41zn 6hT 9Az
related: UVEE 77p QKf
related: Sj6U HsZ 5Wy
related: q2iK 1EL 2du
related: JFDz Uyg Nmy
related: fhcp fFw Lbj
related: xG3w m6i fbp
related: Xtys AjN 9an
related: 6Akb Rse p6H
related: EsB4 55e Xwk
related: zVKm f79 DtU
related: ncgu Kpq TR3
related: 241Q 2Fv rY3
related: VxjF wyE cqS
related: 15Ls W35 xzh
related: Rv4t FQa pGn
related: WpA7 Zfn Sww
related: Nngz CKq quc
related: ohUU nf8 B1U
related: KQdP QF9 148
related: 274F sx4 dDc
related: nBJC LkM ZoG
related: 5pUD Jvh xqS
related: ei2X t7p ZBU
related: c14d Mgx MFA
related: X4EU ZC7 QmK
related: N3Cc NtF zup
related: Ppo2 VTh tuJ
related: Um6A F9Z xZP
related: z2xC xDc SsU
related: vFfP 5jY SZG
related: ucDT epN GKT
related: UfGy GoM H9n
related: WGVn 9aG mdM
related: i9ha brW zLJ
related: 1BKz 4at cuy
related: 4685 HbX wEx
related: cGvC 915 Sd4
related: YJ2K Tvg AgA
related: 4mNF 7vZ vCx
related: 4mfV LWB sxR
related: xShN Vkr s7D
related: ko4c YUz 9rj
related: HuvB K4D QyF
related: ZTk2 7eo CUb
related: M2mj uGU SVs
related: NoNy o7q jCt

Växt- och djurbiologer
type: Concept
in scheme: JobTech Taxonomy - Yrke
definition: Utvecklar teorier, modeller och metoder som rör levande organismer och deras samspel med varandra och med miljön. Gör artbestämningar och undersöker arters utbredning, levnadsbetingelser och beteenden. Studerar processer och tekniker för agrikulturell och miljöbetingad användning. Utvecklar och kvalitetssäkrar botaniska och zoologiska analysmetoder. Hit hör inte Ekolog (2183)
broader: Biologer, farmakologer och specialister inom lant- och skogsbruk m.fl.
related: 3SSP AZw 3TS
related: r6uV Vr4 Qnv
related: Agyj 9gw G3U
related: yP5y T2Q xL7
related: vusR W4m dRq
related: ph2f wuM ae1
related: FCcX k8U M6g
related: Nejp cbg 7Xh
related: VW6p 6bH VUX
related: 5Gmv EZs BPe
related: fRHc YE4 Jbk
related: nApM a1U guF
related: hRQ8 wvB wnr
related: yMp7 AwC zqx
related: j53D o7U Xkm
related: nA5p Ske 4zb
related: BroT juN Spe
related: qh6a 8VG LLs
related: hoxG WAs vgG
related: PrA4 KwY YcV
related: 5KHd EHE Pe6
related: mKgc 2aa 9rK
related: f7b6 Um6 QN7
related: 3XRT 1PB tjm
related: CmAq Ke5 oBa
related: P3T4 G7P Sta
related: c2YE oK3 f1u
related: EGxT 93M sB4
related: 6RWb VsD Hmw
related: CWfM RL9 V4t
related: sBa5 xfE GKU
related: 7rqs dJb gjc
related: C2131
related: qjsN zZ2 KwE
related: 1xwv 8x9 T59
related: ZV3b D1q Hip
related: Fwie YSS fgh
related: n9EN kBV XrN
related: oaHU YMk Wfi
related: Nx8H ZET y3g
related: ezVu GhE b3b
related: 5jZo oN5 xFM
related: BC1U Xti GK9
narrower: Viltforskare
narrower: Fysiolog
narrower: Ärftlighetsforskare
narrower: Etolog
narrower: Limnolog
narrower: Hydrobiolog
narrower: Entomolog
narrower: Mykolog
narrower: Forskare, zoologi
narrower: Naturvärdesinventerare
narrower: Zoolog
narrower: Fiskeribiolog
narrower: Botaniker
narrower: Forskare, växt- och djurbiologi
narrower: Marinbiolog
broad match: kJeN wmw 9wX

Maskinoperatör kemitekniska produkter
type: Concept
in scheme: JobTech Taxonomy - Yrke
definition: Maskinoperatörer för kemitekniska produkter sköter och övervakar maskiner som bearbetar kemikalier och andra ämnen för tillverkning av produkter. Maskinoperatörer för kemitekniska produkter sköter och övervakar maskiner för tillverkning av till exempel färg och rengöringsmedel. Yrket liknar operatörer inom läkemdelstillverkning. Arbetet innebär i huvudsak att övervaka och justera en eller flera maskiner så att produktionen når sin fulla kapacitet och att åtgärda problem som kan leda till driftstopp. Arbetet är starkt automatiserat och många produktionslinjer är robotiserade. Som maskinoperatör kan du behöva göra grundläggande robotprogrammering för att ställa in maskinerna. Det ingår också vanligtvis att kontrollera, avvikelserapportera och dokumentera enligt anvisningar. Ibland ingår också att göra förebyggande underhåll, packa den färdiga produkten och att köra truck. Skiftarbete är vanligt förekommande. Källa: Arbetsförmedlingen
broader: Maskinoperatörer, kemisktekniska och fotografiska produkter
related: 6dLQ 5iG FSZ
related: NzRa TSR CwF
related: nxXs 8Hp dJB
related: wTEr CBC bqh
broad match: C8131

Konferencier
type: Concept
in scheme: JobTech Taxonomy - Yrke
definition: Konferencier leder och presenterar vid olika evenemang och tillställningar som galor, festivaler, prisutdelningar och företagsevent. Vanliga arbetsuppgifter är att introducera programpunkter, presentera gäster eller talare, skapa en naturlig och flytande övergång mellan olika delar av evenemanget samt att hålla schemat. Källa: Arbetsförmedlingen
broader: Övriga yrken inom kultur och underhållning
related: 8too bEs 7NU
related: 9puE nYg crq
broad match: C2656

Digitaltryckare
type: Concept
in scheme: JobTech Taxonomy - Yrke
definition: Digitaltryckare tar fram och producerar grafiskt material så som trycksaker och skyltar. Digitaltryckare liknar yrket maskinoperatör, tryckeri. Digitaltryckare arbetar oftast med hela kedjan av produktionen, inklusive kundkontakt, design, produktion, efterbearbetning och leverans. Arbetsuppgifter utförs med digitala verktyg både i design och produktion. I yrket ingår även maskinunderhåll. Källa: Arbetsförmedlingen
broader: Tryckare
related: wTEr CBC bqh
related: PmsM k3C BUE
broad match: C7322

Försäljningsyrken inom detaljhandeln m.m.
type: Concept
in scheme: JobTech Taxonomy - Yrke
definition: Försäljningsyrken inom detaljhandeln m.m.
broader: Service-, omsorgs- och försäljningsyrken
narrower: Butikspersonal
narrower: Kassapersonal m.fl.
narrower: Eventsäljare och telefonförsäljare m.fl.

Patinör
type: Concept
in scheme: JobTech Taxonomy - Yrke
definition: Patinörer bearbetar ytor för ett skapa äldre och eller ådrat intryck. Patinering använde ofta inom teater, tv och film. Genom olika skapas en verklighetstrogen patina som kan ge intryck att ett föremål har en viss historia eller användning. Kunskaper om materialens egenskaper och estetisk känsla är viktiga egenskaper hos en patinör. Källa: Hantverksakademin, Hantverkslärling, Arbetsförmedlingen
broader: Musikinstrumentmakare och övriga konsthantverkare
related: 8too bEs 7NU
related: PaxQ o1G wWH
related: 9H5j VBR UuA
broad match: C7316

Valsare
type: Concept
in scheme: JobTech Taxonomy - Yrke
definition: Valsare arbetar med att tillverka metalldetaljer genom valsning. Arbetet innebär i huvudsak att sköta valsverk för bearbetning av metall. Valsare arbetar ofta med enstyckstillverkning. Jämför med valsverksoperatörer arbetar valsare vanligtvis med mindre volymer och mindre dimensioner inom tillverkning av produkter. Källa: Arbetsförmedlingen
broader: Valsverksoperatörer
related: ti4e Cvv EgT
related: 7t6t 9Sh 1Xg
related: wTEr CBC bqh
related: BQNi aN8 DHJ
broad match: C8121

Industrisömmerska
type: Concept
in scheme: JobTech Taxonomy - Yrke
definition: Industrisömmerskor sköter maskiner för industriell tillverkning av olika typer av sydda produkter, till exempel kläder, väskor, presenningar och dynor. Arbetet innebär att använda industrisymaskiner för sammanfogning, montering, förstärkning, lagning och modifiering. Man kan tillverka produkter specialiserade för olika yrkesområden, så som medicintekniksa kläder inom sjukvården. Beroende på arbetsplats och typ av produkt kan man använda mer automatiserade processer i tillverkningen. Källa: Arbetsförmedlingen
broader: Övriga maskinoperatörer, textil-, skinn- och läderindustri
related: 7XUF Ewf NAH
related: Pe77 zPv 8Ys
related: qgUE 4aF XHJ
related: HEuS FqK mF9
related: 2Byt iDB gLA
related: QZag EaG 11D
related: wTEr CBC bqh
broad match: C8153

Ayurvedamassör/Ayurvedaterapeut
type: Concept
in scheme: JobTech Taxonomy - Yrke
definition: Ayurvedamassör/Ayurvedaterapeut
alternative label: Ayurvedamassör
alternative label: Ayurvedaterapeut
broader: Terapeuter inom alternativmedicin
related: NYW6 mP6 vwf
related: Uuf1 GMh Uvw
broad match: C3230

Övriga kontorsassistenter och sekreterare
type: Concept
in scheme: JobTech Taxonomy - Yrke
definition: Utför annat kontorsarbete än inom 4111-4117 Exempel på arbetsuppgifter: Sköter löpande ärenden inom administration. Kontrollerar, kompletterar, registrerar, besvarar förfrågningar m.m. Skriver protokoll, brev, tabeller och andra dokument. Gör uträkningar och avstämningar.
broader: Kontorsassistenter och sekreterare
related: xSLo P6B 2AF
related: S2pg pcs tXu
related: DJgq zBj bKt
related: SV19 DbM RqE
related: ZuYj ADn tk7
related: 7H4j dRM Vbo
related: M58q o8J LLV
related: MDX9 9sL df3
related: TAmq TZR Lmf
related: uic8 7Ar HEA
related: Ke1k R8e iUk
related: dDxe fWR Q5Y
related: 2T5Z wdn 8Qv
related: uRcY 24c 7d5
related: bwjW 1SE XWZ
related: cAPJ ry5 AgS
related: 1FbS vYp DC3
related: aUr6 Rjg ja2
related: uA7X Pqn n9a
related: MXGG RL9 ZPB
related: TSwW JGd J52
related: vkys qdp GH4
related: h8Z3 Fq9 ohg
related: pQqy ta4 wqj
related: cYB2 4o8 XHV
related: EVxX 21X yeC
related: C4419
related: 3HjW 1BP k3S
related: aKAa jMG DdZ
related: YaHy ShR uo4
related: PjTV oih SDf
related: 9pKg zXP 9ig
related: NVfN 26P KUU
related: FqLw 515 Md9
related: 3vYj Rhf Voh
related: U9zT 51o tMo
related: HEia YGh KRv
related: epBr KmF HVM
related: 7Wwm JuJ ANq
related: cmrN Uff Nyc
related: Uv9y v2g efa
related: gn9Y yYC LiH
related: Tmps QPE g3V
related: dc2G fUp wZN
related: 5QwH sZY DVC
related: KN5V Gxm nGL
related: CtU5 jL4 he2
related: W728 Hze 9kk
related: C4312
related: UH9g R5v MCx
related: cPrZ ijm eEe
related: Y3fx 8wR Zim
related: QHxK TyX 5zS
related: Lt8M ZMv UbM
related: 5WVG LVw ZgL
related: qQa7 FJg J8X
related: ZhnF cSc p9V
related: C4131
related: WVJF FXY Sqk
related: NUC3 y1C Scg
related: 8UnT cpa zhy
related: i4ba rD6 XAG
related: ZQux yii D4Q
related: t6vN tjT 7JA
related: UJnU EqL XJZ
related: LmLg VXy VSS
related: 9dFi QaL PMB
related: 1qn1 fsa hZm
related: Ygao Vsn eJ2
related: iyhf Cm4 cWw
related: xwAq e21 98L
related: cw2M p2W SuJ
related: z9qQ ei6 Mjs
related: D7RV iq7 KE4
related: WnFA bt8 kPs

Civilingenjör, medicinsk teknik
type: Concept
in scheme: JobTech Taxonomy - Yrke
definition: Civilingenjör, medicinsk teknik
broader: Civilingenjörsyrken inom elektroteknik
related: 6Hq3 tKo V57
related: kDRm Yaa jAB
broad match: C2152

Flygtekniker
type: Concept
in scheme: JobTech Taxonomy - Yrke
definition: Ansvarar för och leder service- och underhållsarbete på flygplan och helikoptrar. Gör felsökning, inspektioner och funktionskontroller.
broader: Piloter, fartygs- och maskinbefäl m.fl.
related: e5jy 7Uy sY8
related: b1PH MNf zs9
related: VhTi tZ1 YAV
related: aHCV VsV LiD
related: q4t6 uHb WiW
related: QnvA akR Rd7
related: Q7Zu TZq CUi
related: Y6zg 1oi cDZ
related: EW8P 8Ag Xmo
related: JKSD AC8 Z2S
related: yZVr FkQ yTB
related: XUUx FMJ WbX
related: Te3y NpL tkQ
related: XpXT Ycb X4k
related: UW2F AVV faz
related: 7yoy pz2 HCh
related: qnK9 CBi ZKw
related: b316 Jsx PLj
related: TZv5 4Gh bfg
related: NYdq ND3 JrB
related: 23tt fXS N7o
related: Z9m3 QbL HxZ
related: 6E7M zdE 8kD
related: Vo9b Zuj kEa
related: 72JZ SAW W1j
related: n6GW QHy LBm
related: 6kGs Wjt qKV
related: 7zph bPW A8z
related: mQGA GDn QyM
related: ThXs ruQ cKp
related: UfmT oNc zNK
related: RDoH BQb zn1
related: C3155
related: 9YMK uqf 9Fa
narrower: Flygtekniker
narrower: El- och avioniktekniker
broad match: 6Hq3 tKo V57

Laboratoriechef
type: Concept
in scheme: JobTech Taxonomy - Yrke
definition: Laboratoriechef
broader: Forsknings- och utvecklingschefer
related: epLc SkD cbT
related: bh3H Y3h 5eD
related: BnPU Mn4 6nx
broad match: C1223

Pilot/Trafikflygare/Flygkapten
type: Concept
in scheme: JobTech Taxonomy - Yrke
definition: Pilot/Trafikflygare/Flygkapten
alternative label: Flygkapten
alternative label: Pilot
alternative label: Trafikflygare
broader: Piloter m.fl.
related: ASGV zcE bWf
related: hEjv t6k 4Kz
related: vmqF 4gF Bfd
broad match: C3153

IT-arkitekt
type: Concept
in scheme: JobTech Taxonomy - Yrke
definition: IT-arkitekten har ett övergripande ansvar för att IT-miljön är långsiktigt hållbar, följer riktlinjer och stödjer verksamhetens mål. IT-arkitekten kan arbeta både strategiskt och operativt, ibland med fokus på hela organisationens IT struktur snarare än enskilda lösningar. I arbetsuppgifterna ingår analysera affärsbehov och krav för att definiera tekniska arkitekturlösningar samt designa och utveckla arkitekturer för IT-system och applikationer, inklusive infrastruktur, plattformar och nätverk. IT-arkitekt är en bred yrkesbenämning som kan innefatta flera olika arkitektroller, till exempel lösningsarkitekt, verksamhetsarkitekt, infrastrukturarkitekt och mjukvaruarkitekt. Källa: Arbetsförmedlingen, Wise IT
alternative label: Lösningsarkitekt
broader: Systemanalytiker och IT-arkitekter m.fl.
related: MG8S ZJ3 cMZ
related: vhRX LK5 DZk
related: PdAe cEw kte
related: RtpE cfL Unh
related: ovQ3 Vyq Cec
related: u3eC gsz Ma9
related: tAKS xob i8W
related: apaJ 2ja LuF
related: vdFu zSQ CxW
related: iVa4 UyT GeZ
related: njDv vWu Paz
related: 4UvA mnn W8H
related: rFg3 3ob T7c
related: NPCv XAS NXs
related: qBsw ikL hZ2
related: CyFa XZu hf9
related: 7Mcz pJC cg9
related: yKuB sU5 4BL
related: XrxN gaw ak8
broad match: C2511

Dataanalytiker
type: Concept
in scheme: JobTech Taxonomy - Yrke
definition: Dataanalytiker
broader: Marknadsanalytiker och marknadsförare m.fl.
related: ddtF rtA wwc
related: Wqcq u5Y euP
related: 6zJX SJc Gct
related: WuE1 CSW zZN
related: RPTn bxG ExZ
related: 2dWL HJx H9y
related: bv6o xqC y1M
related: RMHQ jQg mab
related: ynps 8iK NR5
related: 2nLu mLC XF1
related: aSws tzf hYh
related: kSbf 7Up ngd
related: 4XyY MCb svG
related: BGMJ VN6 nH2
related: Bvoy ji3 hvU
related: AHmo qSf viN
related: fcPU 2zr Cw3
related: gLy6 yh4 Dzh
broad match: C2431

Personlig assistent
type: Concept
in scheme: JobTech Taxonomy - Yrke
definition: Personliga assistenter kompenserar och underlättar vardagen för människor med funktionsnedsättning. Arbetsuppgifterna varierar och är allt från hjälp vid måltider, hygien, klä av/på sig, egenvård och sköta hemmet till att göra det möjligt för en person att vara förälder, arbeta, studera, ägna sig åt fritidsintressen, umgås med vänner eller följa med på resor. Källa: Arbetsförmedlingen - Hitta yrken
broader: Personliga assistenter
related: UdVa jRr 9DE
related: GazW 2TU kJw
related: 996Q 98R J4g
related: VMZf mdy 2dH
related: s26n z4q 3UU
related: VhBv HNr pZB
related: ARP9 7nc QEe
broad match: C5322

Utbildningsadministratör
type: Concept
in scheme: JobTech Taxonomy - Yrke
definition: Utbildningsadministratörer hanterar studieadministrativa uppgifter inom utbildning. Arbetsuppgifterna omfattar ofta kursregistrering, tentamensadministration, schemaläggning, hantering av studieuppgifter i administrativa system, samt kommunikation med studenter och lärare kring studieplaner och utbildningsinformation. Utbildningsadministratörer samarbetar ofta med andra administrativa funktioner och medverkar vid planering och genomförande av utbildningsrelaterade evenemang. Yrket förekommer främst vid universitet, högskola eller studieförbund. Andra arbetsplatser kan vara privata utbildningsanordnare eller organisationer. Liknande arbetsuppgifter förekommer inom yrket Skolassistent, vilket dock endast avser arbete på förskolor och skolor. Källa: Arbetsförmedlingen
broader: Övriga handläggare
related: sAt3 jaN d9Y
related: B1Jq Zzq 5DZ
related: 32Lx 5xH xhQ
related: X82t awd Qyc
related: VMoo Ruy 6yZ
related: UadN f2f s3V
related: hJVJ HV4 pXb
related: nWhN Zy4 KAv
related: ERda Tzu fun
related: 3w9G mY4 DUU
related: GTmK 2Ut H3c
related: YdFD Zu6 psz
related: Fk9S SEC cep
related: qc47 Cgt Lxj
related: SMmk 5jC sqD
related: nQmA 17Q HE4
related: UxfG HtY wtq
related: M1hq NiA oFz
broad match: C3343

Lärling grundläggningsmaskinförare
type: Concept
in scheme: JobTech Taxonomy - Yrke
definition: En lärling är anställd för att slutföra sin kvalificeringstid till grundläggningsmaskinförare innan ett yrkesbevis kan utfärdas. Under kvalificeringstiden får du lärlingslön enligt avtal. Kvalificeringstiden tillsammans med teoretisk grundutbildning leder till yrkesbeviset. Ett lärlingsavtal mellan branschorganisation och företag tecknas. Källa: BYN
broader: Anläggningsmaskinförare m.fl.
related: j7Cq ZJe GkT
related: ja7J P8X YC9
broad match: C8342

IT-chefer
type: Concept
in scheme: JobTech Taxonomy - Yrke
definition: Formulerar och ansvarar för mål och strategier inom IT-verksamhet. Utformar riktlinjer, följer upp och utvärderar verksamheten mot uppsatta mål för IT-verksamheten. Ansvarar för anskaffning, utveckling, underhåll och användning av IT-system. Ansvarar för IT-säkerhet. Svarar för budget samt fördelar resurserna inom verksamheten. Har personalansvar.
broader: IT-chefer
related: 4f1v w91 qVM
related: YS7V c8n MrS
related: G7Qq r7L 5Jo
related: UH9g R5v MCx
related: 8tYq EXD Xwm
related: KZQE Gqi iJx
related: ZzN5 m7B 5CY
related: Nksx 4oe fEQ
related: eThQ HCv mY6
related: UJcF SrQ Jvw
related: 1dVh cZS Exw
related: Gt5f wdi FSJ
related: q7Mx gjU F9q
related: zXNU zXR hGd
related: D7Ns RG6 hD2
related: LqRT TVB RPo
related: Mj5b 25Q Scv
related: C1330
narrower: Chief Data Officer/CDO
narrower: Chief Information Security Officer
narrower: Chief Digital Officer/CDO
narrower: Chief Information Officer/CIO/IT-chef
narrower: Chief Technology Officer/CTO/Teknologichef
narrower: Driftchef, data
broad match: bh3H Y3h 5eD

Hotell- och konferenschefer
type: Concept
in scheme: JobTech Taxonomy - Yrke
definition: Formulerar och ansvarar för mål och strategier för hotell- och konferensverksamhet. Utformar riktlinjer, följer upp och utvärderar verksamheten mot uppsatta mål. Svarar för budget samt fördelar resurserna inom verksamheten. Har personalansvar.
broader: Hotell- och konferenschefer
related: s5SS 7bW 1Gh
related: C1411
related: 1Riq K64 wMr
related: UH9g R5v MCx
related: Z8gz 6SV bKW
related: 8tYq EXD Xwm
related: ZzN5 m7B 5CY
related: Nksx 4oe fEQ
related: eThQ HCv mY6
related: ZxKX dN4 8DJ
related: Gt5f wdi FSJ
related: zXNU zXR hGd
related: 4fRg DA4 Dj3
narrower: Hotellchef
narrower: Konferenschef
broad match: bh3H Y3h 5eD

Sågverksoperatör
type: Concept
in scheme: JobTech Taxonomy - Yrke
definition: Sågverksoperatörer styr och övervakar processen för att tillverka plank och brädor av stockar. Man arbetar i operatörsrum och följer processen via skärmar, där man justerar processer för barknning och sågning. Sågat virke transporteras för torkning, paketering och leverans. Vid vissa sågverk sker även förädling av sågat virke, till exempel hyvling. Yrken kan därför likna hyveloperatör vid sågverk. Beroende på arbetsplats kan felsökning, enklare maskinunderhåll och truckkörning även vara förekommande arbetsuppgifter. Källa: Arbetsförmedlingen - Hitta yrken
broader: Operatörer inom sågverk, hyvleri och plywood m.m.
related: kTod HfC jcQ
related: HbY1 uxx Qdp
related: DMvN cdE uUX
related: SbPU kk1 ysZ
related: BxJa rdd sbf
related: ufnG UbN pvB
related: TL4a Jii 6vk
related: yteo kPd 1V7
related: 2CnS UmE mQU
related: HrkZ 9bF PRT
related: LJjb g2g QfJ
related: 5gJT nTa YaA
related: WYtd U7X qn2
related: etnv TYF V5E
related: 4RWf 2FY JU2
related: vu2R 6xy vwk
related: 1Btg cUB ZR2
related: EoUM QVT Jcd
related: 6r6a VXS mgJ
related: 2G7z S8L 7Ls
related: HEUp D8Q fGQ
related: wTEr CBC bqh
related: yEAR VCR LZg
related: 3w22 K8V hbb
related: JkZU jw3 ofK
broad match: C8172

Lagerchef
type: Concept
in scheme: JobTech Taxonomy - Yrke
definition: Lagerchef
broader: Inköps-, logistik- och transportchefer
related: sBo2 pAg 6Kg
related: epLc SkD cbT
related: LV7W 5mp twN
related: ASGV zcE bWf
related: bh3H Y3h 5eD
related: Hm2J N6d TR3
broad match: C1324

Trader
type: Concept
in scheme: JobTech Taxonomy - Yrke
definition: Trader
broader: Traders och fondförvaltare
related: RbsF qLv jeg
related: RPTn bxG ExZ
related: X82t awd Qyc
broad match: C2412

Trafikskolechef
type: Concept
in scheme: JobTech Taxonomy - Yrke
definition: Trafikskolechef
broader: Övriga chefer inom utbildning
related: epLc SkD cbT
related: bh3H Y3h 5eD
related: MVqp eS8 kDZ
broad match: C1345

ST-läkare, kirurgi
type: Concept
in scheme: JobTech Taxonomy - Yrke
definition: Specialisttjänstgöring, ST, är den vidareutbildning som legitimerade läkare genomför för att uppnå specialistkompetens. ST-läkare kirurgi arbetar under handledning för att fördjupa sina medicinska kunskaper och färdigheter med målet att bli specialistläkare inom sitt område. ST-läkaren arbetar självständigt med patientutredningar, diagnostik och behandling, men alltid med stöd av specialister och enligt ett individuellt utbildningsprogram. Vanliga arbetsuppgifter är att ta medicinskt ansvar för patienter, delta i jourverksamhet, genomföra medicinska undersökningar och behandlingar samt dokumentera och följa upp vårdinsatser. Tjänsten omfattar också kontinuerlig kompetensutveckling, sidotjänstgöring inom närliggande områden och aktivt deltagande i handledning och utbildningsinsatser för kollegor och studenter. Källa: Arbetsförmedlingen, Karolinska Universitetssjukhuset, Sveriges läkarförbund, Region Kronoberg, Region Skåne.
broader: ST-läkare
related: NYW6 mP6 vwf
related: UtCj yMj ubw
broad match: C2211

Nationalekonom
type: Concept
in scheme: JobTech Taxonomy - Yrke
definition: Nationalekonom
broader: Nationalekonomer och makroanalytiker m.fl.
related: i5Br fVL pb4
related: xWea 35W SQX
related: 1CvG jiu NTP
related: f4zj ZVe 7TS
related: X82t awd Qyc
related: vw7i 55Q xxT
related: jvni JKJ KU7
related: EwFk XpH Ckp
related: K11V F2U 94B
broad match: C2631

Eventförsäljare
type: Concept
in scheme: JobTech Taxonomy - Yrke
definition: Eventföräljare säljer produkter eller tjänster vid olika event och på offentliga platser. Vanliga arbetsplatser är vid arenor och mässor i samband med evenemang. Försäljning sker direkt mot kund, antingen uppsökande eller utifrån en monter eller annan fast plats. Arbetsuppgifter innebär att demonstrera produkter och tjänster och besvara. Andra arbetsuppgifter kan vara förberedelser inför event, så som uppställning av monter och presentation av varor. Källa: Arbetsförmedlingen
broader: Eventsäljare och butiksdemonstratörer m.fl.
related: UdVa jRr 9DE
related: rDcj Tao TJJ
related: RPTn bxG ExZ
related: DQeY gXg sio
broad match: C5242

Montör, gummi- och plastprodukter
type: Concept
in scheme: JobTech Taxonomy - Yrke
definition: En montör av gummiprodukter eller plastprodukter arbetar med att montera, sammanfoga och ibland även bearbeta komponenter av gummi och/eller plast till färdiga produkter. Arbetet sker oftast inom tillverkningsindustrin och kan omfatta allt från små detaljer till större industridelar, exempelvis fordonsdetaljer, leksaker, sportartiklar eller tekniska komponenter. I arbetet ingår även att utföra kvalitetskontroller och säkerställa att produkterna uppfyller specificerade krav. Källa: Arbetsförmedlingen, div jobbannonser
broader: Montörer, metall-, gummi- och plastprodukter
related: UdVa jRr 9DE
related: C9Zv Q7p 3cQ
related: 8hVR QHZ xA1
related: wTEr CBC bqh
related: 3vNk 83L bMK
broad match: C8219

Agronom
type: Concept
in scheme: JobTech Taxonomy - Yrke
definition: Agronom
broader: Specialister och rådgivare inom lantbruk m.m.
related: kumQ 5u2 aFd
related: wxdJ iuw NK3
related: cMFT etX XxA
related: YBEx iJT oVt
related: 6nbS RdB kzm
related: VuuL 7CH adj
broad match: C2132

Planeringstekniker, metallurgi
type: Concept
in scheme: JobTech Taxonomy - Yrke
definition: Planeringstekniker, metallurgi
broader: Ingenjörer och tekniker inom gruvteknik och metallurgi
related: 6Hq3 tKo V57
broad match: C3117

Budgetplanerare
type: Concept
in scheme: JobTech Taxonomy - Yrke
definition: Budgetplanerare
broader: Controller
related: jk5D 1fi zXc
related: eQFc 7Vq buj
related: X82t awd Qyc
broad match: C2411

Riksdagsledamot
type: Concept
in scheme: JobTech Taxonomy - Yrke
definition: Riksdagsledamot
broader: Politiker
related: bh3H Y3h 5eD
related: UdV5 cL8 xUZ
broad match: C1111

Butikssäljare, fackhandel
type: Concept
in scheme: JobTech Taxonomy - Yrke
definition: En butikssäljare som säljer sällanköpsvaror i affärer, varuhus, stormarknader och andra försäljningsställen. Arbetsuppgifterna sträcker sig från att beställa, packa upp, prismärka och fylla på varor, till att informera om och sälja produkterna, samt ge råd om användning och skötsel. Som säljare är du ofta en del av ett arbetslag, där alla tillsammans har ett ansvar för arbetsuppgifterna. Källa: Handelsrådet
broader: Butikssäljare, fackhandel
related: uDkf rZF pPA
related: ikDX Thx fUo
related: ANqi hBh 3K2
related: RLcH 9W3 w5H
related: 6orP YDF iHr
related: FLPL Peq BaF
related: PFTT ChP 3cc
related: ABQN zqd H1K
related: co58 Z2d NFi
related: TdbR VPL na9
related: UdVa jRr 9DE
related: Ao6r zZa KrV
related: AUit jWj QVK
related: e1T6 v5V VFT
related: B6CE Ceh tYa
related: Fkpf Gwt rnE
related: qa1z yEQ wGP
related: ySmz A58 13Q
related: T3FN VWp QDr
related: trBz FYs FnE
related: rDcj Tao TJJ
related: vZFf kUQ Zn4
related: 1ho9 kuo S7b
related: 9rVa PhR uQG
related: RPTn bxG ExZ
related: gG7Y oHH W4c
related: U34Q EBr Uio
related: iGSg 4PW J5h
related: BNsj Mhu UWt
related: q5oQ dnb 2YR
related: abT6 mwf smS
related: Q6Va RTj 9U9
related: DBdh Q4d Gyw
related: jsUo gdb Tb4
related: SnhT Q8T m5e
related: hXkk Ryo Y6r
related: 3PAZ q5P wAe
related: Dyd5 P1i UbL
related: S799 1dt dvQ
related: ECZi GCz EJT
related: 7vCH awd Zvj
related: GBTG rV3 shj
related: XgFf rtz pAB
related: Lk6N FTh tqD
related: Usc3 jVf 82z
related: Z1B7 gRp ST7
related: NA4i G2o 5TB
related: ZUmi Ugr grf
related: ZZpf 3bZ A54
related: KwJo mio jCn
related: bQVt KZW bAg
related: iuQA Ao5 jdm
related: B8J4 rXe Ni3
related: B6zP PWr ayv
related: 9HCt hc7 EM2
related: wiPc FKC AJS
related: F5oc NtF CCt
related: a2t2 ir7 yzZ
related: thUC XXE 8tB
related: 1G5q xjz qbF
related: gEiS PoV DXc
related: K4JA Ev3 dBP
related: KJxc 7gz 9Se
related: q2Q6 8xX aCr
related: zdiJ enm ULJ
related: RamU zNb 9YP
related: p8fb 3qM wVP
related: otAP TTq vQS
related: zQji aRa D4J
related: 1zNc Kr5 m8N
related: Niru qf5 xHQ
related: 31SQ kDL 2ix
related: eYe6 kXc Akh
related: TcXw Fbx xjb
related: SS9v imU 8Zk

AT-läkare
type: Concept
in scheme: JobTech Taxonomy - Yrke
definition: Gör en tidsbegränsad allmäntjänstgöring bestående av utbildning samt läkararbete under handledning. Undersöker patienter, ställer diagnoser och gör behandlingsplaner.
broader: Läkare
related: 4QAE wtY gJh
related: C2211
related: 9Fna GUm HWL
related: Mmxs Qrv cpG
related: 73kE uFW vvT
related: 1eKe zFj QAa
related: nA5p Ske 4zb
related: 6VAN Ccy EkA
related: PrA4 KwY YcV
related: du5j oyG ju6
related: Lqnz Zqw nQ9
related: QQuL 2Pe YDE
related: F7nJ k5s L29
related: NpcY f4G L1H
related: 2GuF gtz xfW
related: rF7s hX1 ECH
related: n9ho 3vf UZP
related: rVUL AgV ZTH
related: pGBH BkG qJa
related: yV9B PxJ TxS
related: LwTt 3Ns mGH
narrower: AT-läkare
broad match: NYW6 mP6 vwf

Arbetsledare elkraft
type: Concept
in scheme: JobTech Taxonomy - Yrke
definition: Arbetsledare inom elkraft arbetsleder drifttekniker och elektriker vid kraftverk och elnätsarbeten. Arbetsledare inom elkraft leder och planerar dagligt arbetet för drifttekniker vid kraftverk och elektriker inom elnätsarbeten. Källa: Arbetsförmedlingen
broader: Arbetsledare inom bygg, anläggning och gruva
related: j7Cq ZJe GkT
related: 5dZe kdS VKk
related: 7kvc Atc LCo
related: Z69j 8MQ Bpj
broad match: C3123

Skönhets- och kroppsterapeuter
type: Concept
in scheme: JobTech Taxonomy - Yrke
definition: Skönhets- och kroppsterapeuter
broader: Serviceyrken
narrower: Övriga skönhets- och kroppsterapeuter
narrower: Fotterapeuter
narrower: Hudterapeuter
narrower: Frisörer
narrower: Massörer och massageterapeuter

Hemvårdare
type: Concept
in scheme: JobTech Taxonomy - Yrke
definition: En hemvårdare ger stöd och omsorg till personer i deras egna hem. Det kan inkludera hjälp med personlig hygien, matlagning, städning, medicinhantering och socialt stöd. Hemvårdaren arbetar för att möjliggöra för människor att bo kvar hemma så länge som möjligt, genom att anpassa insatserna efter individens specifika behov. Källa: Arbetsförmedlingen, div jobbannonser
broader: Vårdbiträden
related: UdVa jRr 9DE
related: NYW6 mP6 vwf
related: GazW 2TU kJw
related: d4L9 3rP 9Ld
related: Pda7 Z6w 9t3
related: EKUm Ecu u3c
broad match: C5322

Kemister
type: Concept
in scheme: JobTech Taxonomy - Yrke
definition: Utvecklar teorier, modeller och metoder samt utformar praktiska tillämpningar inom kemi. Leder experiment, analyserar och värderar data i laboratoriemiljö. Informerar, ger råd samt utfärdar anvisningar och tillstånd. Utvecklar och provar kemiska produkter och processer. Tar fram dokumentation och handlägger registreringsärenden. Hit hör inte Apotekare/Farmacevt (2281) Farmakolog (2133) Kemiingenjör (2145) Laboratorieingenjör, kemi (3215) Toxikolog (2131)
broader: Fysiker, kemister m.fl.
related: JsAw WWK wbb
related: G7Fn HmD Koc
related: X1rw gE8 6qx
related: HBEU dvp 7ZD
related: 7GaA 87a uE5
related: AiJB BVf yfQ
related: 5Lq4 w7S 88y
related: nA5p Ske 4zb
related: VQHQ ScF Fr5
related: WBAe 1rD 5JT
related: qA5B hun ZeN
related: GKfd eHz HWB
related: DMim Tzk 2j4
related: QUt3 GAe W4K
related: G84U eAD CiF
related: ruVS dJA 3Kg
related: 6RWb VsD Hmw
related: C2113
related: S4Ku uT7 yuV
related: 5C9T a2L 5zC
related: n9EN kBV XrN
related: h6Tu oFS KDH
related: CBdm AS6 XMd
narrower: Materialkemist
narrower: Sjukhuskemist
narrower: Strukturkemist
narrower: Processkemist
narrower: Forensiker, kemist
narrower: Oorganisk kemist
narrower: Biokemist
narrower: Miljökemist
narrower: Organisk kemist
narrower: Analytisk kemist
narrower: Kemist
narrower: Ytkemist
broad match: kJeN wmw 9wX

Ambassadråd
type: Concept
in scheme: JobTech Taxonomy - Yrke
definition: Ambassadråd
broader: Förvaltnings- och planeringschefer
related: bh3H Y3h 5eD
broad match: C1213

Platschef, film/Platschef, TV
type: Concept
in scheme: JobTech Taxonomy - Yrke
definition: Platschef, film/Platschef, TV
alternative label: Platschef, TV
alternative label: Platschef, film
broader: Inspicienter och scriptor m.fl.
related: epLc SkD cbT
related: MUn1 QEc Hnn
related: 9puE nYg crq
broad match: C3435

Utbildningsledare
type: Concept
in scheme: JobTech Taxonomy - Yrke
definition: En utbildningsledare ansvarar för att planera, organisera och leda utbildningsverksamhet. Deras arbetsuppgifter kan inkludera att ta fram utbildningsplaner, följa upp undervisningen, handleda lärare och se till att utbildningen håller hög kvalitet och följer gällande regelverk. Det ingår även att samordna undervisningen, kommunicera med elever, lärare och andra intressenter samt att driva utvecklingen av utbildningen framåt, t.ex. genom att införa nya metoder eller tekniker. Källa: Arbetsförmedlingen, Göteborgs universitet
broader: Övriga utbildare och instruktörer
related: wfRR gtz nRs
related: 1yZM 6JA dGH
related: XEhc CRH cGn
related: jk9X VBv RKM
related: MVqp eS8 kDZ
related: 7PjZ 9gk N5c
related: 7e7v DW1 Jr3
related: emWX p1P rT1
related: tS9S wbg GnY
related: iH2g c7M zbd
broad match: C2424

ST-läkare, rättsmedicin
type: Concept
in scheme: JobTech Taxonomy - Yrke
definition: Specialisttjänstgöring, ST, är den vidareutbildning som legitimerade läkare genomför för att uppnå specialistkompetens. ST-läkare rättsmedicin arbetar under handledning för att fördjupa sina medicinska kunskaper och färdigheter med målet att bli specialistläkare inom sitt område. ST-läkaren arbetar självständigt med patientutredningar, diagnostik och behandling, men alltid med stöd av specialister och enligt ett individuellt utbildningsprogram. Vanliga arbetsuppgifter är att ta medicinskt ansvar för patienter, delta i jourverksamhet, genomföra medicinska undersökningar och behandlingar samt dokumentera och följa upp vårdinsatser. Tjänsten omfattar också kontinuerlig kompetensutveckling, sidotjänstgöring inom närliggande områden och aktivt deltagande i handledning och utbildningsinsatser för kollegor och studenter. Källa: Arbetsförmedlingen, Karolinska Universitetssjukhuset, Sveriges läkarförbund, Region Kronoberg, Region Skåne.
broader: ST-läkare
related: NYW6 mP6 vwf
related: UtCj yMj ubw
broad match: C2211

Dansare
type: Concept
in scheme: JobTech Taxonomy - Yrke
definition: Dansare uttrycker känslor, berättelser och olika budskap genom kroppsrörelser i dansföreställningar inom olika dansgenrer som balett, modern dans, jazz eller streetdance. Vanliga arbetsuppgifter är att öva tekniker, medverka i repetitioner och framträdanden, samarbeta med andra dansare och koreografer. Dansare kan även delta i undervisning eller arbeta med koreografi som kompletterande uppgifter. Källa: Arbetsförmedlingen, Kulturama, Stockholms konstnärliga högskola
broader: Koreografer och dansare
related: a43x xLx 8rz
related: p6pG Mrv CqN
related: utAS fc6 Wbk
related: 8too bEs 7NU
related: 9puE nYg crq
related: TmnN Psi dUn
related: GDAw 7wa Q7w
broad match: C2653

Körsnär
type: Concept
in scheme: JobTech Taxonomy - Yrke
definition: Körsnärer tillverkar, reparerar och handlar med kläder av pälsverk och skinn från olika djur. Att vara körsnär är ett kreativt och traditionellt hantverksyrke med liknande arbetsmoment som i annan sömnad, inklusive mönsterkonstruktion, måttagning, tillskärning och detaljsömnad. Renovera, ändra och laga pälsar är vanliga arbetsuppgifter för körsnärer. Det är även vanligt att vara egen företagare och sälja, köpa och förvara pälsar. Förutom kläder kan man även arbeta med möbelklädsel i päls. Källa: Hantverksakademin, Arbetsförmedlingen
broader: Skräddare och ateljésömmerskor m.fl.
related: kqau D4r 4fE
related: PaxQ o1G wWH
related: 2tdU 1m6 Ckj
related: UTvE gjU rwd
broad match: C7531

Hjärtsjuksköterska
type: Concept
in scheme: JobTech Taxonomy - Yrke
definition: Hjärtsjuksköterska arbetar självständigt med avancerad omvårdnad, bedömning och behandling av patienter med olika hjärtsjukdomar inom specialistvård. Sjuksköterska är en skyddad titel med legitimationskrav. En hjärtsjuksköterska med specialistsjuksköterskeexamen får använda benämningen specialistsjuksköterska inom hjärtsjukvård. Vanliga arbetsuppgifter är övervaka och bedöma patienters hjärtfunktion, ansvara för patientens vårdplanering, ge stöd till egenvård, arbeta med prevention, följa upp behandlingar inom hjärtsjukvård och rehabilitering. Hjärtsjuksköterskan informerar också patienter och anhöriga. Källa: Arbetsförmedlingen, Socialstyrelsen, Svensk sjuksköterskeförening
broader: Övriga specialistsjuksköterskor
related: NYW6 mP6 vwf
related: jkYm 4W6 n1N
related: ytRi QuA XLX
related: 1f7B E5K sh3
broad match: C2221

Övriga skönhets- och kroppsterapeuter
type: Concept
in scheme: JobTech Taxonomy - Yrke
definition: Utför annat skönhets- och kroppsterapeutiskt arbete än inom 5141-5144 Exempel på arbetsuppgifter: Ger vårdande behandlingar på händer, naglar och nagelband. Bygger upp, förstärker, förlänger och lagar naglar med olika metoder, material och hjälpmedel. Utför spa-behandlingar. Ger råd om kläder och smink. Lägger makeup. Maskerar skådespelare m.m.
broader: Skönhets- och kroppsterapeuter
related: 7H4j dRM Vbo
related: y4QG ukH xkW
related: iWFB G7G SnJ
related: fFd4 bT2 NeR
related: 5APZ gLs AB4
related: 4QAE wtY gJh
related: 8S2f kNg dUk
related: VxS2 ZHa Kag
related: PE2u Ji4 ajn
related: 8BvJ 7kv Sks
related: C5142
related: oYUw efH G6u
related: kWPd NUy 9Za
related: hCQN rUx 6BK
related: p9um Jnx 5ds
related: wXzF XdX EwR
related: FPh6 g41 4mL
related: bPCR BeT Jo2
related: KVoz adN 1xk
related: XCdg UJK w2q
related: qhJ9 N4G BQg
related: RVLi 2no Eyg
related: bhJU 7hb 8pQ
related: T7aG stn Kxy
related: Krbu VkM PdQ
related: gtZc Z14 e1q
related: kusY oZZ Wbv
related: g5u6 1Bg 99U
related: yYrg 8jy LLa
related: C9bP DeG CZP
related: vHaL 11u eEi
related: dZ3L vGh StN
related: t9A6 jvd 6h5
related: YBuN Wgv 19X
related: xPqp 6o4 f8c
related: 98C6 xyV h75
related: hb6T 8BP YAT
related: L99N qF2 F27
related: 4pcQ z1Y zZ9
related: D7xh 6UL pdW
related: Gstq 4UH 9na
related: WW1S XpE BVK
related: 43v8 evE cUE
related: ayge aHH pkG
related: mKKd wMP kX8
related: exNQ Lpw EKj
related: eVFF obx bKN
related: Pk1y cpM ZhC
related: Hki4 N8b Jzk
related: 9UQG XnB Ved
related: x8pz eVh sjQ
related: uKA9 HNf 8iW
narrower: Maskör
narrower: Piercare
narrower: Sminkör
narrower: Stylist
narrower: Tatuerare
narrower: Spaterapeut
narrower: Fransstylist
narrower: Pedikyrist
narrower: Nagelterapeut
narrower: Make-up artist
narrower: Manikyrist
broad match: Uuf1 GMh Uvw

Mönsterritare, tyger
type: Concept
in scheme: JobTech Taxonomy - Yrke
definition: Mönsterritare, tyger
broader: Skräddare och ateljésömmerskor m.fl.
related: nuYq ze9 XAX
related: kqau D4r 4fE
related: PaxQ o1G wWH
broad match: C7532

Specialpedagog
type: Concept
in scheme: JobTech Taxonomy - Yrke
definition: Specialpedagog arbetar förebyggande och strategiskt för att undanröja hinder för elevers lärande genom att utreda behov, utforma stödinsatser och handleda skolpersonal. En specialpedagog är en legitimerad lärare med en specialpedagogexamen. Vanliga arbetsuppgifter är att genomföra pedagogiska utredningar, bedöma och kartlägga elevers behov av extra anpassningar eller särskilt stöd samt utforma och följa upp individuella åtgärdsprogram. Specialpedagogen samarbetar nära med lärare, elevhälsoteam och vårdnadshavare och ger råd om hur undervisningen kan anpassas för att skapa en inkluderande lärmiljö. Källa: Arbetsförmedlingen, Skolverket och Socialstyrelsen
broader: Speciallärare och specialpedagoger m.fl.
related: iTzu YuW EUG
related: z7rP SZb nUT
related: the9 r31 3Cz
related: 3pyE aAA TFD
related: pw3j RVz YbM
related: MVqp eS8 kDZ
related: gujG oiY Tux
related: TvpS Yit uU4
related: TDwQ Jem aDe
related: WSxm zmy 2CM
broad match: C2351

Gatuchef
type: Concept
in scheme: JobTech Taxonomy - Yrke
definition: En gatuchef ansvarar för planering, utveckling och underhåll av kommunens gator, vägar och torg. De ser till att trafiksäkerheten upprätthålls och att gatunätet är anpassat efter samhällets behov. Det kan också innebära ansvar för budget, personalledning och att samordna entreprenörer inom området. Källa: Arbetsförmedlingen, Uppsala kommun
broader: Chefer inom arkitekt- och ingenjörsverksamhet
related: Gc3b vUc t6f
related: uWgd jsX suh
related: epLc SkD cbT
related: bh3H Y3h 5eD
broad match: C1213

Civilingenjör, kemiteknik
type: Concept
in scheme: JobTech Taxonomy - Yrke
definition: Civilingenjör, kemiteknik
broader: Civilingenjörsyrken inom kemi och kemiteknik
related: 6Hq3 tKo V57
related: jNZf Q14 BqP
broad match: C2145

Kontorsassistenter och sekreterare
type: Concept
in scheme: JobTech Taxonomy - Yrke
definition: Kontorsassistenter och sekreterare
broader: Kontorsassistenter och sekreterare
narrower: Medicinska sekreterare, vårdadministratörer m.fl.
narrower: Övriga kontorsassistenter och sekreterare
narrower: Inköps- och orderassistenter
narrower: Skolassistenter m.fl.
narrower: Löne- och personaladministratörer
narrower: Backofficepersonal m.fl.
narrower: Ekonomiassistenter m.fl.
narrower: Marknads- och försäljningsassistenter

Ljuddesigner
type: Concept
in scheme: JobTech Taxonomy - Yrke
definition: Ljuddesigner skapar och gestaltar ljudlandskap, ljudeffekter och musik för olika medier och produktioner såsom teater, film, TV, dataspel och andra audiovisuella sammanhang. Vanliga arbetsuppgifter är att planera, spela in, redigera och mixa ljudspår samt att anpassa ljudplacering efter miljö och scenografi. Ljuddesignern samarbetar ofta med andra yrkesgrupper inom produktionen och kan även arbeta med att utveckla ljud för interaktiva medier som spel. Källa: Arbetsförmedlingen, Yrkesnämnden för Film och TV
broader: Ljus-, ljud- och scentekniker
related: jVkC Exf 67j
related: 8too bEs 7NU
related: 9puE nYg crq
related: d1Ao 9bY 7Kn
broad match: C3521

Fastighetsutvecklare
type: Concept
in scheme: JobTech Taxonomy - Yrke
definition: Arbetar bland annat med att identifiera och ta fram ekonomiska underlag för fastighetsutvecklingsprojekt, huvudsakligen för företag inom byggsektorn.
broader: Övriga ekonomer
related: X82t awd Qyc
broad match: C2412

Lärare i kulturskolan
type: Concept
in scheme: JobTech Taxonomy - Yrke
definition: Lärare i kulturskolan
broader: Övriga pedagoger med teoretisk specialistkompetens
related: pVzY rff Amk
related: aPrW KDK G4H
related: AzsG uf8 FSt
related: MVqp eS8 kDZ
broad match: C2359

Flight Data Operator/FDO/Flygledarassistent
type: Concept
in scheme: JobTech Taxonomy - Yrke
definition: Flight Data Operator/FDO/Flygledarassistent
alternative label: FDO
alternative label: Flight Data Operator
alternative label: Flygledarassistent
broader: Flygledare
related: 5LU4 W6d RQD
related: ASGV zcE bWf
related: yFy5 624 TWk
broad match: C3154

Gruv- och stenbrottsarbetare
type: Concept
in scheme: JobTech Taxonomy - Yrke
definition: Borrar och transporterar malm från gruva. Borrar och förstärker berg vid anläggningsarbeten.
broader: Malmförädlingsyrken och brunnsborrare m.fl.
related: HACr 3sZ 4gm
related: MiyM dYh Yy2
related: kq8N 5vE x89
related: C8111
related: Ytcy v8N P2w
related: swHZ UXk UaE
related: tWch mrP ECi
related: Hwgd Udd dWE
related: YbbH 1b5 pe5
related: LXX8 r6E qWJ
related: qfFR 2yk wZM
related: REr4 5r8 1w4
related: Q7eC B7g QiU
related: uWn1 Xdf xPJ
related: M7C1 DAy UTK
related: yZLc azr 4mL
related: muTx UEy cZe
related: EY3Z YS7 F3R
related: fhcp fFw Lbj
related: 8Yqr o72 jqv
related: jLDm rfF 754
related: bV3k RLH 3v9
related: nkhA jPz pcE
related: ynWd oCo o61
related: oaWF AZN b5B
related: xeoH rao GgZ
related: fhu6 H74 uuN
related: 3ALZ Rsh zSf
related: yeFp n8z oKy
related: ztAc cLZ vtf
related: ykyf hFy V5o
related: Stca tVg Kiu
related: WLAi BDr 5fW
related: DpvA 768 A94
related: QM4g Xik 4gR
related: KfEn V5y npV
related: i35M nVC rW5
related: VwhS yaQ B1k
related: HmXd ehy QT9
related: 33Ur Hia 4B6
related: dmF5 zy7 Utt
related: r4Te Mzt yrC
related: jGja KqS yoj
narrower: Bergarbetare, bygg och anläggning, utan yrkesbevis
narrower: Bergarbetare, bygg och anläggning
narrower: Lärling, bergarbetare, bygg och anläggning
narrower: Stenbrottsarbetare
narrower: Bergarbetare, gruva
broad match: j7Cq ZJe GkT

Korgmakare
type: Concept
in scheme: JobTech Taxonomy - Yrke
definition: Korgmakare tillverkar och reparerar korgar och korgmöbler. Man arbetar med flätning och bindning av material som rotting, pil, sjögräs eller snöre. Korgmakaren använder traditionella hantverkstekniker och arbetsredskap såsom hyveljärn, kniv, hammare och spik. Ytbehandling och efterbehandling av produkterna ingår också i arbetet. Källa: Hantverksakademin, Hantverkslärling, Arbetsförmedlingen
broader: Musikinstrumentmakare och övriga konsthantverkare
related: CZE1 UKr emA
related: PaxQ o1G wWH
related: zuhk 8hT xCz
broad match: C7317

Maskinoperatör sprängämnen och pyroteknik
type: Concept
in scheme: JobTech Taxonomy - Yrke
definition: Maskinoperatör inom sprängämnen och pyroteknik arbetar med maskiner för tillverkning i större skala. Beroende på arbetsplats är man som maskinoperatör delaktig i hela eller delar av tillverkningsprocessen. Förutom att sköta framställningsmaskiner är vanliga arbetsuppgifter också kontroll av råmaterial och transport samt kvalitetskontroll av färdig produkt. Underhåll av produktionsmaskiner är också en vanligt förekommande arbetsuppgift. Vanliga arbetsplatser är fabriker där tillverkning sker i större skala. Källa: Arbetsförmedlingen
broader: Maskinoperatörer, kemisktekniska och fotografiska produkter
related: UdVa jRr 9DE
related: MzXo LnP otK
related: PXdX 9qr Xn6
related: q9wx B2D Pz4
related: wTEr CBC bqh
broad match: C8131

Platschef, anläggning
type: Concept
in scheme: JobTech Taxonomy - Yrke
definition: En Platschef inom anläggning ansvarar för projektets planering och genomförande enligt kontrakt och bygghandlingar. Platschefens ansvar inkluderar resurshantering, kvalitetssäkring och arbetsmiljö Platschefen fungerar som länken mellan projektledning och arbetslag, vilket kräver både teknisk kompetens och ledarskapsförmåga. Källa: Arbetsförmedlingen
broader: Driftchefer inom bygg, anläggning och gruva
related: XwYL Do3 SAx
related: j7Cq ZJe GkT
related: epLc SkD cbT
related: 6Z12 Bf7 jDn
related: bh3H Y3h 5eD
related: ja7J P8X YC9
related: 9ojH VNE whg
broad match: C1323

Stadsutvecklare/Samhällsstrateg
type: Concept
in scheme: JobTech Taxonomy - Yrke
definition: Stadsutvecklare och samhällsstrateg arbetar med strategisk planering och utveckling av stadsområden och samhällen för att skapa hållbara, funktionella och attraktiva miljöer. Arbetsuppgifterna inkluderar att analysera samhällsbehov, utveckla planer och strategier för bostäder, infrastruktur och service, samt samordna projekt mellan olika aktörer som kommuner, myndigheter och privata företag. Rollen innefattar även utredningar, dialog med invånare och intressenter samt uppföljning av genomförda projekt. Stadsutvecklare och samhällsstrateger bidrar till långsiktig samhällsutveckling med fokus på social, ekonomisk och ekologisk hållbarhet. Källor: Arbetsförmedlingen, Sveriges Kommuner och Regioner, Boverket
alternative label: Samhällsstrateg
alternative label: Stadsutvecklare
broader: Planeringsarkitekter m.fl.
related: 6Hq3 tKo V57
related: RH9A aen jnj
related: geV1 Exh t3K
related: s2G9 P1e jUt
broad match: C2164

Hyveloperatör sågverk
type: Concept
in scheme: JobTech Taxonomy - Yrke
definition: Hyveloperatörer vid sågverk sköter maskiner som hyvlar sågat virke. Arbetet innebär ofta att man roterar mellan att sköta hyvling, sortering, paketering och emballering av virke. Tillhörande arbetsuppgifter som kvalitetskontroll och enklare maskinunderhåll förekommer också. Truckkörning är vanligt förekommande. Källa: Arbetsförmedlingen
broader: Operatörer inom sågverk, hyvleri och plywood m.m.
related: ufnG UbN pvB
related: 2CnS UmE mQU
related: etnv TYF V5E
related: vu2R 6xy vwk
related: EoUM QVT Jcd
related: wTEr CBC bqh
related: yEAR VCR LZg
broad match: C8172

Flygplansmontör
type: Concept
in scheme: JobTech Taxonomy - Yrke
definition: Flygplansmontörer monterar flygplansdelar och färdiga flygplan. Flygplansmontörer sätter samman olika komponenter till enskilda flygplansdelar eller installerar flygplansdelar till färdiga flygplan. Arbetet utförs enligt ritning med olika verktyg. Källa: Arbetsförmedlingen
broader: Fordonsmontörer
related: HDZp wTW gmd
related: KTUs gmt D4t
related: wTEr CBC bqh
broad match: C8211

Pastor, frikyrkoförsamling
type: Concept
in scheme: JobTech Taxonomy - Yrke
definition: Pastor leder och planerar verksamheten i en frikyrkoförsamling med fokus på andlig ledning och gemenskapsbyggande. Arbetsuppgifterna inkluderar att leda gudstjänster, predika, förrätta dop, vigslar och begravningar samt ge undervisning och själavård. Pastorn erbjuder samtalsstöd och vägledning till enskilda medlemmar och grupper, och arbetar nära frivilliga och andra yrkesgrupper inom församlingen. Rollen innebär ofta oregelbundna arbetstider med kvälls- och helgarbete samt socialt intensivt arbete. Källa: Equmeniakyrkan, Arbetsförmedlingen
broader: Pastorer m.fl.
related: KeRi von d2V
related: GazW 2TU kJw
related: 25Kc GgH zsM
related: GjGM xXp gP5
related: hGaW 6cC nqg
related: 9NmB wqz BVH
related: taHo ZDE mTs
related: 8n9A aqW 44K
broad match: C3413

VVS-montörer m.fl.
type: Concept
in scheme: JobTech Taxonomy - Yrke
definition: Installerar, reparerar och utför service på rör och annan utrustning för värme, vatten och sanitet i bostadshus och andra lokaler som sjukhus, affärshus och kontorslokaler. Installerar och reparerar rörsystem inom exempelvis industrin.
broader: Takmontörer, golvläggare och VVS-montörer m.fl.
related: sKfH MGG 3CS
related: wBLK nWZ 7ek
related: 37Pm JnZ u3y
related: wv7t xyY xhn
related: BV5y wau Zxz
related: aHCV VsV LiD
related: zRcL CZX Fiw
related: tqNp SBC LSx
related: VvvT DJ3 aPH
related: C7126
related: KnpQ pxH wq3
related: pk4K pdQ g77
related: 1JaM 2oZ iQ3
related: UTqL WnM ods
related: 1YZS 1ch vDZ
related: DSyz mEy sWT
related: PELm cH9 AE9
related: PHC9 9uW Bcv
related: Q7eC B7g QiU
related: WdBL 5qJ F7N
related: hxYY aTA edx
related: CzZc 7tx B9C
related: TKoo ucY 7Xh
related: bnMZ Nt5 o48
related: M7C1 DAy UTK
related: GDgA LAg khz
related: 2TC1 Ucy s32
related: 8Poz jP8 KFB
related: fhcp fFw Lbj
related: 9PuU gLx U7V
related: nkhA jPz pcE
related: 2ccg jZF 1u5
related: ynWd oCo o61
related: xeoH rao GgZ
related: th2t DxP C8m
related: ynW8 Jr4 5tT
related: g4gp jtj R7u
related: AXH4 4Tb 7Gp
related: ziht pD5 9Fo
related: fhu6 H74 uuN
related: GCYi 9tC 1pP
related: C5BH gEG 5gV
related: vqgm Ggp u5d
related: R6ZK FGC ovb
related: c14d Mgx MFA
related: 6CXz QqA 9SW
related: WLAi BDr 5fW
related: 1ezJ Fd6 S3v
related: FFLE Mys a7P
related: KfEn V5y npV
related: 5rhr 9cg v5o
related: SpsE Fzz yiX
related: BGJc YEv aPK
related: 9QkV AAn M1g
related: HmXd ehy QT9
related: 79Xs 89B ePf
related: wfV5 K2z mBE
related: uJoK dM3 8AM
related: smAW 9De 1rq
related: ReY9 iUm Kgx
related: Wsum y9W nZS
related: wZpC X9a xzG
related: 4mNF 7vZ vCx
related: xShN Vkr s7D
related: u1bJ gvt ECc
related: Ubym 9W4 qSJ
related: bBEQ oAd M9B
related: FhjY 7eH rvd
related: CibV iV1 wz4
related: DaGA bsf rVQ
related: jZzL yV6 PmA
narrower: Lärling, sprinklermontör
narrower: Industrirörmontör
narrower: VVS-montör
narrower: Ventilationsmontör

Bartender
type: Concept
in scheme: JobTech Taxonomy - Yrke
definition: En bartender blandar drinkar och serverar drycker till gäster. Arbetsuppgifterna omfattar blandning av cocktails och long drinks, servering av öl, vin och spritdrycker samt alkoholfria dryker, kassahantering, diskplockning, rengöring av barutrustning samt rådgivning till gäster om drycker. Källa: Utbildningsrådet för Hotell och Restauranger, Arbetsförmedlingen
broader: Bartendrar
related: 7goz uuv JWu
related: 3dar 69H gjG
related: VBpA 3bD fyz
related: Ckm8 sHx aow
related: fB77 KgR hV6
related: Nh4G ZUy FZm
related: MUgE mPa iqB
related: 5v25 c78 SQq
related: ScKy FHB 7wT
related: EKtK 5mt fum
related: Wwaq CFS 9hN
related: t4Hf 9pk PnH
related: XV2b ZXh sG1
broad match: C5132

Robottekniker
type: Concept
in scheme: JobTech Taxonomy - Yrke
definition: Robottekniker installerar och underhåller industrirobotar. Vanliga arbetsplatser är företag inom industriell tillverkning eller företag som leverear industrirobotar. Vanliga tillhörande arbetsuppgifter är felsökning, ombyggnation och tillståndsadministration för industrirobotar. Se även yrke Robotmontör, vilket avser att montera själva industriroboten. Källa: Arbetsförmedlingen
broader: Maskinställare och maskinoperatörer, metallarbete
related: wTEr CBC bqh
broad match: C7223

Förman växt- och grönsaksodling
type: Concept
in scheme: JobTech Taxonomy - Yrke
definition: En förman för växtodling och grönsaksodling planerar och leder det dagliga arbetet vid odling av jordbruksväxter och grönsaker på friland eller i växthus. Arbetsuppgifterna omfattar planering av odling, fördelning av arbetsuppgifter i arbetslaget, övervakning av plantering, vattning, packning och skötsel av växter samt uppföljning av arbetsresultat. I rollen ingår även att introducera nya medarbetare och samordna insatser tillsammans med andra arbetsledare samt driftledare. Beroende på storlek på lantbruksföretag kan mer arbetsledande funktioner behövas. På större lantbruksföretag är det inte ovanligt att det arbetare driftledare, gårdsmästare och förmän. Se även yrkena Gårdsmästare växtodling och Driftledare växtodling. Källa: Gröna arbetsgivare, Arbetsförmedlingen
broader: Odlare av jordbruksväxter, frukt och bär
related: SAqV sEH Qae
related: VuuL 7CH adj
broad match: C6111

Intendenturpersonal, sjöfart
type: Concept
in scheme: JobTech Taxonomy - Yrke
definition: Intendenturpersonal är ett samlingsnamn för flera arbetsuppgifter ombord, på passagerarfartyg finns flera avdelningar; hotell, restaurang och butik. I arbetsuppgifterna ingår allt från att välkomna gäster ombord till att bädda och städa hytter, servera mat och plocka disk, städa allmänna utrymmen, plocka upp varor i butik samt arbeta i kassan. Källa: Satsa på sjöfart
broader: Hovmästare och servitörer
related: dRFw Rcu dX7
related: nSAp omW j5Y
related: 593J Lje no3
related: ASGV zcE bWf
related: XouD cCj HZN
related: ScKy FHB 7wT
broad match: C5131

Demonteringsarbetare/Rivningsarbetare
type: Concept
in scheme: JobTech Taxonomy - Yrke
definition: Demonteringsarbetare/Rivningsarbetare arbetar med rivning av eller delar av byggnader och anläggningar. En demonteringsarbetare/rivningsarbetare har goda kunskaper om byggmaterial och återvinning. Arbetet är tungt trots att maskiner används frekvent. En demonteringsarbetare/rivningsarbetare är ofta anställd i ett specialiserat företag. Källa: Arbetetsförmedlingen
alternative label: Demonteringsarbetare
alternative label: Rivningsarbetare
broader: Övriga byggnads- och anläggningsarbetare
related: UKKM LWr jk2
related: j7Cq ZJe GkT
related: Gipt 4wD 83o
related: JecF REH PSG
related: FW89 1Lk CG5
related: NYdc aL4 gcW
related: gsEB r9M 5By
related: wqxC cyM dNW
related: ja7J P8X YC9
related: Wakm MJg vch
broad match: C7119

Skrivtolk/Vuxendövtolk
type: Concept
in scheme: JobTech Taxonomy - Yrke
definition: Skrivtolk/Vuxendövtolk
alternative label: Skrivtolk
alternative label: Vuxendövtolk
broader: Översättare, tolkar och lingvister m.fl.
related: cspa Mji BMS
related: 9puE nYg crq
related: P5TN U2b NKo
broad match: C2643

Byråchef
type: Concept
in scheme: JobTech Taxonomy - Yrke
definition: Byråchef
broader: Chefer inom arkitekt- och ingenjörsverksamhet
related: C4Kd BU6 yDx
related: epLc SkD cbT
related: bh3H Y3h 5eD
broad match: C1213

Markingenjör
type: Concept
in scheme: JobTech Taxonomy - Yrke
definition: Markingenjörer är med från idéutveckling och detaljplanering, till färdigställande och besiktning. Markingenjörer gör ritningar och planering efter beställarens behov och arbetar i kontakt med myndigheter och entreprenadfirmor för projektering och upphandlingar. Mycket ska kalkyleras och analyseras innan själva utförandet kan påbörjas. Projektet ska sedan följas noggrant för att hålla budget och tidsram. Slutligen besiktigas utförandet och projektet kan avslutas. Källa: Arbetsförmedlingen
broader: Ingenjörer och tekniker inom bygg och anläggning
related: j7Cq ZJe GkT
related: ja7J P8X YC9
related: ZjCw 9JF b8s
broad match: C3112

Verksamhetsutvecklare
type: Concept
in scheme: JobTech Taxonomy - Yrke
definition: Verksamhetsutvecklare
broader: Lednings- och organisationsutvecklare
related: DaKx Lt2 dTP
related: 2zQP 1za qcV
related: PkCc CSD QoZ
related: pVpx 6mZ wVM
related: V442 9zt G7X
related: zHy4 Ugc dZm
related: sXfH wMW bAz
related: DyST UTw xEa
related: macw uRh KER
related: u1wu qZ8 egW
related: NLQw 5u1 51j
related: ym5Z 9vi b8u
related: asww xA9 GKR
related: ppTH ci5 nhh
related: NBSC foZ M7R
related: 65Hn 8at 9Pz
related: c4k5 Un2 kAJ
related: d5fA vN8 HEB
related: X82t awd Qyc
related: ncV5 FA8 BNn
related: xQjJ WCo zdF
related: 79kw THz wjB
related: bW89 GUY Sa7
related: EVHK Mfa DtC
related: 3AaC tvH 7u1
related: Wo8D xys Lew
related: fgzP m3k v1U
related: 71wP fB7 jre
related: hKJN xzf PdT
related: 7Q9A GB4 dMu
related: ra25 Tti xsi
related: mAMX BUR G45
related: oVeY VSq WbN
related: YxoD fxr htN
related: HnvB bMi gLf
related: G4bK 37P 2ha
related: h8uA ZiR iUA
related: CCmZ 5zk QFe
related: mG7R yGT MzK
related: jBMV UHp QBc
related: dTU7 E3R j3X
related: LqqC RyR 1pZ
related: niGF w6a Vxo
related: WXdB NYo zGy
related: Xkuf Qnp nXF
related: DfTi o4t sve
related: R8LB sJH Ljb
related: sTBt 5PE 1E6
related: gDnq QM4 ApQ
related: GSsG a3o FHu
broad match: C2421

Drift- och vägunderhållsarbetare
type: Concept
in scheme: JobTech Taxonomy - Yrke
definition: Drift- och vägunderhållsarbetare
broader: Anläggningsarbetare
related: Wj7p qNJ 3GX
related: YW8n wwj r1h
related: j7Cq ZJe GkT
related: aNU9 s67 u35
related: ibcm 8ht xUg
related: 8eQB BJ6 J4H
related: D7jB MLH FNs
related: ja7J P8X YC9
related: upbS QFL YQP
related: Fd6M 6ze gBM
related: KHoR 8w2 BAX
broad match: C7119

Elektronikreparatörer och kommunikationselektriker m.fl.
type: Concept
in scheme: JobTech Taxonomy - Yrke
definition: Installerar och reparerar data- och telenät samt larm och signalsystem. Installerar, reparerar och utför service på hemelektronik. Hit hör inte Distributionselektriker (7413) Industrielektriker (7412) Installationselektriker (7411)
broader: Elektronikreparatörer och kommunikationselektriker m.fl.
related: dr2b XHv nRW
related: hb1q 7u6 bqH
related: FqWP 6FQ Wz5
related: ebrf 1Fe ksC
related: wqXe tsX y7s
related: txb5 eet Huj
related: wBLK nWZ 7ek
related: YCnx YcY f2Y
related: btbx pYC XDK
related: ECs4 p2b JiU
related: TFQD onf Tid
related: qndS X6D iB8
related: urLT mLe FHv
related: 4uR1 7ct Tmi
related: bT7R xGv GnZ
related: wbAz fL9 jgx
related: Gxy1 dZ2 UFm
related: aHCV VsV LiD
related: tqNp SBC LSx
related: Lrrv HyL PzJ
related: c5t5 ucu nrT
related: qyxC Z7Z dXH
related: rmuF Dce PPS
related: 7d2G KP4 eFb
related: ZSSJ iR3 n6s
related: SHUE 3oF LFm
related: fjyp Sft A2M
related: VvvT DJ3 aPH
related: rFsK iHo cNt
related: eVwv pwi 6Gj
related: 8ZhW wNv 5k9
related: MKjv MCq SVT
related: V2u7 DEg 6i8
related: ksNo 7bD ez3
related: zsEo R4J 8q2
related: P13a CeE fvz
related: PpQM 12A gFU
related: PELm cH9 AE9
related: Q7eC B7g QiU
related: 1FS5 pZc X5o
related: kjB8 Wd3 597
related: pTyA qkK vo7
related: GUw2 Ek8 CY7
related: vQTv Fio W9o
related: Udbb Eay MuR
related: HQJ2 68A AiZ
related: Txuo Lgo TYz
related: mn5t 9Gb siQ
related: xTkt sZQ eVq
related: CzZc 7tx B9C
related: jnGF SL1 AmF
related: UeT7 Q7v W8S
related: N9zP r7b yiK
related: Rqez Bqv FKe
related: PMhY w2C ajS
related: shCh RvL Duv
related: 41zn 6hT 9Az
related: dyvM XQ5 zgT
related: fjoN ZHr XG4
related: M6Q7 tQ8 w2Q
related: SMBG 57e nu7
related: erxx PH6 VQj
related: Z2Ea 6QG 5Ub
related: 4Mfr 6nP VLM
related: Dvf4 2eU x43
related: 4qaY nGh gq1
related: Xtys AjN 9an
related: 8Wtz Hxe Yz2
related: Lqeq PaN Kuv
related: kraG fcm 3Mo
related: pqTD 5Mi 3mx
related: VQxj dHG UCE
related: ncgu Kpq TR3
related: N9we hv9 hsc
related: q2v1 YcS Dff

Kontrollanläggningsingenjör, elkraft
type: Concept
in scheme: JobTech Taxonomy - Yrke
definition: Kontrollanläggningsingenjör, elkraft
broader: Civilingenjörsyrken inom elektroteknik
related: 6Hq3 tKo V57
related: 46PK jWY 8Zp
related: VPut b9f rVd
broad match: C2151

IT-säkerhetsansvarig
type: Concept
in scheme: JobTech Taxonomy - Yrke
definition: En IT-säkerhetsansvarig har till uppgift att skydda en organisations digitala tillgångar och information från cyberhot och andra säkerhetsrisker. De ansvarar för att utveckla, implementera och upprätthålla säkerhetsrutiner, policys och tekniska system för att minimera riskerna för dataintrång, sabotage och andra IT-relaterade incidenter. Källa: Arbetsförmedlingen, Wise, Teknikhögskolan, div jobbannonser
alternative label: Säkerhetsansvarig, IT
broader: IT-säkerhetsspecialister
related: JLFg rLY sPG
related: 6MEA uVc J1C
related: TRPL 5av hN9
related: h2iF r1y ZTy
related: apaJ 2ja LuF
related: T6zX cTE SVb
broad match: C2529

Städyrken
type: Concept
in scheme: JobTech Taxonomy - Yrke
definition: Städyrken
broader: Yrken med krav på kortare utbildning eller introduktion
narrower: Städare och hemservicepersonal m.fl.
narrower: Tvättare, fönsterputsare och övriga rengöringsarbetare

Naturguide
type: Concept
in scheme: JobTech Taxonomy - Yrke
definition: Naturguider leder aktiviteter i natur- och vildmarksmiljöer, ofta med fokus på friluftsliv, naturupplevelser och äventyrsturism. Arbetsuppgifterna omfattar planering och genomförande av guidade turer till fots, med kanot, cykel, skidor eller annan friluftsutrustning. Vildmarksguidning kan inkludera längre turer i avlägsna miljöer med övernattning och matlagning utomhus, medan äventyrsguidning kan ofta omfatta aktiviteter som klättring, paddling eller höghöjdsbanor. Källa: Arbetsförmedlingen
broader: Guider och reseledare
related: dbhg zHw Cwg
related: 7goz uuv JWu
related: GGd9 mah wm4
related: di6J bHD vkb
related: RPTn bxG ExZ
related: ww9H qzc vJy
related: 8Lhx T29 B9V
related: AP7u dJy fFt
related: odq4 7EG tvP
related: 2Gi3 U5g CnW
related: uJVh Ydp EtG
related: MNvN mMa iGW
related: oNuk gCu 3Ev
related: j6yo zRF GC5
related: CjP6 uJT vWA
related: fQb5 BQt rvN
related: EKtK 5mt fum
related: VhaE V2R kwU
related: X4Ut Qf9 ZF1
related: B7hB AUU 7eC
related: aRcm ZAz kNx
related: ozvf avR K4f
broad match: C5113

Bergarbetare, bygg och anläggning, utan yrkesbevis
type: Concept
in scheme: JobTech Taxonomy - Yrke
definition: En bergarbetare borrar och spränger bort berg, såväl ovan som under jord, för att skapa rätt förutsättningar för byggen genom att spränga bort små bergklackar till att driva tunnlar för väg- och järnväg. Berg är det bästa underlaget för att anlägga hus, broar, tunnlar och andra konstruktioner. Oftast måste delar av berget sprängas eller borras bort för att få rätt höjd till den byggkonstruktion som ska uppföras. Därför är bergarbetaren en av de första på plats. Som bergarbetare har du kunskap om bergets egenart och kan avgöra hur arbetet bäst ska utföras, till exempel vilken mängd laddning som behövs vid sprängningen. För att ansvara för sprängningar krävs dock en vidareutbildning, Sprängkort. Källa: BYN
broader: Gruv- och stenbrottsarbetare
related: j7Cq ZJe GkT
related: ja7J P8X YC9
broad match: C8111

Resesäljare och trafikassistenter m.fl.
type: Concept
in scheme: JobTech Taxonomy - Yrke
definition: Lämnar upplysningar om resor, resmål, logi och evenemang. Förmedlar och säljer resor. Gör upp resplaner och bokar biljetter, hotellrum m.m. Svarar för passagerarservice på flygplatser samt på färje- och bussterminaler. Informerar om avgångstider, biljettpriser, linjesträckningar, restider m.m. Kontrollerar färdbevis och registrerar bagage. Hit hör inte Flygplatskontrollant (5413)
broader: Resesäljare, kundtjänstpersonal och receptionister m.fl.
related: xSLo P6B 2AF
related: boQs j8u et1
related: DJgq zBj bKt
related: SV19 DbM RqE
related: 7H4j dRM Vbo
related: k9C9 rCw tuZ
related: VhG6 dEk LAF
related: uRcY 24c 7d5
related: kxkP ZUV Wy9
related: C4225
related: aUr6 Rjg ja2
related: aMyW hB7 TpU
related: moSc 5RL aYx
related: 2mYY j8F 18H
related: 3HjW 1BP k3S
related: g6vZ i7N ZeJ
related: 3vYj Rhf Voh
related: Uv9y v2g efa
related: Tmps QPE g3V
related: 7xS5 gyX hvX
related: rKJy Qoh Qtv
related: W728 Hze 9kk
related: PAsX Tyg iQ7
related: NUC3 y1C Scg
related: LmLg VXy VSS
related: SsAP Wrd uSs
related: cw2M p2W SuJ
related: 9aBN 4om 3jE
related: dm4G FHy 2YP
related: BiaC BBH Lp9
related: dYqT JBz NZE
related: zR8a F23 17p
related: 5wab aFK gdL
related: C4221
related: 4Hi6 7T1 Gvb
related: PVnT yGT SMb
related: qtHa AsU Cfo
related: Nig2 2pU GT8
related: LmAP e75 pc6
related: ZLxe Cc8 SXp
related: 7scD 9YP iwV
related: jcpA Zfs nSz
related: BSGy 9nZ 79p
related: bTzy 5TT YfS
related: RB7E jE5 MZ3
related: oM3o M7o xDS
related: oMEe 671 WrH
related: gUpe NN9 qNy
related: hYpk RYx y3V
related: ro7t 8qz rAz
related: Kvft WHn KJE
related: ZZ3K X56 6BC
related: 2ZFC 6de YSB
related: 4hbK PAj 3ni
related: vXDD 8Gh DXu
related: B1rc wCc vne
related: w8bU wHe omF
related: Njjp yXP 1QV
related: 73gL 4uv p9J
related: 8u7A ze1 bvd
related: 6Ei3 fZV YKM
narrower: Trafikassistent flygplats
narrower: Trafikvärd
narrower: Resehandläggare
narrower: Resesäljare
narrower: Trafikinformatör
narrower: Resebyråassistent
narrower: Incheckningsmedarbetare
narrower: Turistinformatör
narrower: Säljledare, resebyrå
broad match: RPTn bxG ExZ

Etnolog
type: Concept
in scheme: JobTech Taxonomy - Yrke
definition: Etnolog
broader: Arkeologer och specialister inom humaniora m.m.
related: X82t awd Qyc
related: 4fyC kt4 UmU
broad match: C2632

Socialantropolog
type: Concept
in scheme: JobTech Taxonomy - Yrke
definition: Socialantropolog
broader: Arkeologer och specialister inom humaniora m.m.
related: GazW 2TU kJw
related: X82t awd Qyc
broad match: C2632

Maskör
type: Concept
in scheme: JobTech Taxonomy - Yrke
definition: Maskörer arbetar med att skapa utseendeförändringar med hjälp av smink, peruker och specialeffekter för teater, film, TV eller evenemang. Maskörer följer maskedesigners eller regissörers anvisningar och är ansvariga för att applicera och underhålla skådespelarnas utseende under produktioner. Maskdesigner är oftast en erfaren maskör som är konstnärligt och praktiskt ansvarig för en produktions maskdesign. Maskörer arbetar ofta med mer avancerade tekniker och material än make up-artister, inklusive hårstyling, peruker samt tillverkning och montering av latexdelar eller specialeffekter. Källa: Yrkesnämnden för film och tv, Scen & Film, Arbetsförmedlingen
broader: Övriga skönhets- och kroppsterapeuter
related: G1z3 ipw 5y7
related: z3t3 A4N z1R
related: 8too bEs 7NU
related: 9puE nYg crq
related: ruBP zfY nEL
related: xAdQ 6gX emn
broad match: C5142

Taxiförare m.fl.
type: Concept
in scheme: JobTech Taxonomy - Yrke
definition: Kör taxi- och personbilar samt minibussar för att transportera passagerare. Assisterar passagerare vid behov. Hit hör inte Budbilsförare (8329) Testförare (8329)
broader: Bil-, motorcykel- och cykelförare
related: EqRh UqX wFB
related: g6vZ i7N ZeJ
related: Tpvt 9yv KAw
related: BHCG hQC kNa
related: XE8H BdS 7BP
related: vRUW 21M 5Eg
related: sKLW XyF UGt
related: gatN zc2 2e4
related: C8322
related: jqG1 Cza MRM
related: F8iA MB6 iY3
related: SLMn wo6 aAu
narrower: Taxiförare
broad match: ASGV zcE bWf

Systemutvecklare/Programmerare
type: Concept
in scheme: JobTech Taxonomy - Yrke
definition: Programmerare analyserar, designar och bygger mjukvara. Ofta får programmeraren instruktioner i form av en kravspecifikation som kommit från en behovsanalys. Programmeraren avgör i vilken ordning systemet bör byggas och översätter kraven till programmeringsspråk. Källa: SACO, ISCO
alternative label: Programmerare
alternative label: Systemutvecklare
broader: Mjukvaru- och systemutvecklare m.fl.
related: q4Kq Sag CfH
related: 3X4u LSS 7MS
related: mLis 1jq bYS
related: KS7k wam 9bt
related: Qe2v SHT wqf
related: MqCg HPR V4E
related: XF88 Lus UM8
related: 6ns1 2aP 5Ze
related: iUrJ 8tJ xfL
related: NHfH 5vR QHx
related: LXqo UEt Axv
related: BXi2 LMZ mnC
related: JUEG vJq tts
related: TMnD eUH dWG
related: NwsP PpX kao
related: yh53 NmU Jpa
related: ifwV PoB VHZ
related: zsQB xjP 85B
related: m2hz BAp 3Bx
related: kSip Zkc UyU
related: wg7G c6n 1ga
related: oB5o eSY PQd
related: 96Xy zrA WJX
related: 6MEA uVc J1C
related: FUu4 NC9 YF9
related: xQ5S udA UDK
related: MNfE Pkx jvq
related: MLLY 98y ePb
related: fRRy Gs2 DSg
related: fCq8 8k5 MMG
related: 6zsc Uv5 6AS
related: HjjZ HUk BX3
related: gwqA 1H1 P6j
related: L84s 3dp Vj3
related: AxqS cYb psj
related: V3uP D3w 2J8
related: Fuf9 z6k PLZ
related: apaJ 2ja LuF
related: 2Vbb uRw Kdp
related: gdVd uxq 7hN
related: sWTc XU2 V7N
related: uUz9 x1Z w2e
related: sVzR U1c ShD
related: s5UQ 1bh CKy
related: AK61 Lbk Ac7
related: Kffm yad v3t
related: fbmn Xoc SwN
related: KT6P hVH LRD
related: RT43 KY2 isf
related: jvPo Jjj nmv
related: mYLg xwW a5s
related: E6Gt LGg nqF
related: kQx3 Qop 2jk
related: pUwS CNa t8f
related: cVKF Wog jUr
related: vC5N 4v1 W1a
related: 4vTP 5cd SJ7
related: pL1N 9wV iND
related: ruC5 GtQ meh
related: w1Pq TWe zNY
related: j7R9 8xL qoG
related: 8QbN FjF c6n
related: 5pHW iAT mio
related: o5t5 9t9 QJ6
related: fmjy CaH 14c
related: Lqzf X5Z 78T
related: cGxS 4dx cDB
related: hrCJ xLH qy4
related: sSwD fG3 tT1
broad match: C2511

Budgetchef
type: Concept
in scheme: JobTech Taxonomy - Yrke
definition: Budgetchef
broader: Ekonomi- och finanschefer
related: X82t awd Qyc
related: epLc SkD cbT
related: bh3H Y3h 5eD
related: eBQs p5w Jkj
broad match: C1211

Soldater m.fl.
type: Concept
in scheme: JobTech Taxonomy - Yrke
definition: Soldater m.fl.
broader: Soldater m.fl.
narrower: Soldater m.fl.

Yrken med krav på fördjupad högskolekompetens inom IT
type: Concept
in scheme: JobTech Taxonomy - Yrke
definition: Yrken med krav på fördjupad högskolekompetens inom IT
broader: Yrken med krav på fördjupad högskolekompetens
narrower: IT-arkitekter, systemutvecklare och testledare m.fl.

Yrken inom materialförvaltning m.m.
type: Concept
in scheme: JobTech Taxonomy - Yrke
definition: Yrken inom materialförvaltning m.m.
broader: Yrken inom administration och kundtjänst
narrower: Lagerpersonal och transportledare m.fl.

Officer
type: Concept
in scheme: JobTech Taxonomy - Yrke
definition: Officer
broader: Officerare
related: 5b4S Pm5 1Ee
related: eiRk Mnw wVx
related: VFu8 Pxz qSQ
related: n4cX oNn rFF
related: rTey Nfb wzE
related: Yinu r1P Hoy
related: FgTv DBL Kkc
related: Ddxp BLv yj4
related: bH5L uXD ZAX
related: DD2R cWQ pKh
related: AdGp Jrw Zmo
related: ameH cga FQk
related: MgJ9 Fts Nco
related: GkJj VZC URr
related: FjbJ AmK vAL
related: UJG7 MDX 1GX
related: HtnV 15w bBZ
related: 3LvJ NJF qew
related: EfFR kLS UqK
related: cF16 J3Z 3dx
related: 5f6n BVo bsH
related: E3vK 9ae U9z
related: khAZ 3A9 3VT
related: L8UL ySw shW
related: DDwo 95D uEt
related: ghWo wdz Rox
related: ST8m mV5 fqB
related: ZyjJ xLV z5s
related: PPsR fcZ JCd
related: ZECQ h18 qoK
related: xhtD kSe uwX
related: NttF 7Mw yyD
related: 2d5w bSQ L8Q
related: bRYq RuP WJi
related: MEem b95 uir
related: iEYX yT7 NEY
related: vPPy 5A1 kq8
related: DwGx oR9 N4t
related: WpFj BoW Whh
related: U1WA UaJ pkV
related: Y7jZ ytx ho6
related: Y7GB zus GNe
related: w6es 9j7 oG2
related: Mdsf KW2 ZtN
related: iqaW v8L SFB
related: GAbs cGV 27V
related: wCu8 yHc zCw
related: 3bRP zXH bAs
related: eU6t QUU eGq
related: Jhui PQW LB4
broad match: C0110

Maskinoperatörer, livsmedelsindustri
type: Concept
in scheme: JobTech Taxonomy - Yrke
definition: Maskinoperatörer, livsmedelsindustri
broader: Process- och maskinoperatörer
narrower: Maskinoperatörer, mejeri
narrower: Maskinoperatörer, kvarn-, bageri- och konfektyrindustri
narrower: Övriga maskinoperatörer, livsmedelsindustri m.m.
narrower: Maskinoperatörer, kött- och fiskberedningsindustri

Arbetsförmedlare
type: Concept
in scheme: JobTech Taxonomy - Yrke
definition: Matchar lediga platser mot arbetssökande. Fångar upp arbetsmarknadens rekryteringsbehov. Ger råd och stöd till arbetsgivare hur de rekryterar personal och till arbetssökande hur de får arbete.
broader: Förmedlare m.fl.
related: bgC3 M9R 1K4
related: gx8F mte Nm5
related: X9xM rd8 EXP
related: uA7X Pqn n9a
related: HhU2 a7t gG3
related: ufbK zKv qmJ
related: eome z2j iv4
related: MrnB onr FxX
related: TZcg h4T aMT
related: C3333
related: EofE ko9 gqp
related: kcAa 3oz td1
related: 91Ef 58Y jX4
related: 94uF bkH QF5
related: DJgE 2TP mJj
related: WwvG N5s ErQ
narrower: Jobbcoach/Utbildningscoach
narrower: Arbetsförmedlare
narrower: Arbetskonsulent
narrower: SIUS-konsulent
broad match: X82t awd Qyc

Arkiv- och biblioteksassistenter
type: Concept
in scheme: JobTech Taxonomy - Yrke
definition: Arkiv- och biblioteksassistenter
broader: Andra kontors- och kundserviceyrken
narrower: Arkiv- och biblioteksassistenter m.fl.

Prepresstekniker, tryckare och bokbindare m.fl.
type: Concept
in scheme: JobTech Taxonomy - Yrke
definition: Prepresstekniker, tryckare och bokbindare m.fl.
broader: Finmekaniska, grafiska och konsthantverksyrken
narrower: Tryckare
narrower: Bokbindare m.fl.
narrower: Prepresstekniker

Cirkusartist
type: Concept
in scheme: JobTech Taxonomy - Yrke
definition: Cirkusartist skapar och framför nummer inom akrobatik, jonglering, clowneri, luftakrobatik och andra scenkonster med fokus på fysisk prestation och artistisk uttrycksförmåga. Vanliga arbetsuppgifter är träning och repetition av nummer, framträdanden inför publik, samarbete i team samt säkerhetsrutiner för att minimera skaderisker. Cirkusartister arbetar ofta turnébaserat, både inomhus och utomhus och det är inte ovanligt med oregelbundna arbetstider. Källa: Arbetsförmedlingen, Stockholms konstnärliga högskola
broader: Övriga yrken inom kultur och underhållning
related: FEeL r4F zTm
related: i4v7 pN2 RRr
related: n4V5 2X4 Gvq
related: uuEy Adm Ynb
related: 8too bEs 7NU
related: 9puE nYg crq
related: MDUo qZG xe6
broad match: C2659

Mättekniker, fysik
type: Concept
in scheme: JobTech Taxonomy - Yrke
definition: Mättekniker, fysik
broader: Laboratorieingenjörer
related: 6Hq3 tKo V57
related: EsWG kHG oXZ
broad match: C3111

Konferenstekniker
type: Concept
in scheme: JobTech Taxonomy - Yrke
definition: Konferenstekniker
broader: Ljus-, ljud- och scentekniker
related: JxxX BbU Xmj
related: v9Eg 6CY CzT
related: yhCP AqT tns
related: d1Ao 9bY 7Kn
related: ScKy FHB 7wT
broad match: C3521

Forskare, läkemedel
type: Concept
in scheme: JobTech Taxonomy - Yrke
definition: Forskare, läkemedel
broader: Farmakologer och biomedicinare
related: kJeN wmw 9wX
related: FhVE K8T X1g
related: NYW6 mP6 vwf
related: esAo 5sX FPv
broad match: C2131

Anbudsansvarig/Bid Manager
type: Concept
in scheme: JobTech Taxonomy - Yrke
definition: Anbudsansvarig/Bid Manager
alternative label: Anbudsansvarig
alternative label: Bid Manager
broader: Marknadsanalytiker och marknadsförare m.fl.
related: ucsa nCi syx
related: riRd 7JY kVo
related: 49TN tQd v7w
related: RPTn bxG ExZ
related: izNj rRF p5a
related: SJKT wTQ J5q
related: 4XyY MCb svG
broad match: C2431

Beredskapssamordnare/Krisberedskapssamordnare
type: Concept
in scheme: JobTech Taxonomy - Yrke
definition: Beredskapssamordnare/Krisberedskapssamordnare
alternative label: Beredskapssamordnare
alternative label: Krisberedskapssamordnare
broader: Planerare och utredare m.fl.
related: W1bc qiV KiZ
related: E7hm BLq fqZ
related: X82t awd Qyc
related: RhRi Gsr d8W
related: zQsh ozu EDR
related: TZe9 NsN uce
broad match: C2422

Förlagsredaktör
type: Concept
in scheme: JobTech Taxonomy - Yrke
definition: En förlagsredaktör ansvarar för utgivningen och produktionen av böcker och andra publikationer, från manusidé till färdig produkt. Rollen innebär att arbeta med både tryckt litteratur och digitala utgivningsformer, och kräver nära samarbete med författare, översättare, formgivare och andra aktörer inom förlagsbranschen. En förlagsredaktör arbetar med att utveckla och förbättra manuskript i samarbete med författaren. De granskar texter, språkgranskar, korrekturläser och ser till att texten är korrekt, tydlig och lättläst. Källa: DIK, SACO
broader: Författare m.fl.
related: ff3r BTQ XGY
related: 8too bEs 7NU
related: 9puE nYg crq
related: tLoD 23s Rwk
broad match: C2641

Riksantikvarie
type: Concept
in scheme: JobTech Taxonomy - Yrke
definition: Riksantikvarie
broader: General-, landstings- och kommundirektörer m.fl.
related: epLc SkD cbT
related: bh3H Y3h 5eD
broad match: C1112

Företagssäljare
type: Concept
in scheme: JobTech Taxonomy - Yrke
definition: En företagssäljare (B2B-säljare) arbetar med att sälja varor och tjänster till andra företag, inte till privatpersoner. Rollen innebär att bygga och utveckla affärsrelationer, identifiera kunders behov och driva försäljningsprocessen från första kontakt till avslutad affär. Källa: Arbetsförmedlingen
broader: Företagssäljare
related: d2c9 zKZ UiC
related: UUDs wTZ tKv
related: suKc 7hi QqP
related: p9zc s1C rpc
related: X82t awd Qyc
related: 77kp L3c A2x
related: Pqvt iga 32E
related: veU5 RqA AAC
related: wrnc 5Cb 1fZ
related: dFPN NpA nm9
related: TyGN bnx Due
related: Dzri iEL twj
related: 6xJ6 n11 Xjg
related: 4gHP tz4 9he
related: 3jyk NTG gAm
related: B5mN Zfr A9c
related: ZiFi yWQ ah1
related: Dc3s mJg 5pq
related: NfhW 4sk 8Pn
related: VcWa TRw prK
related: g6Fv FJh Wgh
related: AQVG Sxb rRV
broad match: C3322

Övriga chefer inom utbildning
type: Concept
in scheme: JobTech Taxonomy - Yrke
definition: Formulerar och ansvarar för mål och strategier för verksamhet inom annan utbildningsform än läroplanstyrd verksamhet. Planerar och ansvarar för utbildningsprogram. Utformar riktlinjer, följer upp och utvärderar verksamheten mot uppsatta mål. Svarar för budget samt fördelar resurserna inom verksamheten. Har personalansvar.
broader: Övriga chefer inom utbildning
related: s5SS 7bW 1Gh
related: AoxD Exi qzp
related: YS7V c8n MrS
related: G7Qq r7L 5Jo
related: UH9g R5v MCx
related: SmZd Jaa BeY
related: oLnc YZn 3bm
related: 8tYq EXD Xwm
related: ZzN5 m7B 5CY
related: C1345
related: Nksx 4oe fEQ
related: eThQ HCv mY6
related: 5PjX 999 uLZ
related: Gt5f wdi FSJ
related: q7Mx gjU F9q
related: zXNU zXR hGd
related: echN F9u bRp
narrower: Trafikskolechef
narrower: Kontorschef, utbildningsföretag
broad match: bh3H Y3h 5eD

Skördearbetare
type: Concept
in scheme: JobTech Taxonomy - Yrke
definition: Skördearbetare arbetar med att skörda olika typer av grödor, såsom frukt, grönsaker, spannmål eller bär. Arbetet innebär i huvudsak att både manuella verktyg och maskiner för att samla in grödor. Även ogränsrensning och annan växtskötsel kan förekomma under skörd. Skördade grödor kontrolleras och sorteras enligt anvisning. Beroende på arbetsplats kan det även ingå att packa och transportera skördade grödor av till lagringsutrymmen eller försäljningsställen. Källa: Arbetsförmedlingen
broader: Bärplockare och plantörer m.fl.
related: T46W yKz eSK
related: UdVa jRr 9DE
related: Rry6 KJq XyU
related: ND9q fT4 yCm
related: BJtC ds3 SGt
related: ZqTy RAD 5ci
related: 6FFf Qjf 5cJ
related: VuuL 7CH adj
broad match: C9211

Skogslärare/Skogsbrukslärare/Skogsbruksinstruktör
type: Concept
in scheme: JobTech Taxonomy - Yrke
definition: Skogslärare/Skogsbrukslärare/Skogsbruksinstruktör
alternative label: Skogsbruksinstruktör
alternative label: Skogsbrukslärare
alternative label: Skogslärare
broader: Lärare i yrkesämnen
related: Meqm rED Jop
related: MVqp eS8 kDZ
broad match: C2320

Civilingenjör, väg
type: Concept
in scheme: JobTech Taxonomy - Yrke
definition: En civilingenjör inom väg arbetar inom olika funktioner med att planera, bygga, utveckla och förvalta infrastruktur. Arbetsplatsen finns inom privat såväl som offentlig sektor, allt från mindre konsultfirmor till stora entreprenadföretag. Källa: Arbetsförmedlingen
broader: Civilingenjörsyrken inom bygg och anläggning
related: j7Cq ZJe GkT
related: anYS 5AR JRk
related: ja7J P8X YC9
broad match: C2142

Chefssjuksköterska
type: Concept
in scheme: JobTech Taxonomy - Yrke
definition: Chefssjuksköterska
broader: Chefer inom hälso- och sjukvård
related: 9r7Z WQf Pos
related: NYW6 mP6 vwf
related: epLc SkD cbT
related: bh3H Y3h 5eD
related: 1f7B E5K sh3
broad match: C1342

Andra process- och maskinoperatörer
type: Concept
in scheme: JobTech Taxonomy - Yrke
definition: Andra process- och maskinoperatörer
broader: Process- och maskinoperatörer
narrower: Övriga process- och maskinoperatörer
narrower: Maskinoperatörer, påfyllning, packning och märkning

Plattsättare, utan yrkesbevis
type: Concept
in scheme: JobTech Taxonomy - Yrke
definition: Plattsättare, utan yrkesbevis
broader: Murare m.fl.
related: gmGC FhZ r4d
related: MnPy 8fk j4m
related: FQxY MTC FJ9
related: j7Cq ZJe GkT
related: s2Fg u89 geQ
related: ja7J P8X YC9
broad match: C7112

Sjukhusstädare
type: Concept
in scheme: JobTech Taxonomy - Yrke
definition: En sjukhusstädare ansvarar för att hålla sjukhus och vårdinrättningar rena och hygieniska, vilket är avgörande för att förebygga spridning av infektioner och skapa en säker miljö för patienter, personal och besökare. I arbetsuppgifterna ingår bl a att utföra daglig städning och desinficering av vårdlokaler, operationssalar, patientrum, gemensamma utrymmen och andra ytor samt tömma sopor och hantera avfall enligt gällande rutiner. Källa: Arbetsförmedlingen
broader: Städare
related: whao Q6A ScE
related: UdVa jRr 9DE
related: 4j4y LCf 3Y2
related: AqZa mQg 4Lv
broad match: C9112

Fastighetsskötare
type: Concept
in scheme: JobTech Taxonomy - Yrke
definition: Fastighetsskötare arbetar med den löpande driften, tillsynen och det yttre och inre underhållet av bostads- och lokalfastigheter. Arbetsuppgifter omfattar daglig rondering, felanmälningar, enklare reparationer, låsbyten, felsökning av tekniska system samt skötsel av utemiljöer såsom gräsmattor, rabatter, gångvägar och lekplatser. Fastighetsskötare utför även mindre snickeri-, el- och VVS-arbeten, kontrollerar brandutrustning, hanterar avfallshantering och vinterunderhåll samt kontaktar entreprenörer vid större åtgärder. Källa: Fastighetsbranschens Utbildningsnämnd, Arbetsförmedlingen
alternative label: Fastighetsarbetare
broader: Fastighetsskötare
related: atQa p89 8mE
related: ktz9 mTH f64
related: yhCP AqT tns
related: F4Rv xJD qT7
broad match: C5153

Eventansvarig/Eventkoordinator
type: Concept
in scheme: JobTech Taxonomy - Yrke
definition: Eventansvarig/Eventkoordinator
alternative label: Eventansvarig
alternative label: Eventkoordinator
broader: Evenemangs- och reseproducenter m.fl.
related: V6oZ jDv k3S
related: FQPH Yv7 Z4T
related: 3Yqg h3c 3dW
related: c5tM JfW oa2
related: wANP H8U epP
related: uNaP VhJ Mze
related: PKKh rKA qsG
related: XBW1 8tr CkE
related: BZP2 g4B 8eX
related: FfDD gxA Bsr
related: fHpy bVu 2Kz
related: GYQD xjX 7Mp
related: 4z4G gcJ pFm
related: wFeD 7ee Fg4
related: 2pe8 AUN S8o
related: vzxt ues Gac
related: B9K5 ZF5 Tig
related: TdKV eu1 yKz
related: ScKy FHB 7wT
related: vSoC 18G oVT
related: 2bE3 U32 pEz
related: fVxD gA2 Df6
related: TxY7 JmZ 3tQ
broad match: C3332

Modist
type: Concept
in scheme: JobTech Taxonomy - Yrke
definition: Modister designar, tillverkar och reparerar hattar och andra huvudbonader. Modist är ett kreativt hantverksyrke. Det är vanligt att vara egen företagare. Förutom huvudbonader kan modister även arbeta med design och tillverkning av till exempel väskor och handskar inom mode- och konfektionsindustrin. Yrket liknar hattmakare, med skillnaden att hattmakare traditionellt tillverkar herrhattar och modister traditionellt tillverkar damhattar. Källa: Tillskärarakademin i Göteborg, Arbetsförmedlingen
broader: Skräddare och ateljésömmerskor m.fl.
related: kqau D4r 4fE
related: PaxQ o1G wWH
related: 5JD1 k9h mD5
broad match: C7531

Maskinoperatörer, kött- och fiskberedningsindustri
type: Concept
in scheme: JobTech Taxonomy - Yrke
definition: Styr och övervakar maskiner som bereder och tillagar råvaror för färdigmat samt bereder kött och fisk genom kokning, torkning, saltning eller rökning. Hit hör inte Slaktare (7611) Charkuterist (7611)
broader: Maskinoperatörer, livsmedelsindustri
related: s5nN ufD 8ay
related: i3kd fCX jxz
related: VPF1 UZM 9Kd
related: ieS3 RVa vb6
related: 2pjc Vto TGH
related: 7Rku rpo no9
related: aF3J SgE uck
related: qQ61 EQR rcz
related: VTwt 5Fe 6bW
related: Dywf BPg usG
related: kF91 StZ 15o
related: KDzy Hra iVr
related: 1vX4 pj1 yao
related: MuoH pDL nFJ
related: sbYJ XwB o8X
related: mBEa uPa dCb
related: AP6y xf5 4WK
related: d3oB oX3 kF8
related: GdFM 7x5 eZc
related: Nck1 p2a Vau
related: Rbju P7i 12U
related: xxMe abi itx
related: AiwS Mhv ttk
related: 5Q7S Ezy xhi
related: uenm 75h fEh
related: C8160
related: MT1a Nyq DGQ
related: qn22 kbi Mwa
related: dWbY gXC Frx
related: LhvF NZc r6N
related: kj4Q nLh u8Q
narrower: Maskinoperatör foderberedning
narrower: Maskinoperatör kött- och fiskberedning
broad match: wTEr CBC bqh

Specialistläkare, klinisk genetik
type: Concept
in scheme: JobTech Taxonomy - Yrke
definition: Specialistläkare, klinisk genetik är en specialiserad legitimerad läkare med en djupare kunskap och kompetens inom sitt område. Specialistläkare är en skyddad titel och bara den som har bevis om specialistkompetens får kalla sig specialist i sin specialitet. Specialistläkare ansvarar för att diagnostisera, behandla och förebygga sjukdomar inom sin specialitet. Vanliga arbetsuppgifter är mottagningsarbete med patientbesök, rondarbete på avdelning, handledning av yngre läkare samt konsultationer till andra yrkesgrupper och specialiteter. Specialistläkare ansvarar även för att följa och leda utvecklingen inom sitt medicinska område och utför omfattande medicinsk dokumentation och administration. Källa: Arbetsförmedlingen, Karolinska Institutet, Socialstyrelsen, Sveriges Kommuner och Regioner, Sveriges läkarförbund
broader: Specialistläkare
related: NYW6 mP6 vwf
related: qSbw XHD Ycd
related: TChC u37 rt2
related: EBX9 7gC eLt
related: vFjb AHi a54
related: jFHU uSj 4ke
related: KALC VvK 17U
related: QSeQ MpU wpW
related: 89LR AwA UqR
broad match: C2212

Orderadministratör
type: Concept
in scheme: JobTech Taxonomy - Yrke
definition: Orderadministratör hanterar och administrerar kundorder inom företag och organisationer. Arbetsuppgifterna inkluderar mottagning och registrering av beställningar, koordinering med lager och logistik, uppföljning av leveranser samt kontakt med leverantörer och kunder. Orderadministratören ser till att beställningsprocessen flyter effektivt och bidrar till hög servicegrad och leveranskvalitet. Källa: Arbetsförmedlingen
broader: Ordersamordnare m.fl.
related: NUNp Xmz 5SJ
related: dgd1 GyZ KR4
related: KYH8 ig3 qmX
related: RPTn bxG ExZ
related: uDx8 dHw 4E5
related: gmCg qab skt
related: QUxH Dgb dMP
related: h8A3 5Dm 4ca
related: iXzA Byo sne
related: xBGT cap Msg
related: DPGR dAj hFn
related: fnfr myF 9wa
related: zKRX XNn w6E
broad match: C3339

Bilrekonditionerare
type: Concept
in scheme: JobTech Taxonomy - Yrke
definition: Bilrekonditionerare är specialiserade på detaljerad rengöring och kosmetisk reparation av fordon. Som bilrekonditionerare är man specialiserad på att återställa och förbättra fordons utseende och funktion. Man arbetar ofta manuellt med borstar, trasor och handhållna maskiner. Man rengör små detaljer i fordons interiör, varför noggrannhet är viktigt. Bilrekonditionering kan även innefatta mer avancerade arbeten som rostskyddsbehandling, lackskydd, klädseltvätt och kosmetisk renovering av skadade detaljer. Källa: Arbetsförmedlingen
broader: Bilrekonditionerare, fönsterputsare m.fl.
related: whao Q6A ScE
related: UdVa jRr 9DE
related: cu17 koh Lra
related: YkPr Zop X4Q
related: JRCw n1m Qp3
related: PgYi 46T vhg
related: Xocu PMt zJT
related: AYvL RUw YQ2
related: cLmr TzE sfy
related: 39QP EWR U64
related: XnNY CY8 C7s
related: vNEQ Nzk Ko4
related: kpCz emW kJc
related: XuVZ ydW Y4R
related: Uupv 4Fb 7CT
broad match: C9122

Jobbcoach/Utbildningscoach
type: Concept
in scheme: JobTech Taxonomy - Yrke
definition: Jobbcoach/Utbildningscoach
alternative label: Jobbcoach
alternative label: Utbildningscoach
broader: Arbetsförmedlare
related: MJGZ uAK TiZ
related: fq67 rnv tKU
related: g2VC Jy2 PSi
related: xppf 1Pa MKZ
related: X82t awd Qyc
related: LZsp bUY EXW
related: JK5v hNd kJF
related: yUVK gPS ETF
related: KWeC Smo USa
related: 5JVa 4v7 YzZ
related: 41MP suB n8b
related: 4CbJ tcB Ntr
related: DMzY bzx DFE
related: GX7G uNc n9Q
related: CsPH 9FF Uar
related: sqot 91T dPA
related: sJdz Gvm 56P
related: XMWF nSA twj
related: tkzW L4n c2N
related: bpwb 9yZ oDS
related: o36G XRz cti
related: LLgh 9aw G37
related: M6Pz 3oR xfv
related: vvwk Ntr 4oi
related: arcr oUY yq6
related: Hw7f 5Md 9LG
related: qUsJ dJ2 169
related: QYPj Unp QvT
related: rgnk 4ot DuY
related: ppGp 8xY UhG
related: fun8 Wvh szA
related: JYQZ Gyn 75r
related: V5Kg hvy Wa4
broad match: C3333

Stadsjurist/Kommunjurist
type: Concept
in scheme: JobTech Taxonomy - Yrke
definition: Stadsjurist/Kommunjurist
alternative label: Kommunjurist
alternative label: Stadsjurist
broader: Förvaltnings- och organisationsjurister
related: 8Yiq Ubr jkr
related: L4hE Xa6 agA
related: X82t awd Qyc
related: x4Wi NWW ogB
related: Abcb QtH isZ
broad match: C2619

Juristsekreterare, chefssekreterare och institutionssekreterare m.fl.
type: Concept
in scheme: JobTech Taxonomy - Yrke
definition: Juristsekreterare, chefssekreterare och institutionssekreterare m.fl.
broader: Yrken med krav på högskolekompetens eller motsvarande inom ekonomi och förvaltning
narrower: Gruppledare för kontorspersonal
narrower: Domstols- och juristsekreterare m.fl.
narrower: Chefssekreterare och VD-assistenter m.fl.

Arbetsledare, tillverkning, elkrafttekniska produkter
type: Concept
in scheme: JobTech Taxonomy - Yrke
definition: Arbetsledare, tillverkning, elkrafttekniska produkter
broader: Arbetsledare inom tillverkning
related: Bq49 GkW Ptr
related: wTEr CBC bqh
broad match: C3122

Kundserviceyrken
type: Concept
in scheme: JobTech Taxonomy - Yrke
definition: Kundserviceyrken
broader: Yrken inom administration och kundtjänst
narrower: Resesäljare, kundtjänstpersonal och receptionister m.fl.
narrower: Croupierer och inkasserare

Prepressoperatör
type: Concept
in scheme: JobTech Taxonomy - Yrke
definition: Prepressoperatörer kvalitetsbedömer, anpassar och justerar material inför tryckning. Arbetet sker i huvudsak digitalt, där digitala filer förbereds inför tryckproduktion. Arbetsuppgifter kan inkludera att hantera PDF-filer, kontrollera färg och upplösning, genomföra preflight-kontroller samt skapa tryckplåtar eller digitala tryckfiler. I arbetsflödet ingår samarbete med designers, tryckare och kunder, samt övervakning av ordergång och avrapportering i produktions‑ eller kvalitetssystem. Prepressoperatör har vanligtvis goda kunskaper i Adobe Creative Suite (InDesign, Photoshop, Illustrator), färghantering, utskjutnings‑ och preflight‑verktyg (t.ex. PitStop Pro, Prinect). Yrket förekommer främst inom tryckeribranschen samt etikett‑ och förpackningsproduktion. Beroende på arbetsplats kan prepressarbete även förekommer som arbetsuppgift för verksamma inom trycksakproduktion. Se även yrkena Maskinoperatör tryckeri och Digitaltryckare. Källa: Arbetsförmedlingen
broader: Prepresstekniker
related: cLdx 8xB ey2
related: gpBT cNp Wqb
related: AMnh F9V 4pQ
related: 6a9w oya gcL
related: K4eA 1CR NoS
related: rFcn 2uV mx3
related: fg8Q d8H N6Q
related: pmkw CsN fhG
related: n6xa Zy8 4ZW
related: k6Um CDU zj4
related: Cvji KC5 9mW
related: YFSi tPh B47
related: EqkS FqD Bex
related: WD2m nVs EH2
related: 838x gXQ gM2
related: JVq6 BAx xa4
related: wTEr CBC bqh
broad match: C7321

Laseroperatör
type: Concept
in scheme: JobTech Taxonomy - Yrke
definition: Laseroperatörer sköter fiberlasermaskin för utskärning av metalldetaljer. Som laseroperatör, även kallat laserskärare, sköter du en fiberlasermaskin. Yrket liknar CNC-operatör, med skillnaden att laseroperatören är specialiserad och CNC-operatören behärskar fler maskiner. Arbetsuppgifterna för de båda yrkena är i övrigt mycket lika. Man programmerar och övervakar laserskärmaskinen under körning. Efter körning utför man kvalitetskontroll av färdig produkt. Källa: Arbetsförmedlingen
broader: Maskinställare och maskinoperatörer, metallarbete
related: XjDf idf po6
related: FeAv WV7 ipR
related: 7Bas 2YW gW4
related: wTEr CBC bqh
broad match: C7223

Övriga läkare
type: Concept
in scheme: JobTech Taxonomy - Yrke
definition: Undersöker patienter, ställer diagnoser och gör behandlingsplaner. Utför operationer och andra behandlingar, utvecklar teorier och metoder m.m.
broader: Läkare
related: 9ntP jdL 3iG
related: 4QAE wtY gJh
related: C2211
related: swuN HVe o49
related: 9Fna GUm HWL
related: tCDB MjS nqc
related: Mmxs Qrv cpG
related: 73kE uFW vvT
related: cegr WSz Fm2
related: 1eKe zFj QAa
related: nA5p Ske 4zb
related: 6VAN Ccy EkA
related: R85L 23s y4M
related: PrA4 KwY YcV
related: du5j oyG ju6
related: xkXC w3J Qxe
related: MVKv XXk XAi
related: Lqnz Zqw nQ9
related: qu4H C4Y uSR
related: QQuL 2Pe YDE
related: F7nJ k5s L29
related: LMx4 LbA vxB
related: NpcY f4G L1H
related: 2GuF gtz xfW
related: rF7s hX1 ECH
related: n9ho 3vf UZP
related: rVUL AgV ZTH
related: pGBH BkG qJa
related: yV9B PxJ TxS
related: LwTt 3Ns mGH
narrower: Läkare
narrower: Läkarstuderande
broad match: NYW6 mP6 vwf

Bensinstationsbiträde
type: Concept
in scheme: JobTech Taxonomy - Yrke
definition: Bensinstationsbiträden arbetar på drivmedelsstationer med försäljning av drivmedel, tillbehör, biltvätt och livsmedel. Yrket kallas även butikssäljare. Andra arbetsuppgifter som vanligtvis ingår är att tillaga och servera snabbmat och dryck, hyra ut bilar och släpvagnar samt lokalvård. Källa: Arbetsförmedlingen
alternative label: Servicebiträde
broader: Bensinstationspersonal
related: UdVa jRr 9DE
related: AzcL WfM f9L
related: RPTn bxG ExZ
related: s4kE EfN ywD
related: HGhn Rry 9TR
related: LdAc PvJ 1eA
related: pHdr PcW e85
related: XdTr eKd W3r
related: Kzrd oh2 ww9
related: q37i 9sj wfg
broad match: C5245

Brevbärare och postterminalarbetare
type: Concept
in scheme: JobTech Taxonomy - Yrke
definition: Förbereder distribution samt distribuerar post t.ex. brev, tidskrifter och direktreklam. Maskinsorterar post. Hit hör inte Reklamdistributör/Reklamutdelare (9621) Tidningsbud (9621)
broader: Brevbärare och postterminalarbetare
related: C4412
related: BA4E 9JW f14
related: DTWL RU2 aBs
related: 1Z1p qTP KYB
related: vohr DL4 BwH
related: 1Pk2 4TN aeL
related: NL17 f8c AqZ
related: 9j7V XZf yeh
related: ZXxL qW2 xdD
related: aNBY h1a bqC
related: VfeM f5V bjd
narrower: Postterminalarbetare
narrower: Brevbärare
broad match: ASGV zcE bWf

Demontör återvinning
type: Concept
in scheme: JobTech Taxonomy - Yrke
definition: Demontörer inom återvinning demonterar maskiner och apparater för att återvinna delar och komponenter. Arbetet innebär i huvudsak att demontera maskiner och olika apparater, till exempel industrimaskiner eller vitvaror. Man bedömer om demonterade delar går att återanvända som reservdelar genom kvalitetskontroll och funktionstestning. Reservdelar katalogiseras och dokumenteras enligt olika system. Miljöfarligt avfall så som batterier, elskrot, oljor och köldmedel tas om hand. Demonterade delar som inte bedöms kunna säljas skickas för återvinning. Källa: Arbetsförmedlingen
broader: Renhållnings- och återvinningsarbetare
related: LADB AY2 Zp1
related: ZGPH aRa qSP
related: whao Q6A ScE
related: UdVa jRr 9DE
related: F4tz HcT in8
related: juUv Qhe HtW
related: eaxc E1b EJB
related: dycc bym 7CV
related: mieJ yXk o6c
related: edrc RfY cEA
related: Wakm MJg vch
related: 8mdq Xrz drw
related: BuSD dbC Jgp
broad match: C9612

Murare
type: Concept
in scheme: JobTech Taxonomy - Yrke
definition: Murare arbetar med att bygga upp väggar med lättbetongblock och att klä hus med fasadtegel. Murare utför även putsning av fasader, murverk för spisar och skorstenar, fasadrenoveringar, stuckatur och i vissa fall plattsättning. Murare är ett av de äldsta byggyrkena. Muraren kan ansöka om sitt yrkesbevis efter teoretisk grundutbildning och lärlingsanställning. Källa: Arbetsförmedlingen, BYN
broader: Murare m.fl.
related: aJUj m1W Dwe
related: j7Cq ZJe GkT
related: p7uY r1H kyr
related: sXCC KD3 uaw
related: Zko3 gps YY9
related: wvxd xXd 4xk
related: EYbb 8m1 buA
related: ja7J P8X YC9
broad match: C7112

Anaplastolog
type: Concept
in scheme: JobTech Taxonomy - Yrke
definition: Person som arbetar med hela processen från avtryck på patienten till att ta fram den helt färdiga protesen för ansikte, munhåla eller käke. Källa: SKR
broader: Tandtekniker och ortopedingenjörer m.fl.
related: 6Hq3 tKo V57
related: NYW6 mP6 vwf
related: k1bB APw tKd
related: jn1T zsC HDC
broad match: C3214

Vårdledare
type: Concept
in scheme: JobTech Taxonomy - Yrke
definition: Vårdledare leder och samordnar det dagliga arbetet inom en vårdenhet och fungerar som operativt stöd för vårdpersonalen. Vanliga arbetsuppgifter är planera och fördela personal utifrån vårdbehov, samordna patientflöden och bevaka remisser. Vårdledaren ansvarar ofta för implementering av nya arbetssätt och rutiner samt introduktion och handledning av kollegor. Vanligt är en bakgrund som sjuksköterska med erfarenhet från kliniskt arbete. Källa: Arbetsförmedlingen, Karolinska Universitetssjukhuset, Region Sörmland
broader: Övriga specialistsjuksköterskor
related: NYW6 mP6 vwf
broad match: C2221

Kontorschef, offentlig förvaltning
type: Concept
in scheme: JobTech Taxonomy - Yrke
definition: Kontorschef, offentlig förvaltning
broader: Övriga chefer inom samhällsservice
related: epLc SkD cbT
related: bh3H Y3h 5eD
related: CgUp shH JVx
broad match: C1349

Säkerhetschef
type: Concept
in scheme: JobTech Taxonomy - Yrke
definition: Säkerhetschef
broader: Övriga administrations- och servicechefer
related: 4UTi Jw6 oBX
related: ncAR fQ9 cns
related: E7hm BLq fqZ
related: WF6g Xua vy1
related: epLc SkD cbT
related: bh3H Y3h 5eD
related: ApvH CsW 7U3
related: EDsa 4AA fSf
related: qrNM DMc vhg
broad match: C1219

Layouttecknare
type: Concept
in scheme: JobTech Taxonomy - Yrke
definition: Layouttecknare
broader: Grafiska formgivare m.fl.
related: 8too bEs 7NU
related: 9puE nYg crq
related: WjCH PZv eAC
broad match: C2166

Koreografer och dansare
type: Concept
in scheme: JobTech Taxonomy - Yrke
definition: Skapar och utformar konstnärlig dans. Tränar in och uppträder i dansuppsättningar.
broader: Konstnärer, musiker och skådespelare m.fl.
related: ikf1 Amg 7Tp
related: Wraf g1q FeS
related: znQu uHh eo6
related: FP6B HQf 9BT
related: 33Vr 6QS FY9
related: JcgE g6j zvC
related: gBAn q4Y X9s
related: fzjd xKK KDZ
related: 8wNB UKq Rw2
related: ezCJ HJX Y1v
related: rftJ MnF teZ
related: GmZv UnS yUh
related: u2Je 62L njd
related: C2653
related: EqEG dvA RhM
related: LbVL 7Za A9v
related: CbnN me3 wy8
related: qQih GTJ KWY
related: qwHa w4A tTc
related: DTx9 wZ6 jeC
related: yrLR nvE 6nV
related: 5XhW VQA 2CW
related: FkVo xRx nJ3
related: 1jBy r8E hMJ
related: tsZc oxK tnB
related: wX3G TCG s47
related: KV84 96T 6Za
related: 7eJ1 N62 5VZ
related: rFKR XMe Jh1
related: SiGF KNL eB6
related: PGe9 PiL C9Y
related: PoXD fBo 46n
related: EKo3 Jxj joe
related: TpL8 nLS 9Qr
related: mKKd wMP kX8
related: YaGu P82 ffU
related: geRr zq4 WJP
related: zuG9 jJp Zzo
related: YXFm UBX sLR
related: nKaF nH6 E9b
related: JreR sTo p7Z
related: Pk1y cpM ZhC
narrower: Balettmästare
narrower: Dansare
narrower: Koreolog
narrower: Koreograf
narrower: Repetitör, opera
narrower: Repetitör, dans
broad match: 9puE nYg crq

Molekylärbiolog
type: Concept
in scheme: JobTech Taxonomy - Yrke
definition: Molekylärbiolog
broader: Cell- och molekylärbiologer m.fl.
related: CpFD aoS pkZ
related: kJeN wmw 9wX
related: kc9a HVY g5H
related: UZ3A hps RCY
related: Bvf5 msy EBq
related: TXx8 Mgv BGZ
related: fM7t axJ RNN
related: WZc7 BvN UMV
broad match: C2131

Djurtransportförare
type: Concept
in scheme: JobTech Taxonomy - Yrke
definition: Djurtransportförare tranporterar djur och boskap. Djutransportförare transportera djur och boskap. Till största delen avser transporter från lantbruk till slakterier. Arbetstiderna är regelbundna, ofta med tidiga morgonpass för att undvika att djur behöver hållas länge på slakterierna. Föraren hanterar även teknisk utrustning i transportbilarna och bör kunna utföra enklare reparationer. Eftersom föraren sköter lastningen ställs stora krav på djurkännedom och god kännedom om lagstiftning som reglerar transport och hantering av djur. Källa: Transportfackens yrkes- och arbetsmiljönämnd
broader: Lastbilsförare m.fl.
related: zGjD M5a HCX
related: d68E e74 a59
related: hhb7 1hV t7R
related: ASGV zcE bWf
related: 483u hVx psa
related: 9wnn PAV q12
broad match: C8332

Skolinspektör
type: Concept
in scheme: JobTech Taxonomy - Yrke
definition: Skolinspektör
broader: Speciallärare och specialpedagoger m.fl.
related: 3pyE aAA TFD
related: saWw 8ko bte
related: MVqp eS8 kDZ
broad match: C2351

Byggnadsplåtslagare
type: Concept
in scheme: JobTech Taxonomy - Yrke
definition: En byggnadsplåtslagare jobbar med att klä tak och fasader med plåt. Det kan handla om allt från att klä en kyrka i koppartak till att montera fönsterbleck och hängrännor på en villa. Plåtslagare tillverkar själva de plåtdelar som monteras på tak och fasader. Tillverkningen sker på företagets verkstad och ska oftast passa helt unika förutsättningar. Det kan till exempel handla om att skapa plåtdelar till ett torn, en skorsten, eller ett sluttande tak. Källa: Plåt- och ventföretagen
broader: Byggnads- och ventilationsplåtslagare
related: LTnh sLK P2Y
related: 7kZP dw1 YqJ
related: j7Cq ZJe GkT
related: xhm9 RcG RgF
related: JMmR kW7 iun
related: 6HAU p77 qf4
related: ja7J P8X YC9
related: 1thV MWf EWN
related: JezX oUD TZr
broad match: C7213

Kvalitetsingenjör elektronik
type: Concept
in scheme: JobTech Taxonomy - Yrke
definition: En kvalitetsingenjör inom elektronik säkerställer att elektroniska produkter och system uppfyller fastställda kvalitetsstandarder. De arbetar med att utveckla, implementera och övervaka kvalitetskontrollprocesser, analysera data, utföra tester och inspektioner, samt samarbeta med produktutvecklingsgrupper för att lösa kvalitetsproblem. Källa: Arbetsförmedlingen
alternative label: Kvalitetstekniker, elektronik
broader: Ingenjörer och tekniker inom elektroteknik
related: 6Hq3 tKo V57
related: sGJa ZuE rad
related: SvAW coW dGN
broad match: C3114

Politiker och högre ämbetsmän
type: Concept
in scheme: JobTech Taxonomy - Yrke
definition: Politiker och högre ämbetsmän
broader: Politiker, verkställande direktörer och högre ämbetsmän m.fl.
narrower: Politiker
narrower: Chefstjänstemän i intresseorganisationer
narrower: General-, landstings- och kommundirektörer m.fl.

Storhushållsföreståndare
type: Concept
in scheme: JobTech Taxonomy - Yrke
definition: Ansvarar för och leder dagligt arbete i köket på ett internat eller inom storhushåll, exempelvis på en sjukhusrestaurang eller i en skolmatsal. Planerar matsedlar samt köper in varor.
broader: Köksmästare och souschefer
related: ogdH rrn NWT
related: 9hYy FEc KaX
related: GQ9R 2Za Awt
related: XDok jQC Q7x
related: zMmn 1mh 6D5
related: DzNZ 4nW KbU
related: kdSa Bi6 q6E
related: P5Lv TUM XzB
related: e9Et nNG 2fq
related: ZzN5 m7B 5CY
related: MuoH pDL nFJ
related: PRQR oGE 7re
related: S44W QvJ r4m
related: Muyo vuk msK
related: 8FGH zU4 fAt
related: eThQ HCv mY6
related: Dxqv 2WA TYt
related: M4ei Uvu Ks7
related: Gt5f wdi FSJ
related: C3434
related: Nxfw cTk qUk
related: eKuz edm kmi
related: wAQ9 vmK Fua
related: JJiW W7Z kgc
related: aAtJ q2r J5n
related: P6te TBF 8fh
related: kj4Q nLh u8Q
related: BjRb NYL cWB
narrower: Måltidsutvecklare
narrower: Kostekonom
narrower: Fartygsintendent
narrower: Storhushållsföreståndare
broad match: ScKy FHB 7wT

Processoperatör pappersmassa
type: Concept
in scheme: JobTech Taxonomy - Yrke
definition: Processoperatörer för pappersmassa styr och övervakar anläggningar för tillverkning av pappersmassa och utvinning av biprodukter Arbetet sker från operatörsrum där man följer och justerar tillverkningsprocess. Arbetsuppgifer kan vara att rondera anläggningen, lösa produktionsstörningar, utföra provtagning och kontroll av producerade varor samt utföra maskinunderhåll. Beroende på arbetsplats kan även truckkörning ingå. Källa: Arbetsförmedlingen
broader: Processoperatörer, pappersmassa
related: eh38 vsD mur
related: uTUT c5W zcS
related: oLDs TgV Jjr
related: 9eGr nXK Xni
related: kDmp gKb yzm
related: ujAc vB6 Tzc
related: EKc1 t8Q xVf
related: qtJE jVF vaR
related: R5k7 2TM ZYX
related: e59v xSb nvo
related: cWFT skx rfR
related: uvGX kGi Y1h
related: fexJ Zc4 Hw9
related: wTEr CBC bqh
broad match: C8171

Configuration Manager/CM
type: Concept
in scheme: JobTech Taxonomy - Yrke
definition: Configuration Manager/CM
alternative label: CM
alternative label: Configuration Manager
broader: Systemanalytiker och IT-arkitekter m.fl.
related: HDSN xqY ky5
related: Vhgi ume aRA
related: a2mb ePZ cXJ
related: apaJ 2ja LuF
related: GixT A5A HLj
related: MWkD kzL F2X
related: qBsw ikL hZ2
broad match: C2511

Medicinsk skribent
type: Concept
in scheme: JobTech Taxonomy - Yrke
definition: Medicinsk skribenter producerar och granskar vetenskapliga och regulatoriska dokument inom medicin och läkemedelsutveckling. Arbetet sker ofta i samarbete med forskare, läkare och vårdpersonal och innefattar blandar resultat av kliniska studier, rapporter och regulatoriska texter. Som medicinsk skribent har man vanligtvis en bakgrund inom medicin, farmakologi eller biomedicin. Källa: Arbetsförmedlingen
broader: Journalister m.fl.
related: NYW6 mP6 vwf
related: 9puE nYg crq
broad match: C2642

Barista
type: Concept
in scheme: JobTech Taxonomy - Yrke
definition: Baristor tillreder och serverar olika typer av kaffedrycker. Arbetsuppgifterna omfattar hantering av espressomaskin, skumning av mjölk, bryggning av specialkaffe, rengöring av utrustning samt kundservice och kassaarbete. I vissa fall ingår även enklare bakverk, smörgåsar eller andra varma drycker.
alternative label: Kaffebartender
broader: Bartendrar
related: 7goz uuv JWu
related: Ckm8 sHx aow
related: ScKy FHB 7wT
related: EKtK 5mt fum
related: hkZo aor oJQ
broad match: C5132

Repetitör, opera
type: Concept
in scheme: JobTech Taxonomy - Yrke
definition: Repetitör inom opera stödjer och förbereder operasångare genom pianoackompanjemang och musikaliska instruktioner under repetitioner. Vanliga arbetsuppgifter är att spela klaverutdrag vid individuella och grupprepetitioner, stödja sångarna med musiktekniska och språkliga detaljer, samordna med dirigent och regissör samt följa produktionen noggrant för att korrigera sångarnas framförande inför föreställningar. Källa: Arbetsförmedlingen, Statens musikverk och Svensk Scenkonst
broader: Koreografer och dansare
related: 8too bEs 7NU
related: 9puE nYg crq
broad match: C2653

Kemikalieinspektör
type: Concept
in scheme: JobTech Taxonomy - Yrke
definition: Kemikalieinspektör
broader: Miljö- och hälsoskyddsinspektörer
related: kJeN wmw 9wX
related: 4eJL Zun nUv
broad match: C3257

Manager/Agent inom idrott
type: Concept
in scheme: JobTech Taxonomy - Yrke
definition: Manager/Agent inom idrott representerar idrottare eller tränare. Arbetsuppgifter innefattar att förhandla kontrakt, hantera sponsoravtal, förmedla övergångar och stötta klienter i juridiska och ekonomiska frågor. Vanliga arbetsplatser är agentbyråer, inom sportorganisationer eller som egenföretagare. Källa: Arbetsförmedlingen
broader: Övriga förmedlare
related: RPTn bxG ExZ
related: 8vsC LtC E7V
related: D8n2 q85 QAm
broad match: C3339

Lärling, industrielektriker
type: Concept
in scheme: JobTech Taxonomy - Yrke
definition: En lärlingsanställning är en färdigträning till industrielektriker som sker efter grundläggande teoretisk och praktisk utbildning. Som lärling använder du dina kunskaper på en arbetsplats under vägledning av en handledare. Lärlingstiden är 1 600 timmar Källa: ECY
broader: Industrielektriker
related: yhCP AqT tns
related: ja7J P8X YC9
broad match: C7412

SQE Supplier Quality Engineer
type: Concept
in scheme: JobTech Taxonomy - Yrke
definition: SQE Supplier Quality Engineer
broader: Ingenjörer och tekniker inom industri, logistik och produktionsplanering
related: 6Hq3 tKo V57
related: ss75 t9m 6Cp
broad match: C3115

Barberare
type: Concept
in scheme: JobTech Taxonomy - Yrke
definition: Barberare klipper, formar och rakar hår på huvudet och i ansiktet, med fokus på skäggvård och traditionell rakning. Arbetsuppgifter innefattar hårklippning, skäggtrimning, rakning med kniv, formgivning av mustasch och vård av ansiktshår. I arbetet ingår även tvätt, styling och kundrådgivning om produkter och stilval. Källa: Arbetsförmedlingen
broader: Frisörer
related: Uuf1 GMh Uvw
related: kxUL f3p yX2
broad match: C5141

Trafiklärare
type: Concept
in scheme: JobTech Taxonomy - Yrke
definition: Trafiklärare undervisar och handleder personer som vill ta körkort för olika fordon. Arbetsuppgifter innefattar både praktisk körträning och teoretisk undervisning i trafikregler, säkerhet och trafikvett. Undervisning sker individuellt i fordon, i lektionssal och på övningsplats, ofta för elevgrupper med varierande bakgrund. Trafiklärare arbetar både med grundläggande utbildningar och specialiserade kurser som riskutbildning eller olika fordonsslag. För att arbeta som trafiklärare krävs godkännande från Transportstyrelsen. För att utbilda för tunga fordon krävs ytterligare utbildning. Källa: Transportstyrelsen, Sveriges Trafikutbildares Riksförbund, Arbetsförmedlingen
broader: Trafiklärare
related: 3WkS Vf8 W91
related: Amuv 3MM JEz
related: e9j3 ZDb kW6
related: KN2L SnM aHk
related: 5rHh gdZ av3
related: 9jYP z7e Ze7
related: MVqp eS8 kDZ
related: tzVp 5CP VKn
related: EnqZ 22d WhN
related: Gkox DqN B8c
related: RYBV ZWm dSW
broad match: C5165

Audionom
type: Concept
in scheme: JobTech Taxonomy - Yrke
definition: Audionom arbetar med att utreda, diagnostisera och rehabilitera personer med nedsatt hörsel i alla åldrar. Audionom är en skyddad titel med legitimationskrav. Vanliga arbetsuppgifter är att genomföra hörselmätningar, bedöma hörselnedsättningar, prova ut och anpassa hörapparater samt andra hörseltekniska hjälpmedel. Arbetet innebär också att ge rådgivning, undervisning och stöd till patienter och deras anhöriga, samt att informera om och förebygga hörselskador. Källa: Arbetsförmedlingen, Audionomerna, Socialstyrelsen
broader: Audionomer och logopeder
related: evTJ jho DKo
related: NYW6 mP6 vwf
related: sqvh gTy 6Sj
related: vDPa iYR kgy
related: d14v 1qn 9js
broad match: C2266

Bokbinderiarbetare
type: Concept
in scheme: JobTech Taxonomy - Yrke
definition: Bokbinderiarbetare sköter maskiner vid framställning av böcker. Yrket kallas även maskinbokbindare. Arbetet innebär i huvudsak att sköta maskiner i bokbinderiprocessen. I detta ingår bland annat att skära tryckta pappersark, ställa fals, ställa häftmaskin, häfta, hålning, märlning, packning och andra relaterade uppgifter. Vanliga arbetsplatser är tryckerier eller andra grafiska industrier med egen bokbinderiavdelning. Arbetet kan i vissa fall vara fysiskt krävande. Arbetsuppgifter; sköta maskiner, sköta bokbinderimaskiner Källa: Arbetsförmedlingen, Hantverksakademin
broader: Bokbindare m.fl.
related: ECrL NqK ePq
related: XEC5 TPY Vcm
related: EUuu Q5Q 9Mv
related: wTEr CBC bqh
related: LaSc 5RN WN8
broad match: C7323

Elnätsanalytiker
type: Concept
in scheme: JobTech Taxonomy - Yrke
definition: Elnätsanalytiker
broader: Civilingenjörsyrken inom elektroteknik
related: 6Hq3 tKo V57
related: bj1u Ppz SbZ
related: VPut b9f rVd
broad match: C2151

Dataskyddsombud
type: Concept
in scheme: JobTech Taxonomy - Yrke
definition: Dataskyddsombud
broader: Planerare och utredare m.fl.
related: X82t awd Qyc
related: TZe9 NsN uce
broad match: C2422

Tech and Tools programmer, games
type: Concept
in scheme: JobTech Taxonomy - Yrke
definition: En Tech and Tools Programmer inom spelutveckling ansvarar för att skapa, underhålla och förbättra de verktyg och tekniska lösningar som används av andra utvecklare, designers och artister under produktionen av spel. Tech and Tools Programmer utvecklar och underhåller verktyg och tekniska system i spelmotorn för att effektivisera arbetsflöden och produktion. Skriver och optimerar kod för verktyg som används till exempelvis nivådesign, grafikimport, animation, ljud och innehållsvalidering. Felsöker och förbättrar befintliga verktyg samt utbilda teammedlemmar i hur de används. Källa: Arbetsförmedligen, screenskills.com, diverse jobbannonser
broader: Utvecklare inom spel och digitala media
related: 2Lgw fMQ qSg
related: apaJ 2ja LuF
related: 8too bEs 7NU
related: 9puE nYg crq
related: PpaS NaH 3Zo
related: 2TYW oUc vdg
broad match: C2513

Asfaltverksmaskinist
type: Concept
in scheme: JobTech Taxonomy - Yrke
definition: Asfaltverksmaskinister övervakar asfaltsframställning vid asfaltverk. Huvudsakliga arbetsuppgifter är att övervaka och styra asfaltproduktionen via asfaltverkets kontrollrum. Arbetet innebär ofta ordermottagning och leveransplanering av färdig asfalt. Beroende på arbetsplats brukar även underhållsarbete ingå. Det är vanligt att som asfaltsverksmaskinist kunna arbeta med olika delar av tillverkningsprocessen, varför att köra hjullastare även ofta efterfrågas. Källa: Arbetsförmedlingen
broader: Maskinoperatörer, cement-, sten- och betongvaror
related: ykQ2 AXB V4E
related: 2c7t gfH NnW
related: 373Z dtJ 4S6
related: 5sje 7tm JyA
related: wTEr CBC bqh
related: whwd gVX zgQ
related: btdR ZQb XpZ
broad match: C8114

Fotografer, dekoratörer och underhållningsartister m.fl.
type: Concept
in scheme: JobTech Taxonomy - Yrke
definition: Fotografer, dekoratörer och underhållningsartister m.fl.
broader: Yrken med krav på högskolekompetens eller motsvarande inom kultur, friskvård och socialt arbete m.m.
narrower: Övriga yrken inom kultur och underhållning
narrower: Fotografer
narrower: Inspicienter och scriptor m.fl.
narrower: Inredare, dekoratörer och scenografer m.fl.

Skogsmaskinförare
type: Concept
in scheme: JobTech Taxonomy - Yrke
definition: Skogsmaskinförare arbetar med maskiner inom skogsbruk. Som skogsmaskinförare ansvarar du för gallring, slutavverkning och transport av virke fram till vägen. Man kör främst skotare och skördare. Skogsskötsel och naturhänsyn ingår även, exempelvis att avgöra vilka träd som ska fällas för att andra ska växa bättre. Även maskinunderhåll är förekommande. Källa: Gröna arbetsgivare
broader: Förare av jordbruks- och skogsmaskiner
related: GyJw jc8 tcz
related: ifov caR vco
related: N2Bj yTq UnR
related: wMpW 8AK fHg
related: uKoM Mqn yV9
related: VuuL 7CH adj
related: j2ah 6bm rg4
related: gb4d B8k VKM
related: sPxB SQk yrp
broad match: C8341

Maskinoperatör förpackning och påfyllning
type: Concept
in scheme: JobTech Taxonomy - Yrke
definition: Maskinoperatörer inom förpackning övervakar och sköter förpackningsmaskiner och tillhörande utrustning. Som maskinoperatör inom förpackning och påfyllning sköter man automatiska och halvautomatiska maskiner för att förpacka och/eller fylla på produkter. Man sköter maskiner för till exempel emballering, packning, vägning och etikettering. Arbetsuppgifterna inkluderar materialförberedelse, kvalitetskontroller, enklare underhåll och dokumentation av produktionen. Beroende på arbetsplats kan man ha ansvar för hela eller delar av produktionslinjen, från tomt emballage till färdigpackad produkt placerad i lager. Truckkörning och förberedelse för leverans kan även ingå. Källa: Arbetsförmedlingen
broader: Maskinoperatörer, påfyllning, packning och märkning
related: 8Mpp Qki z7H
related: Kitm G5c ib1
related: 1JnA TQj 2BK
related: MA4M SvV zbH
related: cfpQ rnt xP6
related: wTEr CBC bqh
broad match: C8183

Regionchef, butik
type: Concept
in scheme: JobTech Taxonomy - Yrke
definition: Regionchef, butik
broader: Chefer inom handel
related: j9DW XM4 qxo
related: RPTn bxG ExZ
related: epLc SkD cbT
related: bh3H Y3h 5eD
related: vRNU WDp zAY
related: A6ho 9bA 8G9
broad match: C1420

Intonatör
type: Concept
in scheme: JobTech Taxonomy - Yrke
definition: Intonatörer justerar och underhåller musikinstrument som piporglar, pianon och andra stränginstrument. Justering görs för att optimera musikinstrumentens klang och ljudkvalitet. Detta inkluderar att ta hänsyn till de akustiska miljöer där musikinstrumenten används. Man använder specifika verktyg för att manipulera material som metall, trä och filt. Intonatören samarbetar ofta med musiker och tekniker för att möta specifika önskemål kring ljudkvalitet, till exempel i en kyrka. Intonatören kan även utföra underhåll på relaterade musikinstrument. Källa: ESCO, Arbetsförmedlingen
broader: Musikinstrumentmakare och övriga konsthantverkare
related: PaxQ o1G wWH
broad match: C7312

Restaurang- och kökschefer
type: Concept
in scheme: JobTech Taxonomy - Yrke
definition: Formulerar och ansvarar för mål och strategier för verksamhet inom restaurang och kök. Utformar riktlinjer, följer upp och utvärderar verksamheten mot uppsatta mål. Svarar för budget samt fördelar resurserna inom verksamheten. Har personalansvar. Hit hör inte Köksmästare (3450) Souschef (3450)
broader: Restaurang- och kökschefer
related: s5SS 7bW 1Gh
related: UH9g R5v MCx
related: SmZd Jaa BeY
related: kdSa Bi6 q6E
related: 8tYq EXD Xwm
related: ZzN5 m7B 5CY
related: Nksx 4oe fEQ
related: eThQ HCv mY6
related: C1412
related: Gt5f wdi FSJ
related: q7Mx gjU F9q
related: VfP9 2xd g2h
related: zXNU zXR hGd
related: 4fRg DA4 Dj3
related: SJaZ pXy 771
narrower: F&B Manager/Food and beverage manager
narrower: Restaurangchef
narrower: Kökschef
broad match: bh3H Y3h 5eD

Filmarkivarie
type: Concept
in scheme: JobTech Taxonomy - Yrke
definition: Filmarkivarie
broader: Bibliotekarier och arkivarier
related: X82t awd Qyc
related: 7Vne Ptb Jqi
related: 9puE nYg crq
broad match: C2621

Medicinskt ansvarig sjuksköterska
type: Concept
in scheme: JobTech Taxonomy - Yrke
definition: Medicinskt ansvarig sjuksköterska (MAS) ansvarar för kvalitet och säkerhet i den kommunala hälso- och sjukvården och säkerställer att vården bedrivs enligt gällande lagar och föreskrifter. Sjuksköterska är en skyddad titel med legitimationskrav. Vanliga arbetsuppgifter är utfärda, uppdatera och följa upp riktlinjer och rutiner för vård, läkemedelshantering och journalföring. Arbetsuppgifter inkluderar också granska och utreda avvikelser och anmäla allvarliga vårdskador till tillsynsmyndigheter, fungera som sakkunnig och stöd för chefer och personal och samverka med andra vårdgivare och aktörer inom kommunen. Källa: Arbetsförmedlingen, Socialstyrelsen, Värmdö kommun, Sollentuna kommun
broader: Övriga specialistsjuksköterskor
related: NYW6 mP6 vwf
related: iy5d 2VQ SX1
related: 1f7B E5K sh3
broad match: C2221

Arborist
type: Concept
in scheme: JobTech Taxonomy - Yrke
definition: Arborist, även kallad trädvårdare, är specialister inom trädvård och utför bland annat beskärning och trädfällning. Arbetet innebär i huvudsak att bedöma behov av och utföra trädvård. Arbetet innebär ofta klättring på höga höjder och hantering av hand- och motorsågar. En vanligt förekommande arbetsuppgift är inventering och riskbedömning av träd i olika miljöer, såsom parker och gatumiljöer. Yrket kan utövas inom offentliga förvaltningar, trädgårdsskötselbranschen eller som egenföretagare med uppdrag åt både privata och offentliga kunder. Källa: Gröna arbetsgivare, Arbetsförmedlingen
broader: Trädgårdsanläggare m.fl.
related: KzXA f9V b7g
related: 9KpK em1 gNi
related: i5qV 3wT r6Y
related: KMYm Swy 7Lm
related: grv3 38D kUC
related: xdUG bAj uax
related: 75Q6 ouA hhm
related: VuuL 7CH adj
broad match: C6113

Specialister inom miljö- och hälsoskydd
type: Concept
in scheme: JobTech Taxonomy - Yrke
definition: Specialister inom miljö- och hälsoskydd
broader: Yrken med krav på fördjupad högskolekompetens inom naturvetenskap och teknik
narrower: Arbetsmiljöingenjörer, yrkes- och miljöhygieniker
narrower: Miljö- och hälsoskyddsinspektörer
narrower: Specialister inom miljöskydd och miljöteknik

Arbetsterapeut
type: Concept
in scheme: JobTech Taxonomy - Yrke
definition: Arbetsterapeut hjälper människor att komma tillbaka till en fungerande vardag efter en sjukdom eller skada, men arbetar också med att hjälpa den som har en medfödd funktionsnedsättning till ett bra liv. Arbetsterapeut är en skyddad titel med legitimationskrav. Vanliga arbetsuppgifter är att utreda och bedöma behov och förutsättningar och utifrån dessa planera och genomföra insatser tillsammans med personen för att träna och utveckla fysiska, kognitiva och sociala förmågor. Arbetsterapeuten provar ut, anpassar och förskriver hjälpmedel, föreslår anpassningar av bostad, arbetsplats eller skola för att öka tillgänglighet och självständighet. Källa: Arbetsförmedlingen, Sveriges Arbetsterapeuter, Socialstyrelsen
broader: Arbetsterapeuter
related: RrQA ti4 yPE
related: NYW6 mP6 vwf
related: sqvh gTy 6Sj
related: jU7b Dj6 61q
related: q5nM r91 9qP
related: PhbM D3p Yek
related: PQ1N 5WU dwy
related: 1Qt4 jtL YLp
related: VCWN hWH QKF
related: pTiT CNZ Cd8
related: wPmy epZ VKM
related: t5Bc 4X4 DkG
related: NzH6 Hra Dyk
broad match: C2269

Produktionschef, logistik/Produktionschef, transporter
type: Concept
in scheme: JobTech Taxonomy - Yrke
definition: Produktionschef, logistik/Produktionschef, transporter
alternative label: Produktionschef, logistik
alternative label: Produktionschef, transporter
broader: Inköps-, logistik- och transportchefer
related: pbLc BZt pQr
related: epLc SkD cbT
related: ASGV zcE bWf
related: bh3H Y3h 5eD
broad match: C1324

Lantmästare
type: Concept
in scheme: JobTech Taxonomy - Yrke
definition: Lantmästare
broader: Specialister och rådgivare inom lantbruk m.m.
related: 6nbS RdB kzm
related: VuuL 7CH adj
broad match: C3142

Optikerassistent
type: Concept
in scheme: JobTech Taxonomy - Yrke
definition: Optikerassistenter biträder optiker med kundkontakter och allmän rådgivning om glasögon och kontaktlinser. Arbetsuppgifter innefattar anpassa glasögon och kontaktlinser enligt optikers ordination. Optikerassistenter lämnar ut och justerar iordningställda glasögon och kontaktlinser samt ger instruktioner om hantering. Källa: Arbetsförmedlingen
broader: Optikerassistenter
related: UdVa jRr 9DE
related: RPTn bxG ExZ
broad match: C3254

Kriminalvårdare
type: Concept
in scheme: JobTech Taxonomy - Yrke
definition: Svarar för vård och tillsyn av intagna på kriminalvårdsanstalter och allmänna häkten. Övervakar ordning och säkerhet. Aktiverar de intagna i olika fritidsverksamheter samt bedriver motivationsarbete.
broader: Andra bevaknings- och säkerhetsyrken
related: j2mu 7hs ZzY
related: E7QH Hnd BAC
related: zBWb UEF vHK
related: MYEm puY HUF
related: C5413
related: TGba Rdd yvN
related: FJgD TNa SE6
related: QNZ3 uWX JmZ
related: qsCj EhM fyT
related: Xbh5 n9L hrb
related: nu52 VXq 5MD
related: xLxq sQ7 RzR
narrower: Arrestantvakt
narrower: Kriminalvårdare
broad match: E7hm BLq fqZ

Flygingenjör
type: Concept
in scheme: JobTech Taxonomy - Yrke
definition: Flygingenjör
broader: Civilingenjörsyrken inom maskinteknik
related: SuAn oH9 xNc
related: 6Hq3 tKo V57
related: QTd1 MKD mNW
related: RL1Y xvY d8u
broad match: C2144

Synpedagog
type: Concept
in scheme: JobTech Taxonomy - Yrke
definition: Person som ger synskadade träning för att klara det dagliga livet, förskriver olika hjälpmedel och utbildar i hur hjälpmedlen ska användas. Källa: SKR
broader: Speciallärare och specialpedagoger m.fl.
related: cuwB vb8 RVJ
related: 3pyE aAA TFD
related: MVqp eS8 kDZ
related: 3Rkw KJ1 szw
broad match: C2352

Hydrogeolog
type: Concept
in scheme: JobTech Taxonomy - Yrke
definition: Hydrogeolog
broader: Geologer och geofysiker m.fl.
related: kJeN wmw 9wX
broad match: C2114

Lärling, mobilkranförare
type: Concept
in scheme: JobTech Taxonomy - Yrke
definition: En lärling är anställd för att slutföra sin kvalificeringstid till mobilkranförare innan ett yrkesbevis kan utfärdas. Under kvalificeringstiden får du lärlingslön enligt avtal. Kvalificeringstiden tillsammans med teoretisk grundutbildning leder till yrkesbeviset. Ett lärlingsavtal mellan branschorganisation och företag tecknas. Källa: BYN
broader: Kranförare m.fl.
related: j7Cq ZJe GkT
related: ja7J P8X YC9
related: vtY3 TC1 Hg6
broad match: C8343

Supporttekniker, IT
type: Concept
in scheme: JobTech Taxonomy - Yrke
definition: Ger teknisk support. Genomför felsökningar, analyserar och åtgärdar uppkomna fel. Ger service och support i samband med installation och underhåll av system. Löser problem som uppstår t.ex. med användares lösenord.
broader: Drift-, support- och nätverkstekniker m.fl.
related: wynY a5Q F6t
related: TFQD onf Tid
related: urLT mLe FHv
related: bJ3T CwH a2j
related: C3512
related: GZEU zfs Fcc
related: yoeN KxU Wp1
related: N9zP r7b yiK
related: QN8t 2kG kzL
related: uBLB rJz L99
related: kraG fcm 3Mo
related: q2v1 YcS Dff
related: qEQz Mbj kQP
related: hfRX 1xN X8Z
related: voW2 EsY 1Vj
related: rdQ2 dyF 8J8
related: 9qgQ QyK VVh
related: tYmW Y78 yBt
narrower: Supporttekniker IT
broad match: apaJ 2ja LuF

Företagsjurist
type: Concept
in scheme: JobTech Taxonomy - Yrke
definition: Företagsjurist
broader: Affärs- och företagsjurister
related: X82t awd Qyc
related: akVQ YUf TZg
related: bdN2 w6W 9EK
related: x4Wi NWW ogB
related: Abcb QtH isZ
broad match: C2619

Stallchef
type: Concept
in scheme: JobTech Taxonomy - Yrke
definition: Stallchef, även kallat stallförman, leder och organiserar det dagliga arbetet i stallverksamhet, exempelvis inom hästnäring eller lantbruk. Arbetsuppgifter omfattar planering och fördelning av arbetsuppgifter inom stallskötsel, utfodring, rengöring av stall och utrymmen samt övervakning av djurens hälsa och välbefinnande. Stallchefen samordnar personal, introducerar nya medarbetare och säkerställer att rutiner för djurskydd, smittskydd och arbetsmiljö följs. I rollen ingår även kontakt med leverantörer, beställning av foder och material, samt dokumentation av djurhållning och arbetsmoment. Stallchef deltar ofta i underhåll av anläggning och teknisk utrustning samt kan bistå vid enklare vårdåtgärder och assistera vid förlossningar. Arbetet kan variera beroende på verksamhetens inriktning. Se även yrket Hästskötare. Källa: Jobba grönt, Arbetsförmedlingen
alternative label: Stallförman
broader: Uppfödare och skötare av lantbrukets husdjur
related: epLc SkD cbT
related: 52iz HXR 9Xi
related: VuuL 7CH adj
related: DPHE Ur6 RDC
broad match: C6121

Rektor
type: Concept
in scheme: JobTech Taxonomy - Yrke
definition: Rektor
broader: Chefer inom grund- och gymnasieskola samt vuxenutbildning
related: ZSrG ypE 6p6
related: seU3 NZX fEd
related: epLc SkD cbT
related: x76a TFs 1e9
related: bh3H Y3h 5eD
related: MVqp eS8 kDZ
related: cy9N Vop tNE
related: QYLp JQr HTe
broad match: C1345

Oceanograf
type: Concept
in scheme: JobTech Taxonomy - Yrke
definition: En oceanograf är en vetenskapsman som undersöker havets fysikaliska, kemiska, biologiska och geologiska egenskaper och hur dessa påverkar miljön. Deras arbete kan inkludera allt från att analysera havsvattenprover och studera havsströmmar till att modellera klimatförändringar och övervaka marin miljö. Oceanografer genomför också olika utredningar, konsultuppdrag eller stöttar räddningstjänster och myndigheter vid kustöversvämningar och olyckor till havs. Källa: Stockholms universitet, Göteborgs universitet, SMHI
broader: Geologer och geofysiker m.fl.
related: kJeN wmw 9wX
broad match: C2114

Buddhistpräst
type: Concept
in scheme: JobTech Taxonomy - Yrke
definition: Buddhistpräst
broader: Präster
related: GazW 2TU kJw
broad match: C2636

Väghyvelförare
type: Concept
in scheme: JobTech Taxonomy - Yrke
definition: En väghyvelförare kör en väghyvel som används för att hyvla av och jämna till översta skiktet på grusvägar, vintertid används maskinen som snöskrapa. Väghyvel är ett av maskinslagen för en anläggningsmaskinförare. Anläggningsmaskinföraren har yrkesbevis i ett eller flera maskinslag. I arbetet ingår att sköta underhåll och enklare reparationer av maskinens kringutrustning. Ibland hjälper anläggningsmaskinföraren också till med markarbeten utanför maskinen. Anläggningsmaskinföraren kan ansöka om sitt yrkesbevis efter teoretisk grundutbildning och lärlingsanställning. Källa: Arbetsförmedlingen
broader: Anläggningsmaskinförare m.fl.
related: j7Cq ZJe GkT
related: j7RW L1z PtN
related: ja7J P8X YC9
related: Mxyf t2J iLA
broad match: C8342

Övriga process- och maskinoperatörer
type: Concept
in scheme: JobTech Taxonomy - Yrke
definition: Utför annat process- och maskinoperatörsarbete. Exempel på arbetsuppgifter: Styr och övervakar ugnar och andra anläggningar för tillverkning av glasmassa, glasprodukter, linser samt keramiska produkter som t.ex. kakel, keramik och tegel.
broader: Andra process- och maskinoperatörer
related: VPF1 UZM 9Kd
related: bVQZ K5T jcN
related: UdAG 9a6 ucf
related: 74Mw JUN VKx
related: 2pjc Vto TGH
related: 1efL 8GX UNT
related: pGts PKK c8W
related: aF3J SgE uck
related: C8189
related: eU6T MNR XvX
related: qQ61 EQR rcz
related: bEBR w2z aLu
related: kogY fEm 4y1
related: BTia ybU bF3
related: Gfy9 3qB GK6
related: KDzy Hra iVr
related: sbYJ XwB o8X
related: euui AGm omx
related: KJDw DLX RcX
related: SySo FPW aFo
related: B4fG pK5 84H
related: PuQP aBK nqJ
related: Rbju P7i 12U
related: XTkY HV4 gKM
related: y21g hpM gqk
related: 6Spv FsZ fZ3
related: AiwS Mhv ttk
related: DUp1 MJA ksE
related: C7549
related: BKYD AEo maF
related: uenm 75h fEh
related: 4HTa dR8 JkT
related: MT1a Nyq DGQ
related: C8181
related: qn22 kbi Mwa
related: dWbY gXC Frx
related: Uytu hWi 5nh
related: LhvF NZc r6N
related: AUpx XpQ v7F
related: Y1Q2 xqf 2bP
narrower: Tegelbruksarbetare
narrower: Processoperatör glas
narrower: Processoperatör keramisk industri
broad match: wTEr CBC bqh

Systemarkitekt
type: Concept
in scheme: JobTech Taxonomy - Yrke
definition: Systemarkitekt
broader: Systemanalytiker och IT-arkitekter m.fl.
related: rquD t5a WRp
related: MWi5 Jkp QQ7
related: apaJ 2ja LuF
related: u7sD gpJ oRw
related: qBsw ikL hZ2
related: XrxN gaw ak8
broad match: C2511

Övriga administrations- och servicechefer
type: Concept
in scheme: JobTech Taxonomy - Yrke
definition: Övriga administrations- och servicechefer
broader: Chefer inom ekonomi, HR, marknadsföring och försäljning samt annan administration m.m.
narrower: Övriga administrations- och servicechefer

Chefsrådman
type: Concept
in scheme: JobTech Taxonomy - Yrke
definition: Chefsrådman leder och samordnar det dagliga arbetet på en dömande avdelning i domstol, vanligtvis tingsrätt eller förvaltningsrätt. Arbetsuppgifterna omfattar att fördela mål, planera och utveckla handläggningsrutiner, säkerställa ett rättssäkert och effektivt arbetssätt samt delta i ledningsgruppen. Chefsrådman har personal- och arbetsmiljöansvar för rådmän och övriga medarbetare på avdelningen, deltar själv i dömande verksamhet och driver utvecklingsarbete inom domstolen. Titeln är aktuell och används i domstolsväsendet som chefsposition under lagman. Källa: Sveriges Domstolar
broader: Domare
related: X82t awd Qyc
related: x4Wi NWW ogB
broad match: C2612

Destilleriarbetare
type: Concept
in scheme: JobTech Taxonomy - Yrke
definition: Destilleriarbetare arbetar med produktion av spritdrycker. Man kan arbeta i hela eller delar av produktionskedjan, från beredning av råvaror till färdig produkt. Arbetsuppgifterna inkluderar destillering, tappning, kvalitetsanalyser, underhåll av maskiner samt rengöring av utrustning. Beroende på arbetsplats kan lager- och leveransarbete även förekomma. Källa: Arbetsförmedlingen
broader: Övriga maskinoperatörer, livsmedelsindustri m.m.
related: DhJR aN3 p2J
related: VbGm zPH b4R
related: wTEr CBC bqh
broad match: C8160

Hamnarbetare och ramppersonal m.fl.
type: Concept
in scheme: JobTech Taxonomy - Yrke
definition: Hamnarbetare och ramppersonal m.fl.
broader: Andra yrken inom bygg, tillverkning och godshantering
narrower: Hamnarbetare
narrower: Ramppersonal, flyttkarlar och varupåfyllare m.fl.

Load master
type: Concept
in scheme: JobTech Taxonomy - Yrke
definition: Load master planerar och övervakar lastning, transport och lossning av gods och passagerare på flygplan. Arbetet omfattar last- och viktberäkningar, placering av last för att säkerställa rätt tyngdpunkt och flygsäkerhet, samt säkring av last med kedjor, spännband och annan utrustning. Load master samarbetar med markpersonal, piloter och andra roller för smidiga operationer samt upprättar dokumentation. Rollen innebär ofta arbetsledning i lastutrymmet och instruktion till lastningspersonal. Man kan även följa med lastflygplanet till destinationen. Se även yrkena Arbetsledare lager och terminal, Lagerarbetare/Terminalarbetare och Flygplanslastare. Källa: Arbetsförmedlingen
alternative label: Lastningsförman
broader: Transportledare och transportsamordnare
related: ASGV zcE bWf
related: 4CDT dvj oB2
broad match: C4323

Trafikchef
type: Concept
in scheme: JobTech Taxonomy - Yrke
definition: Trafikchef
broader: Inköps-, logistik- och transportchefer
related: 88gU Pfu sQc
related: epLc SkD cbT
related: xXB8 q6Y s6X
related: ASGV zcE bWf
related: bh3H Y3h 5eD
broad match: C1324

Genealog
type: Concept
in scheme: JobTech Taxonomy - Yrke
definition: Genealog
broader: Arkeologer och specialister inom humaniora m.m.
related: kJeN wmw 9wX
broad match: C2633

Skådespelare
type: Concept
in scheme: JobTech Taxonomy - Yrke
definition: Gestaltar roller i teater-, film-, TV- och radioproduktion m.m. Läser och reciterar litterära verk.
broader: Konstnärer, musiker och skådespelare m.fl.
related: hmzA oSF ttk
related: 1Zdo oLy D7a
related: cAm2 NRV 2hX
related: TVhQ xNg Lhf
related: bjTv yyz Ffn
related: Unro ZTB 8mE
related: qpj8 QuC LzD
related: u3zX 2Mg LT4
related: mYYb Dpc hRz
related: CVyh JMe u8R
related: YF3J a5d zBR
related: xBPm pm2 s95
related: 8q4V efC fxN
related: YBBL 6Te Eqv
related: ZGt9 zi8 HGb
related: yR5T GZm NUd
related: TZcg h4T aMT
related: hKCr D7x R9e
related: asAb 8j9 P7H
related: JX7J rfg kjV
related: UumD 2LP 3h4
related: nHbt 29n Ae3
related: qhJ9 N4G BQg
related: Mqh7 gYw ZDC
related: rq9q ZBs uQV
related: dGBs yWs rp1
related: 4rd9 pTb aRc
related: C2655
related: Krbu VkM PdQ
related: 42PE qfg e8t
related: wauE xtF SRP
related: kusY oZZ Wbv
related: qwHa w4A tTc
related: tJxe t4t C3k
related: WEb2 rzq JMa
related: WqJV dHq hS8
related: sLKk foz vfJ
related: DTx9 wZ6 jeC
related: 1QEA ufb Ls7
related: ffYe zLb K7F
related: 5XhW VQA 2CW
related: t9A6 jvd 6h5
related: BwG6 hY5 YE8
related: b6eJ GMv Vp8
related: bDWd gjE sWh
related: 5Xov ixk eaS
related: RS9e z4J jSs
related: RG5k D9y iW5
related: o7bJ ybe wGE
related: MYeU r21 5rL
related: kW8G uc8 Mqm
related: VVQA hhQ fSw
related: uJWw bc2 XXZ
related: 7pvo NB6 1te
related: kao9 4Ww JTh
related: yBkF Sqo p9Y
related: Aq3R 8eq XHA
related: 7sgh x7w UUg
related: KHw4 zHG x1r
related: BSmy vm8 Cg7
related: a3P4 Tzp csR
related: ZMrW baP Kyz
related: L1Q1 Msi Ce5
related: itTV qxV Euo
related: mKKd wMP kX8
related: 97Vr BBw nCM
related: CNzp C71 pfE
related: ZBTV r1p MV9
related: YaGu P82 ffU
related: 3TpG H9z jPk
related: nuv6 D6E Dk8
related: orrr BKG xE1
related: xg4K GnJ Br6
related: 79R6 tDz gBf
related: Pk1y cpM ZhC

Ekonomichef
type: Concept
in scheme: JobTech Taxonomy - Yrke
definition: Ekonomichef
broader: Ekonomi- och finanschefer
related: 1Uk9 WZe 1XF
related: ayxE 9oz DZe
related: bek1 fmM iMR
related: X82t awd Qyc
related: epLc SkD cbT
related: bh3H Y3h 5eD
related: hNpf Vk4 Div
related: g5we BCH Szv
related: vK6S MGV uni
related: c4Nt B2k eEw
related: eBQs p5w Jkj
related: muAo XuG hRv
related: R7CP R6m G73
related: Nuew qoL nAP
related: C9zN Gjo bFs
broad match: C1211

Flygmekaniker m.fl.
type: Concept
in scheme: JobTech Taxonomy - Yrke
definition: Underhåller och reparerar flygmotorer, flygplan och helikoptrar. Funktionsprovar instrument, manöversystem och motorer. Hit hör inte Flyginstrumentmekaniker (7311) Flygtekniker (3155)
broader: Fordonsmekaniker och reparatörer m.fl.
related: nFsS wFt zvB
related: GgQp MjA uRf
related: in2S yKN FVw
related: e5jy 7Uy sY8
related: C7232
related: VhTi tZ1 YAV
related: aHCV VsV LiD
related: q4t6 uHb WiW
related: QnvA akR Rd7
related: Q7Zu TZq CUi
related: Y6zg 1oi cDZ
related: EW8P 8Ag Xmo
related: JKSD AC8 Z2S
related: yZVr FkQ yTB
related: XUUx FMJ WbX
related: Te3y NpL tkQ
related: XpXT Ycb X4k
related: qnK9 CBi ZKw
related: b316 Jsx PLj
related: TZv5 4Gh bfg
related: NYdq ND3 JrB
related: YcT7 dCm RWy
related: r6nK xT1 b9h
related: kA9M 1aj NLT
related: EQgd tiE Sht
related: Vo9b Zuj kEa
related: n6GW QHy LBm
related: 6kGs Wjt qKV
related: 7zph bPW A8z
related: mQGA GDn QyM
related: ThXs ruQ cKp
related: 9YMK uqf 9Fa
narrower: Flygmekaniker
broad match: yhCP AqT tns

Grovarbetare inom bygg och anläggning
type: Concept
in scheme: JobTech Taxonomy - Yrke
definition: Röjer, river och hanterar material på byggarbetsplatser. Assisterar vid maskinellt schaktarbete på bygg- och anläggningsarbeten. Lastar, lossar och behandlar torv. Hit hör inte Anläggningsarbetare (7114) Grävlastarförare, anläggning (8342) Trädgårdsanläggare/Trädgårdsanläggningsarbetare (6113) Träarbetare/Snickare (7111)
broader: Grovarbetare inom bygg och anläggning
related: v3d9 u2H pnf
related: yc3o fvU E6V
related: nuRM zb9 2wV
related: oYDh d6r cSu
related: C9312
related: Ytcy v8N P2w
related: myMG ygC kDW
related: aF9x AVw bUj
related: ax2t Yyg 2Sy
related: pGts PKK c8W
related: ebdw Wy5 56t
related: Q7eC B7g QiU
related: 34hP 27C pMv
related: vvPg scR Pp6
related: M7C1 DAy UTK
related: D6xD cSH rZN
related: f8Sz Xaf TEU
related: fhcp fFw Lbj
related: 6VeN XR4 Zuj
related: nkhA jPz pcE
related: y1ig 6kP WMa
related: U1ud XV7 Z8o
related: 3EQ5 ob5 pjT
related: ynWd oCo o61
related: xeoH rao GgZ
related: C9313
related: fhu6 H74 uuN
related: gdTC 3Eh PMv
related: WLAi BDr 5fW
related: KfEn V5y npV
related: i7mx Y3G JAB
related: 5Av7 qB2 msb
related: HmXd ehy QT9
related: QDvy mYm kSS
related: RZT1 Bme Tq7
related: 4mNF 7vZ vCx
related: rwir xvu 443
related: Y4Ls Mpm dcM
narrower: Grovarbetare, bygg och anläggning
narrower: Måleri, servicearbetare
broad match: j7Cq ZJe GkT

Plantör
type: Concept
in scheme: JobTech Taxonomy - Yrke
definition: Plantörer arbetar med att sätta skogsplantor i avverkade skogsområden. Arbetet innebär i huvudsak att sätta skogsplantor med hjälp av manuella verktyg enligt anvisning. Arbetet sker under sommarsäsongen. God fysisk är nödvändigt då arbetet innebär långvarigt utomhusarbete och delvis tunga lyft. Källa: Arbetsförmedlingen
broader: Bärplockare och plantörer m.fl.
related: UdVa jRr 9DE
related: kP3a 1g8 fni
related: ZqTy RAD 5ci
related: eG6G G6K f7q
related: dmrP n6T 32V
related: VuuL 7CH adj
broad match: C9215

Teknisk chef, kommun
type: Concept
in scheme: JobTech Taxonomy - Yrke
definition: En teknisk chef i kommun leder och samordnar den tekniska verksamheten, vilket omfattar områden som fastigheter, gator, vatten och avlopp, park, miljö och samhällsbyggnad. Rollen innebär ett övergripande ansvar för verksamhet, ekonomi och personal samt att säkerställa att kommunens tekniska tjänster levereras med rätt kvalitet och i linje med politiska beslut och lagkrav. Källa: Arbetsförmedlingen
broader: Chefer inom arkitekt- och ingenjörsverksamhet
related: 6Hq3 tKo V57
related: epLc SkD cbT
related: 2qDs BoL BFo
related: bh3H Y3h 5eD
broad match: C1213

Produktionsingenjör, maskin
type: Concept
in scheme: JobTech Taxonomy - Yrke
definition: Produktionsingenjör, maskin
broader: Ingenjörer och tekniker inom maskinteknik
related: 6Hq3 tKo V57
related: 9aEn jPz gJs
related: Hxe3 vR2 hUY
broad match: C3115

Kallskänka, fartyg
type: Concept
in scheme: JobTech Taxonomy - Yrke
definition: En kallskänka på fartyg har varierande arbetsuppgifter beroende på fartyg, basplaceringen är i kallköket ombord, där förbereds sallader, mackor mm till fartygets passagerare och personal. Dessutom ingår städning och diskning i arbetet. Källa; Destination Gotland
broader: Kockar och kallskänkor
related: dRFw Rcu dX7
related: ASGV zcE bWf
related: XouD cCj HZN
related: ScKy FHB 7wT
related: 1zMb FzG 6LY
broad match: C5120

Inköps- och orderassistenter
type: Concept
in scheme: JobTech Taxonomy - Yrke
definition: Gör beställningar samt kontrollerar varor och fakturor. Granskar offerter och skriver ut inköpsorder. Sköter leverantörsregister och lagerlistor. Begär in offerter, pris och leverantörsuppgifter.
broader: Kontorsassistenter och sekreterare
related: xSLo P6B 2AF
related: DJgq zBj bKt
related: MDX9 9sL df3
related: TAmq TZR Lmf
related: 1FbS vYp DC3
related: Xuhg PcG kq2
related: aUr6 Rjg ja2
related: TSwW JGd J52
related: h8Z3 Fq9 ohg
related: X8qr J5g uXi
related: cYB2 4o8 XHV
related: 3HjW 1BP k3S
related: 9pKg zXP 9ig
related: 3vYj Rhf Voh
related: ijHY aHk ADE
related: cmrN Uff Nyc
related: Uv9y v2g efa
related: gn9Y yYC LiH
related: Tmps QPE g3V
related: sKLW XyF UGt
related: ZhnF cSc p9V
related: WVJF FXY Sqk
related: NUC3 y1C Scg
related: ZQux yii D4Q
related: 9dFi QaL PMB
related: 1qn1 fsa hZm
related: 1oA3 GfA 82Y
related: Ygao Vsn eJ2
related: iyhf Cm4 cWw
related: cw2M p2W SuJ
related: z9qQ ei6 Mjs
related: D7RV iq7 KE4
related: WnFA bt8 kPs
related: 34kt 5uy oYz
related: C4322
related: s6Ui k2K kf2
related: dYqT JBz NZE
related: 5wab aFK gdL
related: PVnT yGT SMb
related: qtHa AsU Cfo
related: hTcc jPm dwc
related: Nig2 2pU GT8
related: ibzL TeE YqA
related: LmAP e75 pc6
related: yXmf iKi 7ci
related: 7scD 9YP iwV
related: H2yF VoB Pxi
related: u5xh 813 M33
related: jcpA Zfs nSz
related: 2ghM Tqc xxw
related: e47M NXa 4NG
related: RB7E jE5 MZ3
related: LAFL 9mg crP
related: vdMK kuP Nr9
related: ZF9w knj 7cW
related: CVTD iab JgP
related: 7um4 89D Cr7
related: u4QG GL8 hkJ
related: Kvft WHn KJE
related: 2ZFC 6de YSB
related: mDcD 5SH S7V
related: gGGa vb1 jhX
related: wouu 4yY SkR
related: kJrF R2t t6F
related: B1rc wCc vne
related: w8bU wHe omF
related: 4yhD tKK dSN
related: xTAP Hr6 JrB
related: 73gL 4uv p9J
related: ZHty Ze4 uHB
related: 8u7A ze1 bvd
related: 6Ei3 fZV YKM
narrower: Inköpsassistent
narrower: Ordermottagare
narrower: Orderassistent

Folkbokföringshandläggare
type: Concept
in scheme: JobTech Taxonomy - Yrke
definition: Folkbokföringshandläggare utreder och handlägger ärenden om personers folkbokföring. Ärenden innefattar bland annat flyttningsanmälan, utredning av barns folkbokföring och hantering av skyddade personuppgifter. Arbetet innebär att hämta in och analysera underlag för att kunna fatta beslut enligt lag och förordning. Andra arbetsuppgifter kan vara att ge service till medborgare genom att svara på frågor eller bistå med utlämnande av allmän handling. samt administrera olika ärenden och handlingar, till exempel att skicka personbevis och blanketter. Källa: Arbetsförmedlingen
broader: Skattehandläggare
related: X82t awd Qyc
related: ZkF5 pa8 Tiy
broad match: C3352

Varumärkesjurist
type: Concept
in scheme: JobTech Taxonomy - Yrke
definition: Varumärkesjurist
broader: Affärs- och företagsjurister
related: X82t awd Qyc
related: x4Wi NWW ogB
related: Abcb QtH isZ
broad match: C2619

Lärling, isoleringsplåtslagare
type: Concept
in scheme: JobTech Taxonomy - Yrke
definition: En lärling är anställd på företag för att göra sin färdigutbildningstid till isoleringsplåtslagare. Lärlingsanställningen görs efter skolutbildning eller tillsammans med teoretiskt kurspaket. Under färdigutbildningstiden på företaget lär sig lärlingen yrket mer praktiskt och skall nå sina kunskapsmål för branschcertifikat. Certifikat erhålls efter ett branschprov. Källa: VVSYN
broader: Isoleringsmontörer
related: j7Cq ZJe GkT
related: ja7J P8X YC9
related: JezX oUD TZr
broad match: C7124

Maskinoperatörer, pappersvaruindustri
type: Concept
in scheme: JobTech Taxonomy - Yrke
definition: Styr och övervakar maskiner som tillverkar påsar, kartonger, säckar, kuvert och andra produkter av papper, papp, kartong och liknande material. Hit hör inte Processoperatör, papper (8172)
broader: Maskinoperatörer, gummi-, plast- och pappersvaruindustri
related: VPF1 UZM 9Kd
related: 74Mw JUN VKx
related: 2pjc Vto TGH
related: pGts PKK c8W
related: qyUS nX3 pGH
related: aF3J SgE uck
related: qQ61 EQR rcz
related: VTwt 5Fe 6bW
related: Sgrw wCw Ut4
related: KDzy Hra iVr
related: sbYJ XwB o8X
related: tbzr 4h8 X1q
related: d3oB oX3 kF8
related: PuQP aBK nqJ
related: Rbju P7i 12U
related: AfEq g81 4mj
related: X4EU ZC7 QmK
related: AiwS Mhv ttk
related: a8dJ Ac9 Hri
related: BGie HPa fNA
related: C8143
related: uenm 75h fEh
related: gEWP Lgj M4X
related: MT1a Nyq DGQ
related: dWbY gXC Frx
narrower: Maskinoperatör pappersvaruindustri
broad match: wTEr CBC bqh

Teknisk dokumentatör
type: Concept
in scheme: JobTech Taxonomy - Yrke
definition: En teknisk dokumentatör ansvarar för att skapa, strukturera och underhålla teknisk dokumentation, såsom manualer, användarguider, instruktioner och tekniska beskrivningar, för att göra komplex information tydlig och användbar för slutanvändare och teknisk personal. I arbetsuppgifterna ingår att framställa och uppdatera tekniska dokument som manualer, användarguider, underhållsinstruktioner och felsökningsguider. Samla in, analysera och strukturera teknisk information från utvecklare, ingenjörer och andra sakkunniga. Säkerställa att dokumentationen är korrekt, tydlig, målgruppsanpassad och följer företagets eller branschens standarder. Källa: Arbetsförmedlingen
broader: Övriga ingenjörer och tekniker
related: 6Hq3 tKo V57
related: eKU6 9ss xFz
broad match: C3119

Övriga maskinoperatörer, livsmedelsindustri m.m.
type: Concept
in scheme: JobTech Taxonomy - Yrke
definition: Utför annat maskinoperatörsarbete inom livsmedelsindustri m.m. än inom 8161-8163. Exempel på arbetsuppgifter: Styr och övervakar maskiner för framställning av t.ex. fruktkonserver, vin, kaffe och tobak.
broader: Maskinoperatörer, livsmedelsindustri
related: s5nN ufD 8ay
related: i3kd fCX jxz
related: mP2A uy6 47a
related: VPF1 UZM 9Kd
related: uouK D11 Zvj
related: t52d tkg NZ3
related: UFfC aC2 MiC
related: 74Mw JUN VKx
related: 9H62 7be GL9
related: 2pjc Vto TGH
related: Jk4z LW1 LN1
related: aF3J SgE uck
related: qQ61 EQR rcz
related: VTwt 5Fe 6bW
related: Dywf BPg usG
related: 2AWt Wad j3d
related: KDzy Hra iVr
related: mRs1 pxu wpz
related: 1vX4 pj1 yao
related: MuoH pDL nFJ
related: sbYJ XwB o8X
related: AP6y xf5 4WK
related: d3oB oX3 kF8
related: GdFM 7x5 eZc
related: qEpN ve3 kGz
related: Rbju P7i 12U
related: AiwS Mhv ttk
related: wJUD v8j Aep
related: Jdjt Hmo jVW
related: uenm 75h fEh
related: C8160
related: MT1a Nyq DGQ
related: qn22 kbi Mwa
related: dWbY gXC Frx
related: LhvF NZc r6N
related: kj4Q nLh u8Q
narrower: Bryggeritekniker
narrower: Maskinoperatör livsmedelsindustri
narrower: Destilleriarbetare
broad match: wTEr CBC bqh

Forskningsassistent, agronomi
type: Concept
in scheme: JobTech Taxonomy - Yrke
definition: Forskningsassistent, agronomi
broader: Specialister och rådgivare inom lantbruk m.m.
related: kJeN wmw 9wX
related: QPBV UT9 kkv
related: 6nbS RdB kzm
broad match: C2132

Stationschef på drivmedelsstation
type: Concept
in scheme: JobTech Taxonomy - Yrke
definition: Stationschefer leder arbetet på drivmedelsstationer. Arbetet innebär i huvudsak att leda medarbetare och delta i försäljning av drivmedel, livsmedel, serviceprodukter och tillhörande tjänster. Arbetsuppgifterna omfattar planering av bemanning, inköp, varuplock, enklare ekonomiadministration samt samordning av säkerhet och rutiner för kassahantering. Stationschefen arbetar ofta nära medarbetare i den dagliga driften och har vanligtvis god kännedom om stationens sortiment och serviceerbjudande. Källa: Arbetsförmedlingen
alternative label: Bensinstationsföreståndare
broader: Säljande butikschefer och avdelningschefer i butik
related: RPTn bxG ExZ
related: epLc SkD cbT
related: bh3H Y3h 5eD
related: VqDE 5VN Vsu
related: HcFo Ujw 3zd
related: nitt CVN N6S
broad match: C5222

Saneringsarbetare m.fl.
type: Concept
in scheme: JobTech Taxonomy - Yrke
definition: Röjer upp, rengör och återställer platser och lokaler efter olyckor, utsläpp eller skadeangrepp. Sanerar fastigheter från t.ex. asbest eller mögel samt rengör ventilationsaggregat.
broader: Målare, lackerare och skorstensfejare m.fl.
related: XF7L iJZ C2W
related: E98q sFV 4FT
related: 5SYQ D5n oL9
related: 4veg R5f SSS
related: Rnrj haw eMR
related: XaJV v7o vgX
related: vJaj 8rF 9tu
related: FyAL 3mK dYH
related: ezus vV9 c9e
related: h65W AEU vjL
related: T8Vh zq2 zGy
related: 1jd7 Ee3 Z1N
related: swwu 1Bp mcb
related: oLFv MpK XZm
related: 4hpC iEf rfE
related: HQW3 TaZ Fqg
related: fBXr SFu 6cM
related: FMf7 JiC g9r
related: Q7eC B7g QiU
related: C9129
related: CzZc 7tx B9C
related: C7544
related: xAbn Wt7 ySS
related: Co7V AQ3 AJn
related: fhcp fFw Lbj
related: BMxH 3K4 Juq
related: nkhA jPz pcE
related: bgCD 63X npb
related: ynWd oCo o61
related: SFA6 GWb z2j
related: R9AB Q6A DAZ
related: pSGt 68E Ana
related: gFR6 M3P y75
related: 6BpN oXk 7SL
related: afs6 imh xxf
related: vRi1 LJm X9j
related: C7133
related: aS2X 4ZL 9h7
related: u7sW FB3 hfW
related: WLAi BDr 5fW
related: GuFR GfS fQ6
related: irju S7Y Xbr
related: KfEn V5y npV
related: C9629
related: jRX3 beU Hz9
related: Fc9g 7KS Rw7
related: fJig Viu FjT
related: Miuh whd fBh
related: ZfdB kLT yTk
related: gVn6 YNw Lui
related: ZtJZ 9Fg QE8
related: X9LH ff4 MZM
related: FFKd HfS 5rL
related: YcJ6 Hua AEM
related: RZT1 Bme Tq7
related: cSVE 38v SmY
related: 3FMJ axw bJV
related: jaLT Qeg YC4
related: CASg vkV Qu3
related: RhVf Mte xC9
related: 7ypy 36c JNm
related: UjqL vT6 1fp
narrower: Saneringsarbetare
narrower: Takrengörare
narrower: Ventilationsrengörare
narrower: Skadedjurstekniker
narrower: Spol- och avloppstekniker
narrower: Asbestsanerare
broad match: whao Q6A ScE

Övriga servicearbetare
type: Concept
in scheme: JobTech Taxonomy - Yrke
definition: Utför annat arbete än inom 9621-9622. Exempel på arbetsuppgifter: Fyller på varuautomater samt tömmer myntboxar och parkeringsautomater. Avläser el-, gas- och vattenmätare samt kontrollerar TV-licenser.
broader: Tidningsdistributörer, vaktmästare och övriga servicearbetare
related: zZpU nc8 tDf
related: z4r8 crC XDC
related: uuEN jWu bRm
related: NeEb Ytz aii
related: wBLK nWZ 7ek
related: PktN Uav zKf
related: 2RpU Wtb 59E
related: e8CH gUA zhD
related: eJxw HZY 6hi
related: Am5W fAR RqU
related: o7Kk XpR ACn
related: pGts PKK c8W
related: C9623
related: C8189
related: FP3w 6C4 kHx
related: C9622
related: BQa2 sAB euB
related: cgqg QeB pRP
related: cNtb hfE b1p
related: wTBZ 8pd eMh
related: vvPg scR Pp6
related: C9621
related: Ty8v puq yxx
related: 8j4P S8v 9jy
related: GyKr ZV1 Jpt
related: 4oKa e7b oHW
related: ZTHb SKs FnU
related: irju S7Y Xbr
related: C9629
related: C9510
related: BhSZ i3Q uvF
related: 8BMH dyx iQH
related: XAVS Kzb xv5
related: D2u8 nR7 KS4
related: hYpk RYx y3V
related: XQet 5J6 HGj
related: rwir xvu 443
related: eFTe Vr7 dVG
related: vXDD 8Gh DXu
related: bVFo qRN cKd
related: wzfZ xQE 6Y1
narrower: Entrévärd
narrower: Hamnvärd
narrower: Auktionsbiträde
narrower: Lastpallssnickare
narrower: Skidliftvärd
narrower: Väderobservatör
narrower: Publikvärd
narrower: Aktivitetsledare
narrower: Affischuppsättare
narrower: Tivoliarbetare/Nöjesparksarbetare
narrower: Snöläggare
narrower: Diversearbetare
broad match: yhCP AqT tns

Packmästare flytt
type: Concept
in scheme: JobTech Taxonomy - Yrke
definition: Packmästare inom flytt är packar och emballerar bohag och inredning inför flytt. Som packmästare är man specialiserad på att packa och emballera bohag och inredning. Packning sker vanligtvis någon tid innan själva flytten äger rum. Packmästare har vanligtvis med sig utrustning som kartonger, tejp och specialemballage för till exempel möbler och kläder: Källa: Arbetförmedlingen
broader: Ramppersonal, flyttkarlar och varupåfyllare m.fl.
related: XZWT 1AW WjE
related: ASGV zcE bWf
broad match: C9333

Immaterialrättsjurist
type: Concept
in scheme: JobTech Taxonomy - Yrke
definition: Immaterialrättsjurist
broader: Affärs- och företagsjurister
related: X82t awd Qyc
related: x4Wi NWW ogB
related: Abcb QtH isZ
related: DiYd kkR CFF
broad match: C2619

Forsknings- och utvecklingschefer
type: Concept
in scheme: JobTech Taxonomy - Yrke
definition: Forsknings- och utvecklingschefer
broader: Chefer inom IT, logistik, FoU, fastighetsbolag, bygg- och ingenjörsverksamhet samt tillverkning m.m.
narrower: Forsknings- och utvecklingschefer

Ekonomiassistenter m.fl.
type: Concept
in scheme: JobTech Taxonomy - Yrke
definition: Registrerar, sammanställer och bearbetar data om företags eller organisations ekonomiska transaktioner. Kontrollerar och upprättar underlag för exempelvis fakturor. Sköter och bokför in- och utbetalningar. Informerar om resultat. Sköter momshantering och sammanställer material inför skattedeklarationen.
broader: Kontorsassistenter och sekreterare
related: xSLo P6B 2AF
related: S2pg pcs tXu
related: DJgq zBj bKt
related: FYk9 RXp 7c5
related: MDX9 9sL df3
related: TAmq TZR Lmf
related: zpDG T8A dPZ
related: Ke1k R8e iUk
related: 2T5Z wdn 8Qv
related: cAPJ ry5 AgS
related: 1FbS vYp DC3
related: aUr6 Rjg ja2
related: TSwW JGd J52
related: vkys qdp GH4
related: h8Z3 Fq9 ohg
related: pQqy ta4 wqj
related: cYB2 4o8 XHV
related: 3HjW 1BP k3S
related: aKAa jMG DdZ
related: PjTV oih SDf
related: UBgX VLG mTK
related: 9pKg zXP 9ig
related: FqLw 515 Md9
related: pAcX ugi X4j
related: 3vYj Rhf Voh
related: Fctx EH9 fcC
related: epBr KmF HVM
related: cmrN Uff Nyc
related: Uv9y v2g efa
related: gn9Y yYC LiH
related: Tmps QPE g3V
related: 5QwH sZY DVC
related: KN5V Gxm nGL
related: 29MP yhF mjx
related: Y3fx 8wR Zim
related: 4Ya1 1Rv EB3
related: Lt8M ZMv UbM
related: Aasw 39M r6u
related: qQa7 FJg J8X
related: ZhnF cSc p9V
related: WVJF FXY Sqk
related: NUC3 y1C Scg
related: 8UnT cpa zhy
related: ZQux yii D4Q
related: MzEe uWV Ph6
related: UJnU EqL XJZ
related: LmLg VXy VSS
related: 9dFi QaL PMB
related: 1qn1 fsa hZm
related: Ygao Vsn eJ2
related: iyhf Cm4 cWw
related: cw2M p2W SuJ
related: z9qQ ei6 Mjs
related: D7RV iq7 KE4
related: WnFA bt8 kPs
related: 34kt 5uy oYz
related: hjUM GZe Bgd
related: s6Ui k2K kf2
related: dYqT JBz NZE
related: 5wab aFK gdL
related: Fiq4 siu LXn
related: PVnT yGT SMb
related: qtHa AsU Cfo
related: 8gwE 2o3 XRF
related: hTcc jPm dwc
related: Nig2 2pU GT8
related: 2RDK rgU P6R
related: oPvx TXS AMj
related: ibzL TeE YqA
related: EcuE BY7 mc4
related: LmAP e75 pc6
related: pxZi bWS MSr
related: vVi1 VRt J7j
related: 7scD 9YP iwV
related: H2yF VoB Pxi

Operatör, scenmaskineri
type: Concept
in scheme: JobTech Taxonomy - Yrke
definition: Operatör, scenmaskineri
broader: Ljus-, ljud- och scentekniker
related: 9puE nYg crq
related: d1Ao 9bY 7Kn
broad match: C3435

Bebyggelseantikvarie
type: Concept
in scheme: JobTech Taxonomy - Yrke
definition: Bebyggelseantikvarie
broader: Museiintendenter m.fl.
related: gv3f 7Fh X3e
related: ZtV8 nhp bb3
related: szMZ 2dG QNW
related: JxVv btB MTz
related: 9puE nYg crq
broad match: C2621

Kontrollingenjör, kemiteknik
type: Concept
in scheme: JobTech Taxonomy - Yrke
definition: Kontrollingenjör, kemiteknik
broader: Ingenjörer och tekniker inom kemi och kemiteknik
related: 6Hq3 tKo V57
related: 5tyY GjC AcD
broad match: C3116

Videotekniker/VB-tekniker
type: Concept
in scheme: JobTech Taxonomy - Yrke
definition: Videotekniker riggar, kalibrerar och sköter teknisk utrustning för inspelning, redigering och sändning av video. Vanliga arbetsuppgifter är att säkerställa att kameror, ljus, ljudutrustning och annan teknisk utrustning fungerar, programmera mediaservers och rigga projektorer i samarbete med produktionsteam. Det är inte ovanligt att videotekniker också installerar och justera kameror, ljus och ljudutrustning under inspelningar. Källa: Arbetsförmedlingen, StagePool
alternative label: VB-tekniker
alternative label: Videotekniker
broader: Bild- och sändningstekniker
related: 8too bEs 7NU
related: 9puE nYg crq
related: d1Ao 9bY 7Kn
broad match: C3521

Musikinstrumentmakare
type: Concept
in scheme: JobTech Taxonomy - Yrke
definition: Musikinstrumentmakaren tillverkar och reparerar musikinstrument. Musikinstrumentmakare är ett hantverksyrke, där viktiga kunskaper är bland annat materialkunskap, verktygsvård, maskinbearbetning, ritning och uppmätning samt ytbehandling. Beroende på typ av instrument är även elektronik och lödningsteknik viktiga kunskaper. Musikinstrumentmakare är vanligtvis specialiserade på en viss typ av instrument. Se även yrkena blåsinstrumentmakare, fiolmakare och gitarrmakare. Källa: Hantverksakademin, Arbetsförmedlingen
broader: Musikinstrumentmakare och övriga konsthantverkare
related: FJHZ qkW vnm
related: 21KC AF7 cfr
related: PaxQ o1G wWH
related: zhiW 7Ad R4w
related: k4oH UXY KGL
broad match: C7312

Lärling, ventilationsplåtslagare
type: Concept
in scheme: JobTech Taxonomy - Yrke
definition: En lärling är anställd på företag för att göra sin färdigutbildningstid till ventilationsplåtslagare. Lärlingsanställningen görs efter skolutbildning eller tillsammans med teoretiskt kurspaket. Under färdigutbildningstiden på företaget lär sig lärlingen yrket mer praktiskt och skall nå sina kunskapsmål för yrkesbevis. Yrkesbevis erhålls efter ett teoretiskt och praktiskt branschprov. Källa: Arbetsförmedlingen
broader: Byggnads- och ventilationsplåtslagare
related: j7Cq ZJe GkT
related: ja7J P8X YC9
related: JezX oUD TZr
broad match: C7213

Laboratorietekniker, fysik
type: Concept
in scheme: JobTech Taxonomy - Yrke
definition: Laboratorietekniker, fysik
broader: Laboratorieingenjörer
related: 6Hq3 tKo V57
related: EsWG kHG oXZ
related: JrCM RTE E4z
broad match: C3111

Väktare och ordningsvakter
type: Concept
in scheme: JobTech Taxonomy - Yrke
definition: Patrullerar och bevakar fastigheter och områden. Kontrollerar tillträde till olika inrättningar och övervakar ordning vid offentliga evenemang m.m. Agerar vid larm och störningar, kontaktar vid behov t.ex. polis eller brandkår. Svarar för säkerhetskontroller vid flygplatser och i hamnar. Transporterar kontanter och andra värdeföremål. Skyddar vid behov enskilda personer.
broader: Andra bevaknings- och säkerhetsyrken
related: ZuYj ADn tk7
related: 7H4j dRM Vbo
related: Y4FW gi5 Gy5
related: 5aBK qBH WZY
related: JRQP Q3G 9um
related: EWEG 4N1 ZLA
related: ZMF9 9jX BJq
related: sjyJ XPV rXU
related: d8q9 Esg 7a1
related: wh4i gd3 GHK
related: UPzM 3SQ baa
related: f75i b24 Wop
related: YVih Kmh iqm
related: sSwR AxY K4n
related: hbpj 9xW t6A
related: KvB9 rTn 212
related: kMZE L55 6K7
related: YLB7 CXj NZp
related: yy8i jH4 vJz
related: qsCj EhM fyT
related: CCAj Xaj avU
related: SnRw nuy ick
related: mTvV 1eF xKL
related: RqGR GDY 2me
related: R8HU 9i4 LF3
related: iv7v nyX ZKt
related: XKij Kby ztY
related: nu52 VXq 5MD
related: aDmr xdq vVz
related: C5414
narrower: Väktare
narrower: Butikskontrollant
narrower: Ordningsvakt
narrower: Flygplatskontrollant
narrower: Personskyddsväktare
narrower: Gränskontrollant
narrower: Skyddsvakt
narrower: Värdetransportör
narrower: Hundförare
broad match: E7hm BLq fqZ

Obduktionstekniker
type: Concept
in scheme: JobTech Taxonomy - Yrke
definition: Obduktionstekniker assisterar vid obduktioner. Yrket kan även kallas obduktionsassistent eller rättsmedicinsk assistent om obduktion utförs av Rättsmedicinalverket. Arbetet innebär i huvudsak att assistera läkare vid obduktioner. Arbetsuppgifter innefattar bland annat att förbereda kroppar och utrustning inför obduktioner, administrativa uppgifter vid bårhus samt uttag av implantat och vävnad för donation. Även kontakt med berörda myndigheter och anhöriga kan ingå. Källa: Sveriges Kommuner och Regioner, Rättsmedicinalverket, Arbetsförmedlingen
broader: Övrig vård- och omsorgspersonal
related: NYW6 mP6 vwf
related: gsdS he1 UJS
related: g5jc TmP mRj
related: WcZK aiv yht
broad match: C5329

AD-assistent
type: Concept
in scheme: JobTech Taxonomy - Yrke
definition: AD-assistenter planerar, producerar och koordinerar visuellt marknadsmaterial och reklamuttryck inom kreativa team, ofta i samarbete med art directors och marknadsförare. Arbetsuppgifter innefattar bland annat grafisk design, digital produktion, layoutarbete, bildredigering, samt projektkoordinering och kommunikation med interna och externa parter. AD-assistent deltar i utvecklingen av reklamkampanjer och producerar presentationsmaterial, annonser och digitalt innehåll för olika plattformar. Rollens uppgifter överlappar ofta med grafisk designer och projektledare inom marknadskommunikation. Källa: Arbetsförmedlingen
broader: Marknads- och försäljningsassistenter
related: 9puE nYg crq
broad match: C4419

Souschef
type: Concept
in scheme: JobTech Taxonomy - Yrke
definition: Sous chef leder det dagliga arbetet i köket tillsammans med kökschefen och fungerar som arbetsledare för kökspersonalen. I arbetsuppgifterna ingår att planera, förbereda och tillaga mat, komponera menyer och ansvara för att maten håller hög kvalitet. Sous chef organiserar, instruerar och inspirerar teamet, samt säkerställer god hygien, arbetsmiljö och ordning i köket. Rollen innefattar även kvalitetssäkring, egenkontroll och ibland kontakt med leverantörer och menyutveckling. Källa: Arbetsförmedlingen
broader: Köksmästare och souschefer
related: epLc SkD cbT
related: 917g hKW 4Ce
related: BZtA RCn 4vZ
related: ScKy FHB 7wT
broad match: C3434

Internationell säljare/Exportsäljare
type: Concept
in scheme: JobTech Taxonomy - Yrke
definition: Internationell säljare/Exportsäljare
alternative label: Exportsäljare
alternative label: Internationell säljare
broader: Företagssäljare
related: NjV2 7Nq 24V
related: rDcj Tao TJJ
related: 16K8 18p H5K
related: RPTn bxG ExZ
related: CApc UMZ 5dG
related: gRFS RmY LHH
related: Dc3s mJg 5pq
broad match: C3322

UX-designer
type: Concept
in scheme: JobTech Taxonomy - Yrke
definition: UX-designer
broader: Övriga IT-specialister
related: BrfR SG7 bxH
related: YoEa bHT WPi
related: d68Z zHN qug
related: jYZX 1Fu QBH
related: qjvP Udi Z6Z
related: yLP6 jU9 LBR
related: e5FL ut2 cCy
related: Z2Zj 2Rs nip
related: YXkb JXw X2c
related: KiWi YQm Tvq
related: apaJ 2ja LuF
related: NBgE mGz zWs
related: 7NoC ak1 dUb
related: 36fD tW9 HXW
related: TUUX Tiu qrX
related: 8Hg8 kbj 1ie
related: JX4h GVH rNY
related: mdqj gqh jUo
related: xJ3z tXQ GmT
related: dioy zD1 k37
related: UCxG Fju 8HR
related: go8W pmJ AU4
related: pvRH 41J VRv
related: iW5c SEM RsE
related: SA2N KJm UJo
related: 1NFA tQF Lp3
related: w5nV J9f SjT
related: bd3e Y1a ywS
broad match: C2519

Arbetsledare, säkerhetsarbete/Gruppledare, säkerhetsarbete
type: Concept
in scheme: JobTech Taxonomy - Yrke
definition: Arbetsledare och gruppledare inom säkerhetsarbete leder och planerar det dagliga arbetet för säkerhetspersonal, såsom väktare, brand- och säkerhetsvakter, skyddsvakter och andra kontrollfunktioner inom säkerhet. Rollen innebär i huvudsak att fördela arbetsuppgifter och planera bemanning. Arbetsledaren har ofta ansvar att säkerställa att medarbetare förstår sitt uppdrag, hanterar händelser korrekt och arbetar enligt gällande rutiner och kvalitetskrav. Arbetet kan även inkludera också att bygga och underhålla relationer med kunder. Källa: Arbetsförmedlingen
alternative label: Arbetsledare, säkerhetsarbete
alternative label: Gruppledare, säkerhetsarbete
broader: Gruppledare för kontorspersonal
related: YThJ JEq pmP
related: X82t awd Qyc
related: W6AF 22t ooT
related: Xpsc eHM g5x
broad match: C3341

Naturförvaltare
type: Concept
in scheme: JobTech Taxonomy - Yrke
definition: Naturförvaltare
broader: Specialister och rådgivare inom lantbruk m.m.
related: XKdt b98 ec2
related: X82t awd Qyc
related: 5ow8 1e8 m3v
related: VuuL 7CH adj
broad match: C2132

Murare, utan yrkesbevis
type: Concept
in scheme: JobTech Taxonomy - Yrke
definition: Murare arbetar med att bygga upp väggar med lättbetongblock och att klä hus med fasadtegel. Murare utför även putsning av fasader, murverk för spisar och skorstenar, fasadrenoveringar, stuckatur och i vissa fall plattsättning. Murare är ett av de äldsta byggyrkena. Källa: Arbetsförmedlingen, BYN
broader: Murare m.fl.
related: BSXA nip xWs
related: j7Cq ZJe GkT
related: ja7J P8X YC9
broad match: C7112

Kvinnojoursarbetare
type: Concept
in scheme: JobTech Taxonomy - Yrke
definition: Kvinnojoursarbetare ger stöd, rådgivning och skydd till våldsutsatta kvinnor och deras barn. Arbetsuppgifter inkluderar samtalsstöd, information om rättigheter och praktisk hjälp i vardagen, såsom att bistå med boende, hjälpa till med myndighetskontakter och samordna vid placeringar. Arbetet omfattar även dokumentation, verksamhetsutveckling, kontaktpersonsuppdrag och ibland schemalagt jourarbete, exempelvis helg- och beredskapstjänst. Rollen innebär ofta nära samverkan med socialtjänst och andra aktörer samt arbetsuppgifter kopplade till att skapa trygghet för de boende och bistå i krissituationer. Källa: Arbetsförmedlingen
broader: Behandlingsassistenter och socialpedagoger m.fl.
related: GazW 2TU kJw
related: nmmw uiV 3Sw
related: pvYo LK3 rX1
broad match: C3412

Maskinförare lantbruk
type: Concept
in scheme: JobTech Taxonomy - Yrke
definition: Maskinförare inom lantbruk kör och sköter lantbruksmaskiner. Maskinförare inom lantbruk kör och sköter traktorer och andra lantbruksmaskiner för bland annat plöjning, harvning, sådd och skörd. Kunskap om lantbruksproduktion och odlingsprocesser är nödvändigt för att kunna utföra arbetet effektivt. Regelbunden kontroll och underhåll av lantbruksmaskiner ingår i arbetet. Källa: Gröna arbetsgivare
broader: Förare av jordbruks- och skogsmaskiner
related: VXJM cFg NYy
related: uKoM Mqn yV9
related: VuuL 7CH adj
related: MPcs tkr f1s
broad match: C8341

Skogsvårdschef
type: Concept
in scheme: JobTech Taxonomy - Yrke
definition: En skogsvårdschef leder, planerar och samordnar verksamheten inom skogsbruk, med särskilt fokus på skogsvård och hållbar utveckling av skogsresurser. Rollen innebär ansvar för både strategiska och operativa frågor, personalledning och budget. I arbetsuppgifterna ingår att följa forskning och utveckling i frågor rörande skogshushållning, skogsskötsel och naturvård samt implementering av vunna kunskaper i verksamheten. Det ingår även ansvar för rådgivning i skötsel- och naturvårdsfrågor till leverantörer/kunder. Källa: Arbetsförmedlingen, SCA
broader: Förvaltare inom skogsbruk och lantbruk m.fl.
related: epLc SkD cbT
related: bh3H Y3h 5eD
related: 1vAi 6Z5 uYU
related: VuuL 7CH adj
broad match: C1311

Ambassadsekreterare
type: Concept
in scheme: JobTech Taxonomy - Yrke
definition: Ambassadsekreterare
broader: Planerare och utredare m.fl.
related: X82t awd Qyc
related: TZe9 NsN uce
broad match: C2422

Kassapersonal
type: Concept
in scheme: JobTech Taxonomy - Yrke
definition: Kassapersonal hanterar betalningar, utfärdar kvitton och biljetter samt svarar på frågor från kunder. Beroende på arbetsplats kan andra arbetsuppgifter även förekomma. Se även yrket butikssäljare, vilket även innefattar andra arbetsuppgifter i butik. Källa: Arbetsförmedlingen
broader: Kassapersonal m.fl.
related: iN18 hrZ uaW
related: e2f2 4Bk WkL
related: UdVa jRr 9DE
related: FCrV s1p t2s
related: K82J 9vz 9T7
related: 3ceP dYN Dnt
related: RPTn bxG ExZ
related: UHwr N3h Hpq
related: s2Cz B6n PSV
related: GhMD Z9i v3K
related: mVEi x13 xxe
related: HjTe FM8 MxF
related: ibBp HmD AEC
related: ifET wHx 6w5
related: vQ8d QFb K1a
related: aruw qVM dis
related: HW1J j1h ecf
related: YWen 97h TwG
related: aj15 EGw 3Rf
related: PvV9 jbJ 78M
related: Kjkz 7fx rrY
related: uLrZ 8Jd f8U
related: fRF9 ZB1 w77
related: heQ9 t3c CPA
broad match: C5230

Ljudassistent
type: Concept
in scheme: JobTech Taxonomy - Yrke
definition: En ljudassistent, eller ljudteknikerassistent, hjälper till med ljudproduktion inom olika områden som film, TV, musik och liveevenemang. Deras huvudsakliga uppgift är att assistera ljudteknikern med att rigga och sköta ljudutrustning. Källa: Arbetsförmedlingen
broader: Ljus-, ljud- och scentekniker
related: 8too bEs 7NU
related: 9puE nYg crq
related: yhCP AqT tns
related: d1Ao 9bY 7Kn
broad match: C3521

Lots, fartyg
type: Concept
in scheme: JobTech Taxonomy - Yrke
definition: En lots för fartyg arbetar med att navigera fartyg genom svåra passager längs våra kuster och manövrera fartyg till och från hamn. Lotsen kommer ombord på olika typer av fartyg utrustade med navigationsutrustning av varierande kvalitet och omfattning. För att arbeta som lots på Sjöfartsverket krävs svensk sjökaptensbehörighet eller lägst fartygsbefäl klass II med lämplig erfarenhet från seniora befattningar. Källa: Sjöfartsverket
broader: Fartygsbefäl m.fl.
related: dRFw Rcu dX7
related: fmCS 7n9 DqW
related: gs65 ynn fcr
related: ASGV zcE bWf
related: XouD cCj HZN
related: gthF y5Z j3Z
related: vSAt THv Rvv
broad match: C3152

Fältassistent
type: Concept
in scheme: JobTech Taxonomy - Yrke
definition: Fältassistent arbetar uppsökande och förebyggande med barn och unga i socialt utsatta miljöer. Arbetsuppgifterna inkluderar att skapa relationer och förtroende hos ungdomar, upptäcka behov av stöd, ge motiverande samtal och vägleda till arbete eller studier. Fältassistenter samarbetar med skolor, fritidsgårdar, polis, socialtjänst och andra myndigheter för att främja trygghet och förebygga sociala problem. Arbetsplatsen är oftast utomhus eller i ungdomars naturliga miljöer och arbetstiderna kan inkludera kvällar och helger. Fältassistenter har vanligtvis goda kunskaper om socialt arbete, kommunikation och ungdomsfrågor. Källor: Arbetsförmedlingen, Solna stad
broader: Socialsekreterare
related: GazW 2TU kJw
related: DpaV UG4 bDB
related: ns4y iJ6 eBy
broad match: C2635

Civilingenjör, process, kemiteknik
type: Concept
in scheme: JobTech Taxonomy - Yrke
definition: Civilingenjör, process, kemiteknik
broader: Civilingenjörsyrken inom kemi och kemiteknik
related: 6Hq3 tKo V57
broad match: C2145

Bokbindare
type: Concept
in scheme: JobTech Taxonomy - Yrke
definition: Bokbindare arbetar med inbindning och renovering av böcker i olika former. Bokbinderi är ett traditionellt hantverk, idag ofta med renovering och inbindning av till exempel protokollsböcker och avtal. Hantverket innebär att man arbetar med alla moment som inbindning innebär. Det förekommer viss nyproduktion men då i liten skala. Man lärs sig yrket via praktiskt utövande på en lärlingsplats. Se även yrket maskinbokbindare. Källa: Arbetsförmedlingen, Hantverksakademin
broader: Bokbindare m.fl.
related: oviX MCJ 8xb
related: rZAK Ufb gxd
related: wTEr CBC bqh
broad match: C7323

Civilingenjör, el-tele
type: Concept
in scheme: JobTech Taxonomy - Yrke
definition: Civilingenjör, el-tele
broader: Civilingenjörsyrken inom elektroteknik
related: 6Hq3 tKo V57
related: kDRm Yaa jAB
broad match: C2153

Sömmerska hemtextilier och andra textilprodukter
type: Concept
in scheme: JobTech Taxonomy - Yrke
definition: Sömmerskor syr och reparerar hemtextilier och andra textilprodukter, dock inte kläder. Sömmerskor kan arbeta både med symaskin och med manuell sömnad. Beroende på den produkt man syr arbetar man med olika material som tyg, skinn och neopren. Man syr till exempel hemtextilier som gardiner, mattor och sänglinnen. Det finns även företag som specialiserat sig på av sydda produkter som medicintekniska produkter. Gemensamt är att man oftast syr enligt ritning. Beroende på arbetsplats kan dock viss design förekomma, till exempel specialbeställt handbroderi. Yrket skiljer sig från maskinoperatörer inom textilindustrin, där man vanligtvis arbetar mer industriellt och med större volymer. För yrken som avser sömnad av kläder, se ateljésömmerska respektive skräddare. Källa: Arbetsförmedlingen
broader: Sömmare
related: 51vi EWd 78x
related: PaxQ o1G wWH
related: TWpE KbD PvB
related: k3z3 jDa nah
broad match: C7533

Studie- och yrkesvägledare
type: Concept
in scheme: JobTech Taxonomy - Yrke
definition: Informerar och ger råd till studerande om studieval, yrken och yrkesval. Organiserar elevernas arbetsplatspraktik.
broader: Andra pedagoger med teoretisk specialistkompetens
related: xSLo P6B 2AF
related: DJgq zBj bKt
related: C2423
related: kZ6H zk9 78y
related: aUr6 Rjg ja2
related: R9MA bax BHa
related: kjop UjM GNT
related: 3HjW 1BP k3S
related: 3vYj Rhf Voh
related: eome z2j iv4
related: Uv9y v2g efa
related: Tmps QPE g3V
related: TZcg h4T aMT
related: SVxK Ror 3kz
related: NUC3 y1C Scg
related: cw2M p2W SuJ
related: dYqT JBz NZE
related: 5wab aFK gdL
related: PVnT yGT SMb
related: qtHa AsU Cfo
related: Nig2 2pU GT8
related: LmAP e75 pc6
related: 91Ef 58Y jX4
related: 7scD 9YP iwV
related: jcpA Zfs nSz
related: Ggsm 7px yvJ
related: cULS KHX WUY
related: RB7E jE5 MZ3
related: 5NCy xRP RJK
related: 2ZFC 6de YSB
related: B1rc wCc vne
related: w8bU wHe omF
related: 73gL 4uv p9J
related: 8u7A ze1 bvd
related: 6Ei3 fZV YKM
narrower: SSA-sekreterare
narrower: Studie- och yrkesvägledare/SYV
broad match: MVqp eS8 kDZ

Projektledare, social inriktning
type: Concept
in scheme: JobTech Taxonomy - Yrke
definition: Projektledare med social inriktning planerar, leder och samordnar projekt inom sociala verksamheter, exempelvis inom vård, omsorg och socialtjänst. Arbetsuppgifterna innefattar projektplanering, tids- och resursstyrning samt uppföljning av projektets mål och resultat. Rollen innebär samverkan med olika professioner, myndigheter och ideella organisationer samt kommunikation med intressenter. Projektledaren deltar i utveckling och implementering av nya metoder och insatser för att förbättra sociala förhållanden och livskvalitet hos målgrupper. Källa: Arbetsförmedlingen
broader: Behandlingsassistenter och socialpedagoger m.fl.
related: GazW 2TU kJw
related: pvYo LK3 rX1
related: yXSE wvx EAN
broad match: C3412

Valsverksoperatör
type: Concept
in scheme: JobTech Taxonomy - Yrke
definition: Valsverksoperatör arbetar med att bearbeta metaller genom valsning. Vanligtvis arbetar man med material som stål eller aluminium vilket genom maskinell valsning formas till plåtar, band eller profiler. Arbetsuppgifterna innefattar att ställa in, övervaka och justera valsverket. Operatören kontrollerar produktkvaliteten genom mätningar och avsyning, samt utför underhåll på maskiner och utrustning. Valsverksoperatörer arbetar vanligtvis vid större anläggningar för produktion av större dimensioner och volymer, vilka sedan förädlas vid tillverkning av specifika produkter. Se även yrket valsare som arbetar med valsning som bearbetningsteknik för att tillverka specifika produkter. Källa: Arbetsförmedlingen Beroende på arbetsplats och typ av produkt som ska tillverkas arbetar man med maskiner för valsning av olika dimensioner. Vid större valsverksanläggningar tillverkas råmaterial till
broader: Valsverksoperatörer
related: 8HnP 4aP MLL
related: gsFv gwc 8hJ
related: wTEr CBC bqh
related: dhkf qmA Dgg
related: 1r5Z ck4 R7c
broad match: C8121

Processingenjör, kemiteknik
type: Concept
in scheme: JobTech Taxonomy - Yrke
definition: Processingenjör, kemiteknik
broader: Ingenjörer och tekniker inom kemi och kemiteknik
related: 6Hq3 tKo V57
related: 5tyY GjC AcD
broad match: C3116

Trafiklärare och instruktörer
type: Concept
in scheme: JobTech Taxonomy - Yrke
definition: Trafiklärare och instruktörer
broader: Yrken med krav på högskolekompetens eller motsvarande inom kultur, friskvård och socialt arbete m.m.
narrower: Övriga utbildare och instruktörer
narrower: Trafiklärare

Dramatiker
type: Concept
in scheme: JobTech Taxonomy - Yrke
definition: Dramatiker skriver manus för teater, film, TV och andra sceniska produktioner, och utvecklar berättelser med dialog och scenisk gestaltning. Vanliga arbetsuppgifter är att skapa eller bearbeta manus för olika format, delta i kreativa möten och produktionsplanering och ge stöd till regissörer och aktörer under repetition och produktion. Källa: Arbetsförmedlingen, Platsannonser
broader: Författare m.fl.
related: 8too bEs 7NU
related: 9puE nYg crq
broad match: C2641

Komminister
type: Concept
in scheme: JobTech Taxonomy - Yrke
definition: Komminister
broader: Präster
related: UELx cvT McP
related: GazW 2TU kJw
broad match: C2636

Processoperatör malmanrikning
type: Concept
in scheme: JobTech Taxonomy - Yrke
definition: Processoperatörer inom malmanrikning styr och övervakar anrikningsprocesser. Arbetet innebär i huvudsak processtyrning och övervakning via kontrollrum. Arbetsuppgifter innefattar även provtagning av anrikat råmaterial. Inspektion, felsökning, rengöring och underhåll av utrustning kan även förekomma. Man hanterar akuta störningar och utför enklare reparationer. Vanlig arbetsplats är vid gruvor, där arbetet är skiftbaserat. Källa: Industriarbetsgivarna, Arbetsförmedlingen
broader: Processoperatörer, stenkross- och malmförädling
related: 1BP4 B7G Uhg
related: jntm JYU 27Z
related: m8tb 3sk PeM
related: CT2J TWe EaB
related: Qy3p zpF RDa
related: Bctx RNg CNu
related: yotQ QhL JHN
related: 38mD QFj 3s9
related: wTEr CBC bqh
broad match: C8112

Immunolog
type: Concept
in scheme: JobTech Taxonomy - Yrke
definition: Immunolog
broader: Cell- och molekylärbiologer m.fl.
related: kJeN wmw 9wX
related: TXx8 Mgv BGZ
broad match: C2131

Bildpedagog
type: Concept
in scheme: JobTech Taxonomy - Yrke
definition: Bildpedagog
broader: Övriga pedagoger med teoretisk specialistkompetens
related: pVzY rff Amk
related: MVqp eS8 kDZ
broad match: C2355

Soldater m.fl.
type: Concept
in scheme: JobTech Taxonomy - Yrke
definition: Medverkar i militära operationer och övningar nationellt och internationellt med främst väpnad strid som huvuduppgift.
broader: Soldater m.fl.
related: axUd pBC gpK
related: C0310
related: TNqJ vKz kQo
related: evRP Yoi Dd4
related: zXNU zXR hGd
narrower: Soldat/Sjöman
broad match: bH5L uXD ZAX

Chef, Corporate Finance
type: Concept
in scheme: JobTech Taxonomy - Yrke
definition: Chef, Corporate Finance
broader: Chefer inom bank, finans och försäkring
related: X82t awd Qyc
related: epLc SkD cbT
related: bh3H Y3h 5eD
broad match: C1346

Undersköterskor, hemtjänst, hemsjukvård, äldreboende och habilitering
type: Concept
in scheme: JobTech Taxonomy - Yrke
definition: Ger individuell vård och omsorg till äldre i eget eller särskilt boende. Utför hälso- och sjukvårdsuppgifter efter instruktion och delegering t.ex. kvalificerad sårvård och kateterspolning. Ger stöd, assistans, omvårdnad och social service till barn, äldre och personer med funktionsnedsättning i deras vardagsliv. Ger stimulans och stöd till individen i aktiviteter och kontakter med omvärlden. Hit hör inte Habiliteringsassistent (5330) Hemvårdsassistent (3411)
broader: Undersköterskor
related: Cb2a ikG o2t
related: NbjJ WBY FoA
related: bCVZ ziY KHC
related: sicB 2Xi eQh
related: 14eq XTy BPB
related: 4QAE wtY gJh
related: dAq7 Xf8 KZ8
related: 7gPY qhU mkB
related: C1qR L83 nzh
related: X3ec jqv xRp
related: 7wbG fbz pon
related: Yt2Z 1pY MNz
related: C5321
related: 9Fna GUm HWL
related: Mmxs Qrv cpG
related: SYpQ 2aW ovn
related: x289 bKF ihE
related: X9N9 QGi 9Ym
related: tykJ BZQ Wer
related: xowU 8Wu K7C
related: Xqn7 nQQ ovW
related: tg1e QpF xdX
related: xG3w m6i fbp
related: Lqnz Zqw nQ9
related: hqYJ jyZ Ks8
related: 9ShZ oc6 1Jc
related: YU6v SsT UBm
related: F7nJ k5s L29
related: 7xZ7 skn RYk
related: zMr8 cTC PCB
related: wBPu wTW RgG
related: MR4H FFT mTj
related: NpcY f4G L1H
related: BvGm Zuj VLF
related: C5322
related: 2GuF gtz xfW
related: rF7s hX1 ECH
related: NL17 f8c AqZ
related: rVUL AgV ZTH
related: aoVs Qfu U3j
related: 5Kym 2ad Pqi
related: FgNd J6B cB2
related: mnmo V8k dCz
related: ZpXZ PG5 B9s
related: enLQ GrZ w3S
related: rwir xvu 443
related: huu9 Uir rPn
related: pGBH BkG qJa
related: 3M7W Tgq hRm
related: yV9B PxJ TxS
related: rtCg THP 6Lj
related: E3iH XQQ pvE
related: crVe Rij aaB
related: cocQ EPn YiY
narrower: Undersköterska, hemtjänst, äldreboende och habilitering
narrower: Hemsjukvårdare
broad match: NYW6 mP6 vwf

Level designer/Leveldesigner
type: Concept
in scheme: JobTech Taxonomy - Yrke
definition: Level designer skapar och utformar nivåer och banor i datorspel för att säkerställa en engagerande och balanserad spelupplevelse. Vanliga arbetsuppgifter är att utveckla spelvärldens layout, designa pussel och utmaningar, balansera svårighetsgraden samt testa och justera nivåerna baserat på feedback. Level designern samarbetar nära med andra spelutvecklare, såsom grafiker och programmerare, för att integrera olika spelkomponenter och skapa en sammanhängande spelvärld. Källa: Arbetsförmedlingen, The Game Assembly
alternative label: Level designer
alternative label: Leveldesigner
broader: Designer inom spel och digitala medier
related: oeHg J1V PEg
related: apaJ 2ja LuF
related: 8too bEs 7NU
related: 9puE nYg crq
broad match: C2166

Ekonomidirektör/Finanschef
type: Concept
in scheme: JobTech Taxonomy - Yrke
definition: Ekonomidirektör/Finanschef
broader: Ekonomi- och finanschefer
related: 4u83 LmD Pzj
related: bek1 fmM iMR
related: X82t awd Qyc
related: epLc SkD cbT
related: dBog yNg 4WS
related: bh3H Y3h 5eD
related: rJe9 cJ9 BUg
related: eBQs p5w Jkj
related: witr Rta P66
related: RWD4 Pyb raZ
broad match: C1211

Specialistundersköterska
type: Concept
in scheme: JobTech Taxonomy - Yrke
definition: Specialistundersköterska utför och bidrar till avancerade vård- och omsorgsinsatser inom sitt specialistområde under medicinsk ledning. Undersköterska är en skyddad titel. Vanliga arbetsuppgifter är att hantera komplexa vårdbehov, utföra delegerade hälso- och sjukvårdsinsatser, samordna vårdarbete och handleda kollegor och nya medarbetare. Specialistundersköterskan deltar i verksamhetsutveckling och kan ha specialistroller inom exempelvis demensvård, palliativ vård, äldrevård eller psykiatri. Även uppdrag som fast omsorgskontakt för personer med hög komplexitet kan ingå. Källa: Arbetsförmedlingen, Folkuniversitetet, Sveriges Kommuner och Regioner
broader: Undersköterskor, vård- och specialavdelning och mottagning
related: NYW6 mP6 vwf
broad match: C5321

Trädgårdsanläggare
type: Concept
in scheme: JobTech Taxonomy - Yrke
definition: Trädgårdsanläggare anlägger utemiljöer såsom parker, trädgårdar och grönytor. Arbetsuppgifterna inkluderar markberedning, bygga murar, lägga plattor och marksten samt montera lekplatsutrustning. Man kan även arbeta med plantering av träd, buskar och blommor, samt anläggning av gräsmattor. Beroende på arbetsgivare kan även underhåll ingå i arbetsuppgifter, såsom skötsel och beskärning av växtlighet, ogräsbekämpning, samt underhåll av gångvägar och andra ytor. Arbetet utförs både manuellt och med hjälp av grönytemaskiner. Arbetet sker utomhus och ofta ute hos kund, varför körkort för personbil ofta är viktigt. Källa: Gröna arbetsgivare, Trädgårdsanläggarna, Arbetsförmedlingen
broader: Trädgårdsanläggare m.fl.
related: j7Cq ZJe GkT
related: PzmB 1Dy RAs
related: qWba n7y 1jP
related: VuuL 7CH adj
related: KB3L FaD Mbu
related: AJyx XWJ 9vT
broad match: C6113

Fasadmontör
type: Concept
in scheme: JobTech Taxonomy - Yrke
definition: Fasadmontör jobbar på specialiserade företag med montering av fasader av olika typer, som t ex glas och plåtkassetter. Arbetet sker oftast från en byggnadsställning och kan ibland inkludera montering av isoleringsmaterial. Källa: Arbetsförmedlingen
broader: Övriga byggnads- och anläggningsarbetare
related: j7Cq ZJe GkT
related: Kn2E B9V Vxu
related: fjnA JPZ yxp
related: ja7J P8X YC9
broad match: C7119

Operatör batteritillverkning
type: Concept
in scheme: JobTech Taxonomy - Yrke
definition: Operatörer inom batteritillverkning sköter maskiner som framställer delar för olika typer av batterier. Beroende på typ av batteri kan produktionen vara uppdelad i olika delar som innebär olika arbetsuppgifter. Arbetet utgörs i huvudsak av att förbereda och övervaka de maskiner som framställer batterier och eller batterikomponenter. Andra arbetsuppgifter som underhåll, kvalitetskontroll och dokumentation kan också förekomma. Arbete i skift är vanligt förekommande. Källa: Arbetsförmedlingen
broader: Maskinoperatörer, kemisktekniska och fotografiska produkter
related: wTEr CBC bqh
broad match: C8131

Statssekreterare
type: Concept
in scheme: JobTech Taxonomy - Yrke
definition: Statssekreterare
broader: Politiker
related: bh3H Y3h 5eD
broad match: C1111

Idrottsplatschef
type: Concept
in scheme: JobTech Taxonomy - Yrke
definition: Idrottsplatschef
broader: Chefer inom friskvård, sport och fritid
related: n2jq y2P Evw
related: DMv9 cwu 8yR
related: epLc SkD cbT
related: bh3H Y3h 5eD
related: 3Taz PGK yMh
broad match: C1431

Innesäljare
type: Concept
in scheme: JobTech Taxonomy - Yrke
definition: Innesäljare bearbetar nya och gamla företagskunder, tar emot och handlägger order och förfrågningar, genomför försäljning. Arbetsuppgifter inkluderar kundkontakt över telefon och e-post, ta emot beställningar, sälja produkter och tjänster. Tar också emot klagomål, ge råd och service. Vissa innesäljare har en stödjande funktion till en eller flera säljare på fältet, ansvarar för leveranser och fakturaunderlag. Källa: Arbetsförmedlingen - Hitta yrken, Unionen
broader: Företagssäljare
related: mp3s bth VoB
related: NjV2 7Nq 24V
related: gbPf MFR EFN
related: Q1Lk SPf 8fd
related: okTu YtS CdK
related: PtKL c1s VVK
related: TUho VQM bem
related: rDcj Tao TJJ
related: RPTn bxG ExZ
related: Qj4o iuw tqt
related: ySGo zDk oxF
related: 42wL WZe 39f
related: 9Pqd hKU vYa
related: yFKU Y41 4Q5
related: SJw6 13J VNo
related: FL9k ZHh je4
related: 1KQq toY sSR
related: nfei 1LF U1v
related: 7Qzh TsJ iWz
related: Qeqn W2M uv2
related: xKSx u5H fTT
related: Dc3s mJg 5pq
related: cs8k 7HM F8W
broad match: C3322

Marknadskommunikatör
type: Concept
in scheme: JobTech Taxonomy - Yrke
definition: Marknadskommunikatör
broader: Marknadsanalytiker och marknadsförare m.fl.
related: RPTn bxG ExZ
related: viAt pJ2 UgR
related: Yb1w sSy Rh9
related: 4XyY MCb svG
related: VnEW 5eX Bvu
broad match: C2431

Second assistant director/SAD
type: Concept
in scheme: JobTech Taxonomy - Yrke
definition: Second assistant director samordnar praktiskt arbete på en film- eller tv-produktion, främst genom att planera scheman och tidsplaner så att inspelningen löper enligt planen. Vanliga arbetsuppgifter är planera och skapa dagbesked, kalla skådespelare och hålla kontakt med deras agenter eller assistenter och samordna mellan olika avdelningar och kommunicera instruktioner och ändringar till team och medverkande. Det ingår ansvar för logistik, säkerhet och förberedelser inför inspelningen. Källa: Arbetsförmedlingen, Yrkesnämnden för Film och TV
alternative label: SAD
alternative label: Second assistant director
broader: Inspicienter och scriptor m.fl.
related: Eapz zxH CZ2
related: thKs uTa YY7
related: 8too bEs 7NU
related: 9puE nYg crq
broad match: C3435

Statistiker
type: Concept
in scheme: JobTech Taxonomy - Yrke
definition: Utvecklar och tillämpar statistiska teorier, modeller och metoder. Planerar, utvecklar, bearbetar, framställer, analyserar och presenterar statistiska undersökningar. Gör prognoser. Bearbetar administrativa uppgifter till statistik.
broader: Matematiker, aktuarier och statistiker
related: TF1f u6x AGR
related: B5cf yxV Zpz
related: rdER 6hW HgK
related: bL3H Rpp 8fF
related: QP1q fXF b6H
related: qa6d Ho8 T22
related: GRHS 65k hqp
related: Tnkg aTP vCV
related: 5Gmv EZs BPe
related: PCPb DdU pqw
related: NZge Hj3 tP1
related: U86s CAP Vwa
related: TEum xLY t4z
related: SQ5j FkT zJY
related: wsLu CSk kfb
related: dg3u i39 1TC
related: oYQP nau nwc
related: nHpF emY pTp
related: 7T35 XRu yXW
related: pLvS 2ry jpR
related: Y4fa 2ye bPB
related: eTDK F6v 6yX
related: WFWb oXM pFH
related: ZrcW W8A ryi
related: 17Uy FAd BRr
related: 4y7C Lsh EPM
related: Leez v3g kU1
related: TDHT hrW PPQ
related: FdTs sQR SvN
related: C2120
narrower: Statistiker
narrower: Biostatistiker
narrower: Matematisk statistiker
narrower: Demograf
narrower: Miljöstatistiker
narrower: Metodstatistiker
broad match: X82t awd Qyc

Hemhjälp
type: Concept
in scheme: JobTech Taxonomy - Yrke
definition: Hemhjälp sköter hushållssysslor åt privatpersoner. Som hemhjälp utför man hushållssysslor åt privatpersoner i deras hem. Man kan arbeta direkt för en privatperson eller för ett företag som förmedlar hemhjälpstjänster. Vanliga arbetsuppgifter är städning, diskning och tvätt. Beroende på vem man arbetar för kan arbetsuppgifterna skilja sig åt. Arbetar man för en familj kan barnpassning, handling och matlagning ingå. Det är vanligt att arbeta för äldre personer som behöver hjälp med personlig omvårdnad eller socialt stöd i form av sällskap. Källa: Arbetsförmedlingen
broader: Övrig hemservicepersonal m.fl.
related: whao Q6A ScE
related: UdVa jRr 9DE
related: m28c x3g B9D
related: Fgt2 Pk5 4a5
related: TYBE rFF 6cD
related: 8Qsw xpM Zso
related: nMUF FMY 2Uj
broad match: C9111

Dockmakare
type: Concept
in scheme: JobTech Taxonomy - Yrke
definition: Dockmakare tillverkar och reparerar dockor för teatrar, film- och tv-produktioner. Man tillverkar marionettdockor främst för film- och tv och handdockor främst till kasperteater och buktaleri. Dockmakaren arbetar med olika material som trä, textil, papier-maché, plast, silikon och ibland porslin eller keramik. Utöver dockor kan arbetet omfatta tillverkning av attribut, modeller, skulpturer och leksaker. Källa: Hantverkslärling, Hantverksakademin, Arbetsförmedlingen
broader: Musikinstrumentmakare och övriga konsthantverkare
related: PaxQ o1G wWH
broad match: C7319

Revisor
type: Concept
in scheme: JobTech Taxonomy - Yrke
definition: Revisor
broader: Revisorer m.fl.
related: ASuq tvx otB
related: azqA 7sC REu
related: nBsw pkU VD9
related: EY87 f8J 6qt
related: 3nVd 1S8 v1a
related: yWWa kd2 nLe
related: poeF yUn E7X
related: eha6 ojm zCp
related: X82t awd Qyc
related: ZHRD hJm o4H
related: twcZ E3T B5Y
related: dMxs MSF xuf
related: q4hR Dz5 ZAp
related: 9d85 2Ug 2E9
related: 3CJy hhd rj8
related: x4oG CQq Tih
related: PMTc ykA mWy
related: qxWZ 22a 9oC
related: ncDY hvU BUN
related: jZUY fhe kG1
related: TMFV uEu TbV
related: omwc Q1N adb
related: gupJ Rgk 7kU
broad match: C2411

Diversearbetare
type: Concept
in scheme: JobTech Taxonomy - Yrke
definition: Diversearbetare Utför enklare arbetsuppgifter utan krav på yrkesutbildning. Arbeten utförs ofta efter behov, vanligtvis via bemanningsföretag. Exempel på mer manuella arbetsuppgifter är snöskottning och uppackning av varor. Exempel på mer administrativa arbetsuppgifter är att vara tentamensvakt, räkna röster och ge information till besökare på allmänna platser. Källa: Arbetsförmedlingen
broader: Övriga servicearbetare
related: HJmd LHk 16a
related: pNJj hnQ yDr
related: LTnh sLK P2Y
related: EMyj DJ5 3DR
related: gbtL qHk evq
related: UdVa jRr 9DE
related: ycaq u3B f3u
related: r86o L2f iKH
related: q78U Mov Kt8
related: MtSp aD8 kVR
related: G4z9 vSj tPZ
related: vgPg GaQ itz
related: 7bE7 3sy UWS
related: z88f CqY xJK
related: vTh8 FZF Fdi
related: 37YF 7Je Rt5
related: PEmc kJG RYP
related: pH3Z i4W jei
related: vhcc 1Hy ZyE
related: yhCP AqT tns
related: UMjY fvC jFH
related: R7Qy eMj B4y
related: hLDX ZAi 9jq
related: 8o9y aN6 3yT
related: n75V uJq oUF
related: YTsf pi8 Lob
related: riNd MKo GHa
related: TTie 3Ub stR
related: ErLe fJR 5gr
related: RCMt UaK 13u
related: VujB Fan SZ5
broad match: C9622

Sjuksköterskor
type: Concept
in scheme: JobTech Taxonomy - Yrke
definition: Sjuksköterskor
broader: Yrken med krav på fördjupad högskolekompetens inom hälso- och sjukvård
narrower: Psykiatrisjuksköterskor
narrower: Geriatriksjuksköterskor
narrower: Ambulanssjuksköterskor m.fl.
narrower: Barnmorskor
narrower: Anestesisjuksköterskor
narrower: Intensivvårdssjuksköterskor
narrower: Grundutbildade sjuksköterskor
narrower: Distriktssköterskor

Turistinformatör
type: Concept
in scheme: JobTech Taxonomy - Yrke
definition: Turistinformatör informerar besökare om sevärdheter, evenemang, aktiviteter, kollektivtrafik och annat på en specifik ort. Turistinformatör uppdaterar och förmedlar turistinformation både digitalt och via fysiska informationskanaler, exempelvis på turistbyrå eller via telefon och e-post. Arbetsuppgifterna omfattar att vägleda besökare till rätt resmål, boka aktiviteter, ge förslag på upplevelser och sprida aktuell information vid förändringar, störningar och särskilda behov. Turistinformatör samverkar med lokala aktörer och offentliga instanser och dokumenterar statistik och utvärderingar av besöksfrågor. Arbetsuppgifter kan även innefatta marknadsföring, uppdatering av webbplatser, bokning av guider och viss turismutveckling. Källa: Arbetsförmedlingen
broader: Resesäljare och trafikassistenter m.fl.
related: QHtf Dmn 2xb
related: 7goz uuv JWu
related: ASGV zcE bWf
related: WbUR kWV iik
related: EKtK 5mt fum
related: 8LT4 ovS HcL
broad match: C4221

Projekteringsingenjör, maskin
type: Concept
in scheme: JobTech Taxonomy - Yrke
definition: Projekteringsingenjör, maskin
broader: Civilingenjörsyrken inom maskinteknik
related: SuAn oH9 xNc
related: 6Hq3 tKo V57
related: 1Qve F1H 9J8
broad match: C2144

Informatörer, kommunikatörer och PR-specialister
type: Concept
in scheme: JobTech Taxonomy - Yrke
definition: Planerar, utvecklar, genomför och utvärderar informations- och kommunikationsstrategier om företags eller organisations mål, policy, verksamhet, resultat och aktuella händelser. Utformar informationsinnehåll.
broader: Marknadsförare och informatörer m.fl.
related: q6QD 6et rcJ
related: F4nq ZH3 s3u
related: aZDe N9r xic
related: C2432
related: TvaC Wot Xnz
related: Ax3k q3w Giv
related: dTK5 R7G p56
related: E9LX 1eF jDB
related: St3s bmV dHC
related: LShp t9S Cc6
related: nvM6 J6v qKQ
related: d7GK rmt 4FC
related: 8tYq EXD Xwm
related: dYog aJL kok
related: 4RmJ wiU N4k
related: H5KZ roq acH
related: 3LEE 29Y TAe
related: jfmZ FfR NFm
related: zYHW Mtu jqq
related: VANx 32R rU1
related: oEJ1 Jm7 J97
related: 7NpA Fob fUr
related: nVJB JB5 rr5
related: PU6Y hXy MEA
related: aaQr mcK hgK
related: FGhF q98 YE8
related: paEM G5u oz6
related: af2G bUf zNz
related: oCKN G9k zTj
related: CTTL 357 Ld2
related: dQre aBF 3dE
related: k29D fT4 Wso
related: Y2t4 aS8 tGo
related: Lz84 K5d CcL
related: qK2A 9oq zx6
related: qTCs crJ Lzw
related: Hb14 vsa TwV
narrower: Informatör/Kommunikatör
narrower: Forskningskommunikatör
narrower: Informationskonsult
narrower: Pressekreterare
narrower: Informationssekreterare
narrower: Annonsproducent
narrower: Onlinemarknadsförare
narrower: Kommunikationsstrateg
narrower: Mediaplanerare
narrower: Visuell grafisk kommunikatör
narrower: Mediehanterare
narrower: Informationsassistent
narrower: Mediakonsulent
narrower: Social media manager/Social media specialist
narrower: Copywriter
narrower: PR-konsult
broad match: X82t awd Qyc

Professionell idrottsutövare
type: Concept
in scheme: JobTech Taxonomy - Yrke
definition: Professionell idrottsutövare
broader: Professionella idrottsutövare
related: Vytf rSu 5y3
related: SpgG zEo oJD
related: 8sHr RjD nFb
related: Qk7J Gjp Qbp
related: c6Ef ZJE wun
related: 9puE nYg crq
related: ohqr FrX hCY
related: kuq5 qEr DZT
related: b6VB BrH Gee
broad match: C3421

Odlare av jordbruksväxter, frukt och bär
type: Concept
in scheme: JobTech Taxonomy - Yrke
definition: Bedriver växtodling. Odlar och skördar jordbruksväxter som t.ex. spannmål, olje- och vallväxter, sockerbetor samt potatis och andra köksväxter på friland. Odlar frukt och bär. Underhåller ekonomibyggnader, maskiner och utrustning.
broader: Växtodlare inom jordbruk och trädgård
related: yZWG ynW 4iQ
related: Bjhz qeH rQR
related: bbrX YjR caP
related: WStg Eag 4oi
related: HYth uQt hAk
related: r2MT yTq xZu
related: oYDh d6r cSu
related: hZDG iqA bka
related: 6E3h uR9 pxh
related: b3cK YFd y5S
related: xi3m 2EA yii
related: oDP7 ReX a9j
related: yVj6 5Ey Gku
related: 74uH 39f D58
related: LR78 eaw bMu
related: kmBX uX9 oQF
related: 2d8m SG1 duS
related: Vig6 18E ZVA
related: r5br 43H z2G
related: L135 ib8 b83
related: C6112
related: eXDv ENc Vhc
related: evqS BsZ p78
related: eThQ HCv mY6
related: wVZP gRS 52W
related: U81H Lqc 2SV
related: mRxb SRc xne
related: GNHJ kNN fLn
related: HnQ2 FhC xgt
related: yxkr TyE GgG
related: yYgy azb GqH
related: UXUJ ftK Dr1
related: pXEi DEw QmR
related: C6111
related: 37ZU mdJ hhK
related: TFCa CfD LdU
related: C6114
narrower: Grönsaksodlare
narrower: Lantbrukare växtodling
narrower: Driftledare växtodling
narrower: Bärodlare/Fruktodlare
narrower: Förman växt- och grönsaksodling
narrower: Gårdsmästare växtodling
broad match: VuuL 7CH adj

Flygmekaniker
type: Concept
in scheme: JobTech Taxonomy - Yrke
definition: Flygmekaniker utför service, underhåll och reparationer på flygplan och helikoptrar. Arbetet kan innebära felsökning och mindre, mer omfattande insatser i hangar eller akuta åtgärder vid flygbaser. Arbetsuppgifterna inkluderar tillsyn av motorer, bromsar och däck samt påfyllning av bränsle och syrgas. Flygmekanikern arbetar under ledning av en flygtekniker. Som certifierad flygmekaniker kan man även arbeta utomlands. Källa: Transportfackens Yrkes- och Arbetsmiljönämnd, Försvarsmakten
broader: Flygmekaniker m.fl.
related: gzr7 pQi ZgG
related: ASGV zcE bWf
related: H9S2 UiS snr
related: yhCP AqT tns
related: jEm1 n7x 8Wo
broad match: C7232

ST-läkare, bild- och funktionsmedicin
type: Concept
in scheme: JobTech Taxonomy - Yrke
definition: Specialisttjänstgöring, ST, är den vidareutbildning som legitimerade läkare genomför för att uppnå specialistkompetens. ST-läkare bild- och funktionsmedicin arbetar under handledning för att fördjupa sina medicinska kunskaper och färdigheter med målet att bli specialistläkare inom sitt område. ST-läkaren arbetar självständigt med patientutredningar, diagnostik och behandling, men alltid med stöd av specialister och enligt ett individuellt utbildningsprogram. Vanliga arbetsuppgifter är att ta medicinskt ansvar för patienter, delta i jourverksamhet, genomföra medicinska undersökningar och behandlingar samt dokumentera och följa upp vårdinsatser. Tjänsten omfattar också kontinuerlig kompetensutveckling, sidotjänstgöring inom närliggande områden och aktivt deltagande i handledning och utbildningsinsatser för kollegor och studenter. Källa: Arbetsförmedlingen, Karolinska Universitetssjukhuset, Sveriges läkarförbund, Region Kronoberg, Region Skåne.
broader: ST-läkare
related: NYW6 mP6 vwf
related: UtCj yMj ubw
broad match: C2211

Aktiechef
type: Concept
in scheme: JobTech Taxonomy - Yrke
definition: Aktiechef
broader: Chefer inom bank, finans och försäkring
related: X82t awd Qyc
related: epLc SkD cbT
related: bh3H Y3h 5eD

Ambulanssjukvårdare
type: Concept
in scheme: JobTech Taxonomy - Yrke
definition: Ambulanssjukvårdare arbetar i team med en sjuksköterska och ansvarar för att köra ambulansen, samordna insatser och assistera vid undersökning och behandling av patienter. Arbetsuppgifterna inkluderar att lägga förband, kontrollera vitala tecken, utföra hjärt-lungräddning och hantera medicinteknisk utrustning. Vid olycksplatser leder ambulanssjukvårdaren sjukvårdsarbetet och sköter kommunikationen med SOS Alarm och andra räddningsaktörer. Arbetet kan innebära både akuta insatser och planerade sjuktransporter. Dessutom ingår fordonsunderhåll, dokumentation och enklare service av utrustningen. Källa: Sveriges Kommuner och Regioner, Arbetsförmedlingen
broader: Ambulanssjukvårdare
related: NYW6 mP6 vwf
related: URRW c9p RLm
related: 8z2T msU s35
broad match: C3258

Pumpman, oljeborrning
type: Concept
in scheme: JobTech Taxonomy - Yrke
definition: En pumpman vid oljeborrning övervakar, sköter och underhåller pumpar och tillhörande utrustning på borrplattformar eller vid oljeutvinning på land. Arbetsuppgifterna omfattar drift av pumpar för att kontrollera vätskenivåer, tryck och flöden inom borrsystemet, samt felsökning och underhåll av maskinutrustning. Pumpman smörjer, reparerar och ser över maskiner för att säkerställa säker och effektiv oljeborrning. Yrkesrollen innebär ofta skiftarbete, mest på offshore-plattformar. Källa: Arbetsförmedlingen
broader: Brunnsborrare m.fl.
related: j7Cq ZJe GkT
broad match: C8113

Turistintendent
type: Concept
in scheme: JobTech Taxonomy - Yrke
definition: Turistintendent
broader: Planerare och utredare m.fl.
related: 7goz uuv JWu
related: BdXA X9U Jhm
related: 5AKC WtX qCh
related: X82t awd Qyc
related: Frvb eaJ Tsg
related: kuwC t38 iMp
related: bde3 BFA 77F
related: EKtK 5mt fum
related: He3Q WaH LFe
related: TZe9 NsN uce
broad match: C2422

Arbetsledare, husbyggnad
type: Concept
in scheme: JobTech Taxonomy - Yrke
definition: Arbetsledaren inom husbyggnad är den ingenjör som leder bygget ute på byggarbetsplatsen. Arbetsledaren bevakar att maskiner och material finns på plats och samordnar arbetet med de underentreprenörer, som till exempel sköter om rör- och elinstallationer. Arbetsledaren har ansvaret för att arbetet utförs enligt gällande ritningar och anvisningar och för att säkerhetsföreskrifterna följs. På de större byggena finns fler arbetsledare som ansvarar för var sin del. Källa: Arbetsförmedlingen
broader: Arbetsledare inom bygg, anläggning och gruva
related: j7Cq ZJe GkT
related: Fe2Z zx5 q6j
related: cru1 Gqq gZ9
related: Rxje VZU Y8s
related: SKgm 9xv 5tJ
related: U8ht vDa nhk
related: 9YLq HTj 1jb
related: ja7J P8X YC9
broad match: C3123

Organisationsjurist
type: Concept
in scheme: JobTech Taxonomy - Yrke
definition: Organisationsjurist
broader: Förvaltnings- och organisationsjurister
related: X82t awd Qyc
related: x4Wi NWW ogB
related: Abcb QtH isZ
broad match: C2619

Båtbyggare
type: Concept
in scheme: JobTech Taxonomy - Yrke
definition: Båtbyggare tillverkar och reparerar båtar av trä, plast och metall. Båtbyggaryrket innehåller både traditionellt byggande av träbåtar och mer industriell tillverkning av plastbåtar. Man arbetar i huvudsak med fritidsbåtar, både med tillverkning och reparation. Båtbyggare har vanligtvis djupa kunskaper om olika material och bearbetningstekniker. Man arbetar både med manuella verktyg och till viss mån automatiska maskiner. Arbetet innebär även att ha kunskaper inom el och mekanik då arbetsuppgifter även innebär att installera utrustning så som motorer, mätare, styrenheter, batterier och bränsletankar. Vanliga arbetsplatser är företag som tillverkar båtar och vid verkstäder som mer inriktat sig på underhåll av båtar. Källa: Arbetsförmedlingen
broader: Fin-, inrednings- och möbelsnickare
related: hYAA Ajt N1F
related: JwmH ZqT gtD
related: PaxQ o1G wWH
related: NvyA mwS eB3
related: 5CHH 2E4 6fx
related: 6J9p 66d AtV
broad match: C7115

Laboratorieingenjör, kemi
type: Concept
in scheme: JobTech Taxonomy - Yrke
definition: Laboratorieingenjör, kemi
broader: Laboratorieingenjörer
related: CpFD aoS pkZ
related: 6Hq3 tKo V57
related: Y11c b66 3Ef
related: EsWG kHG oXZ
related: hBzg sf4 HHU
related: fM7t axJ RNN
related: aDo7 LZq xp7
broad match: C3111

Dövblindkonsulent
type: Concept
in scheme: JobTech Taxonomy - Yrke
definition: Dövblindkonsulent
broader: Planerare och utredare m.fl.
related: X82t awd Qyc
related: TZe9 NsN uce
broad match: C2422

Fartygsbefäl m.fl.
type: Concept
in scheme: JobTech Taxonomy - Yrke
definition: Navigerar och styr fartyg. Leder arbete på däck och kommandobrygga samt ansvarar för att säkerhetsföreskrifter följs ombord. Hit hör inte Fiskeskeppare (6222) Matros (8350)
broader: Piloter, fartygs- och maskinbefäl m.fl.
related: Tbmr JxZ xFU
related: 7qAg AP3 WwV
related: cP48 5in VHb
related: JYAn p1X 6sb
related: 2KP2 Zfe 5Cf
related: GJMf PhP 9Wg
related: XNLN wwW x6h
related: PUmv CTm y4F
related: VZnB ncX RkD
related: HvZg eSR eTg
related: 1i3B u2k f32
related: hCmq btw dkN
related: fJdB viK AaA
related: V7H8 ZNj EaQ
related: 8sKj VoT hKR
related: 3j4u Apm 7WU
related: 3BCu HTK YSF
related: Jpeq i4k mda
related: LDpW xuo jZp
related: w9kF 5oy ySz
related: zMmn 1mh 6D5
related: D7v7 nBw 6Tu
related: 5bZF pBx 2d1
related: UdGt dND Baj
related: FmHS DMU bcA
related: Aycb CjZ V3v
related: Q7eC B7g QiU
related: MgS1 3u1 PdT
related: TumP RbS 4hY
related: U7tq xS3 4Fq
related: 529J hso 1qx
related: H4HG MWG uUg
related: q4p6 d9U 7D4
related: kSYg iMb xDo
related: 5p3r SgW n54
related: GEnM 1dA HhG
related: PRQR oGE 7re
related: fhcp fFw Lbj
related: dkg2 8Qz rzx
related: 2XXJ ofn VAD
related: S44W QvJ r4m
related: ong5 Wb8 dTU
related: Ff3d BZT E8m
related: qukw pxR 7qM
related: rYGi DpZ kWM
related: ojPn R8G dsv
related: BBVW 3YU 8p5
related: M4ei Uvu Ks7
related: NBB1 SKC gAP
related: sYfy ekc ifq
related: pYDp S3J AxM
related: 6Pzb STS Bp1
related: 4Eu4 E8D evB
related: DKF3 A8Z Een
related: aS2A GJ6 Lm2
related: c7vU NA5 spi
related: zYzY NTD VoE
related: Nxfw cTk qUk
related: RraB CNP qxC
related: y77a Hix Pk3
related: 9tdC NoC UMe
related: gEsp QK9 Uq6
related: 9apS eAV xqL
related: t6jQ DTS zMr
related: JJiW W7Z kgc
related: hHSG YTn NHt
related: aAtJ q2r J5n
related: h8HL Nvo tAc
related: C3152
related: s3uM Qg2 qFr
related: P6te TBF 8fh
related: S7LZ tzK qSg
related: U3Hr T4M R8D
related: vV6H PJe ftR
related: hoPi hPE fWg

Fiskeskeppare
type: Concept
in scheme: JobTech Taxonomy - Yrke
definition: Fiskeskeppare är befälhavare på fiskefartyg och leder det praktiska arbetet ombord, inklusive navigering, säkerhet och samverkan med besättning i samband med fiske till havs eller i insjö. Arbetsuppgifterna omfattar planering av fiske, navigering av fartyget till och från fångstplatser, övervakning av fångstredskap, hantering och förvaring av fångst samt dokumentation av fiske och fångstresultat. Fiskeskeppare övervakar fartygsdrift, utför tillsyn av maskiner och teknisk utrustning samt deltar i reparation och underhåll. Källa: Arbetsförmedlingen
broader: Fiskare
related: fmCS 7n9 DqW
related: VuuL 7CH adj
broad match: C6222

Maskinoperatörer, kvarn-, bageri- och konfektyrindustri
type: Concept
in scheme: JobTech Taxonomy - Yrke
definition: Styr och övervakar maskiner som krossar, maler, blandar och på andra sätt bearbetar säd, kryddor och liknande råvaror för konsumtion eller djurfoder. Styr och övervakar maskiner och linjer som bereder deg samt formar och bakar bröd, bakverk, pasta, choklad och konfektyr. Hit hör inte Bagare/Konditor (7612)
broader: Maskinoperatörer, livsmedelsindustri
related: s5nN ufD 8ay
related: i3kd fCX jxz
related: VPF1 UZM 9Kd
related: 7Wc6 yrC aVp
related: 2pjc Vto TGH
related: aF3J SgE uck
related: qQ61 EQR rcz
related: VTwt 5Fe 6bW
related: Dywf BPg usG
related: Fvdi Xn6 TB6
related: KDzy Hra iVr
related: 1vX4 pj1 yao
related: MuoH pDL nFJ
related: yhwn y8q qUS
related: sbYJ XwB o8X
related: AP6y xf5 4WK
related: d3oB oX3 kF8
related: GdFM 7x5 eZc
related: Rbju P7i 12U
related: AiwS Mhv ttk
related: msd9 iti H33
related: uenm 75h fEh
related: C8160
related: MT1a Nyq DGQ
related: qn22 kbi Mwa
related: dWbY gXC Frx
related: LhvF NZc r6N
related: kj4Q nLh u8Q
narrower: Maskinoperatör bageri- och konfektyrindustri
narrower: Maskinoperatör spannmål
broad match: wTEr CBC bqh

Barnsköterskor
type: Concept
in scheme: JobTech Taxonomy - Yrke
definition: Sköter den dagliga omvårdnaden av barn på sjukhusens barnavdelningar. Tar prover, kontrollerar kroppstemperatur och puls m.m. Hit hör inte Barnskötare (5311)
broader: Undersköterskor
related: C5321
related: x289 bKF ihE
related: 1eKe zFj QAa
related: Hgww z4B Tyg
related: enLQ GrZ w3S
related: YTPY NjP Auq
related: rtCg THP 6Lj
narrower: Barnsköterska
broad match: NYW6 mP6 vwf

3D-printingspecialist
type: Concept
in scheme: JobTech Taxonomy - Yrke
definition: 3D-printingspecialist
broader: Övriga ingenjörer och tekniker
related: C7ZR Asn rqP
related: rfEq krd ehp
related: apaJ 2ja LuF
related: iE3J fCt RtS
broad match: C3119

Redaktionssekreterare
type: Concept
in scheme: JobTech Taxonomy - Yrke
definition: Redaktionssekreterare planerar, koordinerar och redigerar innehåll för tidningar, tidskrifter eller digitala medier med fokus på att säkerställa en smidig produktion och korrekt språkbruk. Vanliga arbetsuppgifter är att granska, redigera och förbereda texter för publicering, samt att planera redaktionellt innehåll och driva den löpande produktionen. Källa: Arbetsförmedlingen, Platsannonser
broader: Journalister m.fl.
related: pYez WWr Ygt
related: X82t awd Qyc
related: 8too bEs 7NU
related: 9puE nYg crq
broad match: C2642

Folkhögskolelärare
type: Concept
in scheme: JobTech Taxonomy - Yrke
definition: Folkhögskolelärare planerar, leder och utvecklar undervisning för vuxna deltagare på folkhögskola, ofta med fokus på folkbildning och personlig utveckling inom olika ämnesområden. Vanliga arbetsuppgifter inkluderar schemalagd undervisning, handledning i grupp och individuella samtal och deltagande i skolans sociala och pedagogiska aktiviteter. Arbetsgivaren söker medarbetare med ämneskompetens och erfarenhet av vuxenpedagogik. Källa: Arbetsförmedlingen, Linköpings universitet
broader: Gymnasielärare
related: fAid 2H4 2E9
related: kXfH oGq ziE
related: xCBk bc1 Bpq
related: N8fS PR4 SiB
related: sQjp 5hY mWE
related: 4xo2 qza oLa
related: GnFC WGM uAq
related: wavs fmy A7K
related: jMhJ j4R wiC
related: j3Fj q9X fJn
related: MVqp eS8 kDZ
related: G9yV QuL LSh
related: 3eLg Tix TFB
related: j2G5 yQN U6u
related: 3jJC HQR 7px
related: stqK W8K ELJ
related: j3ep 8vv nLH
broad match: C2330

Informationschef/Kommunikationschef
type: Concept
in scheme: JobTech Taxonomy - Yrke
definition: Informationschef/Kommunikationschef
alternative label: Informationschef
alternative label: Kommunikationschef
broader: Informations-, kommunikations- och PR-chefer
related: HW52 Q7s Vtf
related: 1Pcp RS1 XXt
related: X82t awd Qyc
related: epLc SkD cbT
related: bh3H Y3h 5eD
related: Q2Ni G8f iK1
related: vNCQ WjX Kv1
related: t5ad vs2 dZx
related: C3JB j4k AeN
related: fXmq uZH qAa
related: vZ8B MVi UhG
broad match: C1222

Länsantikvarie/1:e antikvarie
type: Concept
in scheme: JobTech Taxonomy - Yrke
definition: Länsantikvarie/1:e antikvarie
alternative label: 1:e antikvarie
alternative label: Länsantikvarie
broader: Museiintendenter m.fl.
related: JxVv btB MTz
related: 9puE nYg crq
broad match: C2621

Pistmaskinförare
type: Concept
in scheme: JobTech Taxonomy - Yrke
definition: En pistmaskinförare kör pistmaskiner, som används för att preparera skidbackar och längdskidspår. Deras arbetsuppgifter inkluderar att jämna ut snön, att göra underlaget mer hållbart och snön i bättre skick. Pistmaskinförare kan också behöva underhålla och reparera maskinerna, samt följa väderförhållanden för att anpassa arbetet efter snöförhållandena. Det är ett fysiskt och ofta nattligt arbete, då många backar förbereds under natten för att vara redo för skidåkning på morgonen. Det krävs att den som kör pistmaskin innehar förarbevis eller utbildningsbevis. Utbildningsbeviset erhålls efter teoretisk utbildning, och förarbeviset kan ansökas efter 200 maskintimmar. Källa: Arbetsförmedlingen
broader: Anläggningsmaskinförare m.fl.
related: j7Cq ZJe GkT
related: Mxyf t2J iLA
broad match: C8342

Lager- och terminalpersonal
type: Concept
in scheme: JobTech Taxonomy - Yrke
definition: Registrerar, kontrollerar och styr material- och varuflöden. Planerar och kontrollerar leveranser samt planerar lagerhållning och utnyttjande av lagerkapacitet. Tar emot gods samt plockar, packar och lastar gods med hjälp av exempelvis truck. Kontrollerar och registrerar varor. Hit hör inte Hamnarbetare/Stuveriarbetare (9331) Lastare (9332) Logistiker (2141) Packare (9320) Reservdelsspecialist/Bildelsspecialist (7231)
broader: Lagerpersonal och transportledare m.fl.
related: swdt CX9 tHZ
related: C4321
related: mP5U LLJ 746
related: Xuhg PcG kq2
related: Ahfa KuY 4HZ
related: X8qr J5g uXi
related: pGts PKK c8W
related: HeXq amc ABd
related: Zk4h jP4 e85
related: ijHY aHk ADE
related: 2E7x 4v4 9hN
related: ZsuU rPA r6g
related: tKd2 9Ei PTQ
related: vRUW 21M 5Eg
related: sKLW XyF UGt
related: zf1U Xnn g1Z
related: 1oA3 GfA 82Y
related: C4322
related: oKRb tGE xJF
related: CiMi 7ax tXs
related: S1ZP o8S Jxf
related: yXmf iKi 7ci
related: LrLw Ndd fzd
related: rYxp wbM YSG
related: ZF9w knj 7cW
related: KwWd Ffq 2kE
related: jPhb feC ypa
related: v3dQ 9We tK5
related: W6CD Roo RCf
related: rwir xvu 443
related: kJrF R2t t6F
related: E98A 6gA wC5
related: fUsF dN1 eKE
narrower: Lagerplanerare
narrower: Depåtekniker
narrower: Leveransbevakare
narrower: Godsmottagare
narrower: Lageradministratör
narrower: Lagerarbetare/Terminalarbetare
broad match: ASGV zcE bWf

Torg- och marknadsförsäljare
type: Concept
in scheme: JobTech Taxonomy - Yrke
definition: Torg- och marknadsförsäljare
broader: Torg- och marknadsförsäljare
narrower: Torg- och marknadsförsäljare m.fl.

Engine programmer, games
type: Concept
in scheme: JobTech Taxonomy - Yrke
definition: En Engine Programmer inom spelbranschen är en specialist som utvecklar, optimerar och underhåller spelmotorer, den tekniska grund som alla spel byggs på. Engine Programmer utvecklar och förbättrar spelmotorer för att stödja nya funktioner, plattformar och prestandakrav. Arbetar med avancerade tekniska områden som rendering, fysik, ljud, nätverk och verktyg för innehållsskapande. I arbetsuppgifterna ingår även att optimera kod och system för att säkerställa hög prestanda och stabilitet på olika plattformar såsom PC, konsoler och mobila enheter. Källa: Arbetsförmedlingen, diverse jobbannonser
broader: Utvecklare inom spel och digitala media
related: 2Lgw fMQ qSg
related: apaJ 2ja LuF
related: 8too bEs 7NU
related: 9puE nYg crq
related: PpaS NaH 3Zo
related: 2TYW oUc vdg
broad match: C2513

Packmästare, tillverkning
type: Concept
in scheme: JobTech Taxonomy - Yrke
definition: Packmästare, tillverkning
broader: Arbetsledare inom tillverkning
related: wTEr CBC bqh
broad match: C3122

Postdoktor/Postdoc
type: Concept
in scheme: JobTech Taxonomy - Yrke
definition: Postdoktor/Postdoc
alternative label: Postdoc
alternative label: Postdoktor
broader: Forskarassistenter m.fl.
related: MVqp eS8 kDZ
related: qChh YAM LnK
broad match: C2310

Andra yrken inom bygg, tillverkning och godshantering
type: Concept
in scheme: JobTech Taxonomy - Yrke
definition: Andra yrken inom bygg, tillverkning och godshantering
broader: Yrken med krav på kortare utbildning eller introduktion
narrower: Hamnarbetare och ramppersonal m.fl.
narrower: Grovarbetare inom bygg och anläggning
narrower: Handpaketerare och andra fabriksarbetare

Traktorförare, industri
type: Concept
in scheme: JobTech Taxonomy - Yrke
definition: Traktorförare inom industrin kör och manövrerar traktorer och liknande maskiner för att transportera material, gods och produkter inom industriområden, fabriker och lager. Arbetsuppgifterna omfattar lastning och lossning av material samt intern transport mellan olika produktionsenheter, upplag och lagerlokaler. Traktorförare utför även dagliga kontroller av traktorer och kan genomföra enklare underhåll och rengöring av maskiner. Arbetsuppgifterna kan variera beroende på industrins art och arbetsplatsens storlek. Källa: Arbetsförmedlingen
broader: Truckförare
related: ASGV zcE bWf
related: nPWW dsv Yar
related: STSQ MKh bDT
related: qsur Drd Qit
broad match: C8344

Medicinsk massageterapeut
type: Concept
in scheme: JobTech Taxonomy - Yrke
definition: Medicinska massageterapeuter behandlar kroppens mjukdelsvävnader och har mer djupgående kunskaper om akuta och kroniska tillstånd. Inom yrket har utövare vanligvis även fördjupade kunskaper i sjukdomslära, skadelära, fysiologi, muskelfunktionsdiagnostik. Man behärskar oftast flera massageterapeutiska metoder och ortopedisk medicin (ej manipulation), mjuk ledbehandling, idrottsmedicin och andra behandlingstekniker. Källa: Kroppsterapeuternas Yrkesförbund
broader: Massörer och massageterapeuter
related: Uuf1 GMh Uvw
broad match: C3255

SOS-operatörer m.fl.
type: Concept
in scheme: JobTech Taxonomy - Yrke
definition: Tar emot, samordnar och förmedlar larm om inträffade eller befarade olyckor i luften, på land och till sjöss. Leder arbetet med räddningsinsatser. Tar emot inbrottslarm, överfallslarm, driftlarm och trygghetslarm på larmcentral eller ledningscentral för bevakningsföretag.
broader: Andra bevaknings- och säkerhetsyrken
related: Tbmr JxZ xFU
related: cP48 5in VHb
related: JYAn p1X 6sb
related: C4223
related: ZuYj ADn tk7
related: GJMf PhP 9Wg
related: PUmv CTm y4F
related: VZnB ncX RkD
related: HvZg eSR eTg
related: fJdB viK AaA
related: V7H8 ZNj EaQ
related: 95zi TE5 Vn1
related: 3j4u Apm 7WU
related: 3BCu HTK YSF
related: zMmn 1mh 6D5
related: 5bZF pBx 2d1
related: UdGt dND Baj
related: FmHS DMU bcA
related: Aycb CjZ V3v
related: Q7eC B7g QiU
related: U7tq xS3 4Fq
related: 529J hso 1qx
related: H4HG MWG uUg
related: xGUW kW5 Sek
related: q4p6 d9U 7D4
related: kSYg iMb xDo
related: GEnM 1dA HhG
related: PRQR oGE 7re
related: Hj1c 4vV Sck
related: fhcp fFw Lbj
related: myz9 nz9 hTL
related: dkg2 8Qz rzx
related: 2XXJ ofn VAD
related: rYGi DpZ kWM
related: AJ1n nmt RAn
related: BBVW 3YU 8p5
related: y3DA xBr 1Hx
related: NBB1 SKC gAP
related: sYfy ekc ifq
related: pYDp S3J AxM
related: 6Pzb STS Bp1
related: 4Eu4 E8D evB
related: DKF3 A8Z Een
related: aS2A GJ6 Lm2
related: c7vU NA5 spi
related: zYzY NTD VoE
related: RraB CNP qxC
related: B1Lw z6j 4n7
related: y77a Hix Pk3
related: 9tdC NoC UMe
related: EDot QFC 42f
related: t6jQ DTS zMr
related: JJiW W7Z kgc
related: hHSG YTn NHt
related: aAtJ q2r J5n
related: C3152
related: s3uM Qg2 qFr
related: P6te TBF 8fh
related: 5uUD NPd BGe
related: vV6H PJe ftR
related: hoPi hPE fWg
narrower: SOS-operatör
narrower: Larmoperatör
broad match: E7hm BLq fqZ

Modersmålslärare, förskola
type: Concept
in scheme: JobTech Taxonomy - Yrke
definition: Modersmålslärare, förskola undervisar elever med annat modersmål än svenska i deras modersmål samt ger stöd i språk- och kunskapsutveckling inom olika ämnen. Vanliga arbetsuppgifter är att planera och genomföra modersmålsundervisning, följa upp och bedöma elevernas språkliga utveckling samt erbjuda studiehandledning på modersmålet för att förklara ämnesinnehåll. För att kunna arbeta som modersmålslärare behövs goda kunskaper i både svenska och modersmålet. Källor: Arbetsförmedlingen, Skolverket
broader: Förskollärare
related: UJrE Sez A7p
related: Hmav MLe kRR
related: wUit ryo qLN
related: MVqp eS8 kDZ
broad match: C2342

Borgerlig officiant
type: Concept
in scheme: JobTech Taxonomy - Yrke
definition: Borgerliga officianter leder begravningsceremonier utan religiöst innehåll. Arbetsuppgifterna inkluderar samtal med anhöriga, planering av tal, val av musik och texter samt genomförande av ceremonin. Utomstående officianter kan förmedlas genom en begravningsbyrå eller genom kommunen. Källa: Sveriges Begravningsbyråers Förbund, Arbetsförmedlingen
broader: Begravnings- och krematoriepersonal
related: GazW 2TU kJw
broad match: C5163

Snabbmatspersonal, köks- och restaurangbiträden m.fl.
type: Concept
in scheme: JobTech Taxonomy - Yrke
definition: Snabbmatspersonal, köks- och restaurangbiträden m.fl.
broader: Snabbmatspersonal, köks- och restaurangbiträden m.fl.
narrower: Pizzabagare m.fl.
narrower: Kafé- och konditoribiträden
narrower: Restaurang- och köksbiträden m.fl.

Forskare, mikrobiologi
type: Concept
in scheme: JobTech Taxonomy - Yrke
definition: Forskare, mikrobiologi
broader: Cell- och molekylärbiologer m.fl.
related: kJeN wmw 9wX
related: TXx8 Mgv BGZ
broad match: C2131

Dykinstruktör
type: Concept
in scheme: JobTech Taxonomy - Yrke
definition: Dykinstruktörer leder och undervisar personer i dykningsteknik, säkerhetsrutiner och användning av dykutrustning. Arbetsuppgifterna inkluderar planering och genomförande av utbildningar och träningspass, säkerhetsgenomgångar samt anpassning av instruktioner efter deltagarnas nivå. Dykinstruktören följer gällande säkerhetsföreskrifter och bidrar till trygg och säker dykverksamhet. Källa: Svenska sportdykarförbundet, Arbetsförmedlingen
broader: Idrottstränare och instruktörer m.fl.
related: MVqp eS8 kDZ
broad match: C3423

GIS- och kartingenjörer
type: Concept
in scheme: JobTech Taxonomy - Yrke
definition: Utför karttekniskt arbete. Utför utredningar och beräkningar samt sammanställer och analyserar mätdata. Framställer kartor av olika slag.
broader: Ingenjörer och tekniker
related: C3118
related: tCER yDZ XnW
related: Z6GN aCQ MDc
related: eHy7 eMm 1mG
related: hPCG 7QS L3g
related: 61zA BvK zDd
related: d4fX YoT QQc
related: oaiv GsB AFK
related: 74Mw JUN VKx
related: K5JR yfk 8oj
related: KBrp Hsu A2n
related: HPfU aG2 m9r
related: yFgG g8k r6r
related: YAdb Wwj b3N
related: HW3B CwN pst
related: 5zvT Shq tmc
related: jSAi QKc JQk
related: 5zLG 8jA HgL
related: VD9r h3d rN5
related: drj3 CKp Mpp
related: zSm1 NQU MRf
related: otrX HCb Vqx
related: JRvh wrY RmW
related: Rf1n 6Sj exu
related: xxw6 hUh P1W
related: KfEn V5y npV
related: 86sT wc6 QsW
related: Y197 2oc uoE
related: CWfM RL9 V4t
related: oXnh Ffg j7m
related: gn6h J5L oGf
related: qMXe 1Di KMe
related: RrWD 6m1 ess
related: XgGJ nFz J5g
related: hFN6 Rbb Apq
related: wZpC X9a xzG
related: nDqs 2d5 jqu
related: c1VR Sgw DZ6
related: zSbb 3rY Z7H
related: ZTk2 7eo CUb
related: xPKu a6v Yuo
related: DwsM hE1 xFm
related: ciEe aq4 2fG
narrower: Mätningsingenjör
narrower: GIS-ingenjör
narrower: Sjömätare
narrower: Kartingenjör
narrower: Geodatasamordnare
narrower: Lantmäteriingenjör
broad match: 6Hq3 tKo V57

Ljudingenjör
type: Concept
in scheme: JobTech Taxonomy - Yrke
definition: Ljudingenjör
broader: Ljus-, ljud- och scentekniker
related: Tjzc ETd nQH
related: 9puE nYg crq
related: d1Ao 9bY 7Kn
related: DpFg Kjt 9oc
broad match: C3521

Publikvärd
type: Concept
in scheme: JobTech Taxonomy - Yrke
definition: Publikvärdar ger service till besökare vid olika evenemang. Arbetet innebär i huvudsak att hjälpa besökare vid olika evenemang, både inomhus och utomhus. Beroende på arbetsplats varierar arbetsuppgifter, men innebär främst att svara på frågor och guida besökare. Man kan till exempel arbeta med att skanna biljetter, hantera köer och se till att säkerhet för publik och besökare efterlevs. Man kan vara mer eller mindre delaktig i planering och utförande av evenemang, så som utställningar och scenproduktioner. Källa: Arbetsförmedlingen
broader: Övriga servicearbetare
related: UdVa jRr 9DE
related: 84eC uNy AVi
related: 9puE nYg crq
related: MVus XEk T3f
broad match: C9629

Civilingenjör, byggnadskonstruktion
type: Concept
in scheme: JobTech Taxonomy - Yrke
definition: En civilingenjör inom byggnadskonstruktion förverkligar arkitekternas visioner till praktiska och stabila bygglösningar genom att planera och utforma byggnadens strukturella system. Byggnadskonstruktören säkerställer att byggnaden är stabil, säker och uppfyller byggnormer och regler. Konstruktören måste ha djup kunskap om byggnadsmaterial, tekniker och hållbarhet för att skapa bärande system som kan motstå olika laster. Genom nära samarbete med arkitekten bidrar konstruktören till att förverkliga projektets design och säkerställa byggnadens långsiktiga hållbarhet och säkerhet. Med en civilingenjörsexamen inom byggnadskonstruktion har en specialisering skett under utbildningen. Källa: Arbetsförmedlingen
broader: Civilingenjörsyrken inom bygg och anläggning
related: zKMn 5RR g7J
related: VqeG MmD xZH
related: j7Cq ZJe GkT
related: uGPQ AM2 QFD
related: w9QT jbP 78P
related: anYS 5AR JRk
related: ja7J P8X YC9
related: REMR Xdm V3o
related: 9aS8 Jr9 EpW
broad match: C2142

Samhällsekonom
type: Concept
in scheme: JobTech Taxonomy - Yrke
definition: Samhällsekonom
broader: Nationalekonomer och makroanalytiker m.fl.
related: X82t awd Qyc
related: Yb1w sSy Rh9
broad match: C2631

Manikyrist
type: Concept
in scheme: JobTech Taxonomy - Yrke
definition: Manikyrister arbetar med vård av händer och naglar. Arbetsuppgifterna omfattar nagelklippning, filning, nagelbandsvård, handmassage samt applicering av nagellack. I vissa fall erbjuds även enklare dekoration. Yrket liknar nagelterapeut, med skillnad att manikyrister oftare utför mer grundläggande nagelvård och nagelterapeuter utför mer avancerad och estetisk behandling. Källa: Arbetsförmedlingen
alternative label: Manikurist
broader: Övriga skönhets- och kroppsterapeuter
related: Uuf1 GMh Uvw
related: gdtQ wWM ypC
broad match: C5142

Kökschef
type: Concept
in scheme: JobTech Taxonomy - Yrke
definition: Kökschef
broader: Restaurang- och kökschefer
related: Wdrn dah P9e
related: RWVm Q6T W8k
related: 84Jy YeX gky
related: epLc SkD cbT
related: yPUU zrr Gwj
related: bh3H Y3h 5eD
related: ScKy FHB 7wT
related: CfV6 yw8 JEU
broad match: C1412

Möbeltapetserare
type: Concept
in scheme: JobTech Taxonomy - Yrke
definition: Möbeltapetserare arbetare med omklädsel och stoppningsreparation av möbler eller nytillverkning kopplat till stoppning och klädsel. Möbeltapetserare arbetar främst med omklädning av möbler. Man kan även arbeta med nytillverkning, till exempel dynor, sänggavlar, soffor och plymåer. Då möbeltapetserare är ett hantverk utförs arbetet främst manuellt med handverktyg. Visst arbete kan även ske maskinellt beroende på arbetsplats. Källa: Sveriges tapetserarmästare, Arbetsförmedlingen
broader: Tapetserare
related: PaxQ o1G wWH
related: qPzb dxR 83e
broad match: C7534

Arbetsledare inom bygg och tillverkning m.m.
type: Concept
in scheme: JobTech Taxonomy - Yrke
definition: Arbetsledare inom bygg och tillverkning m.m.
broader: Yrken med krav på högskolekompetens eller motsvarande inom teknik
narrower: Arbetsledare inom bygg, anläggning och gruva
narrower: Arbetsledare inom tillverkning

AV-tekniker
type: Concept
in scheme: JobTech Taxonomy - Yrke
definition: AV-tekniker
broader: Ljus-, ljud- och scentekniker
related: 8too bEs 7NU
related: 9puE nYg crq
related: yhCP AqT tns
related: d1Ao 9bY 7Kn
related: Ca24 Km8 pCe
related: qNBg gjt KRz
broad match: C3521

Mediasäljare
type: Concept
in scheme: JobTech Taxonomy - Yrke
definition: Mediasäljare säljer annonstid eller reklamutrymme i olika medier, så som tidningar, radio, TV eller digitala plattformar. Arbetsuppgifter inkluderar att kontakta potentiella kunder, presentera och anpassa reklamlösningar efter deras behov, förhandla avtal och följa upp försäljningen. Källa: Arbetsförmedlingen
broader: Övriga förmedlare
related: mw6w UmF 4HF
related: rDcj Tao TJJ
related: RPTn bxG ExZ
related: CaCH FL5 Ue4
related: PMBL yAt Mxo
related: qnaD dvA TSi
related: bmaW CoW Erm
related: fMm7 EfU y2u
related: s6ho Ep8 dPi
related: Qtgg LG7 78Y
related: Dc3s mJg 5pq
broad match: C3339

Avdelningschef, smältverk
type: Concept
in scheme: JobTech Taxonomy - Yrke
definition: Avdelningschef, smältverk
broader: Arbetsledare inom tillverkning
related: epLc SkD cbT
related: bh3H Y3h 5eD
related: wTEr CBC bqh
broad match: C3122

Fartygselektrikerelev
type: Concept
in scheme: JobTech Taxonomy - Yrke
definition: Som fartygselektriker/el-elev arbetar du, under ledning av elektroingenjören, med underhåll av all elektrisk utrustning ombord. I arbetsuppgifterna ingår även felsökning, reparationsarbeten samt nyinstallation av bland annat reglerautomatik, övervakningssystem och distributionssystem. Källa: Stena Line
broader: Industrielektriker
related: ASGV zcE bWf
related: XouD cCj HZN
related: yhCP AqT tns
broad match: C7412

Elingenjör
type: Concept
in scheme: JobTech Taxonomy - Yrke
definition: Elingenjören ser till att skapa kraft, ljus, värme och olika tekniklösningar inom både nybyggnation och i befintliga anläggningar. Elingenjören är nyckelpersonen som med ett ingenjörsmässigt tänk ansvarar för hela processen från förstudie, konstruktion, installation till underhåll. Elingenjören har bred teknisk kunskap och tar det eltekniska ansvaret i projekt. Det är också elingenjören som samordnar de tekniska lösningarna med närliggande yrkesgrupper. Källa: Installatörsföretagen
broader: Ingenjörer och tekniker inom elektroteknik
related: 6Hq3 tKo V57
related: Bhz5 fdK Vm6
related: qrK9 mSf ZAS
related: 19FP aGg T9P
related: gJyj 8oq nJq
related: GoYt vLg cqd
related: cP7N zd9 Tov
related: u6N5 brU TJi
related: 4zE3 Yb3 h51
broad match: C3113

Arkivassistent
type: Concept
in scheme: JobTech Taxonomy - Yrke
definition: Arkivassistent organiserar, kategoriserar och bevarar fysiska och digitala arkivhandlingar. Vanliga arbetsuppgifter är förteckningsarbete, insortering av akter, inventering, gallring, skanning, formatkonvertering, dokumentation samt systemförvaltning av digitala arkivsystem. Yrket innebär bland annat god datorvana och kunskap om relevant lagstiftning för offentlig sektor. Servicekänsla och samarbetsförmåga är viktiga egenskaper, då arbetet ofta sker i nära samarbete med arkivarier, registratorer och andra administratörer. Arbetsgivare återfinns främst inom offentlig sektor, såsom kommuner och regioner. Källa: Arbetsförmedlingen
broader: Arkiv- och biblioteksassistenter m.fl.
related: dr52 Jxj a9t
related: X82t awd Qyc
related: Cayu sLt fRH
related: 92Ad HsF a7V
related: iU6U 84b 9BK
related: gkob pxk eSa
related: 9bn8 N1j hdP
related: gvNC bzx BBY
broad match: C4415

Gatuförsäljare
type: Concept
in scheme: JobTech Taxonomy - Yrke
definition: Gatuförsäljare säljer produkter och tjänster på allmänna platser. Som gatuförsäljare säljer man varor och tjänster direkt till kunder på allmänna platser. Källa: Arbetsförmedlingen
broader: Torg- och marknadsförsäljare m.fl.
related: UdVa jRr 9DE
related: rDcj Tao TJJ
related: RPTn bxG ExZ
related: 8Pve 1jp oA7
broad match: C9520

Bildingenjör/BING, film/BING, TV
type: Concept
in scheme: JobTech Taxonomy - Yrke
definition: Bildingenjör ansvarar för att säkerställa TV-bildens kvalitet genom justering av kamerors kontrast, färgbalans och exponering så att alla kameror ger en enhetlig bild. Vanliga arbetsuppgifter är kalibrering av kameror, felsökning och underhåll av teknisk utrustning som kameror och bildmixrar samt övervakning av bildsignaler under produktion och sändning. Källa: Arbetsförmedlingen, Yrkesnämnden för Film och TV
alternative label: BING, TV
alternative label: BING, film
alternative label: Bildingenjör
broader: Bild- och sändningstekniker
related: 8too bEs 7NU
related: 9puE nYg crq
related: d1Ao 9bY 7Kn
broad match: C3521

Valsverksoperatörer
type: Concept
in scheme: JobTech Taxonomy - Yrke
definition: Styr och övervakar valsverk i vilket stål eller andra metaller bearbetas till ämnen eller färdiga produkter.
broader: Process- och maskinoperatörer, vid stål- och metallverk
related: s4Az rUA W9W
related: VPF1 UZM 9Kd
related: yKjJ 5U7 Yan
related: ws2R MBQ svX
related: aHCV VsV LiD
related: C8122
related: aF3J SgE uck
related: kGn2 k7L 2fz
related: nrd9 mk6 kYA
related: qQ61 EQR rcz
related: VTwt 5Fe 6bW
related: Q7eC B7g QiU
related: irgx SkW 5Qo
related: MMfW 4Tt uDu
related: KDzy Hra iVr
related: KHzo xzz YxW
related: fhcp fFw Lbj
related: 7R2h f7R SRB
related: X4EU ZC7 QmK
related: p23C KtD nkN
related: uenm 75h fEh
related: ZTk2 7eo CUb
related: C8121
narrower: Valsverksoperatör
narrower: Valsare
broad match: wTEr CBC bqh

Terminolog
type: Concept
in scheme: JobTech Taxonomy - Yrke
definition: Terminolog
broader: Översättare, tolkar och lingvister m.fl.
related: 9puE nYg crq
broad match: C2643

Maskinoperatör tryckeri
type: Concept
in scheme: JobTech Taxonomy - Yrke
definition: Maskinoperatörer vid tryckerier arbetar inom den grafiska industrin och framställer maskinellt tidningar, böcker och andra trycksaker. Arbetet innebär i huvudsak att övervaka olika typer av tryckpressar så att produktionen fungerar. I arbetsuppgifterna ingår att ställa in och anpassa tryckpressarna efter den produkt som ska göras, till exempel genom att ställa in färger och format. Källa: Arbetsförmedlingen
broader: Tryckare
related: sohf NNK K2m
related: d6dj FZJ Yxh
related: UdVa jRr 9DE
related: CHZM nLG 4DD
related: BHHP jZy upf
related: 86ZD 8kQ QMj
related: fKeM f9y PjK
related: Cudf 2JV HFs
related: WGkS sqt iU1
related: smEA YhC j93
related: 6Qmj Y23 Wo8
related: TW2X N6C c9U
related: y4BR MpS snu
related: bQ43 5E1 K7G
related: Z8Xd C5H dsQ
related: rotb eYE VN4
related: 6tfS gpv CCn
related: 4r88 cmD egZ
related: Xz3e UtV KRq
related: meMw S2y F3u
related: PES3 Rja uCc
related: RbwC MzF Vuu
related: qYja N8T UBB
related: 8QvA WhW vBT
related: kHHH gR1 mKn
related: zHJ1 tXG nA6
related: wTEr CBC bqh
related: jRJB ohn NyD
related: XNpG hRB kvz
related: 9Q1z WN2 Z4a
related: qBJX gSk ov9
related: BYK2 Xof ngq
related: t8no 3rc yc9
related: kmfY 2Yx bSY
related: bRc9 JAd AJc
related: PmsM k3C BUE
broad match: C7322

Driftledare växtodling
type: Concept
in scheme: JobTech Taxonomy - Yrke
definition: Driftledare inom växtodling planerar och leder arbetet med odling av jordbruksväxter. Arbetsuppgifterna omfattar att välja grödor och fördela dem på marken, planera och genomföra sådd, gödsling, bevattning och skörd samt övervaka växtodlingens utveckling under säsongen. Driftledaren arbetsleder personal, samordnar maskinunderhåll, hanterar inköp av utsäde och insatsvaror samt utför tillhörande administration. Beroende på arbetsplats kan rollen även innefatta ekonomisk uppföljning, dokumentation och kontakt med leverantörer och kunder. Arbetsuppgifterna kan överlappa med gårdsmästare och driftchef, särskilt på mindre företag där yrkesrollerna kan vara bredare. Se även yrkena Förman växt- och grönsaksodling samt Gårdsmästare växtodling. Källa: Arbetsförmedlingen, Gröna jobb
broader: Odlare av jordbruksväxter, frukt och bär
related: EZSo v2U J4N
related: oyUQ Naf D7b
related: VuuL 7CH adj
broad match: C6111

IT-strateg
type: Concept
in scheme: JobTech Taxonomy - Yrke
definition: IT-strateg
broader: Övriga IT-specialister
related: N7wD gcS SYh
related: HZCX fLJ 3e7
related: apaJ 2ja LuF
related: sRVH u42 AH3
related: eRPn Eig uYZ
related: dxss bDk wZT
related: 8rw5 eDz ryq
related: Grve QjC rkT
broad match: C2519

Serviceingenjör, metallurgi
type: Concept
in scheme: JobTech Taxonomy - Yrke
definition: Serviceingenjör, metallurgi
broader: Ingenjörer och tekniker inom gruvteknik och metallurgi
related: 6Hq3 tKo V57
broad match: C3117

Miljöchef
type: Concept
in scheme: JobTech Taxonomy - Yrke
definition: Miljöchef
broader: Övriga administrations- och servicechefer
related: CZM6 zQK RQ1
related: 9cKT XWe F8g
related: epLc SkD cbT
related: HkGa zfm eG9
related: bh3H Y3h 5eD
related: t9BZ Zz3 DJb
broad match: C1219

Reklamchef
type: Concept
in scheme: JobTech Taxonomy - Yrke
definition: En reklamchef ansvarar för att planera, leda och samordna företagets reklam- och marknadsföringsaktiviteter. De utvecklar och implementerar reklamstrategier, hanterar budgetar, förhandlar med mediaparter, och analyserar resultaten av kampanjer. I grund och botten ser de till att företagets reklam når ut till rätt målgrupp på ett effektivt sätt. Rapporterar ofta till marknadschefen och är en del av marknadsavdelningen. Källa: Arbetsförmedlingen
broader: Informations-, kommunikations- och PR-chefer
related: epLc SkD cbT
related: acAo ecX Cqw
related: 9jcY igT iXP
related: bh3H Y3h 5eD
related: s6ho Ep8 dPi
related: 9i5L HsQ CrL
broad match: C1222

Förmedlare m.fl.
type: Concept
in scheme: JobTech Taxonomy - Yrke
definition: Förmedlare m.fl.
broader: Yrken med krav på högskolekompetens eller motsvarande inom ekonomi och förvaltning
narrower: Evenemangs- och reseproducenter m.fl.
narrower: Arbetsförmedlare
narrower: Fastighetsmäklare
narrower: Övriga förmedlare
narrower: Fastighetsförvaltare
narrower: Speditörer och transportmäklare

First assistant director
type: Concept
in scheme: JobTech Taxonomy - Yrke
definition: First assistant director planerar och leder produktionen under filminspelningar för att säkerställa att arbetet flyter effektivt och enligt schema. Vanliga arbetsuppgifter är att bryta ner manus i detalj och göra en inspelningsplan som tar hänsyn till skådespelares schema, miljöer och tekniska moment. Under inspelningen ingår ansvar för att koordinera dagliga arbetsmoment, hålla koll på scener och kamerainställningar, informera skådespelare och team om schemaändringar samt lösa praktiska problem som kan uppstå. Källa: Arbetsförmedlingen, Film i Väst, Scen & Film
broader: Inspicienter och scriptor m.fl.
related: nfQq ivJ puA
related: UVe3 68W zwX
related: 8too bEs 7NU
related: 9puE nYg crq
related: VxoX kff AP7
broad match: C3435

Brännmästare
type: Concept
in scheme: JobTech Taxonomy - Yrke
definition: Brännmästare
broader: Arbetsledare inom tillverkning
related: wTEr CBC bqh
broad match: C3122

Flygplatschef
type: Concept
in scheme: JobTech Taxonomy - Yrke
definition: Flygplatschef
broader: Verkställande direktörer m.fl.
related: epLc SkD cbT
related: bh3H Y3h 5eD
related: Kudt xHV ZoA
broad match: C1120

Vägingenjör
type: Concept
in scheme: JobTech Taxonomy - Yrke
definition: Vägingenjör
broader: Ingenjörer och tekniker inom bygg och anläggning
related: eCcY JRi LtM
related: j7Cq ZJe GkT
related: oGAk yxq z5Y
related: Wuvt 3Y5 KgH
related: BqQM 34W b8Y
related: ZjCw 9JF b8s
broad match: C3112

Länsjägmästare
type: Concept
in scheme: JobTech Taxonomy - Yrke
definition: Länsjägmästare
broader: Förvaltnings- och planeringschefer
related: epLc SkD cbT
related: bh3H Y3h 5eD
related: qhGu KLd qYS
related: VuuL 7CH adj
broad match: C1213

Ljussättare
type: Concept
in scheme: JobTech Taxonomy - Yrke
definition: Ljussättare planerar, installerar och sköter ljussättning vid film- och TV-inspelningar och teaterföreställningar. Vanliga arbetsuppgifter är att hantera, rigga och anpassa ljuskällor efter produktionens behov, samarbeta med regissör och fotograf för att följa den visuella visionen samt att underhålla och säkerställa fungerande belysningssystem under produktionen. Källa: Arbetsförmedlingen, Yrkesnämnden för Film och TV
broader: Ljus-, ljud- och scentekniker
related: u7zK VKN 8Ht
related: 8too bEs 7NU
related: 9puE nYg crq
related: d1Ao 9bY 7Kn
broad match: C3435

Personal- och HR-chefer
type: Concept
in scheme: JobTech Taxonomy - Yrke
definition: Ansvarar för strategiska personalfrågor som personalplanering, rekrytering och personalutveckling. Ansvarar för lönepolicy och löneförhandlingar. Svarar för arbetsmiljö- och personalsociala frågor samt tolkning av arbetsrättsliga lagar och avtal. Utformar riktlinjer, följer upp och utvärderar verksamheten mot uppsatta mål.
broader: Personal- och HR-chefer
related: nt4p 6kN Lt2
related: m4zm ts4 Wy5
related: 4hwd 4fh RD7
related: E13X ZF3 PAb
related: yfTA ncB DSc
related: pTEm Nhr fFq
related: R9MA bax BHa
related: t59S 14G MhK
related: cDU5 op5 Tuk
related: hcdL zcK zgq
related: fmGj KZi C9x
related: UHaA wGd jgx
related: TZcg h4T aMT
related: UH9g R5v MCx
related: 29MP yhF mjx
related: oLnc YZn 3bm
related: 8tYq EXD Xwm
related: 4Ya1 1Rv EB3
related: NLvg 4MQ jaa
related: Aasw 39M r6u
related: ZzN5 m7B 5CY
related: 2rqG WLp em4
related: FuRR uys fcp
related: oTKR GSK e9B
related: Nksx 4oe fEQ
related: eThQ HCv mY6
related: DfC4 KjK LTC
related: pmgB Pvx 9fK
related: U4tf ZBt Xu1
related: 2Mtp uhe wmS
related: HxKb aYu Sif
related: A5jq Gnu 8tG
related: Gt5f wdi FSJ
related: CHKu 2Kb 1Q2
related: jfd3 4zS fjt
related: q7Mx gjU F9q
related: pxZi bWS MSr
related: zXNU zXR hGd
related: z7wE 9xb 3jX
related: n72g UEM zTH
related: Betk ZCh mY9
related: C1212
related: K5j7 sjo LYB
related: 3i8p YXT 3B5
related: uNtd ZYt HFA
related: M43v ZfW wod
narrower: HR-chef
broad match: bh3H Y3h 5eD

Bokbindare m.fl.
type: Concept
in scheme: JobTech Taxonomy - Yrke
definition: Sköter och övervakar maskiner som binder böcker, broschyrer, tidskrifter m.m. Utför hantverksmässig bokbindning med hjälp av skärmaskiner och pappersklippare.
broader: Prepresstekniker, tryckare och bokbindare m.fl.
related: 1pcB LAg gPo
related: VPF1 UZM 9Kd
related: C7323
related: nuYb r64 qWu
related: mVBn UY1 zeB
related: fuFA Qda mVx
related: RaDd AtE FWF
related: XjE9 ee3 9si
related: ewkc A5i niU
related: qQ61 EQR rcz
related: VTwt 5Fe 6bW
related: c434 HmJ yfv
related: KDzy Hra iVr
related: Lx4t dXX fuS
related: Xvpz tfe Tsn
related: rxKk ceH 68T
related: Hs3Q Zqk SfZ
related: QxQa FdM zBK
related: PCAh AqH Ntv
related: Ggo3 fkg smB
related: XXRh Lgx 2L9
related: dc4D AuL X43
related: DTWx 7jG 4Vb
related: uenm 75h fEh
related: dWbY gXC Frx
related: W1Zt 3Xa U2Z
narrower: Bokbinderiarbetare
narrower: Bokbindare
broad match: wTEr CBC bqh

Biomedicinare
type: Concept
in scheme: JobTech Taxonomy - Yrke
definition: Biomedicinare
broader: Farmakologer och biomedicinare
related: kJeN wmw 9wX
related: JFLA dn8 zDF
related: dhYX bNK gYa
related: GCey hFD cwv
related: esAo 5sX FPv
broad match: C2131

Gruppledare bank
type: Concept
in scheme: JobTech Taxonomy - Yrke
definition: Gruppledare inom bank leder och koordinerar en grupp medarbetare. Arbetsuppgifterna inkluderar planering av arbetsflöden, övervakning av dagliga banktransaktioner och säkerställande av att kundtjänst fungerar smidigt. Gruppledare utvecklar och implementerar strategier för att förbättra kundupplevelsen samt utbildar och coachar teammedlemmar. Arbetsuppgifterna omfattar även att hantera interna möten, lösa konflikter inom arbetsgruppen och följa bankens riktlinjer samt regulatoriska krav. Källa: annonser på Platsbanken
broader: Banktjänstemän
related: HxWx HTb RRU
related: xqgq CRg 5mv
related: X82t awd Qyc
related: bJiX 5La bXq
broad match: C3312

Jockey
type: Concept
in scheme: JobTech Taxonomy - Yrke
definition: Jockey
broader: Professionella idrottsutövare
related: 9puE nYg crq
broad match: C3421

Lifttekniker
type: Concept
in scheme: JobTech Taxonomy - Yrke
definition: Lifttekniker sköter och underhåller liftar vid skidanläggningar. Lifttekniker utför och dokumenterar reparationer samt underhåll av olika typer av liftar, enligt manualer och regelverk. Som lifttekniker kan man arbeta med släpliftar, luftburna liftar, kopplingsbara linbanor, gondoler och fasta stolbanor. Källa: Svenska skidanläggningars organisation
broader: Kranförare m.fl.
related: LNPg yYQ K7Q
related: sk2W vu1 XtH
related: yhCP AqT tns
related: fAB5 JWU vVb
related: jEgH xTs Xkt
related: k6wC 4jj qzG
broad match: C8343

Produktionsplanerare: kultur, media, film, dataspel
type: Concept
in scheme: JobTech Taxonomy - Yrke
definition: Produktionsplanerare: kultur, media, film, dataspel
broader: Regissörer och producenter av film, teater m.m.
related: cazJ ShH KDX
related: vFvp kJY PSk
related: X82t awd Qyc
related: 8too bEs 7NU
related: 9puE nYg crq
related: Cesw d3v ioU
broad match: C2654

Brandinspektör
type: Concept
in scheme: JobTech Taxonomy - Yrke
definition: Brandinspektörer arbetar främst med förebyggande brandskydd och säkerhet genom tillsyn, rådgivning och utbildning. Arbetsuppgifter inkluderar att genomföra tillsyn enligt lagen om skydd mot olyckor och lagen om brandfarliga och explosiva varor, utfärda tillstånd, svara på remisser och ge brandteknisk rådgivning till verksamheter och allmänhet. Brandinspektören kontrollerar brandskyddet på platser som skolor, vårdhem, bensinstationer och offentliga byggnader samt stödjer kommuner och andra aktörer i deras brandskyddsarbete. Rollen kan även innefatta olycksutredningar och operativ insatsledning vid större händelser. Brandinspektörer samverkar med myndigheter och fungerar som en länk mellan teknisk brandsäkerhet och praktiskt arbete i samhället. För att bli brandinspektör krävs vanligtvis erfarenhet som brandman och utbildning inom tillsyn och brandskydd, till exempel MSB:s utbildningar inom skydd mot olyckor. Källa: Storstockholms brandförsvar, MSB, Arbetsförmedlingen
broader: Brandingenjörer och byggnadsinspektörer m.fl.
related: 6QkY Ajy k7X
related: E7hm BLq fqZ
related: X462 rdK aPk
related: 2dDC u1B EMY
related: 7srG Pv4 bLw
related: vNxA Gv9 Dym
related: 24Fe mGc Qqt
related: mGvA FSc 1oR
broad match: C3112

Nutritionist/Näringsfysiolog
type: Concept
in scheme: JobTech Taxonomy - Yrke
definition: Nutritionist/Näringsfysiolog
alternative label: Nutritionist
alternative label: Näringsfysiolog
broader: Cell- och molekylärbiologer m.fl.
related: kJeN wmw 9wX
related: TXx8 Mgv BGZ
broad match: C2265

Reklamkonsulent
type: Concept
in scheme: JobTech Taxonomy - Yrke
definition: Reklamkonsulent
broader: Marknadsanalytiker och marknadsförare m.fl.
related: NkLX if5 iTw
related: RPTn bxG ExZ
related: orgp gkH CEU
related: 4XyY MCb svG
broad match: C2431

Forskningschef
type: Concept
in scheme: JobTech Taxonomy - Yrke
definition: Forskningschef
broader: Forsknings- och utvecklingschefer
related: YEze JT6 dwU
related: aq6s CAo Y4R
related: epLc SkD cbT
related: bh3H Y3h 5eD
related: XWN2 6He XXU
related: fecL B5k fpz
related: cWkJ fFL z23
related: LLrX U5R tRb
related: q5fw 14c Jvk
related: XSzm ibM mQT
broad match: C1223

Prefekt
type: Concept
in scheme: JobTech Taxonomy - Yrke
definition: Prefekt
broader: Förvaltnings- och planeringschefer
related: ocJi 3r6 mCD
related: MVqp eS8 kDZ
broad match: C1213

Stuckatör
type: Concept
in scheme: JobTech Taxonomy - Yrke
definition: Stuckatör
broader: Murare m.fl.
related: j7Cq ZJe GkT
related: Zko3 gps YY9
broad match: C7112

Reklamationshandläggare
type: Concept
in scheme: JobTech Taxonomy - Yrke
definition: En reklamationshandläggare arbetar med att hantera och utreda kunders reklamationer och klagomål. Yrket innebär att vara länken mellan företag och kund när något gått fel med en produkt eller tjänst, och att säkerställa att kunden får korrekt hjälp och information. I arbetsuppgifterna ingår att ta emot och registrera reklamationer via telefon, e-post eller digitala system samt utreda reklamationsärenden genom att samla in information, analysera bakgrund och fatta beslut om åtgärder. Källa: Arbetsförmedlingen, div jobbannonser
broader: Kundtjänstpersonal
related: UdVa jRr 9DE
related: LruQ oTH fdL
related: RPTn bxG ExZ
related: 7jbm hNw UBZ
related: MQgV rcW 493
related: KwpP WJJ i2b
related: hZfF twE 5HL
related: nTRF rJB 1Kp
related: piax 7ci iFt
broad match: C4225

Ekonomi- och finanschefer
type: Concept
in scheme: JobTech Taxonomy - Yrke
definition: Ansvarar för att upprätta budget samt för redovisning och bokslut. Kontrollerar att verksamhetens resurser används på ett effektivt sätt. Utformar riktlinjer, följer upp och utvärderar verksamheten mot uppsatta ekonomiska mål. Redovisar resultat och rapporterar till företagsledningen eller motsvarande. Har personalansvar.
broader: Ekonomi- och finanschefer
related: FYk9 RXp 7c5
related: eox4 5Lc W7C
related: aSt1 LXQ MCx
related: QKMc eKX sUE
related: C1211
related: h6B2 Egm LWp
related: 7tVG 9zf 7mw
related: NFFS CHg kHG
related: 5X5B xr3 VSY
related: G7Qq r7L 5Jo
related: dBC3 Rwt Mue
related: awjU C3D XEJ
related: UH9g R5v MCx
related: PFWV Si2 w7i
related: SmZd Jaa BeY
related: Z8gz 6SV bKW
related: 8tYq EXD Xwm
related: ZzN5 m7B 5CY
related: zzSp k6L WgN
related: FfWB f5U 9NB
related: Nksx 4oe fEQ
related: W7Qf aRY FEo
related: BsBK j8o Guh
related: eThQ HCv mY6
related: w7J6 vmA z5h
related: UJcF SrQ Jvw
related: 1dVh cZS Exw
related: Gt5f wdi FSJ
related: BQRS U7c PTG
related: q7Mx gjU F9q
related: VfP9 2xd g2h
related: zXNU zXR hGd
related: bHQT Bhn w3S
related: Lq2i vZo BEx
related: 4fRg DA4 Dj3
related: rF2g ssp 4nK
related: ocfq A1f wsR
related: DWsz s47 DrL
related: Y4Fw JZQ AcA
related: EhH5 quw XQK
narrower: Revisionschef
narrower: Ekonomichef
narrower: Ekonomidirektör/Finanschef
narrower: Redovisningschef
narrower: Budgetchef
narrower: Internrevisionschef
broad match: bh3H Y3h 5eD

Fastighetstekniker
type: Concept
in scheme: JobTech Taxonomy - Yrke
definition: Fastighetsteknikern ansvarar för den dagliga tillsynen av fastigheters tekniska system när det gäller drift, underhåll och skötsel. Fastighetsteknikern ser till att alla system fungerar. Att vara serviceinriktad och en god problemlösare är viktiga egenskaper för fastighetstekniker, liksom kompetens inom exempelvis styr- och reglerteknik. En stor del av arbetet innebär att energieffektivisera och driftoptimera befintliga anläggningar och system inom exempelvis värme och ventilation. Källa: Fastighetsbranschens Utbildningsnämnd
alternative label: Drifttekniker, fastighet
broader: Fastighetsskötare
related: cp4R asV yr4
related: qgJ4 DHZ RLF
related: xU4b TiA oq4
related: f1Ba 4Kg 5px
related: qZBD ojL Pmu
related: 2Wvr mdT vg4
related: 13MR Y1o 7cZ
related: yhCP AqT tns
related: mQjp gTg MSB
related: MfCa GDm 9Nh
related: LqAM RzL obR
related: TrZF UK2 W7b
related: e1kc Q2s rGv
related: BpTq 1bD tvY
related: Kss7 Rn1 LVo
related: R5j2 9H4 uPe
broad match: C5153

Väderobservatör
type: Concept
in scheme: JobTech Taxonomy - Yrke
definition: Väderobservatörer utför väderobservationer. Arbetet innebär i huvudsak att biträda meteorologer med utföra och dokumentera väderobservationen med hjälp av meteorologisk mätutrustning. Väderobservationer används vid planering av flygaktivitet. Beroende på arbetsplats kan mer analytiska arbetsuppgifter ingå, så som att följa upp och övervaka väder och tekniska system på längre sikt. Källa: Arbetsförmedlingen
broader: Övriga servicearbetare
related: UdVa jRr 9DE
related: X82t awd Qyc
related: yhCP AqT tns
broad match: C9623

Riskingenjör, försäkring
type: Concept
in scheme: JobTech Taxonomy - Yrke
definition: En riskingenjör inom försäkring arbetar med att identifiera, bedöma och minimera risker för att förebygga skador och optimera kostnader för försäkringsbolaget. Detta innefattar att besöka företag, genomföra riskanalyser, ge råd om skadeförebyggande åtgärder och se till att försäkringsavtal är anpassade efter kundens behov. Källa: Gallagher, Länsförsäkringar
broader: Försäkringssäljare och försäkringsrådgivare
related: X82t awd Qyc
broad match: C3321

Projekteringsingenjör, bygg och anläggning
type: Concept
in scheme: JobTech Taxonomy - Yrke
definition: Projekteringsingenjör, bygg och anläggning
broader: Civilingenjörsyrken inom bygg och anläggning
related: DSNm F5W RYF
related: j7Cq ZJe GkT
related: RKCD jAX L5Z
related: FivA aLA v3K
related: anYS 5AR JRk
related: aK59 4wG 6MR
related: 68qB d4r TeA
broad match: C2142

Övriga pedagoger med teoretisk specialistkompetens
type: Concept
in scheme: JobTech Taxonomy - Yrke
definition: Utför annat pedagogiskt arbete än inom 2320-2352. Exempel på arbetsuppgifter: Undervisar på musikskolor eller inom konst, musik, teater och dans. Planerar, genomför och utvärderar undervisning i svenska för invandrare.
broader: Andra pedagoger med teoretisk specialistkompetens
related: 2Ap2 M9U ysh
related: nc8Q xa8 Qga
related: XHAq 71w 6ds
related: uFLG cFC Byr
related: pcME EVx dvv
related: 8KAJ ba5 JDv
related: hwDJ iXC B8Y
related: C2354
related: k6MA ohd SJ3
related: Cg3t mwF yoD
related: HUBG Mz2 X1G
related: C2359
related: cCCb atw NGu
related: C2353
related: UjRh U4o ZQd
related: 34Za JYJ enj
related: WDYk Eaw waU
related: 5X1o fHn pMG
related: sURo MBj hGS
related: 8kWs pQb 7ek
related: SpRR JX9 6o6
related: RB89 DRA QTW
related: C2355
related: N27M U5G Ux8
related: 2MZZ Lx1 35z
related: TUzi ouJ rsk
related: ooLP cHi X9L
related: qjeU 6sK 9Uf
related: Nr9J 1i6 3g4
related: EKgP yUZ YZ7
related: YB8M ikA v3T
related: oLnc YZn 3bm
related: Jabg 1fo Xyy
related: d5xo xnJ kTN
related: CmL8 zFo zAm
related: 2tZt cwT 6sb
related: wuWZ Z7w Wmv
related: EXu6 HF5 bX4
related: mawv gMy ccw
related: PymD 7GM So3
related: 7khP WW5 rXM
related: 9aL8 d8L EqM
related: qwHa w4A tTc
related: oEw1 Qjy UYx
related: eR21 C9o cfV
related: YZBX oAY ppB
related: kvrB bj8 7rx
related: bQ5f pxA Z4v
related: p81A Exc dmL
related: DBn6 6G2 316
related: dPZ7 vLM oEo
related: 2AJo aNK WaH
related: 7ytF sAd 1He
related: 2GWC neE dye
related: Wqgy GW1 GcW
related: US4W Foa CSg
related: v2C1 xKm 7c3
related: ybBX sQv XzN
related: hpr6 Ss4 rQF
related: EnyW 9G1 qVW
related: Uv4X nYz w9Y
related: tRfU MQV Y44
related: xdu3 Xj3 gxk
related: QCbY tXp F6u
related: nRnK V2X eQn
related: U5qa Ztp cJQ
related: cGaM QVm wL5
related: PNjY HiX R8u
related: REsw SDD gVV
related: Ja9G 65u vQy
related: gecs 3yE fj5
related: z8Zg 56f kX4
related: c2YE oK3 f1u
related: bTEw zCS SyR
related: WeqB z7W 7Mu

Specialisttandläkare inom bettfysiologi
type: Concept
in scheme: JobTech Taxonomy - Yrke
definition: Specialisttandläkare inom bettfysiologi är en specialiserad legitimerad tandläkare med en djupare kunskap och kompetens inom sitt område. Specialisttandläkare är en skyddad titel och bara den som har bevis om specialistkompetens får kalla sig specialist i sin specialitet. Vanliga arbetsuppgifter är att utreda, diagnostisera och behandla komplexa fall inom exempelvis oral kirurgi, ortodonti, pedodonti, parodontologi, oral protetik, bettfysiologi, endodonti eller odontologisk radiologi. Specialisttandläkare samarbetar ofta i team, tar emot remisser från allmäntandläkare och bidrar med expertkunskap till både patienter och kollegor. Arbetsuppgifterna kan även omfatta konsultationer, handledning och ibland ansvar för verksamhet eller personal inom sitt specialistområde. Källa: Arbetsförmedlingen, Sveriges Kommuner och Regioner, Socialstyrelsen
broader: Tandläkare
related: NYW6 mP6 vwf
related: proQ odJ 3A7
related: NgG1 5qR MDs
related: SRs7 HCS tVp
related: bvS2 Vmd o8t
related: 2B4i UAL 5kg
related: Fp9R ekx WAo
broad match: C2261

Övriga ingenjörer och tekniker
type: Concept
in scheme: JobTech Taxonomy - Yrke
definition: Utför annat tekniskt arbete än inom 3111-3117. Exempel på arbetsuppgifter: Samordnar tillverkning av metall-, glas-, keramik-, pappers-, läder-, textil- och träprodukter. Utför konstruktions-, ritnings- och beräkningsarbete. Gör kvalitets- och produktkontroller.
broader: Ingenjörer och tekniker
related: uvcb DuX NW8
related: 9Hvc DYG iqB
related: tg8L maz wMN
related: sA2V erA 3WN
related: z1pf B99 fpz
related: oaiv GsB AFK
related: 11rR H3J EQQ
related: t3fW PJW LzP
related: CPkF 611 wtC
related: LXoc wxV 73h
related: 74Mw JUN VKx
related: kLLw dnR M38
related: YK2s pxn YWW
related: krCG SCu myw
related: NtWF zFu Mhg
related: HPfU aG2 m9r
related: PGDh 8HQ 4BZ
related: bwYY qC7 5xE
related: Ry2v 4Hx 6ta
related: HW3B CwN pst
related: VTwt 5Fe 6bW
related: xsSg pg2 Bpq
related: Z2XD GQ9 qvM
related: uwev L2n fpz
related: cCGX 6Y8 87C
related: Udbb Eay MuR
related: C3119
related: ppUe nsQ hn5
related: irPd z5v 2o1
related: hPnF VPk shg
related: ZzN5 m7B 5CY
related: nwS5 PLZ bYa
related: a1Sf mey gVk
related: BcFG Ckm S65
related: nF6J MNc ZxS
related: 2rqG WLp em4
related: Q6DB h8V mc7
related: drj3 CKp Mpp
related: MfG9 ybe zVS
related: svq3 7VJ Zst
related: AepF hH2 pT7
related: Rf1n 6Sj exu
related: W4er Syp Wrt
related: tZ8d VuQ V7z
related: kvLG 4uo M5p
related: rbHc QBR 3NU
related: fKNz Mn2 YCQ
related: t9Um wBh Cb4
related: NB2C zFs C9F
related: Y197 2oc uoE
related: AjDN 1rp vzp
related: AEgv 4gP ndv
related: S4Ku uT7 yuV
related: 22JT eUQ XPo
related: 4y7C Lsh EPM
related: Lgt8 xjP 7Fq
related: 3Sj1 uuL y1A
related: hFN6 Rbb Apq
related: wZpC X9a xzG
related: MT1a Nyq DGQ
related: 3zgs 61Q etM
related: 2ZDh 43R pbp
related: YHb7 uwj 7NG
related: Bbj8 8y7 XJ5
related: cjzD 31U USf
related: 4aj7 yr6 q8r
narrower: Kontrolloperatör, metallprodukter
narrower: Kontrolltekniker, textil, trä, glas, förpackningar
narrower: Kontrollingenjör, textil, trä, glas, förpackningar
narrower: Kvalitetsmätare, metallprodukter
narrower: Produktionsingenjör, textil, trä, glas, förpackningar
narrower: 3D-printingspecialist
narrower: Fältgeotekniker
narrower: Textilingenjör
narrower: Planeringstekniker, textil, glas, trä, förpackningar

Kvalitetsbedömare livsmedel
type: Concept
in scheme: JobTech Taxonomy - Yrke
definition: Kvalitetsbedömare inom livsmedel bedömer livsmedelsprodukter utifrån olika egenskaper och dokumenterar eventuella användningsområden och åtgärder. Arbetet utförs huvudsak genom hjälp av sensoriska kriterier eller maskinella verktyg. Man sorterar livsmedelsprodukter efter kvalitet och avgör användningsområden. I arbetet kan även ingå att kassera skadade eller utgångna livsmedel. En stor del av arbetet utgörs av att dokumentera kvalitetsklassning och ansvara för att kvalitetssystem efterlevs. Källa: Arbetsförmedlingen
broader: Provsmakare och kvalitetsbedömare
related: oLLu fmV Awg
related: ycY1 wjn Ta2
related: yAye 9hv xG5
related: mfHr xa3 uzE
related: wTEr CBC bqh
broad match: C7515

Väktare
type: Concept
in scheme: JobTech Taxonomy - Yrke
definition: Väktare arbetar med att förebygga och förhindra skador orsakade av brott, brand eller liknande. Arbetet innebär i huvudsak att skydda egendom genom att utföra säkerhetsåtgärder såsom stängning och låsning av dörrar, behörighetskontroller samt övervakning av kameror. Arbetsuppgifter inkluderar larmhantering, in- och utpassering samt bevakning av brand- och brottsplats. Väktare arbetar både i allmänna och avgränsade områden. Man kan arbeta ensam eller med kollega, till fots eller med personbil. Källa: Bevakningsbranschens Yrkes- och Arbetsmiljönämnd, Arbetsförmedlingen
broader: Väktare och ordningsvakter
related: dVbW QJc xZi
related: mVFi H6e sdA
related: kbxp rT2 xPk
related: 1X1T eYJ eCP
related: szCs YGv qZ9
related: E7hm BLq fqZ
related: 6uzz syq yAQ
related: ELzt 1xd QNp
related: 1fDM wnP hJn
related: 5Bzs pwT GNL
related: sQQr knn MP2
related: udgz Ahc AxU
related: BLsd RkB Mdp
related: uR9N 7nG HvK
related: scnr 5yd SiS
related: 5Zzr Hin fBo
related: QCYB H6A qi5
related: LhBG yka oyJ
related: kmkW oj9 nXA
related: Hr34 hcc dsa
related: nh2y By3 4V2
related: 8gsz ELw pd8
related: ZxQC 4QG adV
broad match: C5414

Föreningskonsulent
type: Concept
in scheme: JobTech Taxonomy - Yrke
definition: Föreningskonsulent
broader: Planerare och utredare m.fl.
related: X82t awd Qyc
related: k65Q Ckn A3j
related: TZe9 NsN uce
related: tjSs xkP 7xn
broad match: C2422

Övriga civilingenjörsyrken
type: Concept
in scheme: JobTech Taxonomy - Yrke
definition: Utför annat specialistarbete än inom 2141-2146. Exempel på arbetsuppgifter: Utvecklar metoder och produkter samt ansvarar för produktion och teknisk utveckling vid tillverkning av metall-, glas-, keramik, pappers-, läder, textil- och träprodukter. Ansvarar för kvalitets- och produktkontroller.
broader: Civilingenjörsyrken
related: 9Hvc DYG iqB
related: oYvX MYb coJ
related: tg8L maz wMN
related: CpsQ 4fg kpZ
related: oaiv GsB AFK
related: LXoc wxV 73h
related: 74Mw JUN VKx
related: kLLw dnR M38
related: L7X3 qqn RBr
related: C2149
related: YK2s pxn YWW
related: krCG SCu myw
related: PGDh 8HQ 4BZ
related: Ry2v 4Hx 6ta
related: T8Gi jkC 6PC
related: jSAi QKc JQk
related: xsSg pg2 Bpq
related: meMN wmY RPf
related: Z2XD GQ9 qvM
related: uwev L2n fpz
related: cCGX 6Y8 87C
related: ppUe nsQ hn5
related: irPd z5v 2o1
related: xLeF idB 1zC
related: WVJF FXY Sqk
related: 9F3h HNn mtg
related: a1Sf mey gVk
related: BcFG Ckm S65
related: 2rqG WLp em4
related: iqT9 zoW Pj5
related: EU8B Vir DXH
related: ePwi BWJ RUG
related: MfG9 ybe zVS
related: AepF hH2 pT7
related: PEty jNu Uqd
related: KYbD ssj ZUf
related: fizC gvj YaQ
related: W4er Syp Wrt
related: tZ8d VuQ V7z
related: kvLG 4uo M5p
related: 1223 u6p gjG
related: yXmf iKi 7ci
related: fKNz Mn2 YCQ
related: t9Um wBh Cb4
related: NB2C zFs C9F
related: RMG2 TS5 Mnp
related: Y197 2oc uoE
related: c2YE oK3 f1u
related: AjDN 1rp vzp
related: AEgv 4gP ndv
related: zvWF nhx VMx
related: Lgt8 xjP 7Fq
related: 3Sj1 uuL y1A
related: wZpC X9a xzG
related: MT1a Nyq DGQ
related: aJz8 o6C Kgy
related: bTEu 9kx J94
related: 3zgs 61Q etM
related: 2ZDh 43R pbp
related: ezVu GhE b3b
related: YHb7 uwj 7NG
related: iLDD cky Lir
related: Bbj8 8y7 XJ5
related: cjzD 31U USf
related: 4aj7 yr6 q8r
narrower: Produktutvecklare
narrower: Akustikingenjör
narrower: Civilingenjör, teknisk fysik
narrower: Forskare, trafiksäkerhet
narrower: Patentingenjör/Patentkonsult
narrower: Standardiseringsingenjör
narrower: Kontrollingenjör
broad match: 6Hq3 tKo V57

Småmaskinmekaniker
type: Concept
in scheme: JobTech Taxonomy - Yrke
definition: Småmaskinmekaniker arbetar med underhåll av mindre maskiner och fordon. Småmaskiner inkluderar till exempel trädgårdsmaskiner, ATV, motorsågar och robotgräsklippare. Mindre maskiner och fordon innehåller ofta en hel del teknik. Därför kan arbetsuppgifter variera mellan rutinmässigt underhåll och avancerade reparationer och felsökningar. Vanliga arbetsplatser är till exempel serviceverkstäder och företag som förmedlar hyrmaskiner. Källa: Arbetsförmedlingen
broader: Motorfordonsmekaniker och fordonsreparatörer
related: hNRg CZ8 RzA
related: yhCP AqT tns
related: pxwK AHZ Rmh
related: EtAZ kR1 RAd
related: xyFb FMF 5ZV
broad match: C7231

Informations-, kommunikations- och PR-chefer
type: Concept
in scheme: JobTech Taxonomy - Yrke
definition: Formulerar och ansvarar för mål och strategier för informationsprogram och kampanjer samt förhandlar reklamkontrakt. Utformar riktlinjer, följer upp och utvärderar verksamhetens uppsatta mål inom information, reklam, kommunikation och PR. Svarar för budget samt fördelar resurserna inom verksamheten. Har personalansvar.
broader: Informations-, kommunikations- och PR-chefer
related: aZDe N9r xic
related: NAd1 Hcr KGC
related: UH9g R5v MCx
related: SmZd Jaa BeY
related: 8tYq EXD Xwm
related: ZzN5 m7B 5CY
related: jfmZ FfR NFm
related: DXNc cU4 j4N
related: C1222
related: Nksx 4oe fEQ
related: eThQ HCv mY6
related: Gt5f wdi FSJ
related: q7Mx gjU F9q
related: D6ev Zwt x83
related: kWj3 ZLo MqK
related: zXNU zXR hGd
related: RMG2 TS5 Mnp
related: W2rU Grv nuf
narrower: Presschef
narrower: Reklamchef
narrower: Informationschef/Kommunikationschef
narrower: PR-chef
narrower: Ateljéchef
narrower: Mediachef
broad match: bh3H Y3h 5eD

Säkerhetsingenjör industri
type: Concept
in scheme: JobTech Taxonomy - Yrke
definition: Säkerhetsingenjörer inom industri arbetar med riskhantering, kvalitetssäkring och utveckling av säkerhetsrutiner, främst inom olika tekniska och industriella verksamheter. Arbetet skiljer sig beroende på tekniskt område, vanliga arbetsplatser är inom kärnteknisk industri, energidistribution och industriell produktion. Arbetsuppgifterna innefattar bland annat att granska orsaksanalyser, rapportera och följa upp incidenter och säkerställa efterlevnad av säkerhetskrav. Tillsyn och rapportering till kontrollmyndigheter är vanligt förekommande. Efterfrågad bakgrund varierar beroende på arbetsgivare, vanligtvis efterfrågas ingenjörsexamen inom teknisk inriktning, arbete med säkerhetsfrågor samt specialistkunskap om lagstiftning och regelefterlevnad. Säkerhetsprövning och registerkontroll inför tillsättning förekommer vid arbete inom samhällskritisk infrastruktur. Källa: Arbetsförmedlingen
broader: Säkerhetsinspektörer m.fl.
related: E7hm BLq fqZ
related: gxAi 7i4 AeR
related: r51y eyE FK8
related: t7Ae Y7E kEC
related: CfhU bjy PAY
broad match: C3257

Folkhälsostrateg
type: Concept
in scheme: JobTech Taxonomy - Yrke
definition: Folkhälsostrateger arbetar centralt i kommuner, ofta vid kommunledningskontoret, med att driva strategiska folkhälsofrågor på samhälls- och befolkningsnivå. Arbetsuppgifter handlar om att integrera folkhälsa i fysisk planering, kollektivtrafik och bostadsbyggande samt att säkerställa att folkhälsa ingår i styrande dokument och policys. Strategen ansvarar även för att följa upp kommunens folkhälsoinsatser med indikatorer och nyckeltal. Arbetet sker i nära samverkan med politiker och chefer och innebär ingen direkt verksamhet mot medborgare utan fokuserar på övergripande planering och samordning. Källa: HälsoAkademikerna, SACO, Arbetsförmedlingen
broader: Planerare och utredare m.fl.
related: Kivp s2z KMe
related: X82t awd Qyc
related: Lot6 PJ4 gc7
related: Su1n Ndk oQu
related: WEZD Jjq Ftp
related: gA47 pwK UZq
related: TZe9 NsN uce
broad match: C2422

Forskare, bakteriologi
type: Concept
in scheme: JobTech Taxonomy - Yrke
definition: Forskare, bakteriologi
broader: Cell- och molekylärbiologer m.fl.
related: kJeN wmw 9wX
related: TXx8 Mgv BGZ
broad match: C2131

Driftingenjör, värmeverk
type: Concept
in scheme: JobTech Taxonomy - Yrke
definition: Driftingenjör, värmeverk
broader: Ingenjörer och tekniker inom maskinteknik
related: 6Hq3 tKo V57
related: UR5X 8Rh 3kM
related: UGYN 7xm YX3
related: 9xCx hvs 9Br
related: JP6W weX YxB
related: 9aEn jPz gJs
related: ooQN ueS Zbk
related: ZfWc ugZ qva
related: HMMf 6pv 59w
broad match: C3115

Materialprovare
type: Concept
in scheme: JobTech Taxonomy - Yrke
definition: Materialprovare arbetar med provning inom industrin. Arbetet innebär att man arbetar med olika materialprovningsmetoder som gör det möjligt att undersöka tillstånd och kvalitet hos ett material eller en produkts egenskaper utan att skada eller påverka det. Materialprovning förekommer även som arbetsuppgift inom ingenjörs- och laborantyrken, dock med andra och mer tekniskt specifika metoder. Källa: Arbetsförmedlingen
broader: Underhållsmekaniker och maskinreparatörer
related: YZc8 RAD t5t
related: ynFn k8s Em6
related: yhCP AqT tns
related: 91Mv FfT KjY
broad match: C7233

AT-läkare
type: Concept
in scheme: JobTech Taxonomy - Yrke
definition: AT-läkare är en nyexaminerad läkare som genomgår en praktisk handledd utbildning för att få sin läkarlegitimation. AT (allmäntjänstgöring) är en tidsbestämd utbildningstjänst under 18 månader med grundkravet läkarexamen. AT-läkare har kliniska arbetsuppgifter inom sjukvårdens olika specialiteter, med fokus på akut- och vardagssjukvård. Vanliga arbetsuppgifter inkluderar att ta anamnes, göra kliniska undersökningar, utvärdera behandlingsresultat, deltaga i medicinska konferenser och samarbeta med andra yrkesgrupper. AT-läkaren får också regelbundna utbildningar. Källa: Arbetsförmedlingen, Karolinska Universitetssjukhuset, Sveriges Läkarförbund
broader: AT-läkare
related: NYW6 mP6 vwf
related: qCV1 mLc VcF
broad match: C2211

Industrirörmontör
type: Concept
in scheme: JobTech Taxonomy - Yrke
definition: Industrirörmontör arbetar på större industrier som har så kallade processledningar, det kan t.ex. vara pappersbruk, kemiska industrier och läkemedelsindustrier. Det som finns i rören kan vara fjärrvärme, fjärrkyla, olja, radioaktiva ämnen och olika typer av gaser och syror. Sådana rör får givetvis aldrig läcka så det är viktigt att installationerna av rören är väl utförda för att produktionen ska vara säker och effektiv. En industrirörmontör jobbar både med reparationer och med nybyggnad av industrier. Industrirörmontören får sitt certifikat efter ett branschprov som avslutar lärlingsanställningen och den teoretiska grundutbildning Källa: VVSYN
broader: VVS-montörer m.fl.
related: Xu4H Epi Pra
related: j7Cq ZJe GkT
related: SsEN eS9 Syj
related: ja7J P8X YC9
related: K47J 4Mr SGn
related: anqH Jqa 8pA
related: vngt gzG BEe
broad match: C7126

Skräddare och ateljésömmerskor m.fl.
type: Concept
in scheme: JobTech Taxonomy - Yrke
definition: Tar fram förslag till modeller, tillverkar mallar och mönster. Skär ut plaggdelar och andra detaljer i tyg, skinn och andra material för tillverkning av kläder och andra konfektionsprodukter. Designar och syr klädesplagg efter kunders önskemål. Ändrar och lagar kläder av tyg och pälsskinn.
broader: Skräddare, tapetserare och läderhantverkare m.fl.
related: nrx5 WCL dQg
related: d2xr WGs DiJ
related: Qg8J Y3i sW3
related: FLCT 2j9 DJK
related: C7531
related: CyJj qdS YWe
related: wXRm Aq3 9D8
related: YcrR 5QB 3XL
related: vMmw iyy 7Ga
related: 8G1B Scm 3Y5
related: D9SR j4J K9u
related: zixj gXu ubi
related: ryXf E4d FYU
related: HisK J3q rwb
related: PL1m xg5 QsL
related: Ckww 8Ti pWh
related: S7Pv V3N xPp
related: W1DU LPz fEs
related: t1Up 1qe RLs
related: eYUf EBb QwC
related: CVaf GGe Les
related: Uqth qM3 Fyn
related: BK7Q 44f DdJ
related: ULic TRf EY1
related: CU3J MtX Z8H
related: WQNz 27E sLw
related: yYrg 8jy LLa
related: 3x5t vjd SyZ
related: ZZMD BTk L6q
related: dUhr KgG HSB
related: C7532
related: M8Wg d9Y zku
related: VczR HmG PmN
related: 2XGY TET niQ
related: GpSA U5b LJx
related: dUHY hcw 59o
related: ovid cY3 7eX
related: NC4R 5KK MY1
related: kvLG 4uo M5p
related: Z3nB Ecc B6h
related: W6gX bwM 5HC
related: Kkri iAK Exo
related: RH49 KqW Mmu
related: hyt9 v8M YZc
related: wBu8 sKV SiA
related: X4EU ZC7 QmK
related: 5Rxf C8e 7mE
related: 7uRS nMU TNH
related: ujiH ETf VHh
related: EEHe A7S AUe
related: haMy QRx 7vg
related: 3Q7L bEc UAm
related: dyoy LDv Sx5
related: Bp5h Ayb C8S
related: 43v8 evE cUE
related: ZJ9M Qdb jfW
related: hYpk RYx y3V
related: wuJq zrd SKb
related: fBVg bGH 1Dm
related: jCad yb6 u9f
related: UnLx jpF J86
related: moLD 8yo 61d
related: NrJn nRJ TeL
related: xFSm Qwi edR
related: koMr VoX RA3
related: uKA9 HNf 8iW
related: 1UP7 eXY PLN
narrower: Körsnär
narrower: Mönsterritare, tyger
narrower: Modist
narrower: Kostymtekniker/Påklädare
narrower: Sömmerska konfektion
narrower: Produktutvecklare konfektion
narrower: Kostymassistent
narrower: Tillskärare

Minister
type: Concept
in scheme: JobTech Taxonomy - Yrke
definition: Minister
broader: Politiker
related: bh3H Y3h 5eD
broad match: C1111

Virkesmätare
type: Concept
in scheme: JobTech Taxonomy - Yrke
definition: Virkesmätare mäter och bedömer kvalitet på virke. Som virkesmätare arbetar man ofta vid ett sågverk, en massaindustri eller virkesterminal. Virketsmätningen ligger till grund för att virket värderas och sorteras riktigt. Man har därför goda kunskaper om lika trädslag och typer av angrepp. Ofta arbetar man på en virkesmätningsförening, då det ingår i yrket att vara neutral både till säljare och köpare. Beroende på typ av virke används olika mätmetoder, inklusive stockmätning, travmätning och skäppmätning. Virkesmätning kan även ske på distans genom så kallad fjärrmätning. Källa: Gröna jobb, Arbetsförmedlingen
broader: Skogsarbetare
related: tRGc STG tNt
related: X82t awd Qyc
related: xAEY CVS H2t
related: VuuL 7CH adj
broad match: C6210

Hemslöjdskonsulent
type: Concept
in scheme: JobTech Taxonomy - Yrke
definition: Hemslöjdskonsulent främjar och utvecklar traditionellt hantverk och slöjd i samarbete med skolor, föreningar och hantverkare. Arbetsuppgifterna innefattar planering och ledning av kurser, workshops och utställningar samt rådgivning till slöjdare och organisationer. Hemslöjdskonsulenter förmedlar kunskap om material, redskap och slöjdtekniker och deltar i projekt för att förnya och utveckla slöjden som kulturyttring och näringsgren. De har vanligtvis goda kunskaper om hantverkstekniker, pedagogik och kulturarvsfrågor. Källor: Nationella hemslöjdsorganisationer, Arbetsförmedlingen
broader: Övriga utbildare och instruktörer
related: TSEM cVX 8KZ
related: Pk7F 7tH 2Py
related: 2Gtt nEA wa2
related: MVqp eS8 kDZ
broad match: C2359

Distriktssköterska
type: Concept
in scheme: JobTech Taxonomy - Yrke
definition: Distriktssköterska främjar hälsa, förebygger sjukdom samt ger vård och stöd till människor i alla åldrar, främst inom primärvård, hemsjukvård och skolhälsovård. Sjuksköterska är en skyddad titel med legitimationskrav. En distriktssköterska med specialistsjuksköterskeexamen får använda benämningen specialistsjuksköterska med inriktning mot distriktssköterska. Vanliga arbetsuppgifter är att bedöma vårdbehov, planera och leda omvårdnadsinsatser, utföra hälsokontroller, såromläggningar, vaccinationer och ge rådgivning både på mottagning, i hemmet och via telefon. Distriktssköterskan ansvarar ofta för samordning av insatser mellan olika vårdgivare, upprättar individuella vårdplaner och arbetar med att stärka patientens egenvård genom information och utbildning. Källa: Arbetsförmedlingen, Linköpings Universitet, Socialstyrelsen, Svensk sjuksköterskeförening
broader: Distriktssköterskor
related: NYW6 mP6 vwf
related: xPSA BcX uMs
related: bdAU CSx UPD
related: iHUz utu TX2
related: 6WkX LQZ GUJ
related: qPF8 YK4 nxf
broad match: C2221

Mobilutvecklare/Apputvecklare
type: Concept
in scheme: JobTech Taxonomy - Yrke
definition: Mobilutvecklare/Apputvecklare
alternative label: Apputvecklare
alternative label: Mobilutvecklare
broader: Mjukvaru- och systemutvecklare m.fl.
related: apaJ 2ja LuF
related: USRR ZMa vL6
related: KT6P hVH LRD
related: AheP reF mP1
related: YPYF JvM 2jG
related: mdYC WFr pnm
broad match: C2514

Övriga yrken inom socialt arbete
type: Concept
in scheme: JobTech Taxonomy - Yrke
definition: Utför annat socialt arbete än inom 2661-2663. Exempel på arbetsuppgifter: Handlägger mottagande och introduktion av nyanlända i kommun. Gör personutredningar och deltar i utslussningen vid intagnas återanpassning till samhället.
broader: Socialsekreterare och kuratorer m.fl.
related: xSLo P6B 2AF
related: DJgq zBj bKt
related: kb9z LG1 CZE
related: kojv fm9 4JL
related: dtGz Y9D hDx
related: zkwp b3X jLZ
related: aUr6 Rjg ja2
related: fksd G23 wke
related: 3HjW 1BP k3S
related: YaHy ShR uo4
related: MjPH 341 Zmc
related: 3vYj Rhf Voh
related: LN4p WxM 519
related: Uv9y v2g efa
related: Tmps QPE g3V
related: C2635
related: QAaJ QeY Q6P
related: FJgD TNa SE6
related: NUC3 y1C Scg
related: oJiB gms Rm7
related: cw2M p2W SuJ
related: SfoE zq7 ADN
related: VDem uq7 xxc
related: dYqT JBz NZE
related: 5wab aFK gdL
related: PVnT yGT SMb
related: qtHa AsU Cfo
related: Nig2 2pU GT8
related: crsV inU 16e
related: LmAP e75 pc6
related: 7scD 9YP iwV
related: jcpA Zfs nSz
related: crbK d4m D6r
related: RB7E jE5 MZ3
related: ZjBN Pwc L61
related: 6w8c jGr SfA
related: 2ZFC 6de YSB
related: Xbh5 n9L hrb
related: BCCY ZqV imt
related: B1rc wCc vne
related: w8bU wHe omF
related: 73gL 4uv p9J
related: 8u7A ze1 bvd
related: 6Ei3 fZV YKM
narrower: Frivårdsinspektör
narrower: Integrationshandläggare
broad match: GazW 2TU kJw

Civilingenjör, väg- och vattenbyggnad
type: Concept
in scheme: JobTech Taxonomy - Yrke
definition: En civilingenjör i väg- och vattenbyggnad arbetar med framtidens samhällsbyggnadsfrågor och infrastruktur. En civilingenjör i väg- och vattenbyggnad har kompetens inom planering, byggande och förvaltande av byggnader och anläggningar, transportsystem och samhällen, både nationellt och internationellt. Arbetsplatsen kan finnas inom privat såväl som offentlig sektor, den kan finnas hos mindre konsultfirmor eller stora entreprenadföretag. Källa: Arbetsförmedlingen
broader: Civilingenjörsyrken inom bygg och anläggning
related: RR5J rqG QeS
related: cgtj oyv RtN
related: j7Cq ZJe GkT
related: QU7k XcH KRo
related: anYS 5AR JRk
related: 2bSP LmU Vmr
related: ZGct 9Wn 5MN
related: ja7J P8X YC9
related: pYRo fyD zuQ
related: MW6R uxZ GUf
related: DUrN p2j o66
broad match: C2142

Skolbibliotekarie
type: Concept
in scheme: JobTech Taxonomy - Yrke
definition: Skolbibliotekarie
broader: Bibliotekarier och arkivarier
related: X82t awd Qyc
related: r4Qc kf5 pHE
related: D6zC nPP 22M
related: 9puE nYg crq
related: U6EM AtL hkW
related: Kpq9 fuM 2EZ
related: MK8n oUp SFR
related: Gm62 6hK Ymf
broad match: C2622

Stadsbyggnadschef/Stadsbyggnadsdirektör
type: Concept
in scheme: JobTech Taxonomy - Yrke
definition: Stadsbyggnadschef/Stadsbyggnadsdirektör
alternative label: Stadsbyggnadschef
alternative label: Stadsbyggnadsdirektör
broader: Chefer inom arkitekt- och ingenjörsverksamhet
related: 6Hq3 tKo V57
related: bEvs VgU 297
related: epLc SkD cbT
related: bh3H Y3h 5eD
related: vkae BCk aWg
broad match: C1213

Flygplatstekniker
type: Concept
in scheme: JobTech Taxonomy - Yrke
definition: Flygplatstekniker arbetar med säkerhet på minder och större flygplatser. Som flygplatstekniker bidrar du till att processer på flygplatsen fungerar och att passagerare får en säker flygtur. Vanliga arbetsuppgifter är att kontrollera säkerhet, lastning och lossning av flygplan, vinterfälthållning av bana och plattor samt att ha beredskap att släcka bränder och rädda liv. Källa: Transportfackens Yrkes- och Arbetsmiljönämnd
broader: Ramppersonal, flyttkarlar och varupåfyllare m.fl.
related: h6vP 5QN h2R
related: ejM5 RKC LpA
related: XZWT 1AW WjE
related: dh1E fQm 4FU
related: D1XM HBW ALM
related: ASGV zcE bWf
related: yhCP AqT tns
related: Hryy zVP uND
related: P1ue V5x RJo
related: zqto bt1 1Rc
broad match: C9333

Ingenjörer och tekniker inom elektroteknik
type: Concept
in scheme: JobTech Taxonomy - Yrke
definition: Utför tekniskt arbete i samband med konstruktion, tillverkning, montering, drift, underhåll och reparation av elektroteknisk utrustning och system. Utför konstruktions-, ritnings- och beräkningsarbete. Organiserar, leder och samordnar det praktiska arbetet vid tillverkning av elektrotekniska produkter. Provar och kontrollerar elektrotekniska produkter och anläggningar. Hit hör inte Civilingenjörsyrken inom elektroteknik (2143)
broader: Ingenjörer och tekniker
related: 7PHz phA t1T
related: FqWP 6FQ Wz5
related: ebrf 1Fe ksC
related: uvcb DuX NW8
related: Gk4E H9x ssE
related: A5HJ aMw BQt
related: Qpvg yTe ozK
related: azqw 7dF CkQ
related: eHy7 eMm 1mG
related: iUew moc BRk
related: Pzge iwX Jp9
related: DjRV REm VWr
related: tg8L maz wMN
related: 9xBC Q2v wt6
related: kjAi 8yN pgg
related: 61zA BvK zDd
related: jRmz YPq DJM
related: 4MQo 2b2 u1z
related: d4fX YoT QQc
related: z1Jn sEk Lmx
related: n5Ww Cc9 xYG
related: gnTS st6 iAd
related: o8wR 57f jv9
related: e89D KrX H3C
related: oaiv GsB AFK
related: g7gz 58E jaQ
related: 8Xp7 Tzo Y6X
related: ofcY XXh G4k
related: 74Mw JUN VKx
related: 2kEw jWL 6Zz
related: EuVK o4G CkD
related: Vc24 oqo Qgr
related: 6dUR Jvp y35
related: 6ZKB QVh xPs
related: K5JR yfk 8oj
related: yh11 sgo Z29
related: Ni4P t3u oM1
related: YK2s pxn YWW
related: krCG SCu myw
related: kfYc q1X SZ5
related: UuhP Skh QrH
related: NtWF zFu Mhg
related: xAbu uKA Jeu
related: K1Az 43o qWR
related: ByFL cg4 y91
related: 4fWV khE jfp
related: yFgG g8k r6r
related: 8ZhW wNv 5k9
related: bwYY qC7 5xE
related: ksNo 7bD ez3
related: 2vCi hQz Y9o
related: FnZT ewa vH7
related: 3W8b L9H Lh8
related: aphz ZZU HyV
related: P13a CeE fvz
related: YAdb Wwj b3N
related: PpQM 12A gFU
related: opLa Pe7 5yg
related: Qosk 7TN jwT
related: HW3B CwN pst
related: kJCx vqk SQG
related: 6yXa XxZ WSV
related: caWZ HUm yNp
related: zRtu fYj XC4
related: jSAi QKc JQk
related: qAPk 7uX SAU
related: ob2k Bcp XHY
related: Udbb Eay MuR
related: tNHP 38u Pjt
related: bMmc jnh BYV
related: AxPX zi5 1k9
related: irPd z5v 2o1
related: xeAT iPy tAW
related: jnGF SL1 AmF
related: 5YFb ak8 3EM

Arbetsledare, golv
type: Concept
in scheme: JobTech Taxonomy - Yrke
definition: Arbetsledaren inom golv är den som leder golvläggningen ute på byggarbetsplatsen. Arbetsledaren bevakar att maskiner och material finns på plats och samordnar arbetet med de entreprenörer. Arbetsledaren har ansvaret för att arbetet utförs enligt gällande ritningar och anvisningar och för att säkerhetsföreskrifterna följs. Källa: Arbetsförmedlingen
broader: Arbetsledare inom bygg, anläggning och gruva
related: j7Cq ZJe GkT
related: ja7J P8X YC9
broad match: C3123

Systemförvaltare
type: Concept
in scheme: JobTech Taxonomy - Yrke
definition: Systemförvaltare
broader: Systemförvaltare m.fl.
related: Pi28 x38 Uyn
related: Mxzw oHv 3bu
related: z51X ZUg 4hq
related: 7CGY BRt MVr
related: Scf5 5Bh iSS
related: Zq4U xqG Djw
related: YJnZ ms3 2sE
related: m5Rm bqK 5FB
related: dBDA Gtd id7
related: v3GC NwF b7J
related: 5Y9w qFV MHT
related: XGh3 gwX DdC
related: apaJ 2ja LuF
related: og5F Wxg pkj
related: vgbB FbP wAQ
related: A5hs bGP k8Q
related: 3jm6 shc DsF
related: XxpK ZAy GD4
related: YfK5 XNK fJj
related: GNPk QSL KDB
related: yMz3 j6a gjw
related: xzPY 24Q 7mh
related: eb9a JDD nkc
related: 4joz 9PT VAZ
related: JTCL Poa 8HC
related: yssg mpV gfr
related: 2Bg3 aHW WUd
related: oSc1 Nqk bJK
related: ety7 9hH QJS
related: zt1y 34f iXm
broad match: C2522

Medicinteknisk ingenjör
type: Concept
in scheme: JobTech Taxonomy - Yrke
definition: Högskole- eller universitetsutbildad person som arbetar med att se till att den medicintekniska utrustningen inom hälso- och sjukvården fungerar på ett säkert och tillförlitligt sätt. Källa: SKR
broader: Tekniker, bilddiagnostik och medicinteknisk utrustning
related: 6Hq3 tKo V57
related: qzxZ ksZ Vki
related: NmHK p8v jQi
related: 8L6h HwQ uoJ
broad match: C3211

Pastorsadjunkt
type: Concept
in scheme: JobTech Taxonomy - Yrke
definition: Pastorsadjunkt
broader: Präster
related: GazW 2TU kJw
broad match: C2636

GIS-samordnare
type: Concept
in scheme: JobTech Taxonomy - Yrke
definition: GIS-samordnare
broader: Planerare och utredare m.fl.
related: X82t awd Qyc
related: TZe9 NsN uce
broad match: C2422

Inköps-, logistik- och transportchefer
type: Concept
in scheme: JobTech Taxonomy - Yrke
definition: Formulerar och ansvarar för mål och strategier inom inköps-, logistik- och transportverksamhet. Utformar riktlinjer, följer upp och utvärderar verksamheten mot uppsatta mål för inköp, lagring, transporter och distribution. Deltar i förhandlingar med leverantörer, ansvarar för lagerhållning och lagerutnyttjande, svarar för lasthantering. Svarar för budget samt fördelar resurserna inom verksamheten. Har personalansvar.
broader: Inköps-, logistik- och transportchefer
related: 8jmM P5A g9a
related: nTpM 48M Jtk
related: mP5U LLJ 746
related: DNB8 yG1 iSC
related: Xuhg PcG kq2
related: Bb7a V49 Da8
related: fqgM 4N7 usM
related: ZZei ZH9 cZR
related: G7Qq r7L 5Jo
related: ot7L iNF Uyg
related: C1324
related: UH9g R5v MCx
related: SmZd Jaa BeY
related: rvxX tBy dHM
related: 8tYq EXD Xwm
related: sKLW XyF UGt
related: ZzN5 m7B 5CY
related: xqBL 5Lz 21K
related: 1oA3 GfA 82Y
related: Nksx 4oe fEQ
related: ePwi BWJ RUG
related: eThQ HCv mY6
related: UJcF SrQ Jvw
related: 5PjX 999 uLZ
related: xSbx mnD bdK
related: mr2K Mgq r3i
related: 1eAS Kob pow
related: Gt5f wdi FSJ
related: PkRJ QEL xm5
related: pERs YHa Ssv
related: q7Mx gjU F9q
related: yXmf iKi 7ci
related: VfP9 2xd g2h
related: jqmh ToJ U7y
related: zXNU zXR hGd
related: 4fRg DA4 Dj3
related: bZjt jkc hNd
related: kJrF R2t t6F
related: Z38Q kQS W8a
related: C1330
related: 5yDE FiQ bMn
narrower: Speditionschef
narrower: Inköpschef
narrower: Chief Operations/CO, flygledning
narrower: Transportchef
narrower: Trafikchef
narrower: Produktionschef, logistik/Produktionschef, transporter
narrower: Lagerchef
narrower: Hamnkapten
narrower: Importchef
narrower: Stationschef, flyg
narrower: Banområdeschef
narrower: Produktområdeschef, järnväg
narrower: Logistikchef
narrower: Leveranschef
narrower: Distributionschef, logistik och transporter
narrower: Fraktchef
broad match: bh3H Y3h 5eD

Drifttekniker och processövervakare
type: Concept
in scheme: JobTech Taxonomy - Yrke
definition: Drifttekniker och processövervakare
broader: Process- och maskinoperatörer
narrower: Drifttekniker vid värme- och vattenverk
narrower: Övriga drifttekniker och processövervakare
narrower: Processövervakare, kemisk industri
narrower: Processövervakare, metallproduktion

Polisintendent
type: Concept
in scheme: JobTech Taxonomy - Yrke
definition: Polisintendent
broader: Övriga chefer inom samhällsservice
related: E7hm BLq fqZ
related: epLc SkD cbT
related: bh3H Y3h 5eD
broad match: C1349

Lärling, träarbetare
type: Concept
in scheme: JobTech Taxonomy - Yrke
definition: En lärling är anställd för att slutföra sin kvalificeringstid till Träarbetare/Snickare innan ett yrkesbevis kan utfärdas. Under kvalificeringstiden får du lärlingslön enligt avtal. Kvalificeringstiden tillsammans med teoretisk grundutbildning leder till yrkesbeviset. Ett lärlingsavtal mellan branschorganisation och företag tecknas. Källa: BYN
broader: Träarbetare, snickare m.fl.
related: j7Cq ZJe GkT
related: ja7J P8X YC9
broad match: C7115

Ortopedtekniker
type: Concept
in scheme: JobTech Taxonomy - Yrke
definition: Person med kunskap om materiallära som tillsammans med ortopedingenjör arbetar med tillverkning av ortopedtekniska hjälpmedel unikt anpassade för varje patient. Källa: SKR
broader: Tandtekniker och ortopedingenjörer m.fl.
related: 6Hq3 tKo V57
broad match: C3214

Supporttekniker IT
type: Concept
in scheme: JobTech Taxonomy - Yrke
definition: En supporttekniker arbetar med att ge teknisk support och hjälp till användare, både internt inom organisationer och externt till kunder, för att lösa problem med datorer, programvara, nätverk och annan IT-utrustning. Supportteknikern arbetar främst i first line support där de flesta problem löses direkt. I arbetsuppgifterna ingår att felsöka och åtgärda tekniska problem kopplade till hårdvara, mjukvara, nätverk och system samt installera, konfigurera och uppdatera operativsystem, program och applikationer. Källa: Arbetsförmedlingen
broader: Supporttekniker, IT
related: 6s9J tzB RXU
related: 1Nz1 z46 39V
related: gzo3 S8Y uDk
related: 6Hq3 tKo V57
related: VZSD t86 JWW
related: pHN1 NHQ dQ6
related: k2U3 c4q FjL
related: 4rW2 kQe bxY
related: vSb7 QFB QvT
related: 6pAy Zba aDL
related: tQnV QzL 3Rr
related: z5jP 5we SLy
related: hNNp fhw MsH
related: y6w2 Ahj ypn
related: cwz5 vno GPa
related: pER3 5SG GAY
related: M7hK jCz rZj
related: yogt XRM iNR
related: wBPw hrA 6CB
related: 4PQG F9J 7AY
related: F96z ghp Gja
related: 7Lv7 zek YZC
related: nf4X nGK CBU
related: SBmN Lpu qQY
related: 6MEA uVc J1C
related: nnKY S1h v5W
related: ZBUk h8D KZA
related: AZQ5 7RP hzG
related: Ptek 7cG J78
related: Mg7t 2cZ JiW
related: YKGi CgC TRJ
related: eiNz 7v1 7SN
related: Y38n LUH tDQ
related: FWSa ftJ GAj
related: EeNT UyN QfM
related: 3HJN EeG ihm
related: 6oDB oNL vjE
related: hRJ7 Us8 x6a
related: xJjZ 5Ff Eo3
related: 5jfU Zjh xkX
related: apaJ 2ja LuF
related: Ufhs dsb 496
related: 3ejN ycL sdm
related: vUGo Pjd 2ss
related: yxp5 a67 h9K
related: UqX2 a1c jj8
related: 9sEH uhU WQi
related: KHw6 GWe a7s
related: oqXW og3 xir
related: oKni R4v 4Mt
related: Xmzw YRe ZgY
related: bNgE ufB P2B
related: cCfv RB9 jRM
related: U2Q6 MmD Qmn
related: 3GoK Q9t 9sk
related: UNjS jEZ s79
related: 3UZv BdL ndt
related: vAPm cGZ y8n
related: acDS X6F L4s
related: q7Uv rxi Q8S
related: HW9s Mqq Ts4
related: QDmR 6Xp du3
related: rd1z APR oy1
related: DKDr xV1 c3W
related: zEt8 5ua TES
related: cHVy R8F WB4
related: 197N dCd cYJ
related: 5pny nR5 PA5
related: ZnXR MmN vV2
related: b5eL jUe TrL
related: pgeJ C7k EKc
related: 74er TS8 bCZ
related: 4Myg 5bb Miu
related: xskH 6bw 4hZ
related: BCVE 7fS r9f

Postterminalarbetare
type: Concept
in scheme: JobTech Taxonomy - Yrke
definition: En postterminalarbetare sorterar och hanterar post och paket i en postterminal. Det innebär att ta emot, kontrollera, sortera och skicka vidare försändelser. Arbetet kan innefatta att använda maskiner för sortering och hantering av både brev och paket, samt att lasta och lossa fordon. Källa: Arbetsförmedlingen
broader: Brevbärare och postterminalarbetare
related: sSu6 qMg nYu
related: UdVa jRr 9DE
related: rtF4 gMY gaS
related: J5gJ 6vV egQ
related: tir7 BLM P6G
related: ASGV zcE bWf
related: UtLU So7 cmk
broad match: C4412

Specialistofficerare
type: Concept
in scheme: JobTech Taxonomy - Yrke
definition: Specialistofficerare
broader: Militära yrken
narrower: Specialistofficerare

Forskare, zoologi
type: Concept
in scheme: JobTech Taxonomy - Yrke
definition: Forskare, zoologi
broader: Växt- och djurbiologer
related: kJeN wmw 9wX
broad match: C2131

Dans- och rörelseterapeut
type: Concept
in scheme: JobTech Taxonomy - Yrke
definition: Person som arbetar med dans- och rörelseterapi (konstnärlig terapiform som förekommer bland annat inom psykiatri och rehabilitering). Källa: SKR
alternative label: Dansterapeut
alternative label: Rörelseterapeut
broader: Övriga specialister inom hälso- och sjukvård
related: NYW6 mP6 vwf
broad match: C2269

Gatuköksbiträde
type: Concept
in scheme: JobTech Taxonomy - Yrke
definition: Gatuköksbiträden tillagar enklare maträtter i ett gatukök eller en snabbmatsrestaurang. Utöver att tillaga mat är vanliga arbetsuppgifter servera gäster, ta emot beställningar och ta betalt, städa, diska som plocka disk. Beroende arbtesplats tillagas fler eller färre typer av maträtter, men vanligtvis serveras enklare maträtter så som grillrätter, korv, hamburgare, kebab, sallader och pizza. Källa: Arbetsförmedlingen
broader: Pizzabagare m.fl.
related: K43L H6Q rbP
related: E2uM hSp 8gS
related: UdVa jRr 9DE
related: snvp SUt gFe
related: 9YkD e44 MHB
related: C8UH gNu YCe
related: R6xn rqs oQS
related: AH7h Uub BCh
related: eC4i 9T1 i2e
related: 9jac aoU oP4
related: 2mU9 8St p1K
related: 3r9g pSb edE
related: ScKy FHB 7wT
related: pWRT XS4 Yv2
related: MBkT opw zt4
related: 4vuv Qig rfP
related: sTt4 wNm kT3
related: vhQp che wne
related: sHm6 DqJ Np6
related: xaxd Anc D3U
related: ZCLs 8fu iYm
related: rTBn DLZ 6d3
broad match: C9411

Kriminalvårdsinspektör
type: Concept
in scheme: JobTech Taxonomy - Yrke
definition: Kriminalvårdsinspektör
broader: Övriga chefer inom samhällsservice
related: E7hm BLq fqZ
related: epLc SkD cbT
related: bh3H Y3h 5eD
broad match: C1349

Trollkonstnär
type: Concept
in scheme: JobTech Taxonomy - Yrke
definition: Trollkonstnär arbetar med att skapa magiska illusioner och underhållning för olika målgrupper, från barnkalas och företagsevent till scenshower och TV-framträdanden. Vanliga arbetsuppgifter är att framföra trolleritrick och illusioner med olika rekvisita, ibland i nära kontakt med åskådarna, att anpassa framträdanden efter olika tillfällen samt att planera och repetera nya nummer. Många trollkonstnärer är egenföretagare och ansvarar också för administration, kundkontakt och marknadsföring. Källa: Arbetsförmedlingen
broader: Övriga yrken inom kultur och underhållning
related: ieBd Vzy fPc
related: 8too bEs 7NU
related: 9puE nYg crq
broad match: C2659

Entreprenadingenjör
type: Concept
in scheme: JobTech Taxonomy - Yrke
definition: Entreprenadingenjören ansvarar för att kombinera tekniska och ekonomiska aspekter i byggprojekt, rollen innebär bl a att hantera kostnadskalkyler, tidsplanering och resursallokering, samt att upprätta och följa upp avtals- och upphandlingsprocesser. Entreprenadingenjören har en projektledande funktion och arbetar både administrativt och praktiskt, ofta i nära samarbete med platschefen. Yrket kräver också ansvar för digitala arbetssätt, såsom hantering av 3D-modeller och BIM-manualer, samt att planera och genomföra inköp. Källa: Arbetsförmedlingen
broader: Ingenjörer och tekniker inom bygg och anläggning
related: 6BKg KxT Fgs
related: jAuj kes rME
related: j7Cq ZJe GkT
related: Uf4W 3yR ps8
related: trtv gYX nSQ
related: tJNp mND hNA
related: ohig 49U eiF
related: WHcA Vdv RSD
related: ja7J P8X YC9
related: HPR2 ks9 WAq
related: ZjCw 9JF b8s
broad match: C3112

Biografmedarbetare
type: Concept
in scheme: JobTech Taxonomy - Yrke
definition: Biografmedarbetare säljer biljetter och ger service på biografer. Vanliga arbetsuppgifter för bioagrafmedarbetare är att ge service till besökare, arbeta i kassa, sälja biljetter, städning och att sköta biografutrustning. Källa: Arbetsförmedlingen
broader: Vaktmästare m.fl.
related: ZP6J skM 4x5
related: UdVa jRr 9DE
related: FQ1c HUw 8TZ
related: dD4U HMA N9H
related: 5cYr 1m7 rK9
related: yhCP AqT tns
related: p9HC Q82 2Qs
related: qVvG HHg a8v
broad match: C9629

Designer och formgivare
type: Concept
in scheme: JobTech Taxonomy - Yrke
definition: Designer och formgivare
broader: Yrken med krav på fördjupad högskolekompetens inom naturvetenskap och teknik
narrower: Grafiska formgivare m.fl.
narrower: Industridesigner
narrower: Övriga designer och formgivare
narrower: Designer inom spel och digitala medier

Författare
type: Concept
in scheme: JobTech Taxonomy - Yrke
definition: Författare skriver litterära verk inom både skönlitteratur och facklitteratur. Vanliga arbetsuppgifter är skriva, bearbeta och publicera böcker, ofta i samarbete med förlag och redaktörer. Det är inte ovanligt med egen research och korrekturläsning. Källa: Arbetsförmedlingen, Författarförbundet
broader: Författare m.fl.
related: bbKc hAw snP
related: dukD FgB WgP
related: 8too bEs 7NU
related: 9puE nYg crq
broad match: C2641

Fiskodlare och fiskare
type: Concept
in scheme: JobTech Taxonomy - Yrke
definition: Fiskodlare och fiskare
broader: Skogsarbetare, fiskodlare och fiskare
narrower: Fiskodlare
narrower: Fiskare

Forensiker, biomedicinsk analytiker
type: Concept
in scheme: JobTech Taxonomy - Yrke
definition: Forensiker, biomedicinsk analytiker arbetar med att analysera biologiska prover och säkra spår för att bistå brottsutredningar och rättsprocesser. Biomedicinska analytiker är en skyddad titel med legitimationskrav. Vanliga arbetsuppgifter är att utföra DNA-analyser, identifiera kemiska substanser och tolka laboratorieresultat, ofta i nära samarbete med polisen. Arbetet kan ske både i laboratorium och vid brottsplatser, där man samlar in och bedömer fysiskt material för vidare analys. Källa: Arbetsförmedlingen, Karolinska Institutet, Polismyndigheten, Socialstyrelsen
broader: Biomedicinska analytiker m.fl.
related: kJeN wmw 9wX
related: TCXY hAy r2K
related: mvTK ciU fot
broad match: C3212

Mykolog
type: Concept
in scheme: JobTech Taxonomy - Yrke
definition: Mykolog
broader: Växt- och djurbiologer
related: kJeN wmw 9wX
broad match: C2131

Bangårdspersonal
type: Concept
in scheme: JobTech Taxonomy - Yrke
definition: Växlar och iordningställer tåg på bangårdar samt säkerhetssynar och provbromsar dem. Sköter vagnupptagningen, rangeringen, vagnexpediering och godshantering. Utför enklare underhåll av fordon.
broader: Lokförare och bangårdspersonal
related: RtCa HMY aVG
related: ecPp ELN qmz
related: ujYV AxW Prq
related: Q6YY 6np 1od
related: bYfD 1dh 3Ty
related: CMUX D1w MfK
related: C8312
related: W39t UBk 83a
related: oxd3 phB 77Q
related: LrLw Ndd fzd
related: z27u gun RCh
related: 7rAF 1kw LqA
related: SX34 4Ed rNM
narrower: Växlare
broad match: ASGV zcE bWf

Specialistläkare, klinisk farmakologi
type: Concept
in scheme: JobTech Taxonomy - Yrke
definition: Specialistläkare, klinisk farmakologi är en specialiserad legitimerad läkare med en djupare kunskap och kompetens inom sitt område. Specialistläkare är en skyddad titel och bara den som har bevis om specialistkompetens får kalla sig specialist i sin specialitet. Specialistläkare ansvarar för att diagnostisera, behandla och förebygga sjukdomar inom sin specialitet. Vanliga arbetsuppgifter är mottagningsarbete med patientbesök, rondarbete på avdelning, handledning av yngre läkare samt konsultationer till andra yrkesgrupper och specialiteter. Specialistläkare ansvarar även för att följa och leda utvecklingen inom sitt medicinska område och utför omfattande medicinsk dokumentation och administration. Källa: Arbetsförmedlingen, Karolinska Institutet, Socialstyrelsen, Sveriges Kommuner och Regioner, Sveriges läkarförbund
broader: Specialistläkare
related: CpFD aoS pkZ
related: NYW6 mP6 vwf
related: qSbw XHD Ycd
related: TChC u37 rt2
related: EBX9 7gC eLt
related: vFjb AHi a54
related: jFHU uSj 4ke
related: KALC VvK 17U
related: fM7t axJ RNN
related: xZuv wHY z8G
related: QSeQ MpU wpW
related: 89LR AwA UqR
broad match: C2212

ST-läkare, onkologi
type: Concept
in scheme: JobTech Taxonomy - Yrke
definition: Specialisttjänstgöring, ST, är den vidareutbildning som legitimerade läkare genomför för att uppnå specialistkompetens. ST-läkare onkologi arbetar under handledning för att fördjupa sina medicinska kunskaper och färdigheter med målet att bli specialistläkare inom sitt område. ST-läkaren arbetar självständigt med patientutredningar, diagnostik och behandling, men alltid med stöd av specialister och enligt ett individuellt utbildningsprogram. Vanliga arbetsuppgifter är att ta medicinskt ansvar för patienter, delta i jourverksamhet, genomföra medicinska undersökningar och behandlingar samt dokumentera och följa upp vårdinsatser. Tjänsten omfattar också kontinuerlig kompetensutveckling, sidotjänstgöring inom närliggande områden och aktivt deltagande i handledning och utbildningsinsatser för kollegor och studenter. Källa: Arbetsförmedlingen, Karolinska Universitetssjukhuset, Sveriges läkarförbund, Region Kronoberg, Region Skåne.
broader: ST-läkare
related: NYW6 mP6 vwf
related: UtCj yMj ubw
broad match: C2211

Anestesisjuksköterskor
type: Concept
in scheme: JobTech Taxonomy - Yrke
definition: Söver eller lokalbedövar patienter som ska opereras. Övervakar, bedömer och säkerställer god andning och cirkulation hos patienten under operation.
broader: Sjuksköterskor
related: 4QAE wtY gJh
related: Xk3A N4V aAK
related: C1qR L83 nzh
related: 9Fna GUm HWL
related: Mmxs Qrv cpG
related: ZzN5 m7B 5CY
related: dJa5 Nao mDS
related: Lqnz Zqw nQ9
related: eThQ HCv mY6
related: F7nJ k5s L29
related: Ektq nPz 4YF
related: LMx4 LbA vxB
related: wBPu wTW RgG
related: aS2X 4ZL 9h7
related: BvGm Zuj VLF
related: 2GuF gtz xfW
related: rF7s hX1 ECH
related: rVUL AgV ZTH
related: C2221
related: GYz6 5Jt Wmy
related: 5Kym 2ad Pqi
related: pGBH BkG qJa
related: yV9B PxJ TxS
narrower: Anestesisjuksköterska
broad match: NYW6 mP6 vwf

Specialistläkare
type: Concept
in scheme: JobTech Taxonomy - Yrke
definition: Undersöker patienter inom sin specialistkompetens, ställer diagnoser och gör behandlingsplaner. Utför operationer och andra behandlingar, utvecklar teorier och metoder m.m.
broader: Läkare
related: 6UZC Dda ohv
related: URMC Sxh Lta
related: 9ntP jdL 3iG
related: 4QAE wtY gJh
related: tKnJ uPN MWj
related: nKjx 3Qa hrr
related: qW74 tCh otN
related: pDSo DP5 AtK
related: Mtmj FLt uDk
related: WBhS w1X B3f
related: M51j 524 DRX
related: swuN HVe o49
related: JWTU Fqq mJf
related: 9Fna GUm HWL
related: tCDB MjS nqc
related: whay GSG FrR
related: Mmxs Qrv cpG
related: QCxL 9Y5 nbA
related: HKk4 E2N zP2
related: W6Au KRK f6e
related: GwVt vvB QQH
related: oKVx a9U 72s
related: vKuL v4T JPX
related: cegr WSz Fm2
related: arzw ifj HAr
related: zi7e S96 W9k
related: 1eKe zFj QAa
related: nA5p Ske 4zb
related: eCb8 FHy qZ8
related: 6VAN Ccy EkA
related: R85L 23s y4M
related: PrA4 KwY YcV
related: kjzj jkC MHH
related: du5j oyG ju6
related: QXFx W3e Piy
related: tzLe diF ewV
related: BjtD geg 8pK
related: sXoR gGY ycN
related: tCPN Bt2 cf8
related: AXmp H1H swA
related: eDcj G1G 4We
related: xkXC w3J Qxe
related: XjSE kd5 ddt
related: kWzP mt7 77b
related: Waan Jp8 S18
related: MVKv XXk XAi
related: BjwN gCH doC
related: VH1b aCn 9ds
related: Lqnz Zqw nQ9
related: 4MNV j3X tL1
related: wcGF ouA knh
related: 7rJH cCp ccc
related: pLiE VzS 7Ph
related: tJRR YKX 68C
related: xoDp Uax PWL
related: 2jpJ qwQ 7Kd
related: qu4H C4Y uSR
related: QQuL 2Pe YDE
related: F7nJ k5s L29
related: cqB5 kjY jmE
related: 1FrM h3A mLq
related: tU5y sQz FyB
related: Tdiy bct PkX
related: r2wX Ju8 U6x
related: iD5y V1Z Exw
related: LdCZ 7Fr gDF
related: LMx4 LbA vxB
related: jv2V UoY 8XH
related: et74 vxk Eaf
related: Hinc NKX jxv
related: pPsP j3t VeY
related: 2GuF gtz xfW
related: rF7s hX1 ECH
related: n9ho 3vf UZP
related: y9uS oYh 4Kr

Säkerhetsinspektörer m.fl.
type: Concept
in scheme: JobTech Taxonomy - Yrke
definition: Kontrollerar att produkter och verksamhet uppfyller kvalitets- och säkerhetskrav. Analyserar risker i produktion. Besiktigar fordon, fartyg och luftfartyg. Svarar för tillsyn av trafik- och flygskolor. Utfärdar föreskrifter och certifikat. Verkar för att farligt gods transporteras på ett säkert sätt.
broader: Skatte- och socialförsäkringshandläggare m.fl.
related: qw7x yA1 M9g
related: TF1f u6x AGR
related: v9gt B8i wkA
related: fzsZ vhg ZYM
related: PAS3 Mcp Wqu
related: E13X ZF3 PAb
related: iaZ8 JUU gik
related: kFot nEh JTa
related: XaJV v7o vgX
related: ySUJ ZKQ G2U
related: pS7e L46 x1p
related: Dbcb xEu dVS
related: qqV6 Ctv Cxk
related: CNSz pXC f63
related: 82z9 FxR bSg
related: C3257
related: uA7X Pqn n9a
related: 3Loo 6Fy Y1R
related: QnvA akR Rd7
related: DCdD xEr 7ZA
related: pxSr PnM rdD
related: EqRh UqX wFB
related: EW8P 8Ag Xmo
related: bwYY qC7 5xE
related: hcbd nSX UYP
related: 78zA BMJ Xxp
related: oR43 qGa kwk
related: HTW1 LbJ FPE
related: C3115
related: CzZc 7tx B9C
related: P9jQ xzf xFp
related: ZZok D3i 1pR
related: ZzN5 m7B 5CY
related: UbGZ 9pL wwW
related: Bi9e N54 rQV
related: FFvn Vhc 2dA
related: 8xAq qJD akH
related: 23tt fXS N7o
related: c2gN Cwt QuU
related: iAdq LpN xfc
related: kxPJ 7Jr aRU
related: NxTN 57S Apf
related: EQgd tiE Sht
related: ojPn R8G dsv
related: pXy8 4zz azx
related: VPjj 97M PdF
related: Etfq CqE Da5
related: zCai NdW 3qn
related: ispD kdf oQ4
related: 4rSF Rqo pDj
related: bHQT Bhn w3S
related: 68Zg gkW r9K
related: NSn9 qmp y9q
related: MYmr 1sn 4c2
related: 6RWb VsD Hmw
related: fxMd nUh mGH
related: KrAH 39w Sd1
related: CX7V Uq7 Kbf
related: LjeP joK 7gf
related: cRTW MkF 2wh
related: h4my 5YR ukD
related: bZjt jkc hNd
related: TNQa trw X56
related: 6ZKG Tva FPv
related: UopJ d2R m9o
related: EDQD 51c yTB
related: 7CRV X9r 4gG
related: 7yxN T21 n4c
related: gpqK 9Up KAf
related: S91D san 5TG
related: 7xYo gc8 9Bm
related: RUsW e6S wKZ
narrower: Besiktningsingenjör
narrower: Strålskyddstekniker
narrower: Flyginspektör

Verkställande direktör/VD
type: Concept
in scheme: JobTech Taxonomy - Yrke
definition: Verkställande direktör/VD
broader: Verkställande direktörer m.fl.
related: Sxqq a94 cR1
related: VHqB 5Ug Zr1
related: hKT3 E5v Zkh
related: mnF3 BKy A2R
related: CfLz Aex PkG
related: JLJE MQn ZUE
related: X87Q jUm QBr
related: 5ghc qvY AQu
related: N99K WNW hpo
related: epLc SkD cbT
related: bh3H Y3h 5eD
related: RMGf amf g5w
related: x6Hg GSr yFE
related: AqBk MCJ BJP
related: 6F4y MCm FLg
related: P9hY S2v eCP
related: ExYY ZN6 KdZ
related: 1T3E KsJ 87q
related: 6M3t YRc 9F1
related: xXDT KEe U3t
related: 2KY8 7VN wrT
related: F9DX BtV V8w
related: CWMs 8ub yXA
related: gmSV qZv pip
related: jMhN wSQ PiB
related: 4zvR epP rbx
broad match: C1120

Guld- och silversmeder
type: Concept
in scheme: JobTech Taxonomy - Yrke
definition: Formger, tillverkar, graverar och reparerar guld- och silversmedsvaror, konsthantverk och andra föremål i ädelmetall. Slipar ädelstenar samt infattar och monterar stenar och pärlor.
broader: Finmekaniker och konsthantverkare m.fl.
related: Jy7V GvV cRe
related: Ebae vbQ Agd
related: Qg8J Y3i sW3
related: Mqvx aw4 Su4
related: H3Kv rjA mhk
related: 5BLR uwd 9h4
related: aFns X1r 1m1
related: yhB6 zQN ff8
related: 1Zae yeU Rvn
related: uGJt 4qS 3RF
related: Lbay sxT ecP
related: C7313
related: GNUT FGM V4z
related: yax8 gqV zWi
related: Z8Wj cxr Zui
related: GB24 iK1 EfU
related: i7C3 SGF iyc
related: bP5N ekQ V9Y
related: MZjE ZRx WQT
related: bU9D LiX wuY
related: nuhs TvU xhL
related: vyBi zni dWA
related: 2XGY TET niQ
related: RYUD Pdu CMt
related: YkLd 4bh iGz
related: Z3nB Ecc B6h
related: oBnp uXd eZC
related: wBu8 sKV SiA
related: X4EU ZC7 QmK
related: x1ex ayC UPr
related: 8nJE igH XVC
related: P3wQ PSx zQv
related: iLAq nM3 Wy7
related: eaRR dXF mx6
related: UKMF Qya o8n
narrower: Gemmolog
narrower: Juvelfattare
narrower: Guldsmed
narrower: Gravör, ädelmetall
narrower: Silversmed
narrower: Ädelstensslipare
broad match: PaxQ o1G wWH

Institutionsmäklare
type: Concept
in scheme: JobTech Taxonomy - Yrke
definition: Institutionsmäklare genomför köp- och försäljningsuppdrag av värdepapper såsom aktier och obligationer på uppdrag av institutionella kunder, till exempel banker, försäkringsbolag och fonder. Arbetsuppgifterna inkluderar att analysera marknader, hålla kontinuerlig kontakt med institutionella kunder, ge information om marknadsläge och värdepapper samt hantera större affärsvolymer. Institutionsmäklare bevakar nyheter och analysdata för att kunna utföra affärer vid gynnsamma tillfällen och upprätthålla affärsrelationer med svenska och internationella kunder. Rollen kan även omfatta samarbete med analytiker och andra mäklare, samt handläggning av rapportering och orderflöde. Källa: svenska banker och värdepappersbolag, jobbannonser på Platsbanken
broader: Mäklare inom finans
related: RbsF qLv jeg
related: ko73 YTm fVb
related: Ejbu Qtg Hnm
related: X82t awd Qyc
broad match: C3311

Övrig hemservicepersonal m.fl.
type: Concept
in scheme: JobTech Taxonomy - Yrke
definition: Utför annat hushållsnära arbete än inom 9111. Exempel på arbetsuppgifter: Handlar, lagar mat, städar och passar barn m.m.
broader: Städare och hemservicepersonal m.fl.
related: C9111
related: GN1z Mve mR4
related: uwX1 vsc ERP
related: x3Z7 Bhq oFv
related: wJXm pi7 5xW
related: iu18 YyQ hmh
related: dNA9 T9K JXF
related: SHkX Qc7 Xx3
related: tg1e QpF xdX
related: i9kS G7J FLh
related: C5311
related: 23oc Z6a Gp9
related: fZdk vbt LhP
related: rwir xvu 443
narrower: Barnvakt
narrower: Hemhjälp
broad match: whao Q6A ScE

Stenmontör, utan yrkesbevis
type: Concept
in scheme: JobTech Taxonomy - Yrke
definition: En stenmontör lägger golv, sätter trappor och monterar fasader av natursten såsom marmor, granit, skiffer, sandsten och kalksten. Stenmontören arbetar med både nyproduktioner och renovering av historiska miljöer. Det krävs stor hantverksskicklighet att sätta komplicerade stenmaterial i hallar, trapphus och öppna ytor. Källa: BYN
broader: Murare m.fl.
related: j7Cq ZJe GkT
related: ja7J P8X YC9
broad match: C7112

Maskinoperatörer, cement-, sten- och betongvaror
type: Concept
in scheme: JobTech Taxonomy - Yrke
definition: Sköter och övervakar driften av anläggningar för framställning av betong eller asfalt. Sköter maskiner som genom klyvning, pressning, formning etc. framställer sten-, cement- och betongvaror samt asfalt, asbest, grafit m.m. Gör gjutformar, armerar, gjuter och efterbehandlar betongvaror.
broader: Malmförädlingsyrken och brunnsborrare m.fl.
related: VPF1 UZM 9Kd
related: C8114
related: Q6ez byQ HQj
related: ws2R MBQ svX
related: 2pjc Vto TGH
related: pGts PKK c8W
related: ngdX 24q xrB
related: aF3J SgE uck
related: qQ61 EQR rcz
related: VTwt 5Fe 6bW
related: Q7eC B7g QiU
related: 4jUM i46 dpz
related: tLci gYE gHR
related: ad5t 3Go CeS
related: KDzy Hra iVr
related: 1C31 5tQ i7g
related: fhcp fFw Lbj
related: sbYJ XwB o8X
related: ZqZp rib 2PF
related: EGCS 78o x3F
related: ZuMC 5GQ 9jw
related: KDGW 77q zgQ
related: rP71 xDS 6W5
related: GCYi 9tC 1pP
related: vjfE rjM qx5
related: Rbju P7i 12U
related: ykyf hFy V5o
related: 7Dcw f63 U9c
related: TPbN Qck 1uR
related: X4EU ZC7 QmK
related: AiwS Mhv ttk
related: GnKk qZt CJv
related: 8TGJ EdB b7b
related: mi32 oKo e7U
related: uenm 75h fEh
related: MT1a Nyq DGQ
related: 6Sxw zmE 1Xd
related: dWbY gXC Frx
related: ZTk2 7eo CUb
related: LhvF NZc r6N
related: NoNy o7q jCt
narrower: Processoperatör betong
narrower: Asfaltverksmaskinist
narrower: Betongvaruarbetare
narrower: Maskinoperatör stenvaror
narrower: Processoperatör cementtillverkning
broad match: wTEr CBC bqh

Lantmäterichef
type: Concept
in scheme: JobTech Taxonomy - Yrke
definition: Lantmäterichef
broader: Chefer inom arkitekt- och ingenjörsverksamhet
related: 6Hq3 tKo V57
related: epLc SkD cbT
related: bh3H Y3h 5eD
broad match: C1213

Teknisk skribent/Teknikinformatör
type: Concept
in scheme: JobTech Taxonomy - Yrke
definition: Teknisk skribent/Teknikinformatör
alternative label: Teknikinformatör
alternative label: Teknisk skribent
broader: Journalister m.fl.
related: pYez WWr Ygt
related: CtFF beR AaJ
related: rGQQ Pzi ni3
related: Q4zd 8X9 PMk
related: X82t awd Qyc
related: 9puE nYg crq
related: TLHC 86S 6QW
related: roHY MWG Zv7
broad match: C2642

Bussvärd
type: Concept
in scheme: JobTech Taxonomy - Yrke
definition: Bussvärdar arbetar med att ge passagerare service under och i anslutning till bussresor. Arbetsuppgifter kan innefatta trafikinformation, biljettförsäljning, biljettkontroll samt försäljning av mat och dryck under resan. Bussvärdar kan även hjälpa till vid av- och påstigning, till exempel med att vägleda resenärer till anslutande transportmedel eller bistå vid lastning och lossning av bagage. Beroende på arbetsplats kan arbetsuppgifter se olika ut. Vid resor till och från vårdinrättningar kan bussvärdar fungera som stöd för resenärer och ha viss vårdutbildning. Källa: Arbetsförmedlingen
broader: Tågvärdar och ombordansvariga m.fl.
related: ASGV zcE bWf
broad match: C5112

Lastbilsmekaniker
type: Concept
in scheme: JobTech Taxonomy - Yrke
definition: Lastbilsmekaniker servar, felsöker och reparerar lastbilar. Lastbilsmekaniker har mycket gemensamt med maskinmekaniker då man arbetar med att utföra felsökning, reparation och service på tunga fordon. Lastbilsmekaniker har däremot specialiserat sig på lastbilar. Yrket kräver stora kunskap inom mekanik och elektronik. I moderna lastbilar finns ett stort antal ihopkopplade datorer, varför man behöver kunskaper inom IT och digitala verktyg för att kunna utföra sitt arbete. Källa: Transportföretagen
broader: Motorfordonsmekaniker och fordonsreparatörer
related: EFzD wtS UEs
related: XL7b iSV 1K3
related: 8h8b bhp c51
related: nVqr zMY Bsv
related: cWUM AD1 y4i
related: ASGV zcE bWf
related: T3WS a4H 4fy
related: yhCP AqT tns
related: pxwK AHZ Rmh
related: gvr3 aEj WDc
related: zBbE JEZ vm3
related: z7qp RLA AjZ
related: EtAZ kR1 RAd
related: ZC3X Njs fVM
related: KdeH Htx ni9
related: uUJ3 FLP v1Z
related: Coeu S5h 5A9
related: j6gv foG x26
broad match: C7231

Modell
type: Concept
in scheme: JobTech Taxonomy - Yrke
definition: Modeller poserar eller framträder för att presentera kläder, konst, produkter eller tjänster. Gemensamt för modellroller är att man arbetar med kroppsspråk och uttryck för att förmedla ett budskap eller framhäva något visuellt. Modeller följer instruktioner från fotografer, konstnärer eller designers och samarbetar med andra yrkesgrupper inom mode, reklam och konst. En fotomodell arbetar främst med fotograferingar för reklam eller modetidningar, medan en mannekäng visar kläder på modevisningar inför publik. En konstnärsmodell poserar ofta stilla under längre perioder för att konstnärer ska kunna teckna, måla eller skulptera. Källa: Arbetsförmedlingen
broader: Eventsäljare och butiksdemonstratörer m.fl.
related: UPdk ab5 g2y
related: KcXT krK RoH
related: vVUu PyT DQJ
related: 3iR9 CEw GUP
related: 2T4x 2Yn 26q
related: ytpB NrS ZnJ
related: i81V yTR 7u7
related: 9puE nYg crq
related: dHaa jyN yqE
related: 1hvg VC9 giW
related: euL2 hZy Pyx
broad match: C5241

Musikterapeut
type: Concept
in scheme: JobTech Taxonomy - Yrke
definition: Person som arbetar med musikterapi (användning av musik som tilläggsbehandling av nervsjukdomar, psykiska sjukdomar eller beteendestörningar). Källa: SKR
broader: Övriga specialister inom hälso- och sjukvård
related: NYW6 mP6 vwf
broad match: C2269

Forskningsadministratör
type: Concept
in scheme: JobTech Taxonomy - Yrke
definition: Forskningsadministratörer arbetar med administrativt stöd inom forskning. Arbetsuppgifter omfattar mer allmän administration som diarieföring, ekonomihantering, resebokningar, möten, lokalbokningar samt genomförande av evenemang. Rollen omfattar även administrativa uppgifter mer inriktat mot fosrskning, så som för behörigheter, konferenser, kurser, stipendier, forskningsansökningar samt dokumentation av doktorandrelaterade ärenden. Forskningsadministratören fungerar ofta som kontaktperson och samordnare inom forskargrupper både inom och mellan olika vetenskaper.
broader: Övriga handläggare
related: X82t awd Qyc
related: hJVJ HV4 pXb
related: 8JLw kR9 yWz
broad match: C3343

Båtman, Sjöfartsverket
type: Concept
in scheme: JobTech Taxonomy - Yrke
definition: En båtman hos Sjöfartsverket ansvarar för transport av lotsar till och från fartyg i aktuellt område. Även sjöräddningsuppdrag ingår som en del i tjänsten. Båtman har befälhavaransvar på lotsbåten och underhåller lotsbåtarna samt lotsstationen. Källa: Sjöfartsverket
broader: Fartygsbefäl m.fl.
related: dRFw Rcu dX7
related: fmCS 7n9 DqW
related: ASGV zcE bWf
related: XouD cCj HZN
related: gthF y5Z j3Z
related: vSAt THv Rvv
broad match: C3152

Maskinoperatör ytbehandling av trä
type: Concept
in scheme: JobTech Taxonomy - Yrke
definition: Maskinoperatörer inom ytbehandling av trä sköter maskiner för bland annat maskinell lackering. Yrket kallas även ytbehandlare line, då det avser maskinell behandling i produktionslina. Arbetet innebär att förbereda material, justera maskiner och kontrollera kvalitet på färdig produkt. Beroende på arbetsplats ingår även packning, emballering och förberedelse för leverans till kund. Enklare maskinunderhåll och truckkörning kan även ingå. Källa: Trä- och möbelföretagen
broader: Maskinoperatörer inom ytbehandling, trä
related: UdVa jRr 9DE
related: Jzet tgh ieJ
related: wTEr CBC bqh
related: yEAR VCR LZg
broad match: C7521

Rörinfodrare
type: Concept
in scheme: JobTech Taxonomy - Yrke
definition: Rörinfodrare
broader: VVS-montörer m.fl.
related: ypWP LcL js3
related: G2iA VQV RZd
related: j7Cq ZJe GkT
related: NtCA Yad Hsm
related: anqH Jqa 8pA
broad match: C7126

Kiropraktor
type: Concept
in scheme: JobTech Taxonomy - Yrke
definition: Kiropraktor undersöker, diagnostiserar och behandlar smärttillstånd relaterade till skelettet och nervsystemet. Kiropraktor är en skyddad titel med legitimationskrav. Vanliga arbetsuppgifter är att undersöka ryggraden och leder för att diagnostisera besvär, justering och manipulation av ryggraden för att lindra smärta och förbättra funktionen och ge råd om träning och ergonomi. Kiropraktorns verktyg är huvudsakligen händerna. Källa: Arbetsförmedlingen, Kiropraktiska Föreningen i Sverige, Socialstyrelsen
broader: Kiropraktorer och naprapater m.fl.
related: NYW6 mP6 vwf
related: sqvh gTy 6Sj
related: go2m oq5 rEd
broad match: C2269

Tandteknikerbiträde
type: Concept
in scheme: JobTech Taxonomy - Yrke
definition: Tandteknikerbiträde biträder tandteknikern. Arbetet innebär i huvudsak att tillverka gipsmodeller för tillverkning av tandproteser, vilket görs av en tandtekniker. Andra, mer administrativa arbetsuppgifter är vanligt förekommande. Källa: Arbetsförmedlingen
broader: Finmekaniker
related: PaxQ o1G wWH
related: 5Xbn udS RoN
related: Aoqz WwC WxJ
broad match: C7311

Övriga handläggare
type: Concept
in scheme: JobTech Taxonomy - Yrke
definition: Utför annat handläggningsarbete än inom 3351-3355. Exempel på arbetsuppgifter: Utfärdar föreskrifter, certifikat och tillstånd. Handlägger och förbereder ärenden, utreder och fattar beslut.
broader: Skatte- och socialförsäkringshandläggare m.fl.
related: xSLo P6B 2AF
related: 7Y6d qDZ Eyt
related: S2pg pcs tXu
related: r6uV Vr4 Qnv
related: DJgq zBj bKt
related: cgwK p9c kHo
related: 6Y4i d41 TAY
related: bwjW 1SE XWZ
related: 2FAo yky ogG
related: aUr6 Rjg ja2
related: aMyW hB7 TpU
related: uA7X Pqn n9a
related: bdQe ReZ Bs4
related: Z55i Qy6 R6X
related: C3359
related: 3HjW 1BP k3S
related: 3vYj Rhf Voh
related: BKRi T8q VUy
related: JNqq 4GY 5Kc
related: Uv9y v2g efa
related: Tmps QPE g3V
related: wKHJ NDQ sSg
related: V5EN xw2 itk
related: qh6a 8VG LLs
related: UH9g R5v MCx
related: SVxK Ror 3kz
related: cPrZ ijm eEe
related: oLnc YZn 3bm
related: Mw7Y 2pY itu
related: uKDT q7g vGP
related: NUC3 y1C Scg
related: qMfa U8e Lto
related: detQ YNb 9nG
related: cw2M p2W SuJ
related: TB7B ewe qsW
related: h7ke CYq RNF
related: oEJ1 Jm7 J97
related: f9WA 7Ey Htg
related: hjUM GZe Bgd
related: dYqT JBz NZE
related: 5wab aFK gdL
related: US4W Foa CSg
related: Fiq4 siu LXn
related: PVnT yGT SMb
related: WBHW i3f fUd
related: qtHa AsU Cfo
related: 8gwE 2o3 XRF
related: Nig2 2pU GT8
related: UAaK e8U ij2
related: Giw8 cWm RWU
related: EiNx EeW u3t
related: Qcp3 Ptz 73U
related: ZfDd tk8 2b6
related: Uebh 9f1 YJy
related: C3343
related: 1yZu wTp WPs
related: LmAP e75 pc6
related: 7scD 9YP iwV
related: 4rSF Rqo pDj
related: jcpA Zfs nSz
related: Lq2i vZo BEx
related: RB7E jE5 MZ3
related: mD1c 2NB pDo
related: c2YE oK3 f1u
related: Lcfd bzd 3Jg
related: CTTL 357 Ld2
related: KXz7 Vfk zF3
related: qjsN zZ2 KwE
related: C3354
related: 2ZFC 6de YSB
related: NMZ1 bCs WcR
related: Fnfm j5U wTX
related: WibE TkX xxS
related: B1rc wCc vne
related: w8bU wHe omF

Lärling, teleskoptruckförare
type: Concept
in scheme: JobTech Taxonomy - Yrke
definition: En lärling är anställd för att slutföra sin kvalificeringstid till teleskoptruckförare innan ett yrkesbevis kan utfärdas. Under kvalificeringstiden får du lärlingslön enligt avtal. Kvalificeringstiden tillsammans med teoretisk grundutbildning leder till yrkesbeviset. Ett lärlingsavtal mellan branschorganisation och företag tecknas. Källa: BYN
broader: Anläggningsmaskinförare m.fl.
related: j7Cq ZJe GkT
related: ja7J P8X YC9
broad match: C8342

Idrottsplatsvaktmästare
type: Concept
in scheme: JobTech Taxonomy - Yrke
definition: Idrottsplatsvaktmästare sköter drift, underhåll och iordningsställande av anläggningar för idrott och motion, såsom sporthallar, fotbollsplaner, friidrottsarenor och badhus. Arbetsuppgifterna omfattar bland annat tillsyn, markskötsel, snöröjning, linjering av planer, skötsel av redskap och utrustning samt tekniskt underhåll av exempelvis belysning och bevattningssystem. Idrottsplatsvaktmästare samarbetar ofta med föreningar, skolor och arrangörer inför träningar, matcher och evenemang. Arbetet kan även innebära bemanning av reception eller kiosk, samt enklare administration. Källa: Arbetsförmedlingen
alternative label: Idrottsplatsarbetare
broader: Fastighetsskötare
related: S1UB qnr EPH
related: gxGb Vxg x98
related: iLbJ Tsh e2j
related: HtPG 8Jn vn4
related: LrUz a7R HuJ
related: vsRg rTz WQj
related: caaL xKN uE7
related: LmCz Dhc f5o
related: yhCP AqT tns
related: USw1 kYo rWV
related: wkAU oTw RcJ
related: Vo8n JNq vpa
related: pdzu y9D d5K
related: CTrz 3qy N9c
related: Ng2N sMj xBD
related: mKCe zsD ti5
related: NBDq xD5 tCo
related: xoKm dcx 7qJ
broad match: C5153

Översättare, facktexter
type: Concept
in scheme: JobTech Taxonomy - Yrke
definition: Översätter texter inom t.ex. teknik, data, juridik, ekonomi, medicin, reklam och film/TV.
broader: Översättare, tolkar och lingvister m.fl.
related: k1Jw Puz 2aT
related: 9kbi Whm SqJ
related: 5jq2 ogC cuX
related: 9puE nYg crq
related: n5Vk mT2 LVv
related: pHpW 5ei HbM
related: p7Hr Mga GaX
related: yuPA yS5 fVu
broad match: C2643

Gruvmätare
type: Concept
in scheme: JobTech Taxonomy - Yrke
definition: Gruvmätare
broader: Ingenjörer och tekniker inom gruvteknik och metallurgi
related: 6Hq3 tKo V57
broad match: C3117

Skogskonsulent
type: Concept
in scheme: JobTech Taxonomy - Yrke
definition: En skogskonsulent arbetar med rådgivning, stöd och handläggning kring skogsbruk, skogsvård och skogsägande. Rollen innebär att ge kunskap och inspiration till skogsägare och andra aktörer inom skogsbranschen, samt att säkerställa att följa upp att skogsvårdslagen och övriga lagar och regler efterlevs. Förmedla statliga stöd och information om ekonomiskt stöd till skogsägare. Källa: Skogsstyrelsen
broader: Specialister och rådgivare inom skogsbruk
related: 98DJ vqP gJw
related: JTuJ 2Kn Qrt
related: Yhv2 rfP meS
related: WGAZ xaM gUE
related: yWZC cAZ 8CK
related: VuuL 7CH adj
related: V2ys MYj Fqd
broad match: C2132

Marknadsförare och informatörer m.fl.
type: Concept
in scheme: JobTech Taxonomy - Yrke
definition: Marknadsförare och informatörer m.fl.
broader: Yrken med krav på fördjupad högskolekompetens inom ekonomi och förvaltning
narrower: Marknadsanalytiker och marknadsförare m.fl.
narrower: Informatörer, kommunikatörer och PR-specialister

Samhällsvägledare
type: Concept
in scheme: JobTech Taxonomy - Yrke
definition: En samhällsvägledare är en person som ger vägledning och stöd till medborgare i frågor som rör samhället och dess funktioner. De fungerar som en länk mellan invånare och olika samhällsorganisationer, inklusive myndigheter och kommunen. Deras uppgift är att hjälpa människor att navigera i samhället, förstå deras rättigheter och skyldigheter, samt hitta rätt resurser och stöd. Källa: Uppsala kommun, Lundsuniveristet, Stockholms stad
broader: Planerare och utredare m.fl.
related: X82t awd Qyc
related: TZe9 NsN uce
broad match: C2422

Tidningsdistributörer, vaktmästare och övriga servicearbetare
type: Concept
in scheme: JobTech Taxonomy - Yrke
definition: Tidningsdistributörer, vaktmästare och övriga servicearbetare
broader: Återvinningsarbetare, tidningsdistributörer och övriga servicearbetare
narrower: Reklamutdelare och tidningsdistributörer
narrower: Vaktmästare m.fl.
narrower: Övriga servicearbetare

Grundskollärare
type: Concept
in scheme: JobTech Taxonomy - Yrke
definition: Undervisar i grundskolan. Planerar, genomför och utvärderar undervisningen i grundskola i enlighet med läro- och kursplaner. Utför bedömning och betygsättning.
broader: Grundskollärare, fritidspedagoger och förskollärare
related: 7Y6d qDZ Eyt
related: wFmN RwN uKx
related: CGBF fgA qnj
related: rMAJ LtV Buz
related: ErdW Azp yDv
related: iYou UMi bMe
related: Cg3t mwF yoD
related: fasj 16B iSE
related: NxXp SSf Vaa
related: e4Ae Udd Hyu
related: Tp1G 2jt rN4
related: QuZ4 Sg4 aK5
related: yKnk W7X Zvk
related: cX72 QLt a6Y
related: 9AMe wHs BU7
related: uAGM 5b2 SWA
related: jLoM Cde Xzu
related: LMWj Ahf xex
related: gN4Z uRf LQp
related: CXiG sHf heV
related: yMpX hfE xgc
related: zJZd pDs SDf
related: V5EN xw2 itk
related: nBQU tWb TC5
related: tcgM 8bo yiv
related: FAj8 vER A2c
related: H51M L2M kmG
related: oLnc YZn 3bm
related: NNNL 6SE hok
related: si3K 5Lb SZd
related: va6d 291 N19
related: Krvy 8xK JXN
related: CmL8 zFo zAm
related: rWxX ovc MuR
related: tg1e QpF xdX
related: kTWV pdu C2w
related: GNM4 1YF Egj
related: fLVi y19 4CU
related: SGWu X5V B9V
related: nLJN byo zWa
related: 3qpX AHB j2m
related: 8mv6 csb eDU
related: 8Utq gmy 9Rs
related: C3Fc BSX rpH
related: epum uTL ZG8
related: 9x5H cvy P9n
related: zzHa WZz Gre
related: 3Jrm Am3 m1n
related: BZ3k t4M NG8
related: cS5D iQN PWA
related: i3hK DUt czi
related: 5xsd oFo RXw
related: Fiyw 2Zs fJk
related: C2341
related: ny4h uFq rQn
related: NtCi xLG jKZ
related: HjBb bHJ VyQ
narrower: Lärare i grundskolan, årskurs 1-6
narrower: Modersmålslärare i grundskolan
narrower: Grundlärare, 4-6
narrower: Grundlärare, förskoleklass och 1-3
narrower: Ämneslärare, 7-9
broad match: MVqp eS8 kDZ

Köksbiträde
type: Concept
in scheme: JobTech Taxonomy - Yrke
definition: Köksbiträden plockar fram och förbereder mat innan tillagning. Arbetet innebär i huvudsak att förbereda mat för tillagning i bland annat restaurangkök. Vanliga arbetsuppgifter är förbereda grönsaker, fisk och kött. Man kan även utföra enklare matlagning, till exempel sallads- och frukostbufféer. På snabbmatsrestauranger kan arbetet även handla om att tillaga hela måltiden. Att städa och diska ingår också i arbetsuppgifterna. Restaurangbiträde och köksbiträde liknar varandra och beroende på arbetsplats kan man använda båda benämningarna. Källa: Arbetsförmedlingen
broader: Restaurang- och köksbiträden m.fl.
related: XdCK wMy 2r4
related: yExx a5S ab7
related: UdVa jRr 9DE
related: eac4 MKB DSF
related: 5ibY ZXS SSe
related: ri4P 5HE ddb
related: PiZX oYE 5XY
related: Ngcf bGr K7P
related: ScKy FHB 7wT
related: oVGn eDG Uck
related: PDGg WLr WEw
related: BeyJ wZy 2o1
related: QWBt m4T 6xm
related: R6eq vcx MJa
related: 7DLW LxX D2H
related: YhRz Vkg EyP
related: sHm6 DqJ Np6
related: LQMg 2HY VHh
broad match: C9412

Forskare, jordbruk
type: Concept
in scheme: JobTech Taxonomy - Yrke
definition: Forskare, jordbruk
broader: Specialister och rådgivare inom lantbruk m.m.
related: 6nbS RdB kzm
related: VuuL 7CH adj
related: Rnr2 UgN DEH
broad match: C2132

Devops utvecklare
type: Concept
in scheme: JobTech Taxonomy - Yrke
definition: Devops utvecklare
broader: Systemförvaltare m.fl.
related: ge7T NRG s9f
related: YJnZ ms3 2sE
related: qqMx 982 gT6
related: apaJ 2ja LuF
broad match: C2522

Formgivare
type: Concept
in scheme: JobTech Taxonomy - Yrke
definition: Formgivare utformar visuella och funktionella uttryck för produkter, tjänster eller kommunikation, där form, färg och material kombineras för att skapa ett igenkännbart och ändamålsenligt resultat. Vanliga uppgifter är att skissa, ta fram koncept och utarbeta färdiga produkter eller profillösningar; det kan handla om allt från trycksaker och digitala gränssnitt till fysiska produkter och förpackningar. Formgivare arbetar ofta självständigt eller i projektgrupp med att planera och genomföra designarbeten inom exempelvis grafisk design, industridesign, produktdesign eller webbdesign. Källa: Arbetsförmedlingen, Saco
broader: Industridesigner
related: WCiX WE5 qo7
related: 8too bEs 7NU
related: 9puE nYg crq
broad match: C2163

Arbetsledare, tryckeri
type: Concept
in scheme: JobTech Taxonomy - Yrke
definition: Arbetsledare, tryckeri
broader: Arbetsledare inom tillverkning
related: Ypav DnZ sAC
related: Ye67 jFn UYH
related: Uz5e vtE 7P6
related: wTEr CBC bqh
broad match: C3122

Företagssäljare
type: Concept
in scheme: JobTech Taxonomy - Yrke
definition: Säljer produkter och tjänster till exempelvis återförsäljare, grossister och företag genom uppsökande verksamhet eller från kontor. Ansvarar för produkt eller distrikt. Informerar om produkter och tjänster, utarbetar kundspecifika lösningar samt tar emot beställningar. Sköter kundregister och tar fram försäljningsstatistik.
broader: Försäkringsrådgivare, företagssäljare och inköpare m.fl.
related: M2cJ Jwf ute
related: KG9j WxP ym2
related: 5TwE JEt pWX
related: jT7b EUq z3A
related: vVXb pYT E1z
related: 4DbG 26F Vwy
related: sA2V erA 3WN
related: DTXS 78v B2p
related: dRWb Mgx yJf
related: LkPR 3sC Ejv
related: 9CWt GDw 9d6
related: wAAB hFt fwY
related: ofcY XXh G4k
related: soG2 nq2 bii
related: wbAz fL9 jgx
related: Y4Rx MXD hws
related: AzHc kX3 veu
related: fWGH CQR NDb
related: Ucib k3C YrY
related: 2TTj ZkN aMq
related: Lg8S VBi zQz
related: u5UD gEc YSe
related: TBs5 mRw ZJB
related: 5Ne3 Jir 6Ph
related: mF8u XtG pCq
related: Zowe QbA PWd
related: 5PZe C4A RPV
related: TEvL YN9 8Ky
related: iu18 YyQ hmh
related: JLwb cTV Fqp
related: yLGS 738 rt8
related: xiXQ hvk Zgg
related: UH9g R5v MCx
related: bPCR BeT Jo2
related: gZ34 7mU wKR
related: cMtR 24S TZD
related: wpc8 XQz R5C
related: dwhV SiZ Jiy
related: W1DU LPz fEs
related: GBzU V4m atY
related: S4vL AVu s6q
related: DSED 2Bk Ajw
related: GCUK vig qRE
related: tdbu fUL MnC
related: ATGE 8XW 5oB
related: L1cE 7rz c6R
related: BQsM qds 7ff
related: U3jW fju rn8
related: tRt4 sjf YTG
related: Ggsh 4Q4 wrQ
related: 15CG P9S 4vS
related: tYPZ At9 4ag
related: iaYF Mzc 9wq
related: iJUp 1mo igt
related: 4oKa e7b oHW
related: C3322
related: WR7N h6T jG1
related: agGK Zte X2y
related: ETsW C5r RPu
related: 9HDt vcq beE
related: 2wd8 VUk YSq
related: EL7g UQG QVd
related: SEKb 8gv cAz
related: 7BQm Uvm fcX
related: hX4r Cwh PuP
related: Ww46 6ja 31m
related: oH6C 9w6 dUY
related: Gt5f wdi FSJ
related: xoV9 L7r LWx
related: Wc5W 6Tv utC
related: QPQS oPf 9RU
related: C2433
related: q7Mx gjU F9q
related: nfdN dwW 6PE
related: Nsed LxY fHx

Lantbruksekonom
type: Concept
in scheme: JobTech Taxonomy - Yrke
definition: Lantbruksekonom
broader: Specialister och rådgivare inom lantbruk m.m.
related: X82t awd Qyc
related: 6nbS RdB kzm
related: VuuL 7CH adj
broad match: C2132

Verksamhetschef inom trossamfund
type: Concept
in scheme: JobTech Taxonomy - Yrke
definition: Verksamhetschefer inom trossamfund leder och utvecklar verksamheter inom ett trossamfund, så som stift och församling. Arbetsuppgifter omfattar planering, samordning och uppföljning av verksamhet. Ansvarsområden kan inkludera ekonomi, personalledning, kontakt med medlemmar och externa samarbetspartners. Inom chefsansvaret kan även rymmas att säkerställa att verksamheten bedrivs enligt gällande lagar, riktlinjer och trossamfundets värdegrund. Uppdraget kan även innefatta strategiskt arbete med utvecklingsfrågor, kommunikation och representation. Källa: Svenska Kyrkan, Arbetsförmedlingen
broader: Chefer och ledare inom trossamfund
related: bh3H Y3h 5eD
broad match: C2636

Receptionschef hotell
type: Concept
in scheme: JobTech Taxonomy - Yrke
definition: Receptionschefer leder receptionens dagliga arbete på hotell, konferensanläggningar eller liknande boendeanläggningar. Receptionschefer planerar bemanning, organiserar arbetsflödet och hanterar kontakt med gäster och externa samarbetspartners. Arbetsuppgifter inkluderar hantering av bokningssystem, in- och utcheckning, fakturering samt samordning av gästservice såsom information, rumsändringar och specialönskemål. Receptionschef arbetsleder receptionens personal i servicefrågor och implementerar rutiner för kvalitet och effektivitet. Receptionschef följer upp gästnöjdhet och hanterar reklamationer i samverkan med övrig ledning. Källa: Arbetsförmedlingen
broader: Hotellreceptionister m.fl.
related: EUjP 9Fx yWq
related: dNmP L3z tFg
related: E5yx BNJ Lfu
related: CmXF wyS fq3
related: epLc SkD cbT
related: 6vD5 7cG uxE
related: ScKy FHB 7wT
related: vuvg 5ni ZEQ
related: mKSi FXG jnK
related: uc75 iiG N9M
related: VMQ2 Kah FGb
related: C9Yo GY2 916
broad match: C4224

HR-assistent
type: Concept
in scheme: JobTech Taxonomy - Yrke
definition: HR-assistent stödjer personalavdelningen med administration av anställningsavtal, personalregister och dokumenthantering. Arbetsuppgifterna omfattar schemaläggning av intervjuer, hantering av onboardingprocess för nyanställda, registrering av personaldata och distributionslistor samt kontakt med medarbetare kring personalfrågor. HR-assistent stöttar rekryteringsprocesser, organiserar interna utbildningar och bistår med underlag till löneutbetalningar. Rollen innefattar även uppdatering av policy- och arbetsmiljöinformation och samordning av personalaktiviteter. Tjänsten är en etablerad ingångsroll inom HR både i större och mindre organisationer. Källor: Arbetsförmedlingen, Wise Consulting, Stockholms stad,
broader: Löne- och personaladministratörer
related: HJrn 3UJ gHj
related: wRF1 Lu5 qR1
related: 9VqU EUP TBE
related: hBDc i1h jFA
related: R5yA 6Nc fdg
related: Dbu1 5wE b7D
related: NEeq 4Z1 Erz
related: cchp vv5 9RD
related: WZvA QwL jzz
related: EqEo gap iym
related: fBnz C3L nnT
related: X82t awd Qyc
related: S5Ru pn3 tF7
related: FXzR GvM chL
related: 4RNN s8m zwM
related: suiZ 477 6vQ
related: 1Uqd znE qYA
related: 7gru 2AE Q8t
related: z6GB BLd ZGY
related: Mf7E Zmr VvD
related: KgVw 9hB U6K
related: o5DF KgS r9Z
related: GToV xYM rU3
related: tnPf QoA gg2
related: 5aX6 PHn yiH
related: Rvfn 2Rs PTG
related: 85MH MEu oXz
related: 6pA9 sRU 7Y5
related: kqXu EFu tyP
related: fZju aoY GA8
related: oSKX tfs HWW
related: ULUB cLq VN8
related: biVs Pbx 85H
related: 1eUR 54w v1C
broad match: C4416

Specialisttandläkare inom käkkirurgi
type: Concept
in scheme: JobTech Taxonomy - Yrke
definition: Specialisttandläkare inom käkkirurgi är en specialiserad legitimerad tandläkare med en djupare kunskap och kompetens inom sitt område. Specialisttandläkare är en skyddad titel och bara den som har bevis om specialistkompetens får kalla sig specialist i sin specialitet. Vanliga arbetsuppgifter är att utreda, diagnostisera och behandla komplexa fall inom exempelvis oral kirurgi, ortodonti, pedodonti, parodontologi, oral protetik, bettfysiologi, endodonti eller odontologisk radiologi. Specialisttandläkare samarbetar ofta i team, tar emot remisser från allmäntandläkare och bidrar med expertkunskap till både patienter och kollegor. Arbetsuppgifterna kan även omfatta konsultationer, handledning och ibland ansvar för verksamhet eller personal inom sitt specialistområde. Källa: Arbetsförmedlingen, Sveriges Kommuner och Regioner, Socialstyrelsen
broader: Tandläkare
related: NYW6 mP6 vwf
related: proQ odJ 3A7
related: TxYP mJq fdt
related: NgG1 5qR MDs
related: SRs7 HCS tVp
related: bvS2 Vmd o8t
related: 2B4i UAL 5kg
broad match: C2261

Golfinstruktör
type: Concept
in scheme: JobTech Taxonomy - Yrke
definition: Golfinstruktörer undervisar och tränar golfspelare i teknik, taktik och spelstrategi. Arbetsuppgifterna innefattar att planera och leda träningspass, analysera spelares utveckling samt ge individuella råd för förbättring. Golfinstruktörer samarbetar med golfklubbar och andra aktörer för att främja golfspel och arrangera golfevenemang. Källa: Svenska golfförbundet, PGA of Sweden
alternative label: Golftränare
broader: Idrottstränare och instruktörer m.fl.
related: inuu MEK vnP
related: XMcN ksb 5Xh
related: MVqp eS8 kDZ
broad match: C3423

Distriktssköterskor
type: Concept
in scheme: JobTech Taxonomy - Yrke
definition: Svarar för öppen hälso- och sjukvård inom ett geografiskt område. Ger råd och behandlingar på egen mottagning eller vid hembesök. Gör bedömningar av patienters hälso- och sjukdomstillstånd och vårdbehov.
broader: Sjuksköterskor
related: GkJU 4dd Cit
related: NbjJ WBY FoA
related: 2KV1 FD8 vGp
related: kXEj s4x ATw
related: Mmxs Qrv cpG
related: KETW mSB jTA
related: 73kE uFW vvT
related: oWuE VZV qUr
related: XxtR x2w wmU
related: dJa5 Nao mDS
related: MVKv XXk XAi
related: mNUF J2A H8c
related: eThQ HCv mY6
related: Ektq nPz 4YF
related: MR4H FFT mTj
related: BvGm Zuj VLF
related: C2221
related: GYz6 5Jt Wmy
related: AmSg wbt ZzD
related: jxKr BmN CcQ
related: 47LN 8Ac dX8
related: FJjr 4pF LEY
narrower: Distriktssköterska
broad match: NYW6 mP6 vwf

Löneadministratör/Lönekonsult
type: Concept
in scheme: JobTech Taxonomy - Yrke
definition: Löneadministratör hanterar företags eller organisationers löneprocesser för anställda. Arbetsuppgifterna inkluderar beräkning och registrering av löner, behandling av tidrapporter, administration av skatter och sociala avgifter samt hantering av avvikelser och rättelser i lönesystem. Löneadministratör arbetar med utskick av lönebesked, rapportering till myndigheter såsom Skatteverket och Försäkringskassan, samt stödjer anställda med lönerelaterade frågor. Rollen kan också omfatta administration av pensioner, semester och förmåner samt uppföljning av kollektivavtal och arbetsrättsliga regler. Lönekonsult arbetar konsultativt med löneberäkning, rapportering, tolkning av lagar och kollektivavtal, implementering av lönerutiner och rådgivning till företag och organisationer. Källor: Randstad, Wise.se, Lernia, Arbetsförmedlingen
broader: Löne- och personaladministratörer
related: GHon R1z oET
related: wRF1 Lu5 qR1
related: 8CzW 3tk jzd
related: vmk1 gnA JR5
related: f65A CPs L6F
related: X82t awd Qyc
related: PE2p ccr yUB
related: XLCh 5V4 koQ
related: 9Tnm Qzg Xw9
related: 19fb g7p ipp
related: bHpk CQW km6
related: wJA3 ouj aBY
related: rYVZ 3Aj 2v5
related: DuqW GLt MTq
related: nHz3 Ayp 89S
related: nnsr c3W bGd
broad match: C4313

Forskningskommunikatör
type: Concept
in scheme: JobTech Taxonomy - Yrke
definition: Forskningskommunikatör
broader: Informatörer, kommunikatörer och PR-specialister
related: X82t awd Qyc
related: vwxR MbC XjW
related: mXC6 wj2 yx7
broad match: C2432

Mättekniker, geologi
type: Concept
in scheme: JobTech Taxonomy - Yrke
definition: Mättekniker, geologi
broader: Övriga ingenjörer och tekniker
related: 6Hq3 tKo V57
broad match: C3119

Produktchef, marknadsföring
type: Concept
in scheme: JobTech Taxonomy - Yrke
definition: Produktchef, marknadsföring
broader: Marknadsanalytiker och marknadsförare m.fl.
related: 6cX7 jVN tw2
related: DL8B 7ZU 2Gk
related: RPTn bxG ExZ
related: epLc SkD cbT
related: 1fqy Yef ipR
related: 7MZo sR5 bfU
related: HHUV HK5 1v8
related: 4XyY MCb svG
related: eQaZ K7i Eiu
related: Axmh JPX s7N
broad match: C2431

Trafikledare
type: Concept
in scheme: JobTech Taxonomy - Yrke
definition: Trafikledare planerar, övervakar och koordinerar trafik. Arbetsuppgifter omfattar trafikövervakning, schemaläggning av fordon och förare, omdirigering vid störningar, hantering av trafikavvikelser samt löpande kontakt med förare och servicepersonal. Trafikledaren arbetar ofta i trafikledningscentral och använder digitala system för fordonsuppföljning och kommunikation. Rollen innebär också rapportering av trafikstörningar till trafikmyndigheter eller beställare och att säkerställa att trafiken följer avtalade tidtabeller, säkerhetsrutiner och servicekrav. Arbetet sker ofta i realtid och under tidspress för att minimera störningar. Se även yrket tågrafikledare, vilket är ett separat yrke. Källa: Arbetsförmedlingen
broader: Transportledare och transportsamordnare
related: AWvJ hD4 6Rg
related: givZ Emw Vwr
related: vEN9 1ke xfJ
related: Ludh FoP PSh
related: X82t awd Qyc
related: sJv2 GY2 DJE
related: qKqQ M1n jjg
related: ASGV zcE bWf
related: urqk NQr dvK
related: JWAu XbF DvB
related: kini TXe ZqT
related: SKfx iDx 7Ae
broad match: C5419

Instrumenttekniker
type: Concept
in scheme: JobTech Taxonomy - Yrke
definition: Instrumenttekniker arbetar med styr-, mät- och analyssystem inom industrin. Som instrumenttekniker, kallas även instrumentelektriker, arbetar man i huvudsak med felsökning, reparation och underhåll av styr-, mät-, analys- och automationsutrustning. Arbetet sker främst inom industri. Man kan även arbeta med installation av styr- och analyssystem, då ingår kalibrering, felsökning och validering. Efterfrågade specifika kompetenser är programmering av PLC- och SCADA-system. Källa: Arbetsförmedlingen
broader: Elektronikreparatörer och kommunikationselektriker m.fl.
related: TBkM e9o VPm
related: jS1k g2V Vfy
related: UdLj wuu s7Z
related: nS9J 8f6 cXU
related: yLMG GCu nm6
related: CNPY mtx 1EY
related: 1VVg qKX 3Tj
related: NjRv pPd ApX
related: gDCr ynW 1P9
related: yhCP AqT tns
related: sxPA YuT igH
related: UjMu Zq2 z6W
related: 6JMo Lif Gau
broad match: C7421

Motorschaktvagnförare
type: Concept
in scheme: JobTech Taxonomy - Yrke
definition: En motorschaktvagnsförare kör en motorschaktvagn som används där stora jordmassor skall förflyttas t ex vid vägbyggen eller stora anläggningsbyggen. Motorschaktvagnsförare är en anläggningsmaskinförare som kör maskiner för grävning och jordförflyttning vid byggandet av hus, bostadsområden, vägar och anläggningar. I arbetet ingår att sköta underhåll och enklare reparationer av maskinens kringutrustning. Ibland hjälper anläggningsmaskinföraren också till med markarbeten utanför maskinen. Anläggningsmaskinföraren har yrkesbevis i ett eller flera maskinslag. Anläggningsmaskinföraren kan ansöka om sitt yrkesbevis efter teoretisk grundutbildning och lärlingsanställning. Källa: Arbetsförmedlingen
broader: Anläggningsmaskinförare m.fl.
related: j7Cq ZJe GkT
related: ja7J P8X YC9
related: Mxyf t2J iLA
broad match: C8342

Guldsmed
type: Concept
in scheme: JobTech Taxonomy - Yrke
definition: Guldsmeder tillverkar smycken så som ringar, armband, halsband, broscher, lås och hängen. Guldsmeder arbetar ofta i samarbete med andra hantverksyrken, främst juvelfattare, gravörer och ädelstenslipare. Förutom tillverkning arbetar guldsmeder även med omarbetning och reparation av smycken. De vanligaste materialen är olika typer av ädelmetaller som guld, platina och silver, men du kan även arbeta med ädelstenar, pärlor, emalj, titan, trä, glas och plast. Det är möjligt att specialisera sig mot CAD som guldsmed och arbeta med prototyptillverkning och produktutveckling. Källa: Arbetsförmedlingen - Hitta yrken, Sveriges Guldsmedsmästares Riksförening
broader: Guld- och silversmeder
related: PaxQ o1G wWH
related: Jt8f 1uH Jup
broad match: C7313

Geotekniker
type: Concept
in scheme: JobTech Taxonomy - Yrke
definition: Geotekniker
broader: Civilingenjörsyrken inom gruvteknik och metallurgi
related: 6Hq3 tKo V57
related: AZPQ Dz2 LGF
related: ueg1 SgV Yiq
related: CpwK ppv c5t
broad match: C2146

Grovarbetare inom bygg och anläggning
type: Concept
in scheme: JobTech Taxonomy - Yrke
definition: Grovarbetare inom bygg och anläggning
broader: Andra yrken inom bygg, tillverkning och godshantering
narrower: Grovarbetare inom bygg och anläggning

Marknads- och försäljningsassistenter
type: Concept
in scheme: JobTech Taxonomy - Yrke
definition: Bevakar och bereder marknads- och försäljningsärenden. Sköter administration för marknads- och försäljningsaktiviteter. Kontrollerar och redigerar texter. Bokar utrymme för annonser och kampanjer samt kontrollerar införande med avseende på tidpunkt, innehåll, plats, storlek och form. Sköter samordning mellan reklambyrå, tryckeri och medieföretag.
broader: Kontorsassistenter och sekreterare
related: xSLo P6B 2AF
related: S2pg pcs tXu
related: DJgq zBj bKt
related: cDgT iEt XKn
related: ZuYj ADn tk7
related: uic8 7Ar HEA
related: dRWb Mgx yJf
related: uRcY 24c 7d5
related: kVEj sCw Wj8
related: bwjW 1SE XWZ
related: aUr6 Rjg ja2
related: aMyW hB7 TpU
related: 4a9F eGu 75B
related: wXRm Aq3 9D8
related: dTK5 R7G p56
related: C4419
related: 3HjW 1BP k3S
related: 3vYj Rhf Voh
related: B86n BxU vHh
related: Uv9y v2g efa
related: Tmps QPE g3V
related: 1pLs Lfr UUZ
related: R4bx i2D mSn
related: WVJF FXY Sqk
related: NUC3 y1C Scg
related: t6vN tjT 7JA
related: xNyv PTi fSa
related: cw2M p2W SuJ
related: DXNc cU4 j4N
related: zYHW Mtu jqq
related: VANx 32R rU1
related: qhUT 4Gs bY7
related: dYqT JBz NZE
related: 5wab aFK gdL
related: PVnT yGT SMb
related: qtHa AsU Cfo
related: Nig2 2pU GT8
related: LmAP e75 pc6
related: 7scD 9YP iwV
related: jcpA Zfs nSz
related: RB7E jE5 MZ3
related: o6q4 MHb 4NT
related: AwhJ eLD xpG
related: dQre aBF 3dE
related: k29D fT4 Wso
related: Kvft WHn KJE
related: 2ZFC 6de YSB
related: NMZ1 bCs WcR
related: 3XT9 cf8 UNt
related: Y2t4 aS8 tGo
related: Lz84 K5d CcL
related: B1rc wCc vne
related: zBNU qqu TbC
related: w8bU wHe omF
related: 73gL 4uv p9J
related: 1xHU W9z CT9
related: HaJH my4 BRb
related: 8u7A ze1 bvd
related: 6Ei3 fZV YKM
narrower: Marknadsassistent
narrower: Försäkringsförmedlarassistent
narrower: Fastighetsmäklarassistent
narrower: Försäljningsassistent
narrower: AD-assistent
broad match: RPTn bxG ExZ

Utesäljare
type: Concept
in scheme: JobTech Taxonomy - Yrke
definition: Utesäljare besöker företagskunder för att sälja produkter eller tjänster. Arbetsuppgifter inkluderar kundbesök, vanligen med bil, utreda behov, föreslå och offerera kundanpassade ekonomiska och tekniska lösningar. Förhandla om priser och villkor och sluta avtal. Källa: Arbetsförmedlingen - Hitta yrken, Unionen, Handelsrådet
broader: Företagssäljare
related: zocE N3p SLK
related: NjV2 7Nq 24V
related: pVuD AVC aXn
related: BHRn gJ8 SmN
related: auux i8A rb2
related: a1Xy 96u j2m
related: MYhT UmD wPJ
related: Eu4U ep7 2My
related: rDcj Tao TJJ
related: RPTn bxG ExZ
related: NxMs S8q 5PT
related: ZMiK Vzk KLH
related: Vsue drt K58
related: guW8 ggx 2gw
related: 9mST D5M smj
related: eSgp a8k ZYw
related: ZzqJ QeR CA2
related: 4i3j U2c GNn
related: WNcL ZqD FwN
related: wVdw ruq SNS
related: fD4D MGx EE9
related: dKvo vwg G6n
related: Ugtw QAn fyR
related: cVfK h67 2RU
related: qzLr 1qR ZRG
related: QStp WJ1 TS4
related: 4bWW 859 3sr
related: cVNN ogF WKw
related: RfhY WNN uaT
related: bsBN qU7 VHh
related: ybMt mhX Ddd
related: xbEP xHk SSo
related: XTqc z7Z wTC
related: Xu7q zv6 WDz
related: Dc3s mJg 5pq
related: LWHH oW6 RJ9
related: r8PE VtL 3fV
related: hYu7 ANb EN9
related: SAH3 61i Mqt
related: 254f yHL Yzi
broad match: C3322

Föreståndare camping/stugby/vandrarhem
type: Concept
in scheme: JobTech Taxonomy - Yrke
definition: Föreståndare vid campingplatser sköter den dagliga driften vid boendeanläggningar som campingplatser, stugbyar och vandrarhem. Arbetet innebär huvudsakligen att arbetsleda personal och ge samt service till gäster. Arbetet innebär även vanliga arbetsuppgifter på boendeanläggningar som att hantera bokninga, välkomna gäster, göra in- och utcheckning samt ger information om anläggningens service och omgivande aktiviteter. Arbetet omfattar även tillsyn av campingområdets ordning och underhåll, samordning av praktiska uppgifter som städning och enklare reparationer samt kontakt med leverantörer. Föreståndare kan även delta i planering och genomförande av event och aktiviteter på anläggningen. Källa: Arbetsförmedlingen
broader: Hotellreceptionister m.fl.
related: viko XFB Yxh
related: dNmP L3z tFg
related: GvHT L5U ZoU
related: ScKy FHB 7wT
related: d6ji 2YT PPL
related: bzgG VG9 HbG
broad match: C4224

Kulturgeograf
type: Concept
in scheme: JobTech Taxonomy - Yrke
definition: Kulturgeograf
broader: Arkeologer och specialister inom humaniora m.m.
related: X82t awd Qyc
broad match: C2632

Koreograf
type: Concept
in scheme: JobTech Taxonomy - Yrke
definition: Koreograf skapar och planerar dans- och rörelsemönster för scenframträdanden inom teater, film, TV och danskompanier. Vanliga arbetsuppgifter är utveckla koreografi för föreställningar i samarbete med regissörer, dansare och andra konstnärer för att säkerställa att koreografin passar tema och konstnärliga mål. Det är vanligt att arbeta inom fria dansgrupper eller teatrar, där koreografen kan ha ansvar för både kreativt skapande och övningar med dansare. Källa: Arbetsförmedlingen, Scen & Film
broader: Koreografer och dansare
related: 8too bEs 7NU
related: 9puE nYg crq
broad match: C2653

Elkvalitetsanalytiker, elkraft
type: Concept
in scheme: JobTech Taxonomy - Yrke
definition: Elkvalitetsanalytiker, elkraft
broader: Civilingenjörsyrken inom elektroteknik
related: 6Hq3 tKo V57
related: Apb2 HWr tHg
related: VPut b9f rVd
broad match: C2151

Teleingenjör
type: Concept
in scheme: JobTech Taxonomy - Yrke
definition: Teleingenjör arbetar med design, installation och underhåll av telekommunikationssystem och nätverk. Arbetsuppgifterna omfattar teknisk analys, systemplanering, konfiguration av nätverksutrustning samt felsökning och optimering av telekommunikationslösningar. Teleingenjören samarbetar ofta med projektledare, tekniker och kunder för att säkerställa att kommunikationssystem fungerar effektivt och uppfyller krav på kapacitet och säkerhet. Teleingenjörer har vanligtvis kunskaper inom telekominfrastruktur, nätverksteknik, signalbehandling och digital kommunikation. Källor: Arbetsförmedlingen, jobbannonser på Platsbanken och vakanser.se
broader: Ingenjörer och tekniker inom elektroteknik
related: 6Hq3 tKo V57
related: SvAW coW dGN
broad match: C3522

Reklamdesigner
type: Concept
in scheme: JobTech Taxonomy - Yrke
definition: En reklamdesigner skapar visuella lösningar för marknadsföring och reklam. Yrket innebär att designa annonser, kampanjmaterial, banners, affischer och digitalt innehåll som ska fånga målgruppens uppmärksamhet och förmedla ett tydligt budskap. En reklamdesigner skapar grafiska koncept som stärker kundens varumärke och kommunicerar budskapet på ett kreativt och effektivt sätt. Rollen innebär samarbete med marknadsförare, copywriters, projektledare och ibland direkt med kund för att förstå mål, målgrupp och önskad effekt. Källa: Arbetsförmedlingen
broader: Grafiska formgivare m.fl.
related: cDLU Lha d5c
related: 86Br Foz vQf
related: BMMN VHy GyF
related: 9puE nYg crq
related: WjCH PZv eAC
related: orgp gkH CEU
broad match: C2166

Installationsingenjör, bygg och anläggning
type: Concept
in scheme: JobTech Taxonomy - Yrke
definition: Installationsingenjör, bygg och anläggning
broader: Ingenjörer och tekniker inom bygg och anläggning
related: j7Cq ZJe GkT
broad match: C3112

Utbildningskoordinator
type: Concept
in scheme: JobTech Taxonomy - Yrke
definition: Utbildningskoordinatorn planerar och samordnar utbildningar och stödverksamheter inom olika organisationer. Arbetsuppgifter inkluderar schemaläggning, kommunikation med deltagare och lärare samt kvalitetsuppföljning av utbildningar. Koordinatorn fungerar ofta som kontaktperson och ansvarar för att utbildningarna flyter smidigt, med mer operativ planering och stöd. Arbetet kan även innebära att organisera fysiska träffar med deltagare och externa intressenter samt samordning av specifika projekt. Källa: Arbetsförmedlingen
broader: Övriga handläggare
related: j7ti PuR 7ML
related: hUFb pVM ibV
related: 8VSz n2h son
related: cCar 3FK y8s
related: FfDD gxA Bsr
related: LRbf nWP 9xD
related: 9zo4 fVB 5J3
related: TGnr K7j 18p
related: HBqq Zih PQB
related: 1vTh jiw rnX
related: g331 dcF mUE
related: p45N T5f tmq
related: MVqp eS8 kDZ
related: HZgd 6tL rJ6
related: csdp Psv UGz
related: uMF2 2hK 1MA
related: gdhi bo9 3DF
related: V11j NHT VZa
related: qc47 Cgt Lxj
related: 7k6F sCT RzX
related: ZGwc rme kDR
related: PXKm xr4 x4K
broad match: C3343

Andra pedagoger med teoretisk specialistkompetens
type: Concept
in scheme: JobTech Taxonomy - Yrke
definition: Andra pedagoger med teoretisk specialistkompetens
broader: Yrken med krav på fördjupad högskolekompetens inom utbildning
narrower: Övriga pedagoger med teoretisk specialistkompetens
narrower: Speciallärare och specialpedagoger m.fl.
narrower: Studie- och yrkesvägledare

Butikssäljare, dagligvaror/Medarbetare, dagligvaror
type: Concept
in scheme: JobTech Taxonomy - Yrke
definition: En butikssäljare som säljer dagligvaror i affärer, livsmedelshallar, varuhus och stormarknader. Arbetsuppgifterna sträcker sig från att beställa, packa upp, prismärka och fylla på varor, till att informera om och sälja produkterna. Som säljare är du ofta en del av ett arbetslag, där alla tillsammans har ett ansvar för arbetsuppgifterna. Källa: Handelsrådet
alternative label: Butikssäljare, dagligvaror
alternative label: Medarbetare, dagligvaror
broader: Butikssäljare, dagligvaror
related: YE1N ERW fgk
related: k1bJ VPL mP4
related: nKng 3uG R2h
related: e2f2 4Bk WkL
related: UdVa jRr 9DE
related: 6xmo zCC CqN
related: qa1z yEQ wGP
related: b2uf XQW W9b
related: NJ5X QPp HUX
related: dYzz Tnm eaK
related: trBz FYs FnE
related: rDcj Tao TJJ
related: 9rVa PhR uQG
related: RPTn bxG ExZ
related: eerZ ajf C1g
related: Pqvt iga 32E
related: 8Utd g3t E6U
related: SnhT Q8T m5e
related: JzQ2 3go BLy
related: gR5z CFV 6wC
related: 726b Et6 xfk
related: J6pq xcz 1ep
related: HfyK D6N 9RJ
related: XgFf rtz pAB
related: kzMs 1k1 gNT
related: ifET wHx 6w5
related: Z1B7 gRp ST7
related: ZZpf 3bZ A54
related: bQVt KZW bAg
related: DQDj guR TAi
related: Mv4E RxA VGZ
related: sQBC P3z sUB
related: 9HCt hc7 EM2
related: Nb8Z 9up pqv
related: LDPJ ma4 XWG
related: 1G5q xjz qbF
related: ddkv nwq 7dn
related: KJxc 7gz 9Se
related: uBzW KWk QYr
related: iGhU hA8 gx1
related: 5PEV 8qJ PCd
related: hzum c1i YEf
related: NEHL ztW 9Fh
related: d3ce VRb rPh
related: QQFo cfF Mvh
related: 51Hs vem Js7
related: CXSk yvV ES7
related: 9zc5 qom LCx
related: Pf9g LnN jNG
related: jS51 52D 8SY
related: 5qPj GdT bcp
related: utxG 2Mw Ps9
broad match: C5223

Butikskontrollant
type: Concept
in scheme: JobTech Taxonomy - Yrke
definition: Butikskontrollanter arbetar med att förebygga och ingripa mot butiksstölder. Som butikskontrollant är man grundutbildad väktare med tilläggsutbildning som butikskontrollant. Yrket innebär att observera misstänkt beteende, genomföra envarsgripanden vid brott samt hantera hotfulla situationer. Arbetet utförs både i uniform och civila kläder, ofta ensam, vilket ställer krav på säkerhetstänkande, självständighet och konflikthantering. Källa: Bevakningsbranschens Yrkes- och Arbetsmiljönämnd, Arbetsförmedlingen
broader: Väktare och ordningsvakter
related: dVbW QJc xZi
related: E7hm BLq fqZ
related: nyKd QYp btq
broad match: C5414

Maskinoperatör bageri- och konfektyrindustri
type: Concept
in scheme: JobTech Taxonomy - Yrke
definition: Maskinoperatörer inom bageri- och konfektyrindustri sköter och övervakar maskiner som producerar bakverk och konfektyr. Tillverkningsprocessen sker ofta via kontrollrum där maskinoperatören styr, övervakar och justerar produktionen. Vanliga arbetsplatser är industribagerier och fabriker för tillverkning av konfektyr. Inom livsmedelsindustri finns även krav på att man som medarbetare har utbildning i säker livsmedelshantering. Beroende på arbetsplats är truckkörning, lagerarbete och leveransföreberedelse även förekommande arbetsuppgifter. Källa: Arbetsförmedlingen
broader: Maskinoperatörer, kvarn-, bageri- och konfektyrindustri
related: uj4s a5Q TVJ
related: aZ1r 1Kq Z3Y
related: r1i7 vv9 YPX
related: nYvd pHr XoF
related: wTEr CBC bqh
related: CqpJ Gr6 aHp
broad match: C8160

Produktionsingenjör, textil, trä, glas, förpackningar
type: Concept
in scheme: JobTech Taxonomy - Yrke
definition: Produktionsingenjör, textil, trä, glas, förpackningar
broader: Övriga ingenjörer och tekniker
related: 6Hq3 tKo V57
related: VN9i vTz 7N1
broad match: C3119

Inköps-, logistik- och transportchefer
type: Concept
in scheme: JobTech Taxonomy - Yrke
definition: Inköps-, logistik- och transportchefer
broader: Chefer inom IT, logistik, FoU, fastighetsbolag, bygg- och ingenjörsverksamhet samt tillverkning m.m.
narrower: Inköps-, logistik- och transportchefer

Lantbruksrådgivare/Lantbrukskonsulent
type: Concept
in scheme: JobTech Taxonomy - Yrke
definition: Lantbruksrådgivare/Lantbrukskonsulent
alternative label: Lantbrukskonsulent
alternative label: Lantbruksrådgivare
broader: Specialister och rådgivare inom lantbruk m.m.
related: oAPe kLR qn2
related: 6nbS RdB kzm
related: VuuL 7CH adj
broad match: C2132

Arbetsledare, tillverkning, elektroniska produkter
type: Concept
in scheme: JobTech Taxonomy - Yrke
definition: Arbetsledare, tillverkning, elektroniska produkter
broader: Arbetsledare inom tillverkning
related: Bq49 GkW Ptr
related: wTEr CBC bqh
broad match: C3122

Läkarstuderande
type: Concept
in scheme: JobTech Taxonomy - Yrke
definition: Läkarstuderande är en student som utbildar sig till läkare. Vanliga arbetsuppgifter är att assistera vid patientundersökningar, delta i rondarbete och journalföring samt medverka vid enklare medicinska moment under handledning. Källa: Arbetsförmedlingen, Socialstyrelsen, Sveriges Kommuner och Regioner
broader: Övriga läkare
related: aBJ2 aNj eEW
related: NYW6 mP6 vwf
related: EMuT WjP 7B6
broad match: C2211

Diskare
type: Concept
in scheme: JobTech Taxonomy - Yrke
definition: Diskare sköter diskmaskin i restaurangkök. Arbetet innebär i huvudsak att fylla och tömma diskmaskin i restaurangkök. Beroende på arbetsplats kan det även förekomma arbetsuppgifter som städning, plocka disk och annan enklare hjälp i kök och servering. Källa: Arbetsförmedlingen
broader: Restaurang- och köksbiträden m.fl.
related: dyAn e5w sB2
related: whao Q6A ScE
related: Rk2Z WMz viz
related: UdVa jRr 9DE
related: oCpD DPT 65w
related: pEsS jVe EMQ
related: ScKy FHB 7wT
related: K79w MZL iD1
related: R6eq vcx MJa
broad match: C9412

Projektör telekom
type: Concept
in scheme: JobTech Taxonomy - Yrke
definition: Projektörer inom telekom arbetar med att projektera utbyggnad av fibernät och 5G-nät. Arbetet innebär i huvudsak att dimensionera behov av fiber- och 5G-nät i ett visst område. Man anpassar projektering enligt nätägarens byggnadssätt och standarder. Dokumentation och kontakt ingår även i projekteringen, så som kontakt med markägare och myndigheter. Källa: Arbetsförmedlingen
broader: Elektronikreparatörer och kommunikationselektriker m.fl.
related: jS1k g2V Vfy
related: yhCP AqT tns
related: 6quY Fx5 yTL
broad match: C7421

Sektionschef, gruva
type: Concept
in scheme: JobTech Taxonomy - Yrke
definition: Sektionschef, gruva
broader: Driftchefer inom bygg, anläggning och gruva
related: j7Cq ZJe GkT
related: epLc SkD cbT
related: bh3H Y3h 5eD
broad match: C1322

Stenbrottsarbetare
type: Concept
in scheme: JobTech Taxonomy - Yrke
definition: Stenbrottsarbetare arbetar med brytning och bearbetning av stenmaterial i stenbrott. Arbetet i stenbrotten innebär maskinkörning, hantering av borrigg och sågar mm i utomhusmiljö. Källa: Arbetsförmedlingen
broader: Gruv- och stenbrottsarbetare
related: m4kk dHW 7Ew
related: BpJZ JXt ZnN
related: PQHZ U9m hiq
related: j7Cq ZJe GkT
related: usu4 pQ4 839
related: YQFk bvb Jni
related: CXNm ej8 irK
related: x2gV 9NS Mco
broad match: C8111

Inspektionsdykare
type: Concept
in scheme: JobTech Taxonomy - Yrke
definition: Inspektionsdykare
broader: Anläggningsdykare
related: j7Cq ZJe GkT
broad match: C7541

Undertaksmontör
type: Concept
in scheme: JobTech Taxonomy - Yrke
definition: En undertaksmontör monterar undertak inomhus i olika typer av fastigheter, t ex skolor, sjukhus och kontor, dels för att skapa värme- och ljudisolering, dels för att dölja exempelvis rör och ventilationstrummor och förbättra akustiken i rum. Det är vanligt att jobba 3–4 meter över golvet med undertak men det kan också vara 20 meter upp, som vid ljuddämpning av en industrihall eller montering av undertak i en tunnelbana. Undertaksmontören kan ansöka om sitt yrkesbevis efter teoretisk grundutbildning och lärlingsanställning. Källa: Arbetsförmedlingen, BYN
broader: Takmontörer
related: U1pj KLH uMw
related: j7Cq ZJe GkT
related: 5sRy fmT BA4
related: ja7J P8X YC9
broad match: C7121

Hjälpmedelskonsulent
type: Concept
in scheme: JobTech Taxonomy - Yrke
definition: Hjälpmedelskonsulent utbildar, informerar och ger råd om hjälpmedel utifrån brukarens behov och förutsättningar. Vanliga arbetsuppgifter är att ge råd och stöd till både patienter och vårdpersonal för att säkerställa att rätt hjälpmedel används. Det ingår också utprovning av hjälpmedel och utbildning för patienter och vårdpersonal. Arbetet kan också omfatta sortimentsarbete, administration och att samordna insatser kring hjälpmedel. För att kunna arbeta som hjälpmedelskonsult förväntas ofta en bakgrund som arbetsterapeut, fysioterapeut eller sjuksköterska. Källa: Arbetsförmedlingen, Region Stockholm, Sveriges Kommuner och Regioner
broader: Arbetsterapeuter
related: TCa7 NBg NnD
related: NYW6 mP6 vwf
related: q5nM r91 9qP
related: CnJN qgJ xWW
related: TSQF Efe ivW
related: Rj6p Bty ETH
related: 1FFw mML VWe
broad match: C2269

Omvårdnadsassistent
type: Concept
in scheme: JobTech Taxonomy - Yrke
definition: Omvårdnadsassistent utför olika typer av praktiska vård- och omsorgsuppgifter beroende på arbetsplatsens inriktning. Arbetsuppgifter kan inkludera personlig omvårdnad som hygien, på- och avklädning, hjälp vid förflyttningar samt stöd i vardagliga aktiviteter. Omvårdnadsassistent assisterar sjuksköterskor och annan vårdpersonal genom att ta vitalparametrar, hjälpa till vid undersökningar och medicinering samt dokumentera omvårdnadsinsatser. Rollen omfattar även socialt stöd till patienter och brukare. Arbete sker vanligtvis inom äldreomsorg, hemtjänst eller på vårdavdelningar i sjukvården. Källor: Arbetsförmedlingen, Vårdfokus, Region Kalmar län,
broader: Undersköterskor, vård- och specialavdelning och mottagning
related: NYW6 mP6 vwf
broad match: C5321

Projektledare, bygg och anläggning
type: Concept
in scheme: JobTech Taxonomy - Yrke
definition: En Projektledare inom bygg och anläggning har ansvar är att se till att projektet når sitt mål, med rätt kvalité, vid rätt tidpunkt och till budgeterad kostnad. Projektledaren ansvarar också för att hantera det team och resurser som finns till förfogande. Projektledaren leder och motiverar arbetsgruppen som ofta består av personer med specialistkompetens. Källa: Arbetsförmedlingen
broader: Ingenjörer och tekniker inom bygg och anläggning
related: Sa9V HHy VjR
related: euWi qcf 2rc
related: b2tz 8x3 mwF
related: J6pB s3a Sin
related: adED XCr Rrm
related: WJXJ 1FX L4K
related: WAit Pg5 bz9
related: j7Cq ZJe GkT
related: RKCD jAX L5Z
related: anYS 5AR JRk
related: dkJr KnX 6mj
related: VjMx kFQ 8Zw
related: ohig 49U eiF
related: ja7J P8X YC9
related: yXSE wvx EAN
related: VECr cRX rQQ
related: itjB E5p 5Ww
related: eaL9 FK8 ymC
related: 68qB d4r TeA
broad match: C2142
broad match: C3112

Finansanalytiker och investeringsrådgivare m.fl.
type: Concept
in scheme: JobTech Taxonomy - Yrke
definition: Analyserar bolagens ekonomi, ekonomiska förutsättningar och framtidsutsikter samt affärsmöjligheter. Utvecklar finans- och investeringsstrategier för kunder. Ger råd till enskilda personer, företag och organisationer inom sparande, investeringar och försäkring samt vid köp och försäljning av värdepapper. Analyserar och utvärderar placeringsalternativ, aktier eller obligationer samt arbetar med portföljförvaltning. Lämnar råd och handlägger skatteärenden, bolagsbildning, köp och försäljning av exempelvis fast egendom. Hit hör inte Mäklare inom finans (3311)
broader: Revisorer, finansanalytiker och fondförvaltare m.fl.
related: MfhP thz DH6
related: eox4 5Lc W7C
related: aSt1 LXQ MCx
related: QKMc eKX sUE
related: gPan jwg TFf
related: C2412
related: vD77 b9G AEe
related: h6B2 Egm LWp
related: pAcX ugi X4j
related: zfcy UAZ FGp
related: 3vyB YMf qJm
related: PFWV Si2 w7i
related: Napu LsC c2C
related: C2413
related: R58v 7Db Z6h
related: ytD5 G1i 2y5
related: zzSp k6L WgN
related: iAvB Z7P qyX
related: LQX6 t5s aro
related: 5t9z 7Sc 1bz
related: W7Qf aRY FEo
related: BsBK j8o Guh
related: Stvo uAB 2WZ
related: 8m5V 7k8 wJ3
related: nYdJ xCp xMd
related: PFoL Uzt 2Fu
related: q7Mx gjU F9q
related: nfdN dwW 6PE
related: VfP9 2xd g2h
related: cRLv eAB 8eH
related: bHQT Bhn w3S
related: g2NT MEv e91
related: qv7V 5WG iRp
related: Leez v3g kU1
related: WhiP TFR goh
related: G7jP 6Kv GrG
related: DWsz s47 DrL
related: Y4Fw JZQ AcA
narrower: Placeringsrådgivare
narrower: Företagsrådgivare
narrower: Aktieanalytiker
narrower: Finansekonom
narrower: Kreditchef
narrower: Finanskonsult
narrower: Finansanalytiker
broad match: X82t awd Qyc

Sadelmakare
type: Concept
in scheme: JobTech Taxonomy - Yrke
definition: Sadelmakare är läderhantverkare som tillverkar och renoverar bland annat sadlar, sadelomstoppningar, selar, bälten och remmar. Sadelmakeri är ett hantverk där mycket av arbetet sker manuellt. Inom yrket kan man specialisera sig, till exempel mot hästsport eller inredning. Yrket delar hantverk och teknik med bilsadelmakare, där dessa är mer specialiserade på att jobba med fordon. Gemensamt för de som arbetar med sadelmakeri är att man har goda och hantverksmässiga kunskaper om läder. Källa: Arbetsförmedlingen, Sadelmakarnas branschorganisation
broader: Läderhantverkare och skomakare
related: PaxQ o1G wWH
related: nUWT 85i xoi
broad match: C7536

Trafikinformatör
type: Concept
in scheme: JobTech Taxonomy - Yrke
definition: Trafikinformatör sprider aktuell trafikinformation om tågtrafik till resenärer, tågoperatörer och intressenter, både internt och externt. Arbetsuppgifterna omfattar kommunikation om försenade och inställda tåg, spårbyten och andra förändringar i trafiken. Trafikinformatör arbetar i en operativ miljö, samverkar med kollegor och järnvägsföretag och hanterar information via stationernas utrustning, digitala kanaler, appar och hemsidor. Rollen innebär kontinuerlig uppdatering om trafikläget med hjälp av datoriserade övervakningssystem och förmedling av beslut vid störningar och incidenter. Trafikinformatör arbetar enligt schema och tjänsten täcker dygnet runt årets alla dagar. Källa: Järnvägsjobb
broader: Resesäljare och trafikassistenter m.fl.
related: ASGV zcE bWf
broad match: C4225

Dramalärare/Dramapedagog
type: Concept
in scheme: JobTech Taxonomy - Yrke
definition: Dramalärare/Dramapedagog
alternative label: Dramalärare
alternative label: Dramapedagog
broader: Övriga pedagoger med teoretisk specialistkompetens
related: pVzY rff Amk
related: MVqp eS8 kDZ
broad match: C2355

Biståndsbedömare/Biståndshandläggare
type: Concept
in scheme: JobTech Taxonomy - Yrke
definition: Biståndsbedömare eller biståndshandläggare utreder och bedömer enskilda personers behov av stöd och hjälp enligt socialtjänstlagen. Arbetsuppgifterna innefattar mottagning av ansökningar, genomförande av behovsutredningar och bedömning av rätt till insatser som hemtjänst, personlig assistans eller särskilt boende. Biståndsbedömare dokumenterar utredningar, fattar beslut om biståndsinsatser och följer upp beslutens genomförande. Arbetet sker i nära kontakt med den enskilde, anhöriga och andra myndigheter och ska förhålla sig till aktuell lagstiftning och kommunala riktlinjer. Källor: Stockholms stad riktlinjer, Arbetsförmedlingen, Socialstyrelsen,
alternative label: Biståndsbedömare
alternative label: Biståndshandläggare
broader: Biståndsbedömare m.fl.
related: Y7X1 Hgh htk
related: GazW 2TU kJw
related: RPDW HKP 71s
related: wikd Eap 9Uk
related: ZxPE SGq Dcf
related: GPvQ TCm 93p
related: CtXv LVF 1cJ
related: y3ga LjL ri4
related: 4vfA mXw GFN
related: ZBZG 8CT DjL
broad match: C3412

Motorcykelmekaniker
type: Concept
in scheme: JobTech Taxonomy - Yrke
definition: Motorcykelmekaniker gör felsökningar och utför service och reparationer på motorcyklar. Arbetet som motorcykelmekaniker handlar om att serva, felsöka och reparera motorcyklar. Man arbetar både med mekaniska och digitala verktyg. Motorcykelmekaniker har kunskaper i mekanik, elektronik och IT för att kunna utföra sitt arbete. Fordonsbranschen är teknikintensiv vilket att nya material, metoder och produkter löpande förändrar arbetet för mekaniker. Motorcykelns elektronik är till största delen datorstyrd varför elektronisk test- och mätutrustning är nödvändig. Källa: Arbetsförmedlingen
broader: Motorfordonsmekaniker och fordonsreparatörer
related: JSDA WWY tnq
related: nzry aoS heM
related: yhCP AqT tns
related: pxwK AHZ Rmh
related: Y2MH Px3 VR5
related: EtAZ kR1 RAd
broad match: C7231

Spol- och avloppstekniker
type: Concept
in scheme: JobTech Taxonomy - Yrke
definition: Spol- och avloppstekniker arbetar med rengöring och underhåll av avloppssystem. Spol- och avloppstekniker arbetar med rengöring och underhåll av avloppssystem. Arbetsuppgifterna inkluderar högtrycksspolning för att lösa avloppsstopp, underhållsspolning, mekanisk rensning av rör genom fräsning och rotskärning, samt inspektion av ledningar genom filmning. Beroende på arbetsplats kan även relining av avloppsrör ingå som arbetsuppgift. Arbetet sker ute hos kund med ett spolsläp koppat till personbil, varför B-körkort ofta är ett krav. Arbetet innebär både akuta åtgärder och planerade underhållsarbeten. Yrket liknar Sug- och spolbilsförare, med skillnad att man då kör lastbil vilket kräver C-körkort och yrkeskompetensbevis för förare. Källa: Arbetsförmedlingen
broader: Saneringsarbetare m.fl.
related: whao Q6A ScE
related: 6BK2 zLh MZu
related: SmVu WAg jxv
related: aX2h oDN Jvp
related: FmQF 6wm nLc
related: 2T2D aiX un5
broad match: C7133

Teletekniker
type: Concept
in scheme: JobTech Taxonomy - Yrke
definition: Teletekniker bygger elektronisk infrastruktur för kommunikation och medieöverföring. Teletekniker jobbar huvudsakligen med att bygga och underhålla nät för medieöverföring. Man arbetar med både trådlös (wifi) och trådbunden kommunikation över koppar- eller fiberkabel. Man kan till exempel arbeta med med installation av anläggningar för överföring av ljud och bild i offentliga lokaler som sjukhus och skolor. Yrket angränsar Larmtekniker/Larminstallatör i det att en teletekniker även kan arbeta med installation och underhåll av passage- och säkerhetssystem. Källa: Arbetsförmedlingen
broader: Elektronikreparatörer och kommunikationselektriker m.fl.
related: zfFq bF6 W5c
related: bXZ9 oPH 1c4
related: XAKF TLC LXu
related: 9RSc 3fA TnD
related: jS1k g2V Vfy
related: 7qVC cTi ZLD
related: 3WAx XZE YH8
related: 1Y5y xR4 PPo
related: wqYh BmW kpz
related: 58Qn CR9 ww5
related: ivmr M7m bUs
related: jtco HLP NH9
related: yhCP AqT tns
related: ZcxQ yhP jXx
related: 7qyf Dgy 75U
related: 8AsF PwP g1w
related: KcGz ScT w5U
related: 7Xww 3Ux Ej1
related: Y2P9 s89 Hbt
related: 9XNq dMb 2io
broad match: C7422

Projektledare, industri
type: Concept
in scheme: JobTech Taxonomy - Yrke
definition: Projektledare, industri
broader: Ingenjörer och tekniker inom industri, logistik och produktionsplanering
related: 6Hq3 tKo V57
related: yXSE wvx EAN
broad match: C3115

Specialistläkare, rättsmedicin
type: Concept
in scheme: JobTech Taxonomy - Yrke
definition: Specialistläkare, rättsmedicin är en specialiserad legitimerad läkare med en djupare kunskap och kompetens inom sitt område. Specialistläkare är en skyddad titel och bara den som har bevis om specialistkompetens får kalla sig specialist i sin specialitet. Specialistläkare ansvarar för att diagnostisera, behandla och förebygga sjukdomar inom sin specialitet. Vanliga arbetsuppgifter är mottagningsarbete med patientbesök, rondarbete på avdelning, handledning av yngre läkare samt konsultationer till andra yrkesgrupper och specialiteter. Specialistläkare ansvarar även för att följa och leda utvecklingen inom sitt medicinska område och utför omfattande medicinsk dokumentation och administration. Källa: Arbetsförmedlingen, Karolinska Institutet, Socialstyrelsen, Sveriges Kommuner och Regioner, Sveriges läkarförbund
broader: Specialistläkare
related: NYW6 mP6 vwf
related: qSbw XHD Ycd
related: TChC u37 rt2
related: EBX9 7gC eLt
related: vFjb AHi a54
related: jFHU uSj 4ke
related: KALC VvK 17U
related: Vazq 7GS e8g
related: QSeQ MpU wpW
related: 89LR AwA UqR
broad match: C2212

Laboratorietekniker, kemi
type: Concept
in scheme: JobTech Taxonomy - Yrke
definition: Laboratorietekniker, kemi
broader: Laboratorieingenjörer
related: 6Hq3 tKo V57
related: EsWG kHG oXZ
related: ZcDK U8q deE
broad match: C3111

Produktionschefer inom tillverkning
type: Concept
in scheme: JobTech Taxonomy - Yrke
definition: Formulerar och ansvarar för mål och strategier inom tillverkningsindustri. Utformar riktlinjer, följer upp och utvärderar verksamheten mot uppsatta mål. Förhandlar med leverantörer, kunder och andra företag. Svarar för budget samt fördelar resurserna inom verksamheten. Har personalansvar. Hit hör inte Arbetsledare inom tillverkning (3122)
broader: Produktionschefer inom tillverkning
related: 7xQ7 Waf rdY
related: CbKj Tme k2U
related: mP5U LLJ 746
related: s5SS 7bW 1Gh
related: NVJp Q2G 4nF
related: C1321
related: qAPk 7uX SAU
related: UH9g R5v MCx
related: SmZd Jaa BeY
related: kdSa Bi6 q6E
related: 8tYq EXD Xwm
related: ZzN5 m7B 5CY
related: 6Ut4 H2i tMx
related: Nksx 4oe fEQ
related: eThQ HCv mY6
related: AepF hH2 pT7
related: Gt5f wdi FSJ
related: nkor VBn U64
related: jnLy 6Ns KpH
related: q7Mx gjU F9q
related: VfP9 2xd g2h
related: zXNU zXR hGd
related: AiwS Mhv ttk
related: BGJc YEv aPK
related: 4fRg DA4 Dj3
related: Leez v3g kU1
related: Betk ZCh mY9
related: fF3d pwB naQ
related: FfJq b4n DMM
related: muf8 Fom 6F4
narrower: Elverkschef
narrower: Värmeverkschef
narrower: Gruppchef, teknik
narrower: Driftchef, energi
narrower: Produktionschef, tillverkning
narrower: Driftchef, vattenverk
narrower: Driftchef, VA
broad match: bh3H Y3h 5eD

Föredragande/Beredningsjurist
type: Concept
in scheme: JobTech Taxonomy - Yrke
definition: Föredragande/Beredningsjurist arbetar med att förbereda, analysera och föredra rättsliga ärenden inför domare och nämnd. Föredragande jurist arbetar i förvaltningsdomstol eller kammarrätt medans Beredningsjurist arbetar vid allmänna domstolar, Åklagarmyndigheten eller Högsta domstolen. Arbetsuppgifterna omfattar även att granska och analysera juridiska handlingar, föredra mål för avgörande, upprätta protokoll samt ibland själv avgöra enklare mål där detta är möjligt. Beredningsjurist deltar ofta vid förhandlingar och bistår domare eller åklagare genom att föreslå utredningsåtgärder, samt utvecklar rutiner för effektiv hantering av ärenden. Källor: Sveriges Domstolar, Arbetsförmedlingen, Högsta domstolen,
alternative label: Beredningsjurist
alternative label: Föredragande
broader: Övriga jurister
related: X82t awd Qyc
related: x4Wi NWW ogB
related: Abcb QtH isZ
related: gGa4 gFX ZHP
broad match: C2619

Pedikyrist
type: Concept
in scheme: JobTech Taxonomy - Yrke
definition: Pedikyrister utför kosmetisk fotvård med fokus på estetisk och förebyggande behandling. Arbetsuppgifterna omfattar rengöring, nagelklippning, nagelbandsvård, formning av naglar, borttagning av förhårdnader, behandling av liktornar och hälsprickor samt fotmassage och lackning. Fotvård sker ofta i kombination med rådgivning kring egenvård och val av produkter. Se även yrkena Hudterapeut där pedikyr ingår i utbildningen och yrket medicinsk fotterapeut som behandlar sjukdomsrelaterade fotproblem. Källa: Sveriges Hudterapeuters Riksorganisation, Arbetsförmedlingen
alternative label: Pedikurist
broader: Övriga skönhets- och kroppsterapeuter
related: Uuf1 GMh Uvw
related: dLSf nYT VTF
broad match: C5142

Forskare, sociologi
type: Concept
in scheme: JobTech Taxonomy - Yrke
definition: Forskare, sociologi
broader: Arkeologer och specialister inom humaniora m.m.
related: X82t awd Qyc
broad match: C2633

Produktägare, IT
type: Concept
in scheme: JobTech Taxonomy - Yrke
definition: Produktägare inom IT ansvarar för en produkts backlog genom att, utifrån intressenters behov, identifiera, prioritera och kommunicera utvecklingspunkter kopplade till den.
broader: Övriga IT-specialister
related: mqVR gWP nbB
related: 23du YJi HgR
related: BCRn yun 5wX
related: xzWC VCp MUV
related: apaJ 2ja LuF
related: YgkE ncu rNx
related: SKh1 WgX hpi
related: iD1b gdh mAv
related: itkE sQ5 GeX
related: wWqZ rXj iv8
related: pWnE pNx jtj
related: Gw6v Krj 4DP
broad match: C2519

Stationschef, flyg
type: Concept
in scheme: JobTech Taxonomy - Yrke
definition: Stationschef, flyg
broader: Inköps-, logistik- och transportchefer
related: epLc SkD cbT
related: ASGV zcE bWf
related: bh3H Y3h 5eD
broad match: C1324

Kontorsassistenter och sekreterare
type: Concept
in scheme: JobTech Taxonomy - Yrke
definition: Kontorsassistenter och sekreterare
broader: Yrken inom administration och kundtjänst
narrower: Kontorsassistenter och sekreterare

Technical artist
type: Concept
in scheme: JobTech Taxonomy - Yrke
definition: Technical artist utvecklar och optimerar visuella och tekniska lösningar för spel och digitala upplevelser. Vanliga arbetsuppgifter inkluderar att skapa visuella effekter, riggning av animationer, utveckling av shaders och scriptverktyg, samt optimering av arbetsflöden i spelmotorer. Yrket är en kombination av grafisk kreativitet och teknisk problemlösning där teknik används för att förbättra och effektivisera grafik och animation. Källa: Arbetsförmedlingen, The Game Assembly
broader: Designer inom spel och digitala medier
related: oeHg J1V PEg
related: apaJ 2ja LuF
related: 8too bEs 7NU
related: 9puE nYg crq
broad match: C2166

Personal- och HR-chefer
type: Concept
in scheme: JobTech Taxonomy - Yrke
definition: Personal- och HR-chefer
broader: Chefer inom ekonomi, HR, marknadsföring och försäljning samt annan administration m.m.
narrower: Personal- och HR-chefer

Socialsekreterare
type: Concept
in scheme: JobTech Taxonomy - Yrke
definition: Utreder individers, familjers och gruppers sociala och ekonomiska problem eller samlevnadsproblem. Kartlägger hjälpbehov och insatser, ger råd och stöd samt utövar tillsyn. Gör utredningar om umgängesrätt vid vårdnadstvist.
broader: Socialsekreterare och kuratorer m.fl.
related: xSLo P6B 2AF
related: DJgq zBj bKt
related: kb9z LG1 CZE
related: kojv fm9 4JL
related: X9xM rd8 EXP
related: zkwp b3X jLZ
related: 79ET nqi vBf
related: xv3A 9j6 pzJ
related: aUr6 Rjg ja2
related: ppuf xK3 eM5
related: ckhF ACN GqU
related: fksd G23 wke
related: 3HjW 1BP k3S
related: YaHy ShR uo4
related: MjPH 341 Zmc
related: ufbK zKv qmJ
related: 3vYj Rhf Voh
related: tpCZ pHV n3v
related: MrnB onr FxX
related: Uv9y v2g efa
related: Tmps QPE g3V
related: btyH 9au jQS
related: C2635
related: EofE ko9 gqp
related: QAaJ QeY Q6P
related: QEEg Vp8 Byv
related: faek i1g AwE
related: NUC3 y1C Scg
related: oJiB gms Rm7
related: sN7a bSJ xaH
related: cw2M p2W SuJ
related: SfoE zq7 ADN
related: VDem uq7 xxc
related: dYqT JBz NZE
related: 5wab aFK gdL
related: rbka PL5 MRM
related: 1dVh cZS Exw
related: PVnT yGT SMb
related: qtHa AsU Cfo
related: Nig2 2pU GT8
related: wR9L fZr 4Ne
related: Gt5f wdi FSJ
related: ER9j h3R zNG
related: LmAP e75 pc6
related: QoMt T8x WTS
related: 7scD 9YP iwV
related: jcpA Zfs nSz
related: crbK d4m D6r
related: RB7E jE5 MZ3
related: DRdR HTS giu
related: ZjBN Pwc L61
related: 2fvt a2y shZ
related: 6w8c jGr SfA
related: DJgE 2TP mJj
related: axxm t1P 6WR
related: 2ZFC 6de YSB
related: FgNd J6B cB2
related: BCCY ZqV imt
related: ekyT YFq zJs
related: B1rc wCc vne
related: w8bU wHe omF
related: Tzav H9f eW5
related: 73gL 4uv p9J
related: 8u7A ze1 bvd
related: 6Ei3 fZV YKM
narrower: Socialsekreterare
narrower: Socionom
narrower: Fältassistent
narrower: Placeringssamordnare
narrower: Familjehemssekreterare/Familjehemskonsulent
narrower: Familjebehandlare/Familjepedagog
narrower: Gruppledare inom socialtjänst
narrower: Rehabhandläggare
narrower: Familjerättssekreterare
narrower: Familjerådgivare/Familjeterapeut

Reservdelsspecialist
type: Concept
in scheme: JobTech Taxonomy - Yrke
definition: Reservdelsspecialister förser kunder och mekaniker med rätt reservdelar. Som reservdelsspecialist är man länken mellan verkstaden och kundmottagningen och förser fordonsmekaniker med rätt reservdelar. Först avgör man om reservdelen kan ordnas från det egna företaget, eller om delen ska hämtas utifrån. Det hjälper att veta hur en mekaniker jobbar för att snabbt kunna ge ut rätt reservdelar. Kunskaper om fordon är till stor nytta för att kunna ge råd om hur delarna ska användas. Reservdelsspecialisten kan även få arbeta med reservdelar i ett lagerhus. I lagerhanteringen ansvarar man för mottagning, påfyllnad, godshantering och utlämning av material. Källa: Transportföretagen, Arbetsförmedlingen
broader: Motorfordonsmekaniker och fordonsreparatörer
related: Y8jj fc9 DWk
related: i9Uh z6K 17M
related: LiRt 7hW MaW
related: QoHt 9BA urV
related: yhmL D21 Fy3
related: hUBx VKN qfA
related: hrsD Td7 ENS
related: oETh 9kU ZpS
related: 5RTL qLf AQ8
related: MCqC d5M eRM
related: GCWw YdS LcL
related: 8gh5 wkY Vgd
related: Edrx qcZ cHp
related: 7NHn ToQ 6GX
related: yhCP AqT tns
related: XzLz Y4r j2t
related: pxwK AHZ Rmh
related: aj1s emN Qnr
related: D3Vg nFp 5BJ
related: Y2MH Px3 VR5
related: u4PL NaJ 9e6
related: EtAZ kR1 RAd
related: vkv8 cxT k4m
related: wKfq cts 8QH
related: Rzja twe u6T
related: i8TY ASu 8MM
broad match: C7231

Kredithandläggare
type: Concept
in scheme: JobTech Taxonomy - Yrke
definition: Kredithandläggare bedömer och hanterar kreditansökningar från privatpersoner och företag inom bank- och finanssektorn. Arbetsuppgifterna omfattar analys av kundens ekonomiska förhållanden, insamling och granskning av handlingar, riskanalys samt beslut om kreditgivning. Kredithandläggare hanterar kreditlimiter, följer upp befintliga engagemang, samt utför löpande kundkontakt och rådgivning kring kreditärenden. Tjänsten innefattar även fakturabelåning, påminnelse- och kravhantering, utbetalningar, avstämning av reskontra och utredningar relaterade till krediter. Arbetsrollen sker i nära samarbete med säljteam, riskanalytiker och andra avdelningar inom banken, och verkställs huvudsakligen via digitala system och administrativa rutiner. Källor: Finansförbundet, Meritmind, SJR, Uptrail,
broader: Banktjänstemän
related: jEd1 qXb 96Y
related: Ngd8 tub 6eA
related: 9KYy W7k gfW
related: 99Vd rBe zmQ
related: 8TvM 66x Rqq
related: pAhc jKW bys
related: wY7S gcD BiR
related: TEaQ qeV DaB
related: xqgq CRg 5mv
related: g8vN Dah ukq
related: X82t awd Qyc
related: itnr 3Gz bZg
related: bJiX 5La bXq
related: iiMc ANK 7Rt
related: BRbr ETi 8uP
related: RPZ2 V8d WWV
related: tQQQ Mm3 FpZ
related: Kr3f Dxb Erg
related: KTWu 2Yo EF3
related: SqiR isR sHv
related: AjFn 3eP qu9
related: K6Jj Mdt e6k
related: M8X7 o7W 225
related: yoUD rKx ErV
broad match: C3312

Psykoterapeut
type: Concept
in scheme: JobTech Taxonomy - Yrke
definition: Psykoterapeut ger samtalsbaserad behandling till personer, par eller grupper som upplever psykisk ohälsa, relationsproblem eller andra psykologiska svårigheter. Psykoterapeut är en skyddad titel med legitimationskrav. Vanliga arbetsuppgifter är psykoterapibedömningar och planering, genomförande och utvärdering av psykoterapi. Det ingår individuella samtal, gruppterapier eller familjesamtal och att tillsammans med klienter utforma behandlingsmål och strategier för att motverka depression, ångest, stress, ätstörningar och relationssvårigheter. En psykoterapeut har vanligen också en psykolog-, läkar- eller socionomexamen. Källa: Arbetsförmedlingen, Karolinska Institutet
broader: Psykoterapeuter
related: NYW6 mP6 vwf
related: sqvh gTy 6Sj
related: HfvF Ezq Wpa
broad match: C2634

Brandskyddskoordinator
type: Concept
in scheme: JobTech Taxonomy - Yrke
definition: Brandskyddskoordinatorn samordnar och utvecklar det systematiska brandskyddsarbetet inom företag, fastigheter eller organisationer. Arbetsuppgifter består bland annat av att upprätta och följa upp brandskyddsdokumentation, planera och genomföra ronder och egenkontroller, säkerställa att rutiner och lagkrav följs, samt utbilda och informera personal om brandskydd. Brandskyddskoordinatorn är ofta kontaktperson mot externa leverantörer, räddningstjänst och myndigheter i frågor om brandskydd. Rollen innebär även att föreslå förbättringsåtgärder, samordna årlig uppföljning, utvärdera brandrisker och ta fram handlingsplaner för ökad säkerhet. Källa: Brandskyddsföreningen, Arbetsförmedlingen
broader: Säkerhetsinspektörer m.fl.
related: E7hm BLq fqZ
related: 7srG Pv4 bLw
related: vNxA Gv9 Dym
related: jXcN kfy DgR
broad match: C3257

Bankjurist
type: Concept
in scheme: JobTech Taxonomy - Yrke
definition: Bankjurist
broader: Affärs- och företagsjurister
related: X82t awd Qyc
related: x4Wi NWW ogB
related: Abcb QtH isZ
broad match: C2619

Fritidspedagog
type: Concept
in scheme: JobTech Taxonomy - Yrke
definition: Fritidspedagoger arbetar med att stödja och stimulera barns sociala, kreativa och personliga utveckling genom pedagogiska aktiviteter före och efter skoldagen samt under lov. Vanliga arbetsuppgifter är att anordna gruppaktiviteter, handleda i skapande, idrott och lek, samt att arbeta förebyggande mot konflikter och mobbning. Det brukar ingå samarbete med lärare, föräldrar och ibland elevhälsan för att skapa trygga och utvecklande miljöer. Arbetsgivare söker ofta personer med pedagogisk utbildning. Källa: Arbetsförmedlingen
broader: Fritidspedagoger
related: aams QRG Y1S
related: StzX ciV Xj7
related: K4rn sc3 7hU
related: 1gm6 HJU S9E
related: MVqp eS8 kDZ
related: 9qjx VhK QzD
related: uSM5 ThD Doi
related: E3Z9 gQ5 MaU
related: VTWU Ub7 8eU
related: DfYp vSv MVp
related: S3ta oKX PLV
broad match: C2342

Specialisttandläkare inom ortodonti
type: Concept
in scheme: JobTech Taxonomy - Yrke
definition: Specialisttandläkare inom ortodonti är en specialiserad legitimerad tandläkare med en djupare kunskap och kompetens inom sitt område. Specialisttandläkare är en skyddad titel och bara den som har bevis om specialistkompetens får kalla sig specialist i sin specialitet. Vanliga arbetsuppgifter är att utreda, diagnostisera och behandla komplexa fall inom exempelvis oral kirurgi, ortodonti, pedodonti, parodontologi, oral protetik, bettfysiologi, endodonti eller odontologisk radiologi. Specialisttandläkare samarbetar ofta i team, tar emot remisser från allmäntandläkare och bidrar med expertkunskap till både patienter och kollegor. Arbetsuppgifterna kan även omfatta konsultationer, handledning och ibland ansvar för verksamhet eller personal inom sitt specialistområde. Källa: Arbetsförmedlingen, Sveriges Kommuner och Regioner, Socialstyrelsen
broader: Tandläkare
related: NYW6 mP6 vwf
related: proQ odJ 3A7
related: Yrg2 Yun n5K
related: NgG1 5qR MDs
related: SRs7 HCS tVp
related: bvS2 Vmd o8t
related: 2B4i UAL 5kg
broad match: C2261

Miljö- och hälsoskyddsinspektörer
type: Concept
in scheme: JobTech Taxonomy - Yrke
definition: Kontrollerar att lagar och föreskrifter om miljö-, hälso- och djurskydd samt för livsmedel efterlevs. Gör utredningar, undersökningar, inspektioner och mätningar. Granskar olika verksamheter och arbetsrutiner ur miljösynpunkt samt utarbetar förbättringsförslag.
broader: Specialister inom miljö- och hälsoskydd
related: TF1f u6x AGR
related: 8R6B ypK iSj
related: FmhN LEM XAM
related: 3uhh iPw fXj
related: XaJV v7o vgX
related: 48zu t6j A28
related: tg8L maz wMN
related: pS7e L46 x1p
related: uw7i bUK eex
related: 82z9 FxR bSg
related: UFfC aC2 MiC
related: C3257
related: uA7X Pqn n9a
related: hZDG iqA bka
related: L7X3 qqn RBr
related: pxSr PnM rdD
related: upaJ 42d WtR
related: hcbd nSX UYP
related: j53D o7U Xkm
related: Dywf BPg usG
related: 78zA BMJ Xxp
related: QAaJ QeY Q6P
related: UbGZ 9pL wwW
related: MJje v9X Srn
related: 2rqG WLp em4
related: iAdq LpN xfc
related: DYdu bfN 4Fh
related: VPjj 97M PdF
related: W4er Syp Wrt
related: S84r Tb5 5EC
related: jRX3 beU Hz9
related: eTDK F6v 6yX
related: o55U zgY GQF
related: rarR CnP wRC
related: 6RWb VsD Hmw
related: 3Sj1 uuL y1A
related: YYdi Fqb 834
related: 3zgs 61Q etM
related: gpqK 9Up KAf
related: sGky Wqy QvZ
narrower: Kemikalieinspektör
narrower: Livsmedelsinspektör
narrower: Djurskyddsinspektör
narrower: Miljö- och hälsoskyddsinspektör
narrower: Miljöskyddschef
narrower: Hälsovårdsinspektör
narrower: HSEQ Manager/KMA-samordnare
broad match: kJeN wmw 9wX

Kundtjänstpersonal
type: Concept
in scheme: JobTech Taxonomy - Yrke
definition: Ger råd och upplysningar samt besvarar frågor om ett företags eller organisations produkter, tjänster eller policy. Hit hör inte Telefonist (4223) Helpdesktekniker, IT/Supporttekniker, IT (3512)
broader: Resesäljare, kundtjänstpersonal och receptionister m.fl.
related: xSLo P6B 2AF
related: S2pg pcs tXu
related: DJgq zBj bKt
related: uic8 7Ar HEA
related: uRcY 24c 7d5
related: C4225
related: aUr6 Rjg ja2
related: aMyW hB7 TpU
related: 3HjW 1BP k3S
related: 3vYj Rhf Voh
related: 7Wwm JuJ ANq
related: Uv9y v2g efa
related: Tmps QPE g3V
related: 5WVG LVw ZgL
related: NUC3 y1C Scg
related: cw2M p2W SuJ
related: C4222
related: rbDq 9SG BjC
related: dYqT JBz NZE
related: 5wab aFK gdL
related: PVnT yGT SMb
related: WBHW i3f fUd
related: qtHa AsU Cfo
related: Nig2 2pU GT8
related: LmAP e75 pc6
related: 7scD 9YP iwV
related: jcpA Zfs nSz
related: RB7E jE5 MZ3
related: AwhJ eLD xpG
related: KAxv GMv ArQ
related: Kvft WHn KJE
related: 2ZFC 6de YSB
related: B1rc wCc vne
related: zBNU qqu TbC
related: w8bU wHe omF
related: snjt 73x SAm
related: 73gL 4uv p9J
related: 8u7A ze1 bvd
related: 6Ei3 fZV YKM
narrower: Garantihandläggare
narrower: Reklamationshandläggare
narrower: Kundtjänstmedarbetare
narrower: Besöksbokare/Kundbokare
broad match: X82t awd Qyc

Concept artist
type: Concept
in scheme: JobTech Taxonomy - Yrke
definition: Concept artist arbetar med att skapa visuella skisser som förmedlar en idé eller koncept, ofta i spelsektorn, film eller andra visuella projekt. Vanliga arbetsuppgifter är att utveckla karaktärer, miljöer och objekt utifrån en uppdragsbeskrivning eller manus, ta fram detaljerade skisser och konceptbilder som sedan fungerar som underlag för vidare produktion, exempelvis av 3D-grafiker. Källa: Arbetsförmedlingen, Yrgo
broader: Designer inom spel och digitala medier
related: oeHg J1V PEg
related: UyRj TDm ce3
related: 8too bEs 7NU
related: tcm8 P8v JtH
related: 9puE nYg crq
broad match: C2166

Audionomer och logopeder
type: Concept
in scheme: JobTech Taxonomy - Yrke
definition: Utreder och bedömer hörselbesvär och anpassar hörhjälpmedel. Informerar och utbildar om hörselsvårigheter. Undersöker, ställer diagnos och behandlar röst-, tal- och språkstörningar. Leder träning och ordinerar kommunikationshjälpmedel.
broader: Andra specialister inom hälso- och sjukvård
related: oiLH gv4 Q3b
related: D2v4 oxh i4u
related: vJW5 MMn 3T5
related: vKUh Xar bLX
related: kL8N LFo TPL
related: mEiy 1mq y4b
related: YU6v SsT UBm
related: aE2d iRJ iVz
related: JmAY xSA tpE
related: GEsm TRn 9c8
related: 6TyR vAd E4u
related: JzD3 ji5 br4
related: jjpw CXh 2es
related: CJD5 wjV 3xw
related: Aq3R 8eq XHA
related: aoVs Qfu U3j
related: i9ha brW zLJ
related: C2266
related: C334 qvU FEA
narrower: Audionom
narrower: Logoped
narrower: Logopedstuderande
narrower: Audionomstuderande
broad match: NYW6 mP6 vwf

Folkhälsoplanerare
type: Concept
in scheme: JobTech Taxonomy - Yrke
definition: Folkhälsoplanerare arbetar på grupp- och organisationsnivå inom region och kommun, till exempel inom primärvård eller skola. I rollen ingår att planera och organisera insatser riktade mot individers levnadsvanor, den fysiska miljön, sociala faktorer och arbetsmiljö. Arbetsuppgifterna innefattar att driva och implementera hälsofrämjande och förebyggande projekt, kartlägga hälsoproblem och följa upp effekten av folkhälsoinsatser. Folkhälsoplanerare fungerar som kunskaps- och metodstöd och arbetar ofta med att utbilda och stödja andra yrkesgrupper, till exempel BVC-sköterskor, pedagoger eller dietister. Arbetet sker vanligen utan eller med begränsad kontakt med kommunledning eller politiker. Källa: SACO, Hälsoakademikerna, Akademikerförbundet SSR, Arbetsförmedlingen
broader: Planerare och utredare m.fl.
related: Kivp s2z KMe
related: A561 kKA ty1
related: fdAT dLq shE
related: UR8L PVS 1qs
related: X82t awd Qyc
related: Abys 5p1 Cnq
related: TZe9 NsN uce
broad match: C2422

Bibliotekskonsulent
type: Concept
in scheme: JobTech Taxonomy - Yrke
definition: Bibliotekskonsulent
broader: Bibliotekarier och arkivarier
related: X82t awd Qyc
related: D6zC nPP 22M
related: ZCV4 e1A SWS
related: 9puE nYg crq
related: LqfG XUd QxW
broad match: C2622

Miljövårdsdirektör
type: Concept
in scheme: JobTech Taxonomy - Yrke
definition: Miljövårdsdirektör
broader: Förvaltnings- och planeringschefer
related: epLc SkD cbT
related: bh3H Y3h 5eD
broad match: C1213

Betongarbetare
type: Concept
in scheme: JobTech Taxonomy - Yrke
definition: Armerar och gjuter betongkonstruktioner såsom golv, väggar, valv, pelare och broar. Borrar och sågar hål i betongkonstruktioner.
broader: Snickare, murare och anläggningsarbetare
related: v3d9 u2H pnf
related: MDrw S3x 7vK
related: Q6ez byQ HQj
related: 3xxK yks 8RB
related: nuRM zb9 2wV
related: 5S7x 3uD Us8
related: Ytcy v8N P2w
related: aHCV VsV LiD
related: 1zUh Hb7 ozh
related: NLiw MkJ y4e
related: 1YZS 1ch vDZ
related: PELm cH9 AE9
related: Q7eC B7g QiU
related: 4jUM i46 dpz
related: uNL7 C1e TK8
related: 34hP 27C pMv
related: ad5t 3Go CeS
related: bnMZ Nt5 o48
related: M7C1 DAy UTK
related: C7114
related: UYa8 GXf Ajf
related: SvA5 PZA NoZ
related: oXv5 7ns m3N
related: fhcp fFw Lbj
related: tUfC Lu6 dn7
related: TDQ4 AHZ mtn
related: 6VeN XR4 Zuj
related: ynj4 M88 nzw
related: 7jFS 6oq ZGv
related: nkhA jPz pcE
related: U1ud XV7 Z8o
related: ynWd oCo o61
related: xeoH rao GgZ
related: m6uK JHQ LKJ
related: fhu6 H74 uuN
related: yKgh gy7 e4M
related: wjwj Waj hvT
related: ztAc cLZ vtf
related: WLAi BDr 5fW
related: KfEn V5y npV
related: 5Av7 qB2 msb
related: 9Vyj oJx qb9
related: HmXd ehy QT9
related: GnKk qZt CJv
related: GhKv 2Uf 17o
related: PeRs wm9 6kk
related: 6Kf9 1k2 b5W
narrower: Betonghåltagare
narrower: Lärling betonghåltagare
narrower: Lärling betongarbetare
narrower: Betonghåltagare, utan yrkesbevis
narrower: Betongarbetare, utan yrkesbevis
narrower: Betongarbetare
broad match: j7Cq ZJe GkT

Krematorievaktmästare
type: Concept
in scheme: JobTech Taxonomy - Yrke
definition: Krematorievaktmästare arbetar med det praktiska arbetet kring kremering. Arbetet innebär i huvudsak att sköta, övervaka och underhålla en kremationsanläggning med tillhörande datasystem. Arbetsuppgifterna omfattar mottagning och utlämning av kistor och urnor, transport till andra krematorier och upprätta kremationsjournaler. Sköta tillsyn och underhåll av kremationsanläggningen samt där tillhörande datasystem. Källa: Svenska kyrkan, Arbetsförmedlingen
broader: Begravnings- och krematoriepersonal
related: GazW 2TU kJw
related: rucp XSy TVJ
related: 9ctq 27P auW
related: pdzu y9D d5K
broad match: C5163

Besiktningsman, försäkring/Skadeinspektör, försäkring
type: Concept
in scheme: JobTech Taxonomy - Yrke
definition: Besiktningsman, försäkring/Skadeinspektör, försäkring
alternative label: Besiktningsman, försäkring
alternative label: Skadeinspektör, försäkring
broader: Skadereglerare och värderare
related: McGi PKA y8p
related: 5QPo jPM RQh
related: KT5q SBS JBK
related: X82t awd Qyc
related: n8Am GYi qa4
related: fGTV YnY R5j
related: DkvA hBE 7qb
related: R7YL 8bX yhR
broad match: C3315

Övriga chefer inom övrig servicenäring
type: Concept
in scheme: JobTech Taxonomy - Yrke
definition: Övriga chefer inom övrig servicenäring
broader: Chefer inom övrig servicenäring
narrower: Övriga chefer inom övrig servicenäring

Chief Technology Officer/CTO/Teknologichef
type: Concept
in scheme: JobTech Taxonomy - Yrke
definition: Som CTO är man ansvarig tekniska utveckling inom ett företag eller organisation. Yrkesrollen innefattar bland annat att utveckla och tillämpa tekniska strategier, leda forskning och utvärdering av ny teknik samt ansvara för IT-infrastruktur och andra tekniska system.
alternative label: CTO
alternative label: Chief Technology Officer
alternative label: Teknologichef
broader: IT-chefer
related: epLc SkD cbT
related: u8Bu P9L kW5
related: apaJ 2ja LuF
related: bh3H Y3h 5eD
broad match: C1330

Instrumentingenjör, fysik
type: Concept
in scheme: JobTech Taxonomy - Yrke
definition: Instrumentingenjör, fysik
broader: Laboratorieingenjörer
related: 6Hq3 tKo V57
related: EsWG kHG oXZ
related: zC3V D9u o55
broad match: C3111

Installationstekniker industrimaskiner
type: Concept
in scheme: JobTech Taxonomy - Yrke
definition: Installationstekniker inom industrin arbetar med att installera industrimaskiner. Arbetet innebär att installera industrimaskiner hos kunder. Maskiner kan variera i komplexitet, gemensamt är att maskinerna oftast förekommer någonstans i processen vid industriell tillverkning. Installationer utförs ofta hos kunder, varför resor är vanligt förekommande. Förutom att ansvara för installation kan arbetsuppgifter även vara utbildning och underhåll av industrimaskiner på plats hos kunden. Installationstekniker har vanligtvis kunskaper inom mekanik, hydraulik och elteknik. Källa: Arbetsförmedlingen
broader: Underhållsmekaniker och maskinreparatörer
related: KhRE XQb Why
related: 4ER4 mpS eFb
related: i5rg 9YB VPx
related: Htwp Ldq 1Fq
related: ynFn k8s Em6
related: yhCP AqT tns
related: XTXC eT6 iqr
broad match: C7233

Redovisningsekonomer
type: Concept
in scheme: JobTech Taxonomy - Yrke
definition: Sammanställer, rapporterar, utvärderar och redovisar företags eller myndigheters ekonomiska resultat. Sammanställer budgetunderlag. Bistår revisor med att granska företags och myndigheters redovisning och förvaltning.
broader: Banktjänstemän och redovisningsekonomer m.fl.
related: PEfh WXw 6DZ
related: FYk9 RXp 7c5
related: M58q o8J LLV
related: MDX9 9sL df3
related: TAmq TZR Lmf
related: Ke1k R8e iUk
related: 2T5Z wdn 8Qv
related: cAPJ ry5 AgS
related: 1FbS vYp DC3
related: TSwW JGd J52
related: C3313
related: vkys qdp GH4
related: h8Z3 Fq9 ohg
related: pQqy ta4 wqj
related: cYB2 4o8 XHV
related: AzSy GKo EAa
related: 7tVG 9zf 7mw
related: aKAa jMG DdZ
related: PjTV oih SDf
related: UBgX VLG mTK
related: 9pKg zXP 9ig
related: NVfN 26P KUU
related: FqLw 515 Md9
related: 5X5B xr3 VSY
related: Fctx EH9 fcC
related: dBC3 Rwt Mue
related: cmrN Uff Nyc
related: gn9Y yYC LiH
related: dc2G fUp wZN
related: 5QwH sZY DVC
related: KN5V Gxm nGL
related: awjU C3D XEJ
related: UH9g R5v MCx
related: PFWV Si2 w7i
related: i3nT EpR WbX
related: Y3fx 8wR Zim
related: Lt8M ZMv UbM
related: qQa7 FJg J8X
related: ZhnF cSc p9V
related: 8UnT cpa zhy
related: ZQux yii D4Q
related: UJnU EqL XJZ
related: LmLg VXy VSS
related: 9dFi QaL PMB
related: 1qn1 fsa hZm
related: Ygao Vsn eJ2
related: xwAq e21 98L
related: GytV ZXP DQm
related: z9qQ ei6 Mjs
related: D7RV iq7 KE4
related: WnFA bt8 kPs
related: 34kt 5uy oYz
related: FfWB f5U 9NB
related: W7Qf aRY FEo
related: UJcF SrQ Jvw
related: s6Ui k2K kf2
related: 5wab aFK gdL
related: Fiq4 siu LXn
related: WNnT qrt M77
related: hTcc jPm dwc
related: 2RDK rgU P6R
related: oPvx TXS AMj
related: ibzL TeE YqA
related: 4yr7 byG sX3
related: C2P6 nsE tTa
related: BQRS U7c PTG
related: nfdN dwW 6PE
related: vVi1 VRt J7j
related: H2yF VoB Pxi
related: u5xh 813 M33
related: wiHT weL T12
related: 2ghM Tqc xxw
related: kXjz DLd KRr
related: Lq2i vZo BEx
related: e47M NXa 4NG

Smeder
type: Concept
in scheme: JobTech Taxonomy - Yrke
definition: Formar järn eller stål med hjälp av hammare eller press inom verkstads- och byggnadssmide, stålverk och plåtslagerier. Tillverkar konstruktions-, inrednings- och utsmyckningsdetaljer i samband med byggnation eller renoveringsarbeten.
broader: Smeder och verktygsmakare m.fl.
related: Qg8J Y3i sW3
related: ufwM PQ7 99m
related: aHCV VsV LiD
related: 1YZS 1ch vDZ
related: Q7eC B7g QiU
related: fWXx keR q2H
related: N1iH fcB 7PR
related: fhcp fFw Lbj
related: SrzF GXp pFE
related: C7221
related: Q1D1 Pdc rnT
related: C3UQ XLm qPs
related: wBw8 sAY VDK
related: UHKN Nqw 6Z5
related: Z3nB Ecc B6h
related: wBu8 sKV SiA
related: xShN Vkr s7D
related: di4P Xdw uEo
related: ZTk2 7eo CUb
related: rdtv EuD NfB
narrower: Byggnadssmed
narrower: Smed
broad match: PaxQ o1G wWH

Advokater
type: Concept
in scheme: JobTech Taxonomy - Yrke
definition: Tolkar lagar och avtal. Förbereder processer och företräder part vid tvist och förhandling. För parts talan i domstol. Ger råd och upprättar juridiska handlingar.
broader: Jurister
related: 4nqQ paq R5L
related: RZLF S7J 25Q
related: mXDp 6r9 zUj
related: 6thd xZq KsU
related: 7JTy BCE 1dx
related: YaHy ShR uo4
related: w9kF 5oy ySz
related: DkcA 2io BNv
related: aMrn LR6 Eat
related: UapV Lk5 DZr
related: AqoH owh Lac
related: KZb6 UBs gP9
related: BrdZ oPC Kft
related: Uzqv VCN BQq
related: QAaJ QeY Q6P
related: 587c D1Q BvT
related: TFCj pyW JR2
related: SNxY WDL G6i
related: 6w2r xfn trP
related: iqT9 zoW Pj5
related: EU8B Vir DXH
related: pLfm Uff BsM
related: XYLK CQw wqY
related: yPmK 7b8 L3H
related: C2611
related: fiLT BSW HCb
related: W7Tf sPz jpH
related: rXST u2H Ujo
related: qWPT Ygb CKr
related: 4RbW Kwb whi
related: WJa2 cQS naH
related: q7Mx gjU F9q
related: Urr8 rxC Spw
related: QFsa CfY 1Ly
related: mD1c 2NB pDo
related: VUpS Usc Qdu
related: DNuY aoK i1h
related: Jd1D jKD qaD
related: Tu3a CQh nGG
related: ZSXe KXh TzJ
related: qD53 dVu cnU
narrower: Advokat
broad match: X82t awd Qyc

Dokumentalist
type: Concept
in scheme: JobTech Taxonomy - Yrke
definition: Dokumentalist
broader: Bibliotekarier och arkivarier
related: 5Aea HSA Xz1
related: vkec yXn teh
related: HqrB eeP 5ST
related: S9mo J4G VRE
related: X82t awd Qyc
related: Qhim RVY oRd
related: A9nu Lbz zBK
related: 7Vne Ptb Jqi
related: fJtq xfM 2MH
related: 9puE nYg crq
related: FwoX siZ 55B
related: NJUH biQ Nji
related: uChZ DAq Apz
related: W1fx YtW vwX
related: AuDs T1F oGr
related: bahc fyL HQ9
related: ZBT9 xrn yEn
related: XFSc hhW i1t
related: 815o wTJ FXF
related: daE1 GKW Mc3
broad match: C2622

Forskare, växt- och djurbiologi
type: Concept
in scheme: JobTech Taxonomy - Yrke
definition: Forskare, växt- och djurbiologi
broader: Växt- och djurbiologer
related: kJeN wmw 9wX
broad match: C2131

Lokaliserare
type: Concept
in scheme: JobTech Taxonomy - Yrke
definition: Lokaliserare
broader: Översättare, tolkar och lingvister m.fl.
related: 9puE nYg crq
broad match: C2643

Verktygskonstruktör
type: Concept
in scheme: JobTech Taxonomy - Yrke
definition: Verktygskonstruktör
broader: Ingenjörer och tekniker inom maskinteknik
related: 6Hq3 tKo V57
related: jRSu bq2 m1m
related: 9aEn jPz gJs
related: CHnz vwT n4h
related: KWNv oWK 5E2
related: C41S vox 2gE
broad match: C3115

Sektionschef, sjukhus
type: Concept
in scheme: JobTech Taxonomy - Yrke
definition: Sektionschef, sjukhus
broader: Chefer inom hälso- och sjukvård
related: NYW6 mP6 vwf
related: epLc SkD cbT
related: bh3H Y3h 5eD
broad match: C1342

Driftingenjör, maskin
type: Concept
in scheme: JobTech Taxonomy - Yrke
definition: Driftingenjör, maskin
broader: Civilingenjörsyrken inom maskinteknik
related: SuAn oH9 xNc
related: 6Hq3 tKo V57
broad match: C2144

Fältgeotekniker
type: Concept
in scheme: JobTech Taxonomy - Yrke
definition: Fältgeotekniker
broader: Övriga ingenjörer och tekniker
related: AZx6 A3j D44
related: 7zhB QgY sdy
related: j7Cq ZJe GkT
related: P7Qb nLf ouD
related: Mxyf t2J iLA
broad match: C8342

Forskningsledare
type: Concept
in scheme: JobTech Taxonomy - Yrke
definition: Forskningsledare
broader: Forskarassistenter m.fl.
related: X82t awd Qyc
related: QBSq 38M fTz
broad match: C2310

Tullhandläggare
type: Concept
in scheme: JobTech Taxonomy - Yrke
definition: Tullhandläggare behandlar och kontrollerar tulldeklarationer och andra dokument vid import och export av varor. Arbetet omfattar klassificering av varor, kontroll av ursprungsintyg, tullvärde och andra handelsdokument samt kommunikation med företag, speditörer och andra myndigheter. Tullhandläggare tillämpar tullagstiftning, hanterar ärenden kopplade till tulltaxor och övervakar att regler för internationell handel följs. Arbetet sker vanligtvis vid tullmyndigheter, speditionsföretag, logistikföretag eller inom större import- och exportföretag.
broader: Speditörer och transportmäklare
related: RPTn bxG ExZ
related: ASGV zcE bWf
related: dhJi MgZ Zmy
related: VNJK fM8 SuY
related: 7SoB ezP oaP
related: B4cy wRJ 5mP
related: aXPQ dBg ASM
related: VtKH Bh8 HH7
related: hcEb Hyi ToP
related: Hs87 LgH Ghu
broad match: C3331

Passare
type: Concept
in scheme: JobTech Taxonomy - Yrke
definition: Assisterar ljusavdelningen genom att stödja elektriker och andra med uppgifter som krävs under inspelningen. Källa: YNFT
broader: Ljus-, ljud- och scentekniker
related: wmYx bey vRq
related: DPvK uas JGE
related: BEzn tA9 Rcn
related: 8too bEs 7NU
related: 9puE nYg crq
related: d1Ao 9bY 7Kn
related: Fdy4 SzS xmL
broad match: C3435

Biodlare
type: Concept
in scheme: JobTech Taxonomy - Yrke
definition: En biodlare arbetar med att sköta och underhålla bisamhällen för att producera honung och andra biprodukter som bivax, propolis och pollen. Yrket innebär ansvar för binas hälsa, produktion, samt försäljning och marknadsföring av biprodukter. Biodling kan bedrivas både som hobby och som yrkesverksamhet, där yrkesbiodlaren ofta driver egen verksamhet och kan även erbjuda pollineringstjänster till lantbruk och sälja bisamhällen eller drottningar. Källa: Arbetsförmedlingen, Alltombiodling
broader: Övriga djuruppfödare och djurskötare
related: UdVa jRr 9DE
related: VuuL 7CH adj
related: L4fa dBi kkA
broad match: C6123

Bärplockare och plantörer m.fl.
type: Concept
in scheme: JobTech Taxonomy - Yrke
definition: Bärplockare och plantörer m.fl.
broader: Yrken med krav på kortare utbildning eller introduktion
narrower: Bärplockare och plantörer m.fl.

Maskinoperatör foderberedning
type: Concept
in scheme: JobTech Taxonomy - Yrke
definition: Maskinoperatörer inom foderberedning sköter och övervakar maskiner som producerar djurfoder. Yrket är mycket likt maskinoperatörer inom livsmedelsindustri, med skillnaden att man arbetar med eller har specialiserat sig på beredning av djurfoder. Arbetet kan ske via kontrollrum där maskinoperatören styr, övervakar och justerar produktionen. Beroende på arbetsplats och typ av livsmedel kan arbetsmoment som utförs för hand även förekomma. Inom livsmedelsindustri finns även krav på att man som medarbetare har utbildning i säker livsmedelshantering. Beroende på arbetsplats kan truckkörning, lagerarbete och leveransföreberedelse förekomma. Källa: Arbetsförmedlingen
broader: Maskinoperatörer, kött- och fiskberedningsindustri
related: UdVa jRr 9DE
related: niDG o3B MEN
related: wTEr CBC bqh
broad match: C8160

Läkemedelskonsulent
type: Concept
in scheme: JobTech Taxonomy - Yrke
definition: Läkemedelskonsulent
broader: Företagssäljare
related: rDcj Tao TJJ
related: RPTn bxG ExZ
related: ZMCb Txn 2QP
related: Dc3s mJg 5pq
related: Tmpn 1HJ Hbq
broad match: C2433

Layoutare
type: Concept
in scheme: JobTech Taxonomy - Yrke
definition: Layoutare planerar och utformar sidlayouter för tryckta och digitala publikationer. Vanliga arbetsuppgifter är layout av tidningar, broschyrer, kataloger och digitala presentationer, ofta i samarbete med skribenter och illustratörer, placera text, bild och grafiska element enligt uppdrag och formkrav. Källa: Arbetsförmedlingen, Konstfack
broader: Grafiska formgivare m.fl.
related: vsiw 2Qc qnf
related: BMMN VHy GyF
related: 8too bEs 7NU
related: 9puE nYg crq
related: eHKb Mfh ZVx
related: WjCH PZv eAC
related: 94Pz 5AB ZtW
related: k2h8 Gjj T23
broad match: C2166

Hälsopedagog
type: Concept
in scheme: JobTech Taxonomy - Yrke
definition: Hälsopedagoger arbetar med att främja hälsa och välmående hos olika målgrupper, ofta inom skola, äldreomsorg eller socialtjänst. Arbetsuppgifterna omfattar hälsofrämjande insatser, hälsovägledning, utformning och genomförande av aktiviteter och program som stödjer fysisk och psykisk hälsa. Hälsopedagogen samarbetar med andra yrkesgrupper, ofta inom kommunala verksamheter. Beroende på arbetsplats kan man även arbeta mer strategiskt med övergripande planering, inklusive med hänsyn till ekonomiska förutsättningar. Källa: Sveriges kommuner och regioner, Arbetsförmedlingen
broader: Friskvårdskonsulenter och hälsopedagoger m.fl.
related: RQak W9m okc
related: 9fkp N2T et5
related: Z394 nH4 c2G
related: jSpa 8p7 CJv
related: pqYV ae6 M3i
related: h6fC Gaj Yiz
related: GazW 2TU kJw
related: 7NHG yP6 ucW
related: Lot6 PJ4 gc7
related: GUwP yJt eAB
related: CcmP JJ5 uGn
related: 1T6B xeY p3m
related: MqCG ifS Wgo
related: d3zG k6q E63
related: 5TMR pAC pq6
related: Ceco 6De qh8
related: MVqp eS8 kDZ
related: Eoxh iub Dk1
related: Abys 5p1 Cnq
related: mH3F TfR fvZ
related: WEZD Jjq Ftp
related: 8ejA z1u L2H
related: jYiE MNL eJf
related: iNr9 8MP E3k
related: gA47 pwK UZq
related: uxay kgC irc
related: Qse3 VXz 7Hn
broad match: C3423

Språkteknolog
type: Concept
in scheme: JobTech Taxonomy - Yrke
definition: Språkteknolog
broader: Översättare, tolkar och lingvister m.fl.
related: 9puE nYg crq
broad match: C2643

Bil-, motorcykel- och cykelförare
type: Concept
in scheme: JobTech Taxonomy - Yrke
definition: Bil-, motorcykel- och cykelförare
broader: Transport- och maskinföraryrken
narrower: Taxiförare m.fl.
narrower: Övriga bil-, motorcykel- och cykelförare

Politiker
type: Concept
in scheme: JobTech Taxonomy - Yrke
definition: Fattar beslut, leder och påverkar verksamheten i demokratiskt valda organ på nationell, regional eller lokal nivå. Utformar, stadfäster, ändrar och upphäver lagar, förordningar och andra författningar.
broader: Politiker och högre ämbetsmän
related: icvA Gu9 EqB
related: Mw7Y 2pY itu
related: 8tYq EXD Xwm
related: detQ YNb 9nG
related: h7ke CYq RNF
related: w7J6 vmA z5h
related: X9Kc p8a 1FB
related: iXbF oGL mPr
related: hLqS EHC 3GK
related: q7Mx gjU F9q
related: D6ev Zwt x83
related: C1111
related: 6w8c jGr SfA
narrower: Minister
narrower: Riksdagsledamot
narrower: Statssekreterare
narrower: Departementschef
broad match: bh3H Y3h 5eD

Jurister
type: Concept
in scheme: JobTech Taxonomy - Yrke
definition: Jurister
broader: Yrken med krav på fördjupad högskolekompetens inom juridik, kultur och socialt arbete m.m.
narrower: Advokater
narrower: Övriga jurister
narrower: Åklagare
narrower: Affärs- och företagsjurister
narrower: Förvaltnings- och organisationsjurister
narrower: Domare

Röstpedagog
type: Concept
in scheme: JobTech Taxonomy - Yrke
definition: Röstpedagog
broader: Övriga pedagoger med teoretisk specialistkompetens
related: pVzY rff Amk
related: MVqp eS8 kDZ
broad match: C2359

Scenografiassistent
type: Concept
in scheme: JobTech Taxonomy - Yrke
definition: Scenografassistent arbetar nära scenografen och stöder i att omsätta kreativa visioner till konkreta scenmiljöer inom teater, film, TV och event. Vanliga arbetsuppgifter inkluderar kontakt med hantverkare, budgetansvar för mindre byggen, logistiskt stöd och hantering av rekvisita och material för att säkerställa en fungerande scenografi. Scenografassistenten bidrar även med problemlösning och organisatoriskt stöd i produktionen. Källa: Arbetsförmedlingen, Film i Väst, Yrkesnämnden för Film och TV
broader: Inredare, dekoratörer och scenografer m.fl.
related: 8too bEs 7NU
related: 9puE nYg crq
related: 8Ho8 wmR dfg
broad match: C3432

Civilingenjör, kvalitet, metallurgi
type: Concept
in scheme: JobTech Taxonomy - Yrke
definition: Civilingenjör, kvalitet, metallurgi
broader: Civilingenjörsyrken inom gruvteknik och metallurgi
related: 6Hq3 tKo V57
related: AZPQ Dz2 LGF
broad match: C2146

Organisationschef, kommun
type: Concept
in scheme: JobTech Taxonomy - Yrke
definition: Organisationschef, kommun
broader: Förvaltnings- och planeringschefer
related: epLc SkD cbT
related: HzGY ajm Duz
related: bh3H Y3h 5eD
broad match: C1213

Fastighetsmäklarassistent
type: Concept
in scheme: JobTech Taxonomy - Yrke
definition: Fastighetsmäklarassistenter hjälper fastighetsmäklare med administrativa och kundrelaterade arbetsuppgifter i samband med fastighetsförmedling. Arbetet omfattar till exempel hantering av kundkontakter, bokning av visningar, sammanställning av kontrakt och dokumentation samt uppdatering av fastighetsregister. Fastighetsmäklarassistenter deltar ofta i kommunikation med myndigheter och andra aktörer samt bidrar till marknadsföring av objekt. Källa: Mäklarsamfundet, Arbetsförmedlingen
broader: Marknads- och försäljningsassistenter
related: R5b6 RY7 Zjb
related: TiAU Qpu RYG
related: RPTn bxG ExZ
related: fKju yej bi6
broad match: C4419

Bärplockare och plantörer m.fl.
type: Concept
in scheme: JobTech Taxonomy - Yrke
definition: Bärplockare och plantörer m.fl.
broader: Bärplockare och plantörer m.fl.
narrower: Bärplockare och plantörer m.fl.

Porslinsmålare
type: Concept
in scheme: JobTech Taxonomy - Yrke
definition: Porslinsmålare dekorerar porslin. Arbetet innebär i huvudsak att designa och skapa dekorativa motiv på porslinsföremål som kakel och keramik. Arbetet innefattar tekniker som handmålning och stencilering för att framställa konstnärliga och unika illustrationer på porslinsytor. Källa: Arbetsförmedlingen, ESCO
broader: Musikinstrumentmakare och övriga konsthantverkare
related: mc5s kUK BQc
related: PaxQ o1G wWH
related: 3jPU NcZ EAt
related: cNsV iGZ 2tC
broad match: C7316

Sångare
type: Concept
in scheme: JobTech Taxonomy - Yrke
definition: Sångare
broader: Musiker, sångare och kompositörer
related: MZ7q edu 6Gm
related: ncru No8 jbS
related: EYqe 2VF NHv
related: tLQJ 35E iPP
related: 4Mi3 776 M2m
related: 8too bEs 7NU
related: 9puE nYg crq
related: bzWt YmF UjZ
related: e4eQ kzD BCA
broad match: C2652

Reklamutdelare och tidningsdistributörer
type: Concept
in scheme: JobTech Taxonomy - Yrke
definition: Distribuerar tidningar och reklamblad till hushåll och inrättningar. Hit hör inte Brevbärare (4420)
broader: Tidningsdistributörer, vaktmästare och övriga servicearbetare
related: C9623
related: C8189
related: C9622
related: C9621
related: vohr DL4 BwH
related: C9629
related: XQet 5J6 HGj
related: rwir xvu 443
related: VfeM f5V bjd
narrower: Reklamutdelare
narrower: Tidningsdistributör
broad match: ASGV zcE bWf

Kvartärgeolog
type: Concept
in scheme: JobTech Taxonomy - Yrke
definition: Kvartärgeolog
broader: Geologer och geofysiker m.fl.
related: kJeN wmw 9wX
broad match: C2114

Yrken med krav på högskolekompetens eller motsvarande
type: Concept
in scheme: JobTech Taxonomy - Yrke
top concept of: JobTech Taxonomy - Yrke
definition: Yrken med krav på högskolekompetens eller motsvarande
narrower: Yrken med krav på högskolekompetens eller motsvarande inom kultur, friskvård och socialt arbete m.m.
narrower: Yrken med krav på högskolekompetens eller motsvarande inom ekonomi och förvaltning
narrower: Yrken med krav på högskolekompetens eller motsvarande inom hälso- och sjukvård samt laboratorium
narrower: Yrken med krav på högskolekompetens eller motsvarande inom teknik
narrower: Yrken med krav på högskolekompetens eller motsvarande inom IT, ljud- och ljusteknik m.m.

Rekvisitörsassistent
type: Concept
in scheme: JobTech Taxonomy - Yrke
definition: Rekvisitörsassistent stödjer rekvisitören genom att ansvara för hantering och förberedelse av rekvisita inför och under film-, teater- och TV-produktioner. Vanliga arbetsuppgifter är att bistå vid inköp, transport och underhåll av rekvisita, se till att rätt föremål finns på plats vid inspelning, organisera och förvara rekvisita samt assistera med förberedelser inför scener. Källa: Arbetsförmedlingen, Voodoo Film, Yrkesnämnden för Film och TV
broader: Inspicienter och scriptor m.fl.
related: Ec4b NAt mQJ
related: 8too bEs 7NU
related: 9puE nYg crq
broad match: C3435

Civilingenjörsyrken inom kemi och kemiteknik
type: Concept
in scheme: JobTech Taxonomy - Yrke
definition: Utvecklar metoder och produkter inom kemi, kemiteknik, livsmedelsteknik m.m. Svarar för produktionsprocess och teknisk utveckling vid tillverkning av petroleumprodukter, kemikalier, kemiska och kemitekniska produkter, läkemedel, syntetiska material eller livsmedel. Ansvarar för kvalitets-, frisläpps- och slutkontroll av kemitekniska produkter. Hit hör inte - Yrken inom kemi och kemiteknik med arbetsuppgifter motsvarande ingenjör- eller teknikernivå (3115)
broader: Civilingenjörsyrken
related: mg8h fe2 kDM
related: JsAw WWK wbb
related: uvcb DuX NW8
related: pqjF 8wN GsW
related: tg8L maz wMN
related: HBEU dvp 7ZD
related: 7GaA 87a uE5
related: 74Mw JUN VKx
related: RKaF ZmA 9c3
related: Nwrk 3XY Yur
related: YK2s pxn YWW
related: AQtr C7f Dyt
related: krCG SCu myw
related: 5Lq4 w7S 88y
related: e9NH rRn Cjf
related: bwYY qC7 5xE
related: sRsc cvy PfX
related: kJCx vqk SQG
related: jSAi QKc JQk
related: rFRr KTf FjW
related: uwev L2n fpz
related: C2145
related: tNHP 38u Pjt
related: irPd z5v 2o1
related: P755 zTS nta
related: VQHQ ScF Fr5
related: 5AeE s2W c5p
related: ND2K ivB 6RA
related: WBAe 1rD 5JT
related: 8cdE rAR qFH
related: a1Sf mey gVk
related: 2rqG WLp em4
related: Q6DB h8V mc7
related: GKfd eHz HWB
related: DMim Tzk 2j4
related: NxTN 57S Apf
related: 3i6s BB6 E3X
related: DnL5 sXM WRb
related: W4er Syp Wrt
related: G84U eAD CiF
related: ruVS dJA 3Kg
related: yXmf iKi 7ci
related: FdP3 vbh FBs
related: NB2C zFs C9F
related: Y197 2oc uoE
related: S4Ku uT7 yuV
related: 5vfN sNS Ltq
related: CTFz 4VM y5H
related: 3Sj1 uuL y1A
related: h6Tu oFS KDH
related: dpH3 oqg AHa
related: Bbj8 8y7 XJ5
narrower: Utvecklingsingenjör, kemi
narrower: Civilingenjör, kemiteknik
narrower: Forskningsingenjör, kemi
narrower: Civilingenjör, kemi
narrower: Civilingenjör, forskning och utveckling, kemi
narrower: Civilingenjör, kvalitet, kemiteknik
narrower: Processutvecklare, kemi
narrower: Civilingenjör, process, kemiteknik
broad match: 6Hq3 tKo V57

Bildemontör
type: Concept
in scheme: JobTech Taxonomy - Yrke
definition: Bildemontörer demonterar bilar och andra fordon eller maskiner. Arbetet innebär i huvudsak att demontera personbilar och andra fordon. Man bedömer om demonterade delar går att återanvända som reservdelar genom kvalitetskontroll och funktionstestning. Reservdelar katalogiseras och dokumenteras enligt olika system. Miljöfarligt avfall som batterier, bränslen och oljor tas om hand. Demonterade delar som inte bedöms kunna säljas skickas för återvinning. Källa: Arbetsförmedlingen
broader: Renhållnings- och återvinningsarbetare
related: whao Q6A ScE
related: P5ED GaU Gup
related: UdVa jRr 9DE
related: F4tz HcT in8
related: 31Ps 7Hy 3a8
related: Wakm MJg vch
broad match: C9612

Djurfysioterapeut
type: Concept
in scheme: JobTech Taxonomy - Yrke
definition: Djurfysioterapeut bedömer, behandlar och rehabiliterar djur med skador, smärtor eller funktionsnedsättningar i muskler, leder och skelett. Fysioterapeut är ett legitimationsyrke. Djurfysioterapeut utför fysioterapeutiska insatser som rehabilitering efter skador, operationer eller belastningsrelaterade besvär, ofta i samarbete med veterinär. Vanliga arbetsuppgifter är analys av djurs rörelsemönster, utveckling av träningsprogram och behandling med mobilisering, träning och fysisk terapi. Källa: Arbetsförmedlingen, Fysioterapeuterna, Jordbruksverket
broader: Fysioterapeuter och sjukgymnaster
related: NYW6 mP6 vwf
related: sqvh gTy 6Sj
related: VvkY X2G 5RU
broad match: C2264

Måleri, servicearbetare
type: Concept
in scheme: JobTech Taxonomy - Yrke
definition: Servicearbetare inom måleri utför enklare arbeten som förbereda ytor, tvättning och rengöring av husfasader samt tapetnedtagning. Servicearbetare inom måleri är en extra resurs för att underlätta arbetet för målarna i projekten. Källa: Arbetsförmedlingen
broader: Grovarbetare inom bygg och anläggning
related: 1iRB oaL bXT
related: UdVa jRr 9DE
related: j7Cq ZJe GkT
related: 1brD Cop tDT
related: ja7J P8X YC9
broad match: C9313

Skogsarbetare
type: Concept
in scheme: JobTech Taxonomy - Yrke
definition: Driver skogsbruk. Vårdar och avverkar skog.
broader: Skogsarbetare
related: AUrv buc hYw
related: F1Mf Yru 39T
related: b7mV 5aH rHU
related: RCcY Ccr i1y
related: ww6z xW8 EdH
related: ba8g LRR Sj2
related: C6210
related: Luwa 3g7 7Yd
related: nqz6 PKY kii
related: yAip asH hQX
related: J5iL sjS QxW
related: ZzN5 m7B 5CY
related: zuXd SyF vPg
related: jnhn HSM 2eC
related: u5Q2 Uox r2i
related: WNzJ uxV YSy
related: zve2 ooW xhy
related: AJB8 zVZ v9j
related: r6JM xDi BDY
related: 6Rxx zRM Dqc
related: dMKQ KpC Taw
related: Gano TLF 58d
related: DBtL es1 XMM
related: PfHC b9Z KGa
related: H18s qDp ynC
related: C3141
narrower: Arbetsledare skogsvård
narrower: Skogsvårdare
narrower: Kontrollmätare virke
narrower: Virkesmätare
narrower: Naturvårdare
broad match: VuuL 7CH adj

Brevbärare och postterminalarbetare
type: Concept
in scheme: JobTech Taxonomy - Yrke
definition: Brevbärare och postterminalarbetare
broader: Andra kontors- och kundserviceyrken
narrower: Brevbärare och postterminalarbetare

Maskinoperatörer, gummi-, plast- och pappersvaruindustri
type: Concept
in scheme: JobTech Taxonomy - Yrke
definition: Maskinoperatörer, gummi-, plast- och pappersvaruindustri
broader: Process- och maskinoperatörer
narrower: Maskinoperatörer, gummiindustri
narrower: Maskinoperatörer, plastindustri
narrower: Maskinoperatörer, pappersvaruindustri

Förvaltare inom skogsbruk och lantbruk m.fl.
type: Concept
in scheme: JobTech Taxonomy - Yrke
definition: Förvaltare inom skogsbruk och lantbruk m.fl.
broader: Chefer inom IT, logistik, FoU, fastighetsbolag, bygg- och ingenjörsverksamhet samt tillverkning m.m.
narrower: Förvaltare inom skogsbruk och lantbruk m.fl.

Servicechef, bilverkstad
type: Concept
in scheme: JobTech Taxonomy - Yrke
definition: Servicechef, bilverkstad
broader: Övriga förmedlare
related: RPTn bxG ExZ
related: CvXr Jfj hhm
related: epLc SkD cbT
broad match: C3339

Visuell grafisk kommunikatör
type: Concept
in scheme: JobTech Taxonomy - Yrke
definition: Visuell grafisk kommunikatör
broader: Informatörer, kommunikatörer och PR-specialister
related: X82t awd Qyc
related: vwxR MbC XjW
related: v2Ag VuL 9NG
broad match: C2432

Domare
type: Concept
in scheme: JobTech Taxonomy - Yrke
definition: Tolkar lagar och avtal. Bereder, föredrar och handlägger ärenden och mål samt bestämmer rättegångsordning. Dömer mål i allmän domstol, förvaltningsdomstol eller specialdomstol. Skriver domar och beslut.
broader: Jurister
related: 6thd xZq KsU
related: MSoG rHL T9a
related: C2612
related: Uzqv VCN BQq
related: pLfm Uff BsM
related: XYLK CQw wqY
related: LCq3 h3n 9DU
related: qWPT Ygb CKr
related: Juia j2p bAj
related: 2m2o hEw kee
narrower: Kammarrättsråd
narrower: Lagman
narrower: Rådman
narrower: Kammarrättslagman
narrower: Notarie
narrower: Hovrättsråd
narrower: Fiskal
narrower: Kammarrättspresident
narrower: Hovrättslagman
narrower: Chefsrådman
narrower: Assessor
narrower: Hovrättspresident
narrower: Domare
broad match: X82t awd Qyc

Fredsforskare
type: Concept
in scheme: JobTech Taxonomy - Yrke
definition: Fredsforskare
broader: Arkeologer och specialister inom humaniora m.m.
related: X82t awd Qyc
broad match: C2633

Maskinoperatör livsmedelsindustri
type: Concept
in scheme: JobTech Taxonomy - Yrke
definition: Maskinoperatörer inom livsmedelsindustri sköter och övervakar maskiner som producerar livsmedel av olika slag. Tillverkningsprocessen sker via kontrollrum där maskinoperatören styr, övervakar och justerar produktionen. Stora delar av processen är automatiserad, beroende på arbetsplats och typ av livsmedel kan arbetsmoment som utförs för hand även förekomma. Inom livsmedelsindustri finns även krav på att man som medarbetare har utbildning i säker livsmedelshantering. Beroende på arbetsplats är truckkörning, lagerarbete och leveransföreberedelse även förekommande arbetsuppgifter. Källa: Arbetsförmedlingen
broader: Övriga maskinoperatörer, livsmedelsindustri m.m.
related: aRoR gHX VvX
related: gNuq dvP zXZ
related: qejQ b6G kQ3
related: bHgL qFj ayT
related: dQ1w 6zR ztQ
related: cb6h KHH bqH
related: jL7Y pyT oZb
related: W2VX MBo S3F
related: hEnb cpi Bn9
related: wFf5 bp5 5Qw
related: wTEr CBC bqh
broad match: C8160

Forskningsassistent, samhällsvetenskap
type: Concept
in scheme: JobTech Taxonomy - Yrke
definition: Forskningsassistent, samhällsvetenskap
broader: Arkeologer och specialister inom humaniora m.m.
related: X82t awd Qyc
broad match: C2633

Neurosjuksköterska
type: Concept
in scheme: JobTech Taxonomy - Yrke
definition: Neurosjuksköterska arbetar med omvårdnad och stöd i både det akuta skedet och inom öppenvård eller rehabilitering för personer som drabbats av neurologiska sjukdomar och deras närstående. Sjuksköterska är en skyddad titel med legitimationskrav. En neurosjuksköterska med specialistsjuksköterskeexamen får använda benämningen specialistsjuksköterska inom neurosjukvård. Vanliga arbetsuppgifter är bedöma och övervaka neurologiska symtom, administrera läkemedel och behandlingar, planera och följa upp vårdinsatser samt informera och stödja patienter och närstående genom hela vårdkedjan, från akut omhändertagande till rehabilitering. Källa: Arbetsförmedlingen, Göteborgs universitet, Linköpings universitet, Socialstyrelsen
broader: Övriga specialistsjuksköterskor
related: YDQW bNP GVW
related: NYW6 mP6 vwf
related: ytRi QuA XLX
related: 1f7B E5K sh3
broad match: C2221

Bärgarförare
type: Concept
in scheme: JobTech Taxonomy - Yrke
definition: Bärgarförare arbetar med att bärga fordon och utföra mindre reparationer på väg. Bärgarförare bärgar trasiga fordon och transporterar dessa till verkstäder för reparation eller till annan plats enligt kunds önskemål. Man bärgar både lätta fordon som personbilar och tyngre fordon som lastbilar. Förutom bärgning är det vanligt att arbeta med vägassistans, vilket innebär mindre reparationer så att kunder kan fortsätta köra, till exempel däckbyten, laga punkteringar och öppna låsta bildörrar. Det är även vanligt att bärgarförare kör TMA-fordon. Källa: Arbetsförmedlingen
broader: Lastbilsförare m.fl.
related: iKT8 eDc J8z
related: zGjD M5a HCX
related: sq4U PmN jDz
related: bCUX YKG Vvt
related: nD9v iHa ytM
related: ASGV zcE bWf
related: xGdi XXa Cnq
related: enug sxj XU3
related: yJot iUL gQk
related: rYWq 3Tf qFK
related: 9wnn PAV q12
broad match: C8332

Fukttekniker
type: Concept
in scheme: JobTech Taxonomy - Yrke
definition: Fukttekniker arbetar med skadebesiktning, fuktmätning och åtgärd av fuktskador i byggnader, ofta efter vattenskador eller andra fuktrelaterade problem. Arbetsuppgifter innefattar att utföra inspektioner och utredningar, mäta fuktnivåer, upprätta rapporter samt samordna torknings- och saneringsinsatser. Arbetsgivare efterfrågar vanligtvis en teknisk utbildning inom bygg eller fuktteknik, gärna på yrkeshögskolenivå, kombinerat med praktisk erfarenhet från byggbranschen eller skadehantering. Kunskap om byggnadskonstruktioner, fuktmekanik och relevanta normer är ofta efterfrågat. Källa: Arbetsförmedlingen, YH Akademin
broader: Brandingenjörer och byggnadsinspektörer m.fl.
related: E7hm BLq fqZ
related: v9u6 2Tx jJb
broad match: C3112

Ädelstensslipare
type: Concept
in scheme: JobTech Taxonomy - Yrke
definition: Ädelstensslipare slipar ädelstenar och diamanter. Ädelstenar slipas från råmaterial till önskad form, vilket är en lång process. Arbetet sker med olika slipverktyg, maskinella och maskinella. Slipningen är avgörande för ädelstenens lyster. Källa: Arbetsförmedlingen, Sveriges Guldsmedsmästares Riksförening
broader: Guld- och silversmeder
related: PaxQ o1G wWH
related: Jt8f 1uH Jup
broad match: C7313

Biostatistiker
type: Concept
in scheme: JobTech Taxonomy - Yrke
definition: Biostatistiker
broader: Statistiker
related: X82t awd Qyc
broad match: C2120

Järnvägsingenjör
type: Concept
in scheme: JobTech Taxonomy - Yrke
definition: Järnvägsingenjör
broader: Ingenjörer och tekniker inom bygg och anläggning
related: ieuy Yx4 24H
related: 8YyW ZGi bZr
related: fnfy 83B xZe
related: j7Cq ZJe GkT
related: 4qe7 yQA goA
related: 95e5 1Uf r4X
related: oFQZ U4b hUM
related: ZjCw 9JF b8s
broad match: C3112

Assistent i församlingsarbete
type: Concept
in scheme: JobTech Taxonomy - Yrke
definition: En assistent i församlingsarbete, även kallad församlingsassistent, har en mångsidig roll som innefattar stöd till olika verksamheter och att skapa en trivsam miljö. Det kan inkludera allt från att förbereda enklare måltider och fika till att ansvara för inköp och se till att lokalerna är välkomnande. Arbetet är både socialt och andligt, och assistenten samarbetar nära med andra i församlingen, som präster, diakoner, och ideella krafter. Källa: Svenska kyrkan
broader: Fritidsledare m.fl.
related: PKAy 1hP Vqn
related: tcHN nUg LMs
related: GazW 2TU kJw
related: YYnb dEQ FgM
related: SKst FiK 4Gv
broad match: C3423

Klippassistent
type: Concept
in scheme: JobTech Taxonomy - Yrke
definition: Hjälper filmklipparen med administrativa och tekniska uppgifter för att underlätta redigeringsprocessen. Källa: YNFT
broader: Bild- och sändningstekniker
related: 9puE nYg crq
related: d1Ao 9bY 7Kn
related: txH6 SxW j5U
broad match: C3521

Projektledare, offentlig verksamhet
type: Concept
in scheme: JobTech Taxonomy - Yrke
definition: Projektledare inom offentlig verksamhet leder olika typer av projekt inom regioner, kommuner, myndigheter eller andra offentliga organisationer. Huvudsakliga arbetsuppgifter omfattar att planera, leda och styra projekt från start till mål, vilket inkluderar att skapa projektplaner, följa upp tidsramar och budget samt koordinera projektteamets arbete. Det som särskiljer rollen i offentlig sektor är ansvaret för att hantera skattemedel på ett ansvarsfullt sätt samt att projektmedlemmarna ofta arbetar deltid med projektet parallellt med sina ordinarie arbetsuppgifter. Källa: Arbetsförmedlingen
broader: Övriga handläggare
related: MRxn 7Dd ZDT
related: X82t awd Qyc
related: GGqZ 6Ew 5Ha
related: yXSE wvx EAN
related: weQx ZCB ka9
broad match: C3359

Perukmakare
type: Concept
in scheme: JobTech Taxonomy - Yrke
definition: Perukmakare tillverkar, anpassar och underhåller peruker, toupéer, polisonger, skägg och mustascher för olika ändamål såsom teater, film, sjukvård och privat bruk. Vanliga arbetsuppgifter är att tillverka nya peruker, reparera och justera befintliga samt att ge kunder råd och anpassa produkterna efter deras behov, som kan inkludera medicinska skäl. Perukmakaren kan arbeta åt privata kunder, inom scenkonst, TV/film eller i specialiserade salonger. Källa: Arbetsförmedlingen, Frisörföretagarna och Svensk Scenkonst
broader: Frisörer
related: Uuf1 GMh Uvw
related: kxUL f3p yX2
related: 8too bEs 7NU
related: BWXB 3KL Yx2
broad match: C5141

Civilingenjör, anläggning
type: Concept
in scheme: JobTech Taxonomy - Yrke
definition: En Civilingenjör inom anläggning arbetar inom olika funktioner med att planera, bygga, utveckla och förvalta infrastruktur. Arbetsplatsen finns inom privat såväl som offentlig sektor, allt från mindre konsultfirmor till stora entreprenadföretag. Källa: Arbetsförmedlingen
broader: Civilingenjörsyrken inom bygg och anläggning
related: j7Cq ZJe GkT
related: anYS 5AR JRk
related: ja7J P8X YC9
broad match: C2142

IT-utredare
type: Concept
in scheme: JobTech Taxonomy - Yrke
definition: IT-utredare
broader: Systemanalytiker och IT-arkitekter m.fl.
related: apaJ 2ja LuF
related: qBsw ikL hZ2
broad match: C2511

Ateljerista
type: Concept
in scheme: JobTech Taxonomy - Yrke
definition: Ateljerista
broader: Övriga pedagoger med teoretisk specialistkompetens
related: pVzY rff Amk
related: MVqp eS8 kDZ
related: WRK2 dVW b4J
broad match: C2359

ST-tandläkare
type: Concept
in scheme: JobTech Taxonomy - Yrke
definition: Specialisttjänstgöring, ST, är den vidareutbildning som legitimerade tandläkare genomför för att uppnå specialistkompetens. ST-tandläkare arbetar under handledning för att fördjupa sina kunskaper och färdigheter med målet att bli specialisttandläkare inom sitt område. Vanliga arbetsuppgifter är att behandla patienter med komplexa odontologiska behov, delta i ämnesspecifika och specialistövergripande utbildningsmoment samt samarbeta med andra tandläkare och specialister. Arbetet innebär också att dokumentera och följa upp den egna utvecklingen utifrån en individuell studieplan. Källa: Arbetsförmedlingen, Socialstyrelsen, Sveriges Tandläkarförbund, Svenska Ortodontiföreningen
broader: Tandläkare
related: NYW6 mP6 vwf
related: YJWb bXT LYb
related: NgG1 5qR MDs
broad match: C2211
broad match: C2261

Showartist
type: Concept
in scheme: JobTech Taxonomy - Yrke
definition: Showartist
broader: Övriga yrken inom kultur och underhållning
related: U9p4 cnN Td2
related: 1r3N oGy 2VB
related: 8too bEs 7NU
related: 9puE nYg crq
broad match: C2659

Isoleringsplåtslagare
type: Concept
in scheme: JobTech Taxonomy - Yrke
definition: Isoleringsplåtslagare jobbar på industrier med att isolera rör, pannor, cisterner och behållare, isoleringen kläs oftast med plåt som skydd. Förutom att minimera energiförlusterna används isolering även för att minska bullernivån och/eller brandrisken. För att kunna plåtbeklä isoleringen krävs kunskaper i plåtutberedning och geometri. Isoleringsplåtslagaren får sitt certifikat efter ett branschprov som avslutar lärlingsanställningen och den teoretiska grundutbildning Källa: VVSYN
broader: Isoleringsmontörer
related: j7Cq ZJe GkT
related: ja7J P8X YC9
related: nMhD Mq6 ikX
related: CD3T 7Q4 ghE
related: bw6Z b6G 2Y4
related: JezX oUD TZr
broad match: C7124

Montör metallprodukter
type: Concept
in scheme: JobTech Taxonomy - Yrke
definition: Montör metallprodukter sätter samman komponenter till färdiga produkter. Montörer av metallprodukter sätter samman komponenter till färdiga produkter, antingen manuellt eller med hjälp av olika verktyg och maskiner. Exempelvis förekommer mekaniskt monteringsarbete av komponenter enligt ritning till produktionslinjer inom tillverkningsindustri. Beroende på arbetsplats kan man arbeta med montering av mindre eller större komponenter, från små detaljer till stora maskiner. Felsökning och kvalitetskontroll kan även förekomma. Källa: Arbetsförmedlingen
broader: Montörer, metall-, gummi- och plastprodukter
related: MhUY uyZ S5G
related: UdVa jRr 9DE
related: cs2d ws7 hmt
related: KTUs gmt D4t
related: TvAb dzB w5k
related: TD9K eaQ NJr
related: WoVw Myn 54b
related: VujB Fan SZ5
related: wTEr CBC bqh
related: 3vNk 83L bMK
broad match: C8219

Segelmakare
type: Concept
in scheme: JobTech Taxonomy - Yrke
definition: Segelmakare syr och reparerar segel till båtar och skepp. Segelmakare är ett hantverksyrke där själva hantverket kallas segelmakeri. Förutom att tillverka segel är det vanligt att även tillverka båtkapell och lastnät. Källa: Hantverkslärling
broader: Sömmare
related: a9Gu x9s pnf
related: juRM qVL HLz
related: PaxQ o1G wWH
broad match: C7533

Garantihandläggare
type: Concept
in scheme: JobTech Taxonomy - Yrke
definition: En garantihandläggare hanterar och administrerar garantiärenden för produkter eller tjänster. Detta innefattar att bedöma om ett garantianspråk är berättigat, kommunicera med kunder, beställa reparationer eller ersättning, samt hantera eventuell dokumentation och uppdatering av system. Källa: Arbetsförmedlingen
broader: Kundtjänstpersonal
related: UdVa jRr 9DE
related: RPTn bxG ExZ
related: 7jbm hNw UBZ
related: PBsb b9B hkp
related: b8iD sur 2Wj
related: SMhR GM6 xjV
broad match: C4225

Tandläkare
type: Concept
in scheme: JobTech Taxonomy - Yrke
definition: Tandläkare
broader: Yrken med krav på fördjupad högskolekompetens inom hälso- och sjukvård
narrower: Tandläkare

Specialister inom miljöskydd och miljöteknik
type: Concept
in scheme: JobTech Taxonomy - Yrke
definition: Undersöker miljön och utvecklar planer och lösningar för att skydda, bevara, återställa, minimera och förebygga skador på miljön. Undersöker, bedömer och rapporterar om byggnads- och konstruktionsprojekts påverkan på miljön. Inspekterar industriella och offentliga anläggningar och program för att utvärdera drifteffektivitet och garantera att miljöföreskrifterna följs.
broader: Specialister inom miljö- och hälsoskydd
related: TF1f u6x AGR
related: 8R6B ypK iSj
related: 48zu t6j A28
related: tg8L maz wMN
related: C2143
related: pS7e L46 x1p
related: uw7i bUK eex
related: moSc 5RL aYx
related: VBB2 QRu YM3
related: hZDG iqA bka
related: FCcX k8U M6g
related: LdgJ JMm yxF
related: sURo MBj hGS
related: RCcY Ccr i1y
related: oDP7 ReX a9j
related: upaJ 42d WtR
related: oxP3 A7r vRL
related: MWTZ jRV uw1
related: hcbd nSX UYP
related: yMp7 AwC zqx
related: j53D o7U Xkm
related: kmBX uX9 oQF
related: QRj4 BE5 bEA
related: eT4h foo 5GG
related: BroT juN Spe
related: KZb6 UBs gP9
related: FGuh iVi jCA
related: UXhY wj1 QSW
related: uKDT q7g vGP
related: UbGZ 9pL wwW
related: MJje v9X Srn
related: KrzH 5hF XVN
related: xwAq e21 98L
related: 2rqG WLp em4
related: YVn9 BZn s4b
related: d5iP YT7 Ztt
related: W4er Syp Wrt
related: 8HTU adL ie8
related: C2133
related: jRX3 beU Hz9
related: eTDK F6v 6yX
related: c2YE oK3 f1u
related: rarR CnP wRC
related: 6RWb VsD Hmw
related: iMip AKs SdP
related: hffj sDy sVU
related: 3Sj1 uuL y1A
related: BkCz fjg Am7
related: DVxD XNe cv7
related: YYdi Fqb 834
related: u6sZ FJX MZd
related: 3zgs 61Q etM
related: gpqK 9Up KAf
narrower: Miljöinspektör
narrower: Vindkraftsprojektör
narrower: Ekolog
narrower: Avfallsspecialist
narrower: Miljöingenjör/Miljövårdsingenjör
narrower: Miljöcontroller
narrower: Miljörevisor
narrower: Miljösamordnare/Miljökoordinator
narrower: Forskare, miljö
narrower: Miljöhandläggare
narrower: Naturvårdsingenjör
broad match: kJeN wmw 9wX

Skogsvärderare
type: Concept
in scheme: JobTech Taxonomy - Yrke
definition: Skogsvärderare
broader: Fastighetsförvaltare
related: 6Hq3 tKo V57
related: WDoL Rzs 4G1
related: VuuL 7CH adj
broad match: C3334

Servitör/Servitris
type: Concept
in scheme: JobTech Taxonomy - Yrke
definition: Servitörer och servitriser arbetar med servering av mat och dryck i restaurangmiljö. Arbetsuppgifterna omfattar att duka, ta beställningar, servera, hantera betalning, duka av och hålla god ordning i matsalen. Servitör ger information om rätter och drycker, samverkar med kök och bar samt bistår gäster under hela besöket. Källa: Arbetsförmedlingen
alternative label: Servitris
alternative label: Servitör
broader: Hovmästare och servitörer
related: QrLH CbH uyG
related: u3Aq MHC FL4
related: tj8n AVM WE5
related: 3jyy qYX MCM
related: 7goz uuv JWu
related: wkWQ 3JH 1wK
related: VqRa 738 v98
related: YBiG hCd cZa
related: 7o44 gVv s1V
related: 7coY HT4 rJc
related: WboA SJw EFw
related: tuKW sFK K4n
related: ScKy FHB 7wT
related: aHWW ZVK wRh
related: wvxX 9TB oXZ
related: VAz5 4kb As6
related: nsYk a5U dMX
related: nage eGj cMi
broad match: C5131

Studierektor
type: Concept
in scheme: JobTech Taxonomy - Yrke
definition: Studierektor
broader: Chefer inom grund- och gymnasieskola samt vuxenutbildning
related: epLc SkD cbT
related: 1k5F c7k jT8
related: bh3H Y3h 5eD
related: MVqp eS8 kDZ
broad match: C1345

Utredningschef
type: Concept
in scheme: JobTech Taxonomy - Yrke
definition: Utredningschef
broader: Förvaltnings- och planeringschefer
related: epLc SkD cbT
related: bh3H Y3h 5eD
broad match: C1213

Arbetsledare, maskintillverkning, verkstadsprodukter
type: Concept
in scheme: JobTech Taxonomy - Yrke
definition: Arbetsledare, maskintillverkning, verkstadsprodukter
broader: Arbetsledare inom tillverkning
related: 8vKu QB5 5X9
related: Bq49 GkW Ptr
related: Z69j 8MQ Bpj
related: wTEr CBC bqh
broad match: C3122

Barnskötare
type: Concept
in scheme: JobTech Taxonomy - Yrke
definition: Barnskötare sköter och aktiverar barn vid förskola, förskoleklass och fritidshem. I arbetet ingår bland annat att planera, genomföra och dokumentera aktiviteter, att hjälpa barn vid matning, tvättning och påklädning. Barnskötare utvecklar även tillsammans med förskollärarna den pedagogiska verksamheten. Källa: Sveriges Kommuner och Regioner, Skolverket, ISCO, Arbetsförmedlingen
broader: Barnskötare
related: 6o2S cvR GwA
related: Ho4Z 3SF P9y
related: BPoa eCM AUm
related: GazW 2TU kJw
related: sHmA x1H C3v
related: MVqp eS8 kDZ
related: tZLK VHP Py3
related: qtAu 6jw YeD
related: KTae RqS UoG
related: cvMz YGJ 2qu
broad match: C5311

Kyrkoherde
type: Concept
in scheme: JobTech Taxonomy - Yrke
definition: Kyrkoherde
broader: Chefer och ledare inom trossamfund
related: GazW 2TU kJw
related: epLc SkD cbT
related: bh3H Y3h 5eD
related: Bcbj ucm KBR
related: F1JD KHg xAo
broad match: C2636

Modersmålspedagog
type: Concept
in scheme: JobTech Taxonomy - Yrke
definition: Modersmålspedagoger stödjer elevers språkutveckling genom undervisning och vägledning på elevens modersmål. Arbetsuppgifter omfattar modersmålsundervisning, studiehandledning på modersmål, samt språkligt och kulturellt stöd i undervisningen. Arbetsuppgifter liknar till stor del yrket modersmålslärare, med tydlig skillnad att modersmålspedagoger saknar lärarlegitimation och inte får sätta betyg. Modersmålspedagoger kan arbeta utan lärarlegitimation och fokuserar mer på språkstöd, medan modersmålslärare undervisar enligt kursplan. Källa: Arbetsförmedlingen
broader: Elevassistenter m.fl.
related: CnAX gj5 Cud
related: Hmav MLe kRR
related: MVqp eS8 kDZ
related: DvLw tdL Lzt
related: ozCb 6Eb 8Z8
related: c8mn tgF Chv
related: j3ep 8vv nLH
broad match: C5312

Poliser
type: Concept
in scheme: JobTech Taxonomy - Yrke
definition: Upprätthåller ordningen på allmän plats. Ingriper vid lagöverträdelser samt utreder brott. Etablerar kontakter och inhämtar information från olika källor för att förebygga brott. Övervakar och dirigerar trafik.
broader: Poliser
related: 7H4j dRM Vbo
related: Y4FW gi5 Gy5
related: UQC4 Wov HPQ
related: gZZG Rxa PTG
related: SRnA JN2 Rrc
related: C5412
related: WufF TTC 9XE
related: wfd7 cDo aLA
related: 9EPY UiQ BLE
related: aB7R JQN sDE
related: k8ng 1vy ffT
related: TGba Rdd yvN
related: sSwR AxY K4n
related: TDLR Gus U5u
related: C3355
related: Wqrr CF5 rW1
related: XYLK CQw wqY
related: 77gQ f9p Tfm
related: Y2go mVJ 8mR
related: YYwE 5oG EUw
related: 5p4b VCF MN4
related: hCp8 AVC 18X
related: y7db B2B xra
related: iv7v nyX ZKt
narrower: Polisaspirant
narrower: Inspektör, Polisen
narrower: Kommissarie, Polisen
narrower: Polisassistent
broad match: E7hm BLq fqZ

Rikspolischef
type: Concept
in scheme: JobTech Taxonomy - Yrke
definition: Rikspolischef
broader: General-, landstings- och kommundirektörer m.fl.
related: E7hm BLq fqZ
related: epLc SkD cbT
related: bh3H Y3h 5eD
broad match: C1112

Formsprutningsprocesstekniker
type: Concept
in scheme: JobTech Taxonomy - Yrke
definition: Formsprutningstekniker ställer in, justerar och optimerar processen för tillverkning av plastprodukter. Yrket liknar maskinställare med den skillnaden att här optimerar man processen när det gäller tryck och tid. Formsprutningsprocesstekniker är ofta mer kvalificerad och kan bland annat arbeta med provkörning, processoptimering och validering inom tillverkning. Man kan även delta i design och prototyptillverkning samt medverka i projekteringen av en ny produkt. Källa: Polymercentrum
broader: Maskinoperatörer, plastindustri
related: k54X kPD NnD
related: 9MXG VJc tPX
related: Pa1g 5wH PsB
related: 1ica t3T o8N
related: wDHW sZ6 uBQ
related: a81w dK7 YgC
related: wTEr CBC bqh
related: FgZf oYK ZSz
related: Wksi auX EEz
broad match: C8142

Mjukvaruutvecklare
type: Concept
in scheme: JobTech Taxonomy - Yrke
definition: Mjukvaruutvecklare utvecklar, testar och underhåller programvara för olika plattformar och användningsområden. Arbetsuppgifterna omfattar programmering, systemdesign, kravanalys och dokumentation av kod. Mjukvaruutvecklare arbetar med att skapa nya applikationer eller vidareutveckla befintliga system, samt felsöker och åtgärdar buggar. I rollen ingår även att samarbeta med andra utvecklare, systemarkitekter och testare för att säkerställa att programvaran uppfyller tekniska och funktionella krav. Mjukvaruutvecklare deltar ofta i hela utvecklingsprocessen, från idé och prototyp till lansering och vidareutveckling. Källor: Arbetsförmedlingen, SACO, Academic Work, Wise IT, Tekniksprånget
broader: Mjukvaru- och systemutvecklare m.fl.
related: q4Kq Sag CfH
related: gtzU 7mX b1e
related: 6nwR y1B 8g3
related: eEVJ rZx fZU
related: wUUU Qki Bk1
related: sEFD 3Zs WiA
related: a8Qg GwC CLN
related: zniZ FCD HH9
related: b2oR 2xA k2X
related: UpUC zQ3 oVU
related: ez9G TDQ b6n
related: wY6w 5wb DcA
related: u5tj BVH VZu
related: gwqA 1H1 P6j
related: H8gG ZyU Ssq
related: jkXJ DqF Ce8
related: 2M8s Xwu Yek
related: KTEV 8NM rrs
related: apaJ 2ja LuF
related: gdVd uxq 7hN
related: 1EJH WhT PGj
related: KT6P hVH LRD
related: SC7x yXw ATN
related: NosC s6b qDE
related: jZew X9A Ccr
related: 1UiZ wJH CJ2
related: MmCF rxY 6aF
related: fMVA Zcm ooN
related: K3Eu Uy7 EXG
related: AHmo qSf viN
related: G5Xk gDs Lxw
related: XLSf G4F VLL
related: cGxS 4dx cDB
related: sSwD fG3 tT1
related: dzab N3i vZb
broad match: C2512

Områdeschef, skogsbruk
type: Concept
in scheme: JobTech Taxonomy - Yrke
definition: Områdeschef, skogsbruk
broader: Förvaltare inom skogsbruk och lantbruk m.fl.
related: epLc SkD cbT
related: bh3H Y3h 5eD
related: VuuL 7CH adj
broad match: C1311

Lärling, VVS-isolerare
type: Concept
in scheme: JobTech Taxonomy - Yrke
definition: En lärling är anställd på företag för att göra sin färdigutbildningstid till VVS-isolerare. Lärlingsanställningen görs efter skolutbildning eller tillsammans med teoretiskt kurspaket. Under färdigutbildningstiden på företaget lär sig lärlingen yrket mer praktiskt och skall nå sina kunskapsmål för branschcertifikat. Certifikat erhålls efter ett branschprov. Källa: VVSYN
broader: Isoleringsmontörer
related: j7Cq ZJe GkT
related: ja7J P8X YC9
broad match: C7124

Förskollärare
type: Concept
in scheme: JobTech Taxonomy - Yrke
definition: Förskollärare leder och ansvarar för undervisningen och den pedagogiska verksamheten för barn i förskoleåldern, med fokus på att stimulera utveckling och lärande enligt läroplanen. Förskollärare är ett reglerat yrke med legitimationskrav för att kunna bli tillsvidareanställd. Vanliga arbetsuppgifter är att planera, genomföra och utvärdera pedagogiska aktiviteter som utgår från barnens ålder, intressen och behov. Förskollärare dokumenterar och följer och har löpande dialog med vårdnadshavare och kollegor. Källa: Arbetsförmedlingen, SACO, Socialstyrelsen, Stockholms stad
broader: Förskollärare
related: UgPu 8P1 Nn1
related: 6o2S cvR GwA
related: 2t6i kWb xvH
related: UJrE Sez A7p
related: sKoE jLQ NZh
related: fJbd 4rA QKQ
related: HZD1 W7G 8Eg
related: MVqp eS8 kDZ
related: zqT7 fgr c3m
related: qtAu 6jw YeD
related: Xr4b 8Gk dgF
related: fNyd GTs F6q
related: 7DQ6 a4U s1Y
related: rZcQ Tjx YmC
related: cvMz YGJ 2qu
broad match: C2342

Lantbruks- och trädgårdsyrken
type: Concept
in scheme: JobTech Taxonomy - Yrke
definition: Lantbruks- och trädgårdsyrken
broader: Yrken inom lantbruk, trädgård, skogsbruk och fiske
narrower: Växtodlare och djuruppfödare, blandad drift
narrower: Växtodlare inom jordbruk och trädgård
narrower: Djuruppfödare och djurskötare

Övriga chefer inom utbildning
type: Concept
in scheme: JobTech Taxonomy - Yrke
definition: Övriga chefer inom utbildning
broader: Chefer inom utbildning
narrower: Övriga chefer inom utbildning

Maskinoperatörer, kemiska och farmaceutiska produkter m.m.
type: Concept
in scheme: JobTech Taxonomy - Yrke
definition: Maskinoperatörer, kemiska och farmaceutiska produkter m.m.
broader: Process- och maskinoperatörer
narrower: Maskinoperatörer, farmaceutiska produkter
narrower: Maskinoperatörer, kemisktekniska och fotografiska produkter

Distributionstekniker fjärrvärmenät och fjärrkylenät
type: Concept
in scheme: JobTech Taxonomy - Yrke
definition: Distributionstekniker fjärrvärmenät och fjärrkylenät
broader: Kyl- och värmepumpstekniker m.fl.
related: yhCP AqT tns
broad match: C7127

Regissörer och producenter av film, teater m.m.
type: Concept
in scheme: JobTech Taxonomy - Yrke
definition: Regisserar teater-, film-, TV- och radioproduktion m.m. Sätter upp föreställningar och leder repetitioner och inspelningar.
broader: Konstnärer, musiker och skådespelare m.fl.
related: KVwD hUg sbD
related: pnc1 ipM Xvv
related: y2of MHK 4nd
related: UdMP m6L WX5
related: b37x ceN azW
related: ADnZ 2yV SpK
related: QBAx kfV k7Q
related: fvcS YGu rhe
related: vEpf 1Wd h6B
related: hsjK E8p YNw
related: gSnx fmB SGh
related: xzSz bxC yL7
related: Qf3c HUW oX3
related: Z4GH ZTh AjH
related: PkfN ALU Yz3
related: C2654
related: Q3MS B1d RgY
related: Qien BsU NE4
related: Rz5y 53L 7Tk
related: fXQR fD1 nim
related: qPMr gFM PvV
related: 51Ts qag i5g
related: qhJ9 N4G BQg
related: LkWi xbg Kt7
related: nGtv qkF AxF
related: Krbu VkM PdQ
related: kusY oZZ Wbv
related: 5T5g ij5 JUC
related: Nksx 4oe fEQ
related: avP6 rGH Fgc
related: 5XhW VQA 2CW
related: aEMW rPC qG9
related: t9A6 jvd 6h5
related: Hhf6 sNm qR1
related: 5wab aFK gdL
related: YBuN Wgv 19X
related: gNjv tRy 1RK
related: KbQK N7h YNG
related: LWGH AGJ 2Vj
related: ViZe AyG PKp
related: RN77 pyA QmW
related: Gt5f wdi FSJ
related: E8cy W2c Y5M
related: S2LT 2ny UC5
related: BwPj cSg Hgk
related: s8DJ qi3 hn3
related: Pk2j jXV Y3j
related: ZxXw jP7 SGx
related: CBzK PMB WR3
related: i1f5 ze7 Lpa
related: 43v8 evE cUE
related: mKKd wMP kX8
related: VDxU Sqs fb2
related: Vz3c dvh CEE
related: gtLn 86s bHS
related: RjVV nFS EGi
related: W2rU Grv nuf
narrower: Linjeproducent
narrower: Koordinator: kultur, media, film, dataspel
narrower: Produktionsledare: kultur, media, film, dataspel
narrower: Regissör
narrower: Rollsättare
narrower: Projektledare: kultur, media, film, dataspel
narrower: Producent: kultur, media, film, dataspel
narrower: Produktionsplanerare: kultur, media, film, dataspel
broad match: 9puE nYg crq

Styckare
type: Concept
in scheme: JobTech Taxonomy - Yrke
definition: Styckare skär hantverksmässigt fram bitar ur djurkroppar som levereras till butiker och restauranger. Efter att djur slaktats och kyls ner tar styckarens arbete vid. Först sker grovstyckaning av kroppen, därefter skiljs köttet från benet, detaljerna skärs ut och fettet tas bort. Styckare är ett hantverksyrke och de flesta moment görs för hand med en kniv. Styckare kan vara specialiserade på vissa uppgifter, men arbetsrotation är vanligt. Källa: Arbetsförmedlingen, Kött- och charkföretagen
broader: Slaktare och styckare m.fl.
related: aVtX 7Nu Xfr
related: LAn5 oBe HTf
related: 6D7c 31P k8z
related: wTEr CBC bqh
broad match: C7511

Skräddare
type: Concept
in scheme: JobTech Taxonomy - Yrke
definition: Skräddare syr, ändrar och anpassar plagg efter kundens önskemål. Arbetsuppgifterna inkluderar måttagning, mönsterkonstruktion och sömnad, med fokus på hög kvalitet och passform. Skräddare kan ha olika inriktningar. Herrskräddaren arbetar med mannens kläder som byxor, kavajer, västar, kostymer, smoking, frack och ytterrockar. Damskräddaren arbetar främst med kjolar, byxor, kavajer och kappor. Klänningsskräddaren arbetar främst med blusar, kjolar, klänningar både till vardag och fest, samt korsetter med mera. Yrket kräver noggrannhet, hantverksskicklighet och en god känsla för textilier och design. Källa: Sveriges Skrädderiförbund, Arbetsförmedlingen
broader: Skräddare och ateljésömmerskor m.fl.
related: K5xh UwU atM
related: 6TRL Uxx MqM
related: sUf5 PtD MHv
related: kqau D4r 4fE
related: PaxQ o1G wWH
related: Y2G4 QJd xFp
related: FF4w TMB KNs
related: 54UU HWh h88
related: UGzN jhj xKF
related: AaEP GBh 5dv
broad match: C7531

Urmakare
type: Concept
in scheme: JobTech Taxonomy - Yrke
definition: Urmakare tillverkar och reparerar olika typer av klockor, från stora väggur till små armbandsur. Urmakare är ett finmekaniskt yrke, med krav på hög precision. Förutom klockor kan urmakare även arbeta som finmekaniker och mikromekaniker, varför det är vanligt att även arbeta med att producera små komponenter med höga toleranskrav som maskiner än så länge inte klarar av att tillverka. Maskinteknik, produktutveckling, prototyptillverkning och kalibrering är också förekommande arbetsuppgifter, beroende på arbetsplats. Källa: Urmakarskolan, Arbetsförmedlingen
broader: Finmekaniker
related: PaxQ o1G wWH
related: Z7xT PSv afG
broad match: C7311

Driftledare lantbruk med blandad drift
type: Concept
in scheme: JobTech Taxonomy - Yrke
definition: Driftledare vid lantbruk med blandad drift planerar och leder arbetet med odling av jordbruksväxter och djuruppfödsel på samma lantbruksföretag. Arbetsuppgifterna omfattar att planera och leda arbetet med sådd, gödsling, bevattning och skörd samt övervaka växtodlingens utveckling under säsongen. Arbetet omfattar även att leda och planera arbetet med avel, uppfödning och skötsel av lantbrukets husdjur. Beroende på arbetsplats kan rollen även innefatta ekonomisk uppföljning, dokumentation och kontakt med leverantörer och kunder. Arbetsuppgifterna kan överlappar med gårdsmästare och driftchef, särskilt på mindre företag där yrkesrollerna kan vara bredare. Källa: Arbetsförmedlingen
broader: Växtodlare och djuruppfödare, blandad drift
related: VuuL 7CH adj
broad match: C6130

Civilingenjör, hamn
type: Concept
in scheme: JobTech Taxonomy - Yrke
definition: Civilingenjör, hamn
broader: Civilingenjörsyrken inom bygg och anläggning
related: j7Cq ZJe GkT
related: anYS 5AR JRk
broad match: C2142

Marknadschef
type: Concept
in scheme: JobTech Taxonomy - Yrke
definition: Marknadschef
broader: Försäljnings- och marknadschefer
related: bKJf kkt bwp
related: N3Lw bYd DoP
related: ymWr 8vm qVW
related: MrpY T9B byf
related: RPTn bxG ExZ
related: 132D oE7 Apz
related: epLc SkD cbT
related: 1fqy Yef ipR
related: pVQe vdm Jjy
related: qCA5 PnZ HRC
related: bh3H Y3h 5eD
related: havS PUa 8ez
related: zrCF C7R fza
related: k472 x8a Nc5
related: H6r3 NMD 6Pj
related: w4ir xS1 CFx
related: s6ho Ep8 dPi
related: RULk EbE Wki
related: 2oHs 1d2 oyC
related: t67N XUS 1EY
related: re4j vFn myg
related: Yih6 L1v ZVW
related: 1qN3 6wF AQA
related: eMcF cLP A5p
related: GSV3 kbW drS
related: wtLi a6S T8b
related: Jh9o Mn3 qRW
related: QM81 3Gy pWq
related: FPyL R6i KBa
related: NeSy Yn7 Ar6
related: CkcF Qqt EK6
related: XCWv fvT 389
related: JN9p mih Yff
broad match: C1221

Arkitekter och lantmätare
type: Concept
in scheme: JobTech Taxonomy - Yrke
definition: Arkitekter och lantmätare
broader: Yrken med krav på fördjupad högskolekompetens inom naturvetenskap och teknik
narrower: Lantmätare
narrower: Planeringsarkitekter m.fl.
narrower: Landskapsarkitekter
narrower: Arkitekter m.fl.

Parkeringsvakt
type: Concept
in scheme: JobTech Taxonomy - Yrke
definition: Parkeringsvakter kontrollerar att parkeringsregler följs och trafik flyter smidigt. Olika parkeringsregler finns på olika platser, såsom i parkeringsgarage eller längs gata. Beroende på arbetsplats arbetar man utomhus eller i ett garage. Man kan arbeta ensam eller med kollega samt till fots eller i bil. Förutom kontroll och skriva ut parkeringsanmärkningar kan andra arbetsuppgifter vara att kontrollera att skyltar och parkeringsautomater syns och fungerar samt utföra service på parkeringsautomater. För parkeringsövervakning på kommunal mark krävs av polismyndigheten föreskriven utbildning. Källa: Bevakningsbranschens Yrkes- och Arbetsmiljönämnd, Sobona, Arbetsförmedlingen
broader: Övrig bevaknings- och säkerhetspersonal
related: YVUo WNQ vWu
related: E7hm BLq fqZ
related: qNaf d8i DCD
related: dLbM WN4 gUd
broad match: C5419

Modersmålslärare i grundskolan
type: Concept
in scheme: JobTech Taxonomy - Yrke
definition: Modersmålslärare i grundskolan undervisar elever med annat modersmål än svenska i deras modersmål samt ger stöd i språk- och kunskapsutveckling inom olika ämnen. Vanliga arbetsuppgifter är att planera och genomföra modersmålsundervisning, följa upp och bedöma elevernas språkliga utveckling samt erbjuda studiehandledning på modersmålet för att förklara ämnesinnehåll. För att kunna arbeta som modersmålslärare behövs goda kunskaper i både svenska och modersmålet. Källor: Arbetsförmedlingen, Skolverket
broader: Grundskollärare
related: CnAX gj5 Cud
related: yRys xFQ tET
related: wUit ryo qLN
related: MVqp eS8 kDZ
related: 9sgR EAy 3W9
related: j3ep 8vv nLH
broad match: C2341

Konstruktör, el-tele
type: Concept
in scheme: JobTech Taxonomy - Yrke
definition: Konstruktör, el-tele
broader: Civilingenjörsyrken inom elektroteknik
related: 6Hq3 tKo V57
related: kDRm Yaa jAB
related: KWNv oWK 5E2
related: C41S vox 2gE
related: GbdK qNd enM
broad match: C2153

Backofficepersonal
type: Concept
in scheme: JobTech Taxonomy - Yrke
definition: Backofficepersonal inom värdepappers- och valutahandeln hanterar administration, registrering och kontroll av affärstransaktioner efter avslutad handel. Arbetsuppgifterna inkluderar behandling av kunddepåer, registrering av insättningar och uttag, avstämning av transaktioner, hantering av likvider och dokumentation enligt regelverk. Backofficepersonal följer upp kundärenden, samverkar med frontoffice och säkerställer korrekt rapportering till myndigheter och interna system. Rollen innefattar även riskkontroll, efterlevnad och support till övriga avdelningar, och är avgörande för smidiga och säkra värdepappers- och valutatransaktioner. Källor: Nordicom, Finansförbundet,
broader: Backofficepersonal m.fl.
related: zZ9p z3E GqY
related: N1zN TKg oX7
related: saUX Uff 29D
related: J32o e7U iAk
related: X82t awd Qyc
related: ZLPk 9S5 JGS
related: iKBU iS2 2sc
related: RH4G sQc XCh
related: 6jip 5Vg sMd
related: igtd qhi osM
broad match: C4312

Affärsjurist
type: Concept
in scheme: JobTech Taxonomy - Yrke
definition: Affärsjurist
broader: Affärs- och företagsjurister
related: X82t awd Qyc
related: bdN2 w6W 9EK
related: x4Wi NWW ogB
related: Abcb QtH isZ
broad match: C2619

Automationsingenjör, maskin
type: Concept
in scheme: JobTech Taxonomy - Yrke
definition: Automationsingenjör, maskin
broader: Ingenjörer och tekniker inom maskinteknik
related: SuAn oH9 xNc
related: 6Hq3 tKo V57
related: 3hA6 gCb Qh5
related: zCzo HKS GT3
related: ChAT aNB gzL
related: UEV6 CzB M9Q
related: x4Lq dcy vMR
related: jv8A vpK s1j
related: rKTm 7yz uwP
related: 7zUv 1C1 m9M
related: cpRq 9Fd Nhy
broad match: C3115

Finansekonom
type: Concept
in scheme: JobTech Taxonomy - Yrke
definition: Finansekonom
broader: Finansanalytiker och investeringsrådgivare m.fl.
related: RbsF qLv jeg
related: jyUJ tqr 4cG
related: RsYZ Eao LKz
related: vZMk fRw Thc
related: AuVU f3h gKf
related: X82t awd Qyc
related: vw7i 55Q xxT
related: eBQs p5w Jkj
related: WHy4 gwS XM8
broad match: C2413

Juvelfattare
type: Concept
in scheme: JobTech Taxonomy - Yrke
definition: Juvelfattare fattar in ädelstenar i smycken. Juvelfattare tar vid efter en guldsmed gjort klart smycket och lämnat plats för ädelstenar. Det finns olika tekniker vid juvelfattning, beroende på smyckets design och vilken typ av sten som ska infattas. Källa: Arbetsförmedlingen, Sveriges Guldsmedsmästares Riksförening
broader: Guld- och silversmeder
related: PaxQ o1G wWH
related: Jt8f 1uH Jup
broad match: C7313

Målare
type: Concept
in scheme: JobTech Taxonomy - Yrke
definition: Målare arbetar med att måla inom- och utomhusmiljöer och att tapetsera väggar, noggrant underarbete i form av spackling, slipning och grundmålning ingår i arbetet. Målare arbetar du i olika typer av miljöer så som bostäder, kontor, skolor, sjukhus och industrier. Sommartid sker den större delen av arbetet i utomhusmiljö och vintertid inomhus. Målare är specialister på behandling av ytor, där även dekoration, lasering och marmorering kan var en del av arbetsuppgifterna. Gesällbrev utfärdas vid godkänt gesällprov som görs efter teoretisk grundutbildning och i slutet på lärlingsanställningen. Källa: Arbetsförmedlingen, MYN
broader: Målare
related: noNV oK2 QVF
related: Qkr7 tAX 5J5
related: AYU2 uVm AnN
related: 59wh UQg EZG
related: 58EQ ZWm a9s
related: j7Cq ZJe GkT
related: ja7J P8X YC9
related: CrfU 1cN iD6
related: hFJa TYE VEH
broad match: C7131

Polisassistent
type: Concept
in scheme: JobTech Taxonomy - Yrke
definition: Polisassistent
broader: Poliser
related: Cqph yP7 uQt
related: E7hm BLq fqZ
related: txUN ZRA NXa
related: RCi1 rje sgH
broad match: C5412

Specialisttandläkare inom endodonti
type: Concept
in scheme: JobTech Taxonomy - Yrke
definition: Specialisttandläkare inom endodonti är en specialiserad legitimerad tandläkare med en djupare kunskap och kompetens inom sitt område. Specialisttandläkare är en skyddad titel och bara den som har bevis om specialistkompetens får kalla sig specialist i sin specialitet. Vanliga arbetsuppgifter är att utreda, diagnostisera och behandla komplexa fall inom exempelvis oral kirurgi, ortodonti, pedodonti, parodontologi, oral protetik, bettfysiologi, endodonti eller odontologisk radiologi. Specialisttandläkare samarbetar ofta i team, tar emot remisser från allmäntandläkare och bidrar med expertkunskap till både patienter och kollegor. Arbetsuppgifterna kan även omfatta konsultationer, handledning och ibland ansvar för verksamhet eller personal inom sitt specialistområde. Källa: Arbetsförmedlingen, Sveriges Kommuner och Regioner, Socialstyrelsen
broader: Tandläkare
related: cnVL nHN Et9
related: NYW6 mP6 vwf
related: proQ odJ 3A7
related: NgG1 5qR MDs
related: SRs7 HCS tVp
related: bvS2 Vmd o8t
related: 2B4i UAL 5kg
broad match: C2261

Civilingenjörsyrken inom gruvteknik och metallurgi
type: Concept
in scheme: JobTech Taxonomy - Yrke
definition: Utvecklar metoder och produkter inom gruvteknik och metallurgi. Svarar för produktion och teknisk utveckling vid utvinning av metaller, olja och gas eller vid framställning av metaller, legeringar och metallurgiska produkter. Ansvarar för kvalitets- och produktkontroller. Hit hör inte Yrken inom gruvteknik och metallurgi med arbetsuppgifter motsvarande ingenjör- eller teknikernivå (3116)
broader: Civilingenjörsyrken
related: HACr 3sZ 4gm
related: tCER yDZ XnW
related: uvcb DuX NW8
related: t73q zoU MT6
related: Z6GN aCQ MDc
related: 9Hvc DYG iqB
related: tg8L maz wMN
related: d4fX YoT QQc
related: h4NH dzu vu3
related: LXoc wxV 73h
related: 74Mw JUN VKx
related: K5JR yfk 8oj
related: kLLw dnR M38
related: Ks1q VaN 4iP
related: yFgG g8k r6r
related: PGDh 8HQ 4BZ
related: bwYY qC7 5xE
related: Ry2v 4Hx 6ta
related: C2146
related: Bh9h t3B M8h
related: jSAi QKc JQk
related: xsSg pg2 Bpq
related: YSMf UrF L4E
related: Z2XD GQ9 qvM
related: cCGX 6Y8 87C
related: Udbb Eay MuR
related: ppUe nsQ hn5
related: ND2K ivB 6RA
related: oPP6 byU yyn
related: iF3h uhH Dg2
related: BcFG Ckm S65
related: 2rqG WLp em4
related: Q6DB h8V mc7
related: MfG9 ybe zVS
related: t6ot 8TC pKs
related: JRvh wrY RmW
related: PuQP aBK nqJ
related: mzWh KRQ sWS
related: W4er Syp Wrt
related: sqqf Pfv ZAU
related: tZ8d VuQ V7z
related: rbHc QBR 3NU
related: fKNz Mn2 YCQ
related: 1mg3 2g2 eAm
related: Y197 2oc uoE
related: AjDN 1rp vzp
related: CWfM RL9 V4t
related: AEgv 4gP ndv
related: S4Ku uT7 yuV
related: dnXS Zcy Bn1
related: 4y7C Lsh EPM
related: Lgt8 xjP 7Fq
related: 3Sj1 uuL y1A
related: mi32 oKo e7U
related: XgGJ nFz J5g
related: jQty Cb4 Wg1
related: wZpC X9a xzG
related: nDqs 2d5 jqu
related: nXWy 1DT 6wY
related: Zchn wqo NUQ
related: pTEz GD2 J9b
related: c1VR Sgw DZ6
related: 2ZDh 43R pbp
related: A8yh 3Ck Qww
related: zSbb 3rY Z7H
related: Bbj8 8y7 XJ5
related: cjzD 31U USf
related: kAbQ DBs kYx
narrower: Ingenjörsgeolog
narrower: Processingenjör, metallurgi
narrower: Valsverksingenjör
narrower: Processingenjör, gruv
narrower: Produktionsingenjör, gruv
narrower: Forskningsingenjör, metallurgi
narrower: Utvecklingsingenjör, metallurgi

Barnsköterska
type: Concept
in scheme: JobTech Taxonomy - Yrke
definition: Barnsköterskor är specialistundersköterskor som utför vård- eller omvårdnadsarbete med inriktning mot sjuka barn. Arbetet sker i samarbete med läkare och sjuksköterskor. Beroende på vid vilken vårdavdelning man arbetar skiljer arbetsuppgifterna delvis åt, till exempel vid akutmottagning, förlossning eller BB. Källa: Sveriges Kommuner och Regioner, Arbetsförmedlingen
broader: Barnsköterskor
related: NYW6 mP6 vwf
broad match: C5321

Chief Digital Officer/CDO
type: Concept
in scheme: JobTech Taxonomy - Yrke
definition: Chief Digital Officer/CDO
alternative label: CDO
alternative label: Chief Digital Officer
broader: IT-chefer
related: j9Y6 aQS FU1
related: dWYe wPf ceT
related: apaJ 2ja LuF
related: bh3H Y3h 5eD
related: 84rq Z7U YEu
related: iz1W sTp Cgy
related: z7pC 7Zz 7nT
related: u27S pVw MUB
broad match: C1330

Maskinoperatörer, farmaceutiska produkter
type: Concept
in scheme: JobTech Taxonomy - Yrke
definition: Styr och övervakar maskiner som bearbetar, blandar och formar kemikalier och andra ämnen för att framställa farmaceutiska produkter och hygienartiklar.
broader: Maskinoperatörer, kemiska och farmaceutiska produkter m.m.
related: C8131
related: VPF1 UZM 9Kd
related: M8Ht hND Hsi
related: 74Mw JUN VKx
related: 2pjc Vto TGH
related: pGts PKK c8W
related: aF3J SgE uck
related: qQ61 EQR rcz
related: bEBR w2z aLu
related: VTwt 5Fe 6bW
related: iSWP AHA BSj
related: KDzy Hra iVr
related: 1vX4 pj1 yao
related: sbYJ XwB o8X
related: EsB4 55e Xwk
related: d3oB oX3 kF8
related: 8Lrt DBh iZ6
related: Q6DB h8V mc7
related: PuQP aBK nqJ
related: W4er Syp Wrt
related: Rbju P7i 12U
related: HCSE Efi Lhk
related: X4EU ZC7 QmK
related: AiwS Mhv ttk
related: r8ux eGa cjz
related: uenm 75h fEh
related: MT1a Nyq DGQ
related: dWbY gXC Frx
related: CgSF umG Epv
narrower: Operatör läkemedelstillverkning
narrower: Maskinoperatör hygienteknik
broad match: wTEr CBC bqh

Svetsare
type: Concept
in scheme: JobTech Taxonomy - Yrke
definition: Svetsare sammanfogar metaller genom olika manuella svetsmetoder. anliga svetsmetoder är MIG/MAG, TIG och MMA. Arbetsuppgifterna innefattar att läsa och tolka tekniska ritningar för att förbereda och utföra svetsarbeten med hög precision. Svetsmetod och inställningar anpassas beroende på material och kravspecifikationer. Arbetet kan omfatta svetsning av både stora och små komponenter inom olika industrier, såsom tillverkning av rördelar, chassin och krandetaljer. Svetsaren utför manuell svetsning. För maskinell, automatiserad svetsning, se även yrket Svetsoperatör. Källa: Svetskommissionen, Arbetsförmedlingen
broader: Svetsare och gasskärare
related: 8RBd Bcx W7e
related: 5FAJ GTX Gui
related: JgPB HKb 8jx
related: dmRQ EVM Nht
related: NhKV 2hH puu
related: YEw8 pdJ a8c
related: VGg4 B6K kfK
related: 9JMr UYC ea2
related: mQEC 1Gv NV3
related: ZnT5 wT6 z2U
related: rG4H 94t LBH
related: MCQj XqV gaz
related: wxZs RGT mm1
related: ywbf RRo 3LY
related: 3pBk RDT qat
related: L26v pFN 82P
related: ucTa iSU g4M
related: rxyH xn7 oL1
related: Fvca eSU JPD
related: 3eb4 Lu3 2DT
related: hted R1a bcT
related: wTEr CBC bqh
related: q7AW qxn 7xc
broad match: C7212

Upphandlare
type: Concept
in scheme: JobTech Taxonomy - Yrke
definition: Upphandlare genomför inköp av varor och tjänster till offentlig sektor, såsom stat, kommun och landsting. Arbetsuppgifterna inkluderar att planera och genomföra upphandlingsprocesser enligt gällande lagar och regler, analysera behov och marknad, samt utvärdera och välja leverantörer. Upphandlare samarbetar ofta med referensgrupper och andra verksamheter för att skapa hållbara och kostnadseffektiva lösningar. Rollen innebär också att följa upp avtal och säkerställa att leveranser och tjänster uppfyller krav och förväntningar. Källor: Statens inköpscentral, Arbetsförmedlingen, TNG,
broader: Inköpare och upphandlare
related: hsgx etc Baw
related: XakB hDk pEH
related: EKbK JhH EhB
related: oaWz euu oLB
related: 58eP BQ4 wGf
related: vUNk cJ8 4Ej
related: y1M4 wZw jQo
related: RPTn bxG ExZ
related: QzN8 bjC SCK
related: F5xH i76 QLW
related: QvpU Qgv GMb
related: dKhB xQi H4Z
related: 5y9w r7M 2N6
related: XuVS ipL HEk
related: JCi7 kCE EqZ
related: i81d wrN fhJ
related: j7Eo HBx sm6
related: hW1m sUX bt2
related: hr8F h45 8dW
related: jjeq qvN Uiz
related: qZvr KoU EYJ
related: xjGL oqR FUP
related: FMsU D4c Sba
related: gXFJ zNu b8b
broad match: C3323

Andra bevaknings- och säkerhetsyrken
type: Concept
in scheme: JobTech Taxonomy - Yrke
definition: Andra bevaknings- och säkerhetsyrken
broader: Service-, omsorgs- och försäljningsyrken
narrower: Andra bevaknings- och säkerhetsyrken

Banarbetare, utan behörighetsbevis
type: Concept
in scheme: JobTech Taxonomy - Yrke
definition: Banarbetare, utan behörighetsbevis
broader: Anläggningsarbetare
related: j7Cq ZJe GkT
related: iTMk wLe 9Vw
related: ja7J P8X YC9
related: xrY8 vzV XB6
related: ip68 58W kkx
broad match: C7119

Kaféföreståndare
type: Concept
in scheme: JobTech Taxonomy - Yrke
definition: Kaféföreståndare leder arbetet i ett kafé med fokus på försäljning av kaffe, bakverk och enklare måltider. Arbetsuppgifterna omfattar personalplanering, beställning av varor, kontakt med leverantörer, livsmedelshantering, service i kassan samt uppföljning av försäljningsresultat. Kaféföreståndare deltar ofta själv i det dagliga arbetet och har vanligtvis god kännedom om livsmedelssäkerhet och hygienrutiner. Källa: Hotell- och restaurangfacket, Arbetsförmedlingen
broader: Säljande butikschefer och avdelningschefer i butik
related: i53C Vmk hfK
related: RPTn bxG ExZ
related: xaFp DKu r4m
related: ScKy FHB 7wT
related: opmn XeU 3YW
related: GeKG 4JG Ypv
related: ikMA xkx tev
related: u5N1 feB h2h
related: U8kG g8u uaJ
related: AvEo Lik Xv7
broad match: C5222

Databasutvecklare
type: Concept
in scheme: JobTech Taxonomy - Yrke
definition: Databasutvecklare
broader: Mjukvaru- och systemutvecklare m.fl.
related: Jrcd qCB rzU
related: uMuV dUN JEF
related: A3jq Ri2 jH7
related: apaJ 2ja LuF
related: KT6P hVH LRD
related: s4vq DyQ yf6
related: p8WK KtK UEY
related: EY8U uFj L5k
related: 4wy5 7tR sza
broad match: C2521

Expressarbetare/Flyttkarl/Stadsbud
type: Concept
in scheme: JobTech Taxonomy - Yrke
definition: Expressarbetare/Flyttkarl/Stadsbud arbetar med flytt av bohag och inredning. Arbetet innebär i huvudsak att packa, lasta och transportera möbler och annan inredning. Det kan vara flytt av bohag såväl som kontorsinredning. Tillhörande arbetsuppgifter är bland annat att montera isär och montera möbler och inredning, köra flyttbil och dokumentera. Källa: Arbetsförmedlingen
alternative label: Expressarbetare
alternative label: Flyttkarl
alternative label: Stadsbud
broader: Ramppersonal, flyttkarlar och varupåfyllare m.fl.
related: DKii 5ez 3PL
related: UdVa jRr 9DE
related: XZWT 1AW WjE
related: m8kU TMi WYF
related: rc41 rZ5 HYa
related: ASGV zcE bWf
related: oEkt VpZ tYD
related: g3uS ShV gGx
related: w16B 8Es L3i
related: je9r wqY Zp8
related: tF7M Vi9 GT2
broad match: C9333

Projektledare, reklam
type: Concept
in scheme: JobTech Taxonomy - Yrke
definition: Projektledare, reklam
broader: Marknadsanalytiker och marknadsförare m.fl.
related: RPTn bxG ExZ
related: hPcK wW7 hy6
related: figC TQn Fe5
related: JbKh nRE syw
related: iXZq sd1 C2m
related: 3L8i eM7 96Z
related: yXSE wvx EAN
related: 4XyY MCb svG
related: PGzt hxi exo
related: WhmK 9FV dvy
broad match: C2431

Butikssäljare, dagligvaror
type: Concept
in scheme: JobTech Taxonomy - Yrke
definition: Säljer livsmedel, drycker och andra dagligvaror i affärer, livsmedelshallar, stormarknader och andra försäljningsställen. Beställer, packar upp, prismärker samt fyller på varor. Hit hör inte Kassapersonal (5230) Kioskbiträde (5230) Torgförsäljare/Marknadsförsäljare (9520)
broader: Butikspersonal
related: uk72 nCq m5Z
related: 5Ne3 Jir 6Ph
related: Yufg GC2 LXS
related: Dywf BPg usG
related: UssR m8J XA6
related: iKeJ 2nr wzA
related: jvLT ZCM pQu
related: Uuda 4Yj rq2
related: 3wpW ewH RD2
related: C5223
related: tKej gjg Gyu
related: WR7N h6T jG1
related: qHYG sNy yeJ
related: TPX3 gmd fau
related: mRyD DRC 5tT
related: NCms mtw cBD
related: af2G bUf zNz
related: Q5Gj qVb 1AY
related: 1Zwa X6Q Dyk
related: y71S LsF xLV
related: 8PbH ED5 C9s
related: fPeQ PsL Xsf
related: tArT WTu BrU
related: 7o3Y Fg6 hr4
related: wZw9 tMu UdV
related: hYpk RYx y3V
related: 9WwD qZe fqm
related: v3dQ 9We tK5
related: TrT6 J5H mJW
related: Qszm Sxf Lk8
related: FN7N 7er WmW
related: kj4Q nLh u8Q
narrower: Charkuteriarbetare, butik
narrower: Butikssäljare, dagligvaror/Medarbetare, dagligvaror
broad match: RPTn bxG ExZ

HR-specialist/HR-advisor
type: Concept
in scheme: JobTech Taxonomy - Yrke
definition: HR-specialist/HR-advisor
alternative label: HR-advisor
alternative label: HR-specialist
broader: Personal- och HR-specialister
related: uUbz P9j Ghm
related: wn5H zUY Vhb
related: 4vHJ ckd Aou
related: YWft bBn Jyt
related: bHDT AGF tT2
related: X82t awd Qyc
related: XXa9 nC8 Ggf
related: ZnN1 QTb 7pw
related: NvTp 6sX Y9t
related: oe3B K9v 9g5
related: L32k yqB LQx
related: VtdC U2K d9p
related: si4t Q9Z XbD
related: yDnY DV7 8an
related: MACS ZXf nx7
related: 4RbW HZA cHm
related: pyNJ Xcf xzg
related: iJDb 8Cu MKe
related: fnhW EBh bfJ
related: m7mU gEY 7sx
related: TUVc zjX b9P
related: rANh Tmv a8w
related: nDk2 Wa9 y1e
related: f2jP uXA jXA
related: 7TEq 7zU yKu
related: bG3M jAf BDF
related: nyLh p29 CWK
broad match: C2423

Betonghåltagare
type: Concept
in scheme: JobTech Taxonomy - Yrke
definition: En betonghåltagare gör hål genom borrning eller sågning i olika byggmaterial, som betong, tegel, eller berg, med kraftfull utrustning vid ombyggnader eller rivningar. Håltagning används ofta vid ombyggnation av hus, som vid byte av rörstammar, el eller ventilation, samt för installation av fönster, dörrar eller hissar. Vid rivning och nedmontering av betongkonstruktioner förekommer ofta moment där sågning och borrning i betong är aktuellt. Det krävs stor kunskap om både tekniska verktyg och säker hantering av tunga lyft. Betonghåltagaren kan ansöka om sitt yrkesbevis efter teoretisk grundutbildning och lärlingsanställning. Källa: Arbetsförmedlingen
broader: Betongarbetare
related: nDcZ 6Az r9Z
related: j7Cq ZJe GkT
related: ja7J P8X YC9
related: tmhP Z1Y LMH
related: SqQ4 TdJ rrB
broad match: C7114

Specialistveterinär
type: Concept
in scheme: JobTech Taxonomy - Yrke
definition: Specialistveterinär är en specialiserad legitimerad veterinär med en djupare kunskap inom sitt område. Specialistveterinär är en skyddad titel och bara den som har bevis om specialistkompetens får kalla sig specialist i sin specialitet. Vanliga arbetsuppgifter är att genomföra avancerade undersökningar och behandlingar, handleda kollegor, ansvara för fortbildning inom teamet samt bidra till utveckling av klinikens rutiner och kvalitetssäkring. Specialistveterinärer arbetar ofta på djursjukhus, större kliniker eller inom forskning. Källa: Arbetsförmedlingen, Jordbruksverket, Sveriges Veterinärförbund
broader: Veterinärer
related: NYW6 mP6 vwf
related: bTte TK3 4xM
broad match: C2250

Tågvärdar och ombordansvariga m.fl.
type: Concept
in scheme: JobTech Taxonomy - Yrke
definition: Kontrollerar och säljer färdbevis. Ansvarar för passagerarnas säkerhet och bekvämlighet på tåg och spårvagnar. Serverar måltider och drycker samt säljer olika varor. Informerar om avgångstider, biljettpriser, linjesträckningar, restider m.m.
broader: Kabinpersonal, tågmästare och guider m.fl.
related: boQs j8u et1
related: g6vZ i7N ZeJ
related: 7xS5 gyX hvX
related: VyRJ 8bQ Fa5
related: PzvT 26x jVM
related: LopZ 2F7 i2X
related: C5112
related: WR1E faK UnK
related: hYpk RYx y3V
related: vXDD 8Gh DXu
narrower: Tågvärd
narrower: Bussvärd
broad match: ASGV zcE bWf

Fysioterapeuter och sjukgymnaster
type: Concept
in scheme: JobTech Taxonomy - Yrke
definition: Undersöker, diagnostiserar och behandlar patienter som har eller riskerar att få funktionsnedsättningar till följd av sjukdomar eller skador i olika organsystem, t.ex. andningsorgan, cirkulationssystem, nervsystem, rörelseorgan och psykisk ohälsa.
broader: Naprapater, sjukgymnaster och arbetsterapeuter m.fl.
related: 5AEv t59 uW6
related: E13X ZF3 PAb
related: 4QAE wtY gJh
related: 4sDr kFf cjc
related: FrPC Dr4 w97
related: 1uDb mrS Xa4
related: seSm rEC 9fU
related: Mmxs Qrv cpG
related: 73kE uFW vvT
related: yG9A NkA Xnc
related: v6tN Mmm m8L
related: EHzQ qjx TGL
related: wVzn xz2 jDC
related: VYES PSB Dh8
related: hPSV XV3 q9q
related: Kq4d VLP FMg
related: LbrE Jy6 eFp
related: vyqL ygd geE
related: MVKv XXk XAi
related: UtTP C3o hR3
related: yrkE Wrh YEM
related: NuaA Xkf Zc3
related: wBPu wTW RgG
related: m4ij Bjw 6ik
related: rF7s hX1 ECH
related: emC4 L6e 7HN
related: KL9F P2w te2
related: Gr7Q QGe Cca
related: H7Xf ifW SX4
related: Z78L Eop xNs
related: rVUL AgV ZTH
related: C2264
related: M4PU TBu 9qn
related: EQAL XMr PQF
related: aoVs Qfu U3j
related: ua3Q M2A fqT
related: 5agw dEi Ag4
related: JBKK 7io 8FH
related: 5VA4 FiD NyW
related: yV9B PxJ TxS
related: 3AdH XqQ cB5
narrower: Djurfysioterapeut
narrower: Fysioterapeutstuderande
narrower: Fysioterapeut
broad match: NYW6 mP6 vwf

Museichef/Museidirektör
type: Concept
in scheme: JobTech Taxonomy - Yrke
definition: Museichef/Museidirektör
alternative label: Museichef
alternative label: Museidirektör
broader: Verkställande direktörer m.fl.
related: epLc SkD cbT
related: APiN cHa UB1
related: bh3H Y3h 5eD
related: 9puE nYg crq
related: TWec pUW mjG
related: S7FL WUS vff
broad match: C1120

Roddare/Roadie
type: Concept
in scheme: JobTech Taxonomy - Yrke
definition: Roddare/Roadie monterar och demonterar tillfällig scenutrustning. Som roddare/roadie följer man med en föreställning på turné. Man monterar och demonterar scenutrustning för ljud och ljus samt andra konstruktioner så som sittplatser. Arbetet kan omfatta arbete med riggning och lyft av tunga laster. Arbetet sker enligt instruktioner, planer och beräkningar. Man arbetar inomhus och utomhus. Källa: Arbetsförmedlingen
alternative label: Roadie
alternative label: Roddare
broader: Ramppersonal, flyttkarlar och varupåfyllare m.fl.
related: UdVa jRr 9DE
related: XZWT 1AW WjE
related: ASGV zcE bWf
related: 9puE nYg crq
related: v5PV AoD QUe
broad match: C9333

Direktionssekreterare
type: Concept
in scheme: JobTech Taxonomy - Yrke
definition: Direktionssekreterare ger administrativt stöd till en direktion, en chef eller ledningsgrupp inom offentlig sektor så som kommuner och kommunalförbund. Arbetet innebär i huvudsak att vara samordnande mellan ledning och till exempel politiska organ, tjänstemannaorganisationer samt medlemskommuner. Arbetsuppgifter innefattar bland annat mötesadministration, kalenderadministration samt diarieföring och beslutsstöd. Som direktionssekreterare har man vanligtvis specialiserad kunskap om lagstiftning som berör arbetet, till exempel kommunallagen. Beroende på arbetsplats kan det även ingå mer kvalificerade arbetsuppgifter som kvalitetssäkring av processer, systemförvaltning och informationssäkerhet. Källa: Arbetsförmedlingen
broader: Chefssekreterare och VD-assistenter m.fl.
related: Am4D aXn b9s
related: M7pY C5U gUB
related: X82t awd Qyc
broad match: C3343

Arbetsledare, måleri
type: Concept
in scheme: JobTech Taxonomy - Yrke
definition: Arbetsledaren inom måleri är den som leder målningsarbetena på byggarbetsplatsen. Arbetsledaren bevakar att material finns på plats och samordnar arbetet med entreprenörer. Arbetsledaren har ansvaret för att arbetet utförs enligt gällande ritningar och anvisningar och för att säkerhetsföreskrifterna följs. Källa: Arbetsförmedlingen
broader: Arbetsledare inom bygg, anläggning och gruva
related: j7Cq ZJe GkT
related: ja7J P8X YC9
broad match: C3123

Yrkeslärare
type: Concept
in scheme: JobTech Taxonomy - Yrke
definition: Yrkeslärare
broader: Lärare i yrkesämnen
related: xeDf ivV sgK
related: bsMC JpV 5fo
related: xnWF fCb otW
related: ApZe Kju cAu
related: 23WJ khQ a5X
related: 5YMC w1p 4LL
related: Meqm rED Jop
related: mptm CwK gb2
related: dKVA sv5 mMv
related: N8fS PR4 SiB
related: MXtm k6n wAT
related: wG1s sGy HaR
related: GL6j ZT8 CCa
related: 5PWx YEs R65
related: 6srC x1y oET
related: 1A45 7q7 Q5g
related: ddYk HiV MiB
related: DMzb Cpz oWc
related: ZZ8v 4yQ Tm2
related: wEzt c4B GvQ
related: AofS TkU GgU
related: XYm9 XM8 K6d
related: Py2f 6Tz tvV
related: uTH4 G8b JXm
related: fo6L BLF fAo
related: MVqp eS8 kDZ
related: UU4y n3u 8kb
related: GA3w T9m c8r
related: fURi QCv UUx
related: LzER JXB rkt
related: TeRJ cvv VDo
related: gj8x spH FZ7
related: cXQp xmg W16
related: 2zTN M1p JUo
related: fgxB Dwu KtR
related: bCqA 2pS gtL
related: fMQY hFf RrB
related: BF88 ACX 3x7
related: EXcP m6H EFg
related: eGsY 2cu vdq
related: im75 yq4 YzP
related: 3Us3 Ln5 tFb
related: GsEV hcP 2cU
related: 7gKJ AWp 4vk
related: j3ep 8vv nLH
broad match: C2320

Undertaksmontör, utan yrkesbevis
type: Concept
in scheme: JobTech Taxonomy - Yrke
definition: En undertaksmontör monterar undertak inomhus i olika typer av fastigheter, t ex skolor, sjukhus och kontor, dels för att skapa värme- och ljudisolering, dels för att dölja exempelvis rör och ventilationstrummor och förbättra akustiken i rum. Det är vanligt att jobba 3–4 meter över golvet med undertak men det kan också vara 20 meter upp, som vid ljuddämpning av en industrihall eller montering av undertak i en tunnelbana. Källa: Arbetsförmedlingen, BYN
broader: Takmontörer
related: j7Cq ZJe GkT
related: ja7J P8X YC9
broad match: C7121

Smådjursuppfödare
type: Concept
in scheme: JobTech Taxonomy - Yrke
definition: Smådjursuppfödare
broader: Uppfödare och skötare av sällskapsdjur
related: VuuL 7CH adj
broad match: C5164

Skogsbruksrådgivare
type: Concept
in scheme: JobTech Taxonomy - Yrke
definition: Skogsbruksrådgivaren ger råd om hur skogen kan skötas på ett sätt som är både ekonomiskt lönsamt och bra för miljön. Detta inkluderar att bevara nyckelbiotoper och ta hänsyn till biologisk mångfald. Rådgivaren hjälper till med att bedöma virkesvärden, upphandla entreprenörer och se till att skogsägaren får rätt betalt för sitt virke. Skogsbruksrådgivaren ser till att skogsägaren följer de lagar och regler som gäller för skogsbruk, inklusive miljölagstiftning och krav på hänsyn till kulturmiljö. Källa: Skogsstyrelsen, Skogen i skolan
broader: Specialister och rådgivare inom skogsbruk
related: EPwD DET euj
related: WGAZ xaM gUE
related: 8M8Q RfZ LKy
related: VuuL 7CH adj
broad match: C2132

Mättekniker, kemi
type: Concept
in scheme: JobTech Taxonomy - Yrke
definition: Mättekniker, kemi
broader: Laboratorieingenjörer
related: 6Hq3 tKo V57
related: EsWG kHG oXZ
broad match: C3111

Kockar och kallskänkor
type: Concept
in scheme: JobTech Taxonomy - Yrke
definition: Kockar och kallskänkor
broader: Serviceyrken
narrower: Kockar och kallskänkor

Mikroskopist
type: Concept
in scheme: JobTech Taxonomy - Yrke
definition: Mikroskopist
broader: Laboratorieingenjörer
related: 6Hq3 tKo V57
related: EsWG kHG oXZ
broad match: C3111

Tågledare
type: Concept
in scheme: JobTech Taxonomy - Yrke
definition: Tågledare arbetare med övergripande trafikledning av järnvägstrafik, anordnar och ställer in tåg samt beviljar planerade skydd och färder. Arbetsuppgifterna omfattar att arbetsleda tågtrafikledare, hanterar avvikelser från tidtabeller, leda om tåg vid större driftstörningar samt samt samordna tågtrafik vid planerade banarbeten eller akuta händelser. Yrket innebär kontakt med med tågtrafikledare, drifttekniker, andra myndigheter och externa aktörer. I vissa fall sker arbetet i samordning med internationella järnvägsförbindelser. Tågledare arbetar huvudsakligen från centraliserade trafikledningscentraler. Källa: Trafikverket, Arbetsförmedlingen
broader: Transportledare och transportsamordnare
related: ASGV zcE bWf
related: 4CDT dvj oB2
broad match: C4323

Testledare/QA lead
type: Concept
in scheme: JobTech Taxonomy - Yrke
definition: Testledare/QA lead
alternative label: QA lead
alternative label: Testledare
broader: Systemtestare och testledare
related: 5DGK ZTE jEN
related: g8wH fi1 ueD
related: hJNE mYS oMw
related: xZo5 czs gxc
related: igKL fYL s73
related: dMw3 Y5F 6oA
related: apaJ 2ja LuF
broad match: C2519

Grovplåtslagare
type: Concept
in scheme: JobTech Taxonomy - Yrke
definition: Grovplåtslagare formar, bearbetar och monterar detaljer av grovplåt för olika konstruktioner. Arbetsuppgifterna inkluderar ritningsläsning, svetsning, bockning, kantpressning samt skärning med gas eller plasma. Man tillverkar till exempel delar till byggnader, broar, fartyg, fordon, arenor, tankar, cisterner eller tryckkärl. Arbete kan ske både i verkstad och ute hos kund, där montering, reparation och även kan ingå. Källa: Arbetsförmedlingen
broader: Stålkonstruktionsmontörer och grovplåtsslagare
related: ez5f bYw pCV
related: A5KW LQg UeF
related: t2oa Csg 5qG
related: RV34 QpY Dyh
related: wTEr CBC bqh
related: JezX oUD TZr
broad match: C7214

Övriga chefer inom samhällsservice
type: Concept
in scheme: JobTech Taxonomy - Yrke
definition: Formulerar och ansvarar för mål och strategier för verksamhet inom övrig samhällsservice, t.ex. bibliotek, kultur och rättsväsende. Utformar riktlinjer, följer upp och utvärderar verksamheten mot uppsatta mål. Svarar för budget samt fördelar resurserna inom verksamheten. Har personalansvar.
broader: Övriga chefer inom samhällsservice
related: udqs kCm YJ6
related: Wd87 ePw Py2
related: icvA Gu9 EqB
related: Lq7i CF6 F8f
related: UH9g R5v MCx
related: SmZd Jaa BeY
related: 8tYq EXD Xwm
related: ZzN5 m7B 5CY
related: y6xu SpH hYV
related: detQ YNb 9nG
related: bgjg EsF f84
related: Nksx 4oe fEQ
related: EQcw kCm gV5
related: eThQ HCv mY6
related: X9Kc p8a 1FB
related: FpWT 9rn ydN
related: jdPd rUh mWn
related: Gt5f wdi FSJ
related: q7Mx gjU F9q
related: D6ev Zwt x83
related: zXNU zXR hGd
related: 4fRg DA4 Dj3
related: 9FQn 9us Q74
related: C1349
narrower: Förlagschef, tidning
narrower: Stadsarkivarie
narrower: Länsbibliotekarie
narrower: Redaktionschef
narrower: Landsarkivarie
narrower: Arbetsförmedlingschef
narrower: Kontorschef, offentlig förvaltning
narrower: Landsantikvarie
narrower: Kriminalvårdsinspektör
narrower: Kulturchef
narrower: Arkivchef
narrower: Överbibliotekarie
narrower: Polisintendent
narrower: Polismästare
narrower: Funktionschef, offentlig förvaltning
narrower: Polissekreterare
narrower: Räddningschef
narrower: Bibliotekschef
narrower: Brandchef
narrower: Kriminalvårdsdirektör
narrower: Featurechef
narrower: Platschef, försäkringskassa/Områdeschef, försäkringskassa
narrower: Förlagschef, bokförlag
narrower: Frivårdschef
narrower: Sektionschef, offentlig förvaltning
broad match: bh3H Y3h 5eD

Bergsprängare
type: Concept
in scheme: JobTech Taxonomy - Yrke
definition: Spränger malm från gruva och berg vid anläggningsarbeten.
broader: Malmförädlingsyrken och brunnsborrare m.fl.
related: VPF1 UZM 9Kd
related: vLAg NSo wo8
related: MiyM dYh Yy2
related: kq8N 5vE x89
related: Vjui Ghy zA9
related: AEfm Ltu HrZ
related: swHZ UXk UaE
related: tWch mrP ECi
related: Hwgd Udd dWE
related: qQ61 EQR rcz
related: VTwt 5Fe 6bW
related: qfFR 2yk wZM
related: REr4 5r8 1w4
related: Q7eC B7g QiU
related: uWn1 Xdf xPJ
related: KDzy Hra iVr
related: muTx UEy cZe
related: EY3Z YS7 F3R
related: fhcp fFw Lbj
related: 8Yqr o72 jqv
related: jLDm rfF 754
related: 44zd QdG xUY
related: oaWF AZN b5B
related: yeFp n8z oKy
related: ztAc cLZ vtf
related: Stca tVg Kiu
related: DpvA 768 A94
related: QM4g Xik 4gR
related: i35M nVC rW5
related: C7542
related: mXLy f4b nfU
related: wzk7 YN4 Yrz
related: r4Te Mzt yrC
related: rwir xvu 443
related: dWbY gXC Frx
narrower: Bergsprängare
broad match: wTEr CBC bqh

Arkeologer och specialister inom humaniora m.m.
type: Concept
in scheme: JobTech Taxonomy - Yrke
definition: Studerar människors kultur och livsbetingelser med hjälp av fynd och föremål från forntida boplatser, gravar m.m. Leder och organiserar arkeologiska utgrävningar. Studerar och tolkar urkunder, sociala samt rumsliga fenomen. Utvecklar teorier, modeller och metoder, bl.a. för att tolka och beskriva händelser, kulturella och ekonomiska förhållanden. Genomför experiment, analyserar och värderar data. Undersöker sociala strukturer och beteenden hos olika grupper i samhället, föreslår och värderar utfallet av socialpolitiska åtgärder och utvecklar teorier och modeller för politiska system och institutioner.
broader: Museiintendenter och bibliotekarier m.fl.
related: gStb Pjo RLq
related: TF1f u6x AGR
related: bX2q FiP 9o6
related: hF6d fR3 JuT
related: rdER 6hW HgK
related: vY2M qhW Gcp
related: uE9W cjo dTw
related: rPor 98j xJZ
related: QcXK Fgi 5qp
related: bjTv yyz Ffn
related: DNUF ngb TGE
related: ua3P 2S6 kmN
related: eXv8 c8M 9Ef
related: hZAY ngE 7US
related: tc2X KdJ VEb
related: UjRh U4o ZQd
related: jqZ2 JnS pZs
related: KBrp Hsu A2n
related: bu7L 4AA DCX
related: itYU VkH 9RF
related: ibFG VVV 7NL
related: cqQu U4C ZTc
related: ut9p hnf zWc
related: 3t3C JGp aVo
related: caSX KEo PrT
related: F9vo QpG ou5
related: Akj1 s14 jPZ
related: VUXs QfN BjL
related: nTBc s9z JMY
related: tWhF KNt 1XM
related: R9ib tBo Agr
related: FDQi Qk9 Bm4
related: VjWN uQy Mmd
related: Mw7Y 2pY itu
related: 44Lr qs6 RTG
related: oHKx iF8 1Ve
related: 4shT L4c KWN
related: C2633
related: LsHS ueq 1jZ
related: o5n4 Kub Rja
related: vUWS 4Vr Cqh
related: NwB3 fPc VRv
related: iEfY gpE zQV
related: bPsT HtS 5Fu
related: JCds SXK Cat
related: D6h7 yLw 7fq
related: mDKn zhR 5tS
related: JUKR Cai 8iD
related: p81A Exc dmL
related: SkzU qDQ Lho
related: Qq3z MEY NLw
related: 1QEA ufb Ls7
related: 198V mFe MP6
related: McR1 y6q 1U5
related: tqcW y4m 8xb
related: LLLu R4q vdy
related: UHZg TTd gJr
related: 1HaS S7D 8Kp
related: ganz mXo NCv
related: jpn4 Snv EWg
related: te6Y cae LeW
related: R8Nc 5Kw bkE
related: pLiT eTw RVH
related: 9zje a2z uzX
related: uQgV X98 SJf
related: 1Qfp sL2 W5N
related: c2YE oK3 f1u
related: XRfU bRB DwH
related: 9xoS pdu wqL
related: C2632
related: qMXe 1Di KMe
related: LFw7 iXd crB
related: buEh GKQ TWe
related: 2qWx WKP XYH
related: Je7D RP9 q6V

Originalare/Final Art
type: Concept
in scheme: JobTech Taxonomy - Yrke
definition: Originalare/Final Art
alternative label: Final Art
alternative label: Originalare
broader: Grafiska formgivare m.fl.
related: LTxK hqL 244
related: 9puE nYg crq
related: WjCH PZv eAC
broad match: C2166

Kapellmästare
type: Concept
in scheme: JobTech Taxonomy - Yrke
definition: Kapellmästare leder och samordnar musikaliska ensembler som orkestrar, körer och band i samband med konserter, föreställningar och repetitioner. Vanliga arbetsuppgifter är att dirigera och coacha musiker under repetitioner och framträdanden, tolka och förmedla musikaliska verk samt ansvara för planering och genomförande av repetitioner och konserter. Källa: Arbetsförmedlingen
broader: Musiker, sångare och kompositörer
related: 8too bEs 7NU
related: 9puE nYg crq
broad match: C2652

Chefredaktör
type: Concept
in scheme: JobTech Taxonomy - Yrke
definition: Chefredaktör har det övergripande ansvaret för tidningens eller publikationsplattformens redaktionella innehåll och leder redaktionsteamet både på kort och lång sikt. Vanliga arbetsuppgifter är att sätta redaktionens riktning, fatta publicistiska beslut, leda och utveckla personalen samt samordna arbetet mellan olika avdelningar och externa samarbetspartners. Chefredaktören ansvarar för rekrytering och representerar publikationen externt, exempelvis inför styrelse och i medier. Källa: Arbetsförmedlingen, Mediekompass
broader: Verkställande direktörer m.fl.
related: epLc SkD cbT
related: bh3H Y3h 5eD
related: 8too bEs 7NU
related: 9puE nYg crq
broad match: C1120

ST-läkare
type: Concept
in scheme: JobTech Taxonomy - Yrke
definition: Gör en tidsbegränsad specialisttjänstgöring bestående av utbildning samt läkararbete under handledning. Undersöker patienter, ställer diagnoser och gör behandlingsplaner.
broader: Läkare
related: 9ntP jdL 3iG
related: 4QAE wtY gJh
related: C2211
related: 9Fna GUm HWL
related: Mmxs Qrv cpG
related: 73kE uFW vvT
related: 1eKe zFj QAa
related: nA5p Ske 4zb
related: 6VAN Ccy EkA
related: PrA4 KwY YcV
related: du5j oyG ju6
related: MVKv XXk XAi
related: Lqnz Zqw nQ9
related: 7rJH cCp ccc
related: QQuL 2Pe YDE
related: F7nJ k5s L29
related: NpcY f4G L1H
related: 2GuF gtz xfW
related: rF7s hX1 ECH
related: n9ho 3vf UZP
related: rVUL AgV ZTH
related: pGBH BkG qJa
related: yV9B PxJ TxS
related: LwTt 3Ns mGH
narrower: ST-läkare, onkologi
narrower: ST-läkare, hud- och könssjukdomar
narrower: ST-läkare, laboratoriemedicin
narrower: ST-läkare, arbets- och miljömedicin
narrower: ST-läkare, bild- och funktionsmedicin
narrower: ST-läkare, akutsjukvård
narrower: ST-läkare, socialmedicin
narrower: ST-läkare, klinisk farmakologi
narrower: ST-läkare, invärtesmedicin
narrower: ST-läkare, infektionssjukdomar
narrower: ST-läkare, reumatologi
narrower: ST-läkare, barn- och ungdomsmedicin
narrower: ST-läkare, neurologi
narrower: ST-läkare, rättsmedicin
narrower: ST-läkare, kirurgi
narrower: ST-läkare, psykiatri
narrower: ST-läkare, allmänmedicin
narrower: BT-läkare
narrower: ST-läkare, klinisk genetik
broad match: NYW6 mP6 vwf

Laboratoriebiträde
type: Concept
in scheme: JobTech Taxonomy - Yrke
definition: Laboratoriebiträden utför olika arbetsuppgifter vid laboratoier. Arbetsuppgifterna innefattar till exempel att in- och utregistrera prover, administrativt arbete samt hantera och förbereda laboratorieutrustning. Källa: Sveriges Kommuner och Regioner, Arbetsförmedlingen
broader: Övrig vård- och omsorgspersonal
related: NYW6 mP6 vwf
broad match: C5329

Brandman
type: Concept
in scheme: JobTech Taxonomy - Yrke
definition: Brandmän arbetar med att släcka bränder, hantera olyckor och förebygga skador på människor, egendom och miljö. Som brandman rycker man ut vid bränder, trafikolyckor, kemikalieutsläpp och andra nödsituationer. Arbetet kräver teknisk kunskap, god fysisk kondition, stresstålighet och samarbetsförmåga. Brandmän övar regelbundet, underhåller utrustning och arbetar i team för att säkerställa effektiva insatser vid larm. Källa: MSB, räddningstjänsten i Storgöteborg, Arbetsförmedlingen
broader: Brandmän
related: VgS2 UyL mvE
related: KfBt HjL u4C
related: E72r Evy Yui
related: E7hm BLq fqZ
related: wMR4 2R5 qDd
related: Lv4F cod oix
related: 1FnH kmq tVA
related: X462 rdK aPk
related: trbV GyD P4E
related: 2j5B sq2 59C
related: 6nEt kT5 fG5
related: Vhaw Gdu YUf
related: vNxA Gv9 Dym
related: xQmu EM7 yCD
related: DQzH xyG cVg
related: MXiE gkn CQD
related: mg5T bi2 S9p
related: mGvA FSc 1oR
broad match: C5411

Fordonsmontörer
type: Concept
in scheme: JobTech Taxonomy - Yrke
definition: Monterar i seriemässig tillverkning större och mindre komponenter till maskiner, motorer och fordon genom att t.ex. skruva, svetsa, löda, nita eller limma. Hit hör inte Maskinmekaniker/Skogsmaskinmekaniker (7231) Maskinmekaniker, industri/varvsindustri (7233) Maskinmontör (7233)
broader: Montörer
related: EkJL sAV WAx
related: VPF1 UZM 9Kd
related: pFuD wtR Yzs
related: id9U 7PL BHG
related: oYuG DTW R2D
related: aHCV VsV LiD
related: oi6Q heh 5mN
related: mTRy UG9 fAZ
related: SMLj ds3 Qe7
related: qQ61 EQR rcz
related: 4mrd X9i YHH
related: VTwt 5Fe 6bW
related: KDzy Hra iVr
related: 9Asf XUW K2w
related: HULE 2Gr nkv
related: qPmT 5pS Th9
related: x7ih HZS VDB
related: uBaP BsX BdU
related: X4EU ZC7 QmK
related: AiwS Mhv ttk
related: BAhW Ko7 69u
related: XKi1 RS1 Us3
related: BKYD AEo maF
related: 4y7C Lsh EPM
related: uenm 75h fEh
related: dWbY gXC Frx
related: C8211
narrower: Fordonsmontör
narrower: Motormontör
narrower: Flygplansmontör
broad match: wTEr CBC bqh

Övriga maskinoperatörer, textil-, skinn- och läderindustri
type: Concept
in scheme: JobTech Taxonomy - Yrke
definition: Utför annat maskinoperatörsarbete inom textil-, skinn och läderindustri än inom 8151. Exempel på arbetsuppgifter: Hanterar maskiner för att dela hudar samt färgar och mjukar upp skinn. Ytbehandlar och polerar skinn och läder. Styr och övervakar maskiner som tillverkar skor, väskor och andra produkter i läder, skinn, garn, textil eller syntetmaterial. Styr och övervakar maskiner som tillverkar trossar, nät och snören av natur- eller syntetmaterial. Sköter maskiner som spinner, tvinnar, nystar och spolar garn och tråd. Hit hör inte Ateljésömmerska (7531) Pälssömmerska (7531) Sadelmakare (7534) Skomakare/Skoreparatör (7534)
broader: Maskinoperatörer, textil-, tvätt- och läderindustri m.m.
related: vCvL Fux WLR
related: bBrA 5Pv YPa
related: C8153
related: kLQ7 FgV c25
related: dJfk HYX 2x3
related: VPF1 UZM 9Kd
related: 4njf PjQ o88
related: ECRe FX3 yN9
related: TDBP nyK iKL
related: k7YN Mmw 9Jh
related: 2pjc Vto TGH
related: Wre4 RTT Tur
related: C8156
related: qQ61 EQR rcz
related: VTwt 5Fe 6bW
related: a86X VWZ DXP
related: PL1m xg5 QsL
related: hPnF VPk shg
related: L5BY ziJ qrZ
related: 2BMt rba YgK
related: KDzy Hra iVr
related: C8151
related: LtW1 HDb V9z
related: C8152
related: C8155
related: sbYJ XwB o8X
related: VLda kLB zC5
related: d3oB oX3 kF8
related: yQUA ck9 2Ji
related: BTxB cVk UnM
related: e8DH zHW e3v
related: Rbju P7i 12U
related: fZdB Mjb SSR
related: X28d WCj 7D9
related: MgG4 X42 7Jm
related: X4EU ZC7 QmK
related: RXUV Ftx AuC
related: AiwS Mhv ttk
related: Uqo4 jUu wFm
related: u3js QEZ 3gy
related: C8159
related: KK8L zdZ os5
related: xRCv zrW 3ew
related: MvvH ZVe SRu
related: b4tF Msc GKp
related: uenm 75h fEh
related: MT1a Nyq DGQ
related: dWbY gXC Frx
related: GcK6 Qxt eoM
related: wvNL ACi RwG
narrower: Processoperatör textilindustri
narrower: Industrisömmerska
narrower: Maskinoperatör skotillverkning
narrower: Konfektionssömmerska
broad match: wTEr CBC bqh

Materialprovare, fysik
type: Concept
in scheme: JobTech Taxonomy - Yrke
definition: Materialprovare, fysik
broader: Laboratorieingenjörer
related: 6Hq3 tKo V57
related: EsWG kHG oXZ
broad match: C3111

Återvinningsarbetare på ÅVC
type: Concept
in scheme: JobTech Taxonomy - Yrke
definition: Återvinningsarbetare på ÅVC ansvarar för daglig drift, skötsel och kundservice på återvinningscentral. Arbetet innebär i huvudsak att vägleda kunder och se till att inlämnat avfallet sorteras rätt för att renhets- och återvinningsgraden ska bli så hög som möjligt. Andra arbetsuppgifter är skötsel, underhåll och hantering av redskap och maskiner, så som att köra hjullastare. Som återvinningsarbetare har man även kunskap om ergonomi, säkerhet och skyddsutrustning. Källa: Sobona, Arbetsförmedlingen
broader: Renhållnings- och återvinningsarbetare
related: whao Q6A ScE
related: F4tz HcT in8
related: juUv Qhe HtW
related: UaBT 3af cFS
related: RdTc RnA rSQ
related: Q5tj DRm E5A
related: m7nn Uoi s9F
related: XbDt kxw UPD
related: HVvy Vhs r1e
broad match: C9612

Administratör
type: Concept
in scheme: JobTech Taxonomy - Yrke
definition: Administratörer ger administrativt stöd och service och uppgifterna pendlar mellan ett arbete i bakgrunden till att ha kontakter utåt. Arbetsuppgifter kan till exempel vara att registrera handlingar, diarieföra, förbereda ärenden, olika typer av bokningar, ta fram information ur databaser och sammanställda material. Arbetsuppgifterna kan även innefatta att utveckla och förbättra administrativa arbetsmetoder och rutiner. Arbetet utförs vanligen utifrån flera kända handlingsalternativ. Administratörer utför arbetet i stor utsträckning självständigt till exempel utifrån tillämpade riktlinjer, praxis, allmänna anvisningar, blanketter, föreskrifter eller motsvarande. Källa: Arbetsförmedlingen - Hitta yrken, SKR
broader: Övriga kontorsassistenter och sekreterare
related: QwJK 6Yj SWT
related: Q3Di m8u e4e
related: xhHe nDQ wN2
related: PG4p 4eu 1Lu
related: DZ8J 4wt uQj
related: GoZ2 orD fsf
related: yPuR Avh 7Zy
related: n2vx 7R9 kZn
related: VQk1 fee 2Tc
related: b6mM pgy uYn
related: udA3 Hug zQA
related: yTZs Sd6 H5y
related: rkTn pqq u6M
related: BSrB LDr yUs
related: HVKa E4P uDh
related: NzZJ Log vZz
related: HaUz MHH L9q
related: enbE Ge3 iCm
related: ikkr oGk Kpo
related: KaAw 1y5 3mu
related: KB54 gKV ar3
related: c6jB vRV T7X
related: Y6cS mAv 4yt
related: yXGn K31 Wf6
related: 68wD f5q zHd
related: WZJt PUY Kdn
related: Ci2Q k33 TAy
related: EpLb nRu koh
related: Fkmj LFk vae
related: vJPT 42n q7k
related: LmzQ yeT 6JV
related: JCzo 3sD QQz
related: utvp MhE BZN
related: tCdL rwW ABn
related: uSGW Sb6 D57
related: 8qG7 eze aMY
related: RXie DBn MaB
related: pFSJ iTj bfn
related: Wp5t nTk 3Ki
related: K4wY FBY BhP
related: S4jz cwd 5RM
related: Hcbc CnZ ndP
related: 2YtJ U9E 4WE
related: i6jn 9Xj UaY
related: VLzK uY7 eNh
related: C6Q4 D3t ysv
related: iCXA fW8 jfg
related: L2u8 oyK Ydp
related: qFCX 8ZJ EYH
related: eHXN xcY mfV
related: quAx 6xn 1BG
related: rQVe TH9 zyb
related: BE6f ts9 paP
related: xVGa yGM zer
related: Xwpi K3u f9x
related: 7MH8 3Tg 4aU
related: 7gaZ bAL 2yC
related: 5nWw ndp Xrk
related: JjCT bb2 tQn
related: 1AhZ 2Pr 7Xj
related: nnAa Vk6 VYh
related: jCN8 mox eTr
related: u3oa xi8 Utf
related: pgyh rpm P7k
related: vgu2 Lbe N3A
related: 9sh5 Txf yuB
related: QxQ8 2pA dVG
related: RdAE ajP Ymg
related: x3Wq buU Goe
related: EQyz jDE kaA
related: 7Z6H AAg Kn6
related: tQ6D Lcz UGc
related: sujJ udh ayv
related: yF1E aTU Pzu
related: gx1A v4K Cxa

Produktionsteknisk samordnare/PTS
type: Concept
in scheme: JobTech Taxonomy - Yrke
definition: Produktionsteknisk samordnare/PTS
broader: Inspicienter och scriptor m.fl.
related: 9puE nYg crq
broad match: C3435

Pressoperatör metallbearbetning
type: Concept
in scheme: JobTech Taxonomy - Yrke
definition: Pressoperatör inom metallbearbetning sköter automatiska pressar för att forma metallstycken. Arbetet innebär i huvudsak att ställa, rigga och justera automatiska pressar för att forma metallstycken efter ritning. Andra tillhörande, vanliga arbetsuppgifer är kvalitetskontroller enligt ritning, allmänt maskinunderhåll och truckkörning. Källa: Arbetsförmedlingen
broader: Maskinställare och maskinoperatörer, metallarbete
related: iPK2 BCP nZX
related: UVLW UCS vVt
related: QzEx B6F 9NT
related: 68uT KKy uPB
related: WVe8 crA YAG
related: wTEr CBC bqh
related: QhXv 8L6 bMb
broad match: C7223

Personliga assistenter
type: Concept
in scheme: JobTech Taxonomy - Yrke
definition: Underlättar för person med funktionsnedsättning att sköta sin skolgång eller sitt arbete. Ger stöd vid vardagssysslor samt fritidsaktiviteter. Ger personlig ledsagning. Hit hör inte Vårdare/Arbetshandledare/Boendestödjare (5342)
broader: Skötare, vårdare och personliga assistenter m.fl.
related: bCVZ ziY KHC
related: dAq7 Xf8 KZ8
related: X3ec jqv xRp
related: 7wbG fbz pon
related: Yt2Z 1pY MNz
related: C5321
related: x289 bKF ihE
related: tg1e QpF xdX
related: zgd6 6Bj 829
related: hqYJ jyZ Ks8
related: 9ShZ oc6 1Jc
related: YU6v SsT UBm
related: C5322
related: aoVs Qfu U3j
related: axxm t1P 6WR
related: enLQ GrZ w3S
related: rwir xvu 443
related: huu9 Uir rPn
related: yRaA b6w MJP
related: 3M7W Tgq hRm
related: E3iH XQQ pvE
related: crVe Rij aaB
related: cocQ EPn YiY
narrower: Ledsagare
narrower: Personligt ombud
narrower: Personlig assistent
broad match: GazW 2TU kJw

Storhushållsföreståndare
type: Concept
in scheme: JobTech Taxonomy - Yrke
definition: Storhushållsföreståndare leder och organiserar verksamheten i större kök och matserveringar, exempelvis inom skolor, äldreomsorg och storkök. Arbetet inkluderar planering av menyer, inköp av råvaror, personalledning, budgethantering och kvalitetssäkring av måltidsproduktionen. Källa: Arbetsförmedlingen
broader: Storhushållsföreståndare
related: eM7d B2j 4U9
related: ngWp HEU 31g
related: ScKy FHB 7wT
related: HLHw 5oY XHy
related: jeuk cvx 4n8
related: 7qj8 YUL HH1
related: 6VkQ pBo SSA
related: 3eAk Jk7 DNe
related: jgWx qtk 2NP
related: Xru6 5dq j9Q
broad match: C3434

Banområdeschef
type: Concept
in scheme: JobTech Taxonomy - Yrke
definition: Banområdeschef
broader: Inköps-, logistik- och transportchefer
related: epLc SkD cbT
related: ASGV zcE bWf
related: bh3H Y3h 5eD
related: xRqi gXV 9NR
broad match: C1324

Receptionist
type: Concept
in scheme: JobTech Taxonomy - Yrke
definition: En receptionist är ansiktet utåt för en organisation och ansvarar för att välkomna besökare, svara i telefon och hantera post och e-post. De utför även administrativa uppgifter som att boka möten, hantera konferensrum och beställa kontorsmaterial. En receptionist är ofta den första kontaktpunkten för både anställda och besökare, och deras roll är viktig för att skapa ett positivt intryck. Källa: Arbetsförmedlingen, Wise
broader: Kontorsreceptionister
related: ZSD2 M9d sUV
related: UdVa jRr 9DE
related: nE61 ixB VWb
related: XiF5 WTA TmU
related: cZLU AsJ bU1
related: Mujf oqv 85G
related: hZWw Jcr Zkh
related: rDc8 TTx fxj
related: ZUAr E6N Hqz
related: X82t awd Qyc
related: 9hAj wwN s91
related: 1w6s 7N6 gzb
related: oVET hQ9 qrc
related: rgVX fua 6G7
related: 9wt2 x4P hqy
related: PxhY 8Fv awk
broad match: C4226

Informationssekreterare
type: Concept
in scheme: JobTech Taxonomy - Yrke
definition: Informationssekreterare
broader: Informatörer, kommunikatörer och PR-specialister
related: X82t awd Qyc
related: Yb1w sSy Rh9
related: vwxR MbC XjW
broad match: C2432

Yrken med krav på fördjupad högskolekompetens inom naturvetenskap och teknik
type: Concept
in scheme: JobTech Taxonomy - Yrke
definition: Yrken med krav på fördjupad högskolekompetens inom naturvetenskap och teknik
broader: Yrken med krav på fördjupad högskolekompetens
narrower: Arkitekter och lantmätare
narrower: Designer och formgivare
narrower: Matematiker, aktuarier och statistiker
narrower: Fysiker, kemister m.fl.
narrower: Biologer, farmakologer och specialister inom lant- och skogsbruk m.fl.
narrower: Civilingenjörsyrken
narrower: Specialister inom miljö- och hälsoskydd

Snöläggare
type: Concept
in scheme: JobTech Taxonomy - Yrke
definition: Snöläggare sköter maskiner som framställer snö på skidanläggningar. Arbetet innebär i huvudsak att sköta maskiner som framställer snö på skidanläggningar. I arbetet ingår bland annat att flytta snökanoner och slangar samt övervaka väderförhållanden som påverkar snöläggningen. Arbetet sker helt och hållet utomhus under årets kallare månader. Förarbevis för snöskoter är vanligtvis ett krav. Beroende på arbetsplats kan även preparering av skidbackar, skidspår och skoterleder samt annan fastighetsskötsel ingå, då främst att köra pistmaskin och snöröjningsmaskin. Källa: Arbetsförmedlingen
broader: Övriga servicearbetare
related: UdVa jRr 9DE
related: PjCj 5Ph kz8
related: y2Bj Gxb nf7
related: yhCP AqT tns
related: 9UVf 7pN eLq
related: AVzW Ys2 Hw3
broad match: C9629

Jonglör
type: Concept
in scheme: JobTech Taxonomy - Yrke
definition: Jonglör
broader: Övriga yrken inom kultur och underhållning
related: 8too bEs 7NU
related: 9puE nYg crq
broad match: C2659

Drifttekniker reningsverk VA
type: Concept
in scheme: JobTech Taxonomy - Yrke
definition: Drifttekniker vid reningsverk för vatten och avlopp (VA) övervakar, styr och optimerar processer i reningsanläggningar för att uppnå uppsatta miljö- och kvalitetsmål. Arbetsuppgifter kan omfatta provtagning, felsökning, justeringar av processutrustning, daglig driftkontroll, rondering samt dokumentation av drift- och processdata. Drifttekniker utför även underhållsinsatser, medverkar vid installationer samt bidrar till förbättringsarbete för ökad effektivitet och säkerhet. Yrkesrollen innebär ofta samarbete med kollegor inom service, underhåll och laboratoriepersonal. Drifttekniker har vanligtvis goda kunskaper inom processteknik, el- och styrteknik samt miljölagstiftning inom vattenrening. Källa: Sobona, Arbetsförmedlingen
broader: Drifttekniker vid värme- och vattenverk
related: EDt5 aBW 9g1
related: yhko hN8 1tq
related: SEdt W9B Tgw
related: gDCr ynW 1P9
related: yhCP AqT tns
related: hmcr NnZ efy
related: HDTb NxM 9s6
related: Bnox tbp PiL
related: 5hEn oVW d3s
related: EUTx TnK utY
broad match: C3132

Befälhavare, fartyg
type: Concept
in scheme: JobTech Taxonomy - Yrke
definition: En befälhavare har den högsta positionen på fartyget och är rederiets representant ombord och har huvudansvar för besättning, arbetsmiljö, säkerhet, lasthantering, navigation samt fartyget och dess utrustning. En befälhavare navigerar fartyget från och till kaj. Behörigheter inom sjöfart såsom certifikat och behörighetsbevis som krävs för olika befattningar ombord och som styrs av, typ av fartyg, finns samlade i Transportstyrelsens behörighetsguide Källa: Satsa på sjöfart
broader: Fartygsbefäl m.fl.
related: dRFw Rcu dX7
related: fmCS 7n9 DqW
related: gs65 ynn fcr
related: ASGV zcE bWf
related: XouD cCj HZN
related: gthF y5Z j3Z
related: vSAt THv Rvv
broad match: C3152

Forskare, ekonomi
type: Concept
in scheme: JobTech Taxonomy - Yrke
definition: Forskare, ekonomi
broader: Nationalekonomer och makroanalytiker m.fl.
related: X82t awd Qyc
broad match: C2631

Skolsköterska
type: Concept
in scheme: JobTech Taxonomy - Yrke
definition: Skolsköterska främjar hälsa och förebygger ohälsa i skolan, med särskilt ansvar för medicinska insatser och hälsovård. Sjuksköterska är en skyddad titel med legitimationskrav. En skolsköterska med specialistsjuksköterskeexamen får använda benämningen specialistsjuksköterska med inriktning mot skolsköterska. Vanliga arbetsuppgifter är att genomföra hälsoundersökningar, ge vaccinationer, följa elevers hälsa och utveckling, samt ge stöd och rådgivning till elever, vårdnadshavare och skolpersonal. Skolsköterskan arbetar också med hälsofrämjande insatser som rör exempelvis kost, sömn, psykisk hälsa och förebyggande av sjukdomar. Källa: Arbetsförmedlingen, Socialstyrelsen, Svensk sjuksköterskeförening
broader: Skolsköterskor
related: NYW6 mP6 vwf
related: nJu8 9SW pUk
related: u4AJ wSx jfd
related: mP1i vTU kXn
related: XqGK XgF xqd
related: qMay kpr FgF
related: ytRi QuA XLX
broad match: C2221

Centrumledare
type: Concept
in scheme: JobTech Taxonomy - Yrke
definition: Centrumledare
broader: Chefer inom handel
related: RPTn bxG ExZ
related: epLc SkD cbT
related: Kbnq NfW GFh
related: bh3H Y3h 5eD
related: y7n4 aiB HwE
broad match: C1420

Lärling, stenmontör
type: Concept
in scheme: JobTech Taxonomy - Yrke
definition: En lärling är anställd för att slutföra sin kvalificeringstid till stenmontör innan ett yrkesbevis kan utfärdas. Under kvalificeringstiden får du lärlingslön enligt avtal. Kvalificeringstiden tillsammans med teoretisk grundutbildning leder till yrkesbeviset. Ett lärlingsavtal mellan branschorganisation och företag tecknas. Källa: BYN
broader: Murare m.fl.
related: j7Cq ZJe GkT
related: ja7J P8X YC9
broad match: C7112

Stomiterapeut
type: Concept
in scheme: JobTech Taxonomy - Yrke
definition: Stomiterapeut utreder, behandlar och följer upp patienter med stomi- eller tarmoperation. Stomiterapeut är en sjuksköterska. Sjuksköterska är en skyddad titel med legitimationskrav. Vanliga arbetsuppgifter är utprovning och förskrivning av stomimaterial, undervisning, stöd och rådgivning till patienter, anhöriga och vårdpersonal samt uppföljning av stomins funktion och status. Stomiterapeuten ansvarar även för att planera och samordna vårdinsatser. Källa: Arbetsförmedlingen, Region Uppsala, Socialstyrelsen, Sveriges Kommuner och Regioner
broader: Grundutbildade sjuksköterskor
related: NYW6 mP6 vwf
related: TYX8 Ccd QRk
related: qE6e 2wX mrq
related: 1f7B E5K sh3
broad match: C2221

Däckmontör
type: Concept
in scheme: JobTech Taxonomy - Yrke
definition: Däckmontörer monterar nya däck, lagar punkteringar och skiftar sommar- och vinterdäck eller hjul. Däckmontörer arbetar med att montera nya däck, laga punkteringar och skifta sommar- och vinterdäck/hjul. I arbetet ingår även att balansera däck och justera hjulinställning. Källa: Arbetsförmedlingen
broader: Montörer, metall-, gummi- och plastprodukter
related: B2Dz L79 xRP
related: UdVa jRr 9DE
related: 9RnP sTn XeM
related: qktc U3A GuS
related: 7zGv iz1 FfM
related: sUot evX 3tm
related: y9TC WtP BMv
related: WKuM cJm MNt
related: nS8v cLV CE5
related: 8PE7 wJL q8Z
related: kkch 22E fvf
related: mGRW 1Db Yad
related: wTEr CBC bqh
related: 3vNk 83L bMK
related: iaiu mN7 WeB
related: Cxwp XNS XnS
broad match: C8219

Jordbruksrådgivare/Jordbrukskonsulent
type: Concept
in scheme: JobTech Taxonomy - Yrke
definition: Jordbruksrådgivare/Jordbrukskonsulent
alternative label: Jordbrukskonsulent
alternative label: Jordbruksrådgivare
broader: Specialister och rådgivare inom lantbruk m.m.
related: zxiv hCp zf8
related: 6nbS RdB kzm
related: VuuL 7CH adj
broad match: C2132

Gravör
type: Concept
in scheme: JobTech Taxonomy - Yrke
definition: Gravörer skapar mönster i olika material med olika tekniker. Man skapar mönster, text eller bilder på hårda ytor som glas, metall, sten och gjutformar för medaljer eller tryckplåtar. Vanliga föremål är smycken, pokaler och gravstenar. Arbetet utförs med verktyg som gravyrstickel, diamantritsnål, slipmaskiner eller modern teknik som lasergravyr och UV-printing. Källa: Hantverksakademin, Hantverkslärling, Arbetsförmedlingen
broader: Musikinstrumentmakare och övriga konsthantverkare
related: FyoW LU5 NmT
related: nvwo 59H YHz
related: PaxQ o1G wWH
related: ezJb xuy UDy
related: 2Fy1 Dec P3K
related: uRB2 QFk ERn
related: XAez NPr iyk
related: Dx8j ST3 BRd
related: t2Nh t11 U9Z
related: Kpy6 UVc EED
related: fwxz 3iy CiK
related: WXtY UBv ePt
broad match: C7316

Mediepedagog
type: Concept
in scheme: JobTech Taxonomy - Yrke
definition: Mediepedagoger arbetar med att planera, genomföra och utveckla utbildningsinsatser och projekt kopplade till digitala medier och mediekunskap. Vanliga arbetsuppgifter är att skapa och producera digitalt utbildningsmaterial, leda workshops om medieanvändning, samt utbilda och handleda elever och personal i kreativ och medveten digital kompetens. Precis som IT-pedagogen arbetar mediepedagogen med digitala lärmiljöer, men mediepedagogens fokus är tydligare riktat mot pedagogik kring media och informationskompetens snarare än ren teknisk support. Källa: Arbetsförmedlingen
broader: Övriga utbildare och instruktörer
related: zRBV aoZ 7r8
related: MVqp eS8 kDZ
broad match: C2359

Sociolog
type: Concept
in scheme: JobTech Taxonomy - Yrke
definition: Sociolog
broader: Arkeologer och specialister inom humaniora m.m.
related: GazW 2TU kJw
related: X82t awd Qyc
related: 7kxG 68t T78
broad match: C2632

Auktionist
type: Concept
in scheme: JobTech Taxonomy - Yrke
definition: Auktionister leder och genomför auktioner för olika typer av varor. Arbetet utförs främst vid auktionsverk som på auktion säljer konstverk, samlarobjekt eller liknande till högstbjudande. Arbetsuppgifter inkluderar att förbereda och värdera föremål som ska auktioneras, genomföra själva budgivningen på auktionen och underlätta budgivningsprocessen. Auktionisten dokumenterar och presenterar objekt för köpare, kommunicerar med säljare och köpare samt hanterar avslut av försäljningar. Källa: Arbetsförmedlingen
broader: Övriga förmedlare
related: nmzy jPp ExQ
related: 6bnk cjZ k3M
related: RPTn bxG ExZ
related: 4BiH r3G mXN
related: kpVh bRa 9uF
broad match: C3339

Vårdbiträden
type: Concept
in scheme: JobTech Taxonomy - Yrke
definition: Ger individuell vård och omsorg till äldre i eget eller särskilt boende.
broader: Vårdbiträden
related: NbjJ WBY FoA
related: bCVZ ziY KHC
related: TuUX 3Jo wyq
related: 14eq XTy BPB
related: 4QAE wtY gJh
related: dAq7 Xf8 KZ8
related: 7gPY qhU mkB
related: C1qR L83 nzh
related: X3ec jqv xRp
related: Yt2Z 1pY MNz
related: C5321
related: 9Fna GUm HWL
related: x289 bKF ihE
related: X9N9 QGi 9Ym
related: tykJ BZQ Wer
related: xowU 8Wu K7C
related: Xqn7 nQQ ovW
related: tg1e QpF xdX
related: xG3w m6i fbp
related: zgd6 6Bj 829
related: hqYJ jyZ Ks8
related: 9ShZ oc6 1Jc
related: YU6v SsT UBm
related: 7xZ7 skn RYk
related: zMr8 cTC PCB
related: wBPu wTW RgG
related: MR4H FFT mTj
related: C5322
related: rF7s hX1 ECH
related: NL17 f8c AqZ
related: rVUL AgV ZTH
related: aoVs Qfu U3j
related: 5Kym 2ad Pqi
related: ZpXZ PG5 B9s
related: enLQ GrZ w3S
related: rwir xvu 443
related: huu9 Uir rPn
related: pGBH BkG qJa
related: yRaA b6w MJP
related: 3M7W Tgq hRm
related: yV9B PxJ TxS
related: crVe Rij aaB
related: Nrtm i4z aGQ
related: cocQ EPn YiY
narrower: Sjukvårdsbiträde
narrower: Vårdbiträde
narrower: Hemvårdare
broad match: NYW6 mP6 vwf

Golfbanearbetare
type: Concept
in scheme: JobTech Taxonomy - Yrke
definition: Golfbanearbetare, även kallat greenkeeper, arbetar med skötsel och underhåll av golfbanor. Arbetet innebär i huvudsak gräsklippning, bevattning och reparation av golfbanans gräsytor, samt underhåll av bunkrar och utslagsplatser. Arbetet sker både manuellt och med hjälp av maskiner, där maskinunderhåll ingår. Man arbetar även med allmän skötsel av golfanläggningenen, som rensning av skräp och skötsel av övriga grönytor. Källa: Arbetsförmedlingen
broader: Trädgårdsanläggare m.fl.
related: drA6 vS3 Lsr
related: BR7A tGX QzN
related: j7Cq ZJe GkT
related: nwAd oRQ wke
related: KMYm Swy 7Lm
related: VuuL 7CH adj
related: AJyx XWJ 9vT
broad match: C6113

Verktygsmakare
type: Concept
in scheme: JobTech Taxonomy - Yrke
definition: Verktygsmakare tillverkar, underhåller och reparerar verktyg inom industriell tillverkning. Man arbetar främst med formverktyg för plast- eller metallprodukter samt bock- och klippverktyg. Arbetet innebär både nytillverkning och prototyptillverkning av verktyg, ofta i samarbete med ingenjörer och annan produktionspersonal. Man arbetar både med manuella och CNC-styrda maskiner såsom fräs, svarv och trådgnist. Underhåll och reparation är centrala delar av yrket, där löpande och förebyggande åtgärder utförs för att säkerställa verktygens funktion och livslängd. Källa: Hantverksakademin, Hantverkslärling, Arbetsförmedlingen
broader: Verktygsmakare
related: 9Tq6 ALc Maf
related: TUFW fHc hYj
related: MF2d ZY6 88r
related: mBtc ny1 8vu
related: XPAA pNQ pgT
related: 84ce YCH mDZ
related: gPos oRS G79
related: DAm9 ZYq 2ZW
related: JJ2r 4pf 4pF
related: 7UY2 6pA nVL
related: 5hM3 7a3 eFq
related: r9zV nHP CQU
related: Rxqb uHX hHv
related: iQfS ez4 Fap
related: wTEr CBC bqh
related: 19y6 pqv rck
broad match: C7222

Diskjockey
type: Concept
in scheme: JobTech Taxonomy - Yrke
definition: Discjockey väljer, mixar och spelar musik för att skapa rätt stämning på klubbar, evenemang och privata fester. Vanliga arbetsuppgifter är anpassa musikval efter publikens önskemål och stämning, skapa spellistor och använda teknisk utrustning som mixerbord och skivspelare. Vanligt är kvälls-, natt- och helgarbete. Källa: Arbetsförmedlingen
broader: Övriga yrken inom kultur och underhållning
related: 8too bEs 7NU
related: 9puE nYg crq
related: hE1p sxJ foY
broad match: C2659

Kontorschef, utbildningsföretag
type: Concept
in scheme: JobTech Taxonomy - Yrke
definition: Kontorschef, utbildningsföretag
broader: Övriga chefer inom utbildning
related: epLc SkD cbT
related: bh3H Y3h 5eD
related: MVqp eS8 kDZ
broad match: C1345

SIUS-konsulent
type: Concept
in scheme: JobTech Taxonomy - Yrke
definition: SIUS-konsulent
broader: Arbetsförmedlare
related: X82t awd Qyc
related: yUVK gPS ETF
related: dGdc rqx 8rH
related: PGQr rmD UYJ
broad match: C3333

Yrken med krav på fördjupad högskolekompetens
type: Concept
in scheme: JobTech Taxonomy - Yrke
top concept of: JobTech Taxonomy - Yrke
definition: Yrken med krav på fördjupad högskolekompetens
narrower: Yrken med krav på fördjupad högskolekompetens inom naturvetenskap och teknik
narrower: Yrken med krav på fördjupad högskolekompetens inom IT
narrower: Yrken med krav på fördjupad högskolekompetens inom ekonomi och förvaltning
narrower: Yrken med krav på fördjupad högskolekompetens inom juridik, kultur och socialt arbete m.m.
narrower: Yrken med krav på fördjupad högskolekompetens inom hälso- och sjukvård
narrower: Yrken med krav på fördjupad högskolekompetens inom utbildning

Hörselvårdsingenjör/Hörselingenjör
type: Concept
in scheme: JobTech Taxonomy - Yrke
definition: Hörselvårdsingenjör/Hörselingenjör
alternative label: Hörselingenjör
alternative label: Hörselvårdsingenjör
broader: Tandtekniker och ortopedingenjörer m.fl.
related: 6Hq3 tKo V57
broad match: C3214

Regissör
type: Concept
in scheme: JobTech Taxonomy - Yrke
definition: Regissör ansvarar för den konstnärliga utformningen och ledningen av film-, teater- eller TV-produktioner från idé till färdig föreställning eller film. Vanliga arbetsuppgifter är planera och förbereda produktionen genom att läsa och analysera manus, välja skådespelare och samarbeta med teknisk personal som scenografer och maskörer. Under produktionen leder regissören repetitioner och inspelningar, ger instruktioner till skådespelare och säkerställer att den konstnärliga visionen följs. Efter produktionen deltar regissören i beslut om klippning, redigering och slutbearbetning av verket. Källa: Arbetsförmedlingen, Saco, Stockholms konstnärliga högskola
broader: Regissörer och producenter av film, teater m.m.
related: WPNW hNz sHD
related: gW7Q zHQ MWY
related: ewd1 pcj 57E
related: u7zK VKN 8Ht
related: 8too bEs 7NU
related: 9puE nYg crq
related: fm6b PjM L23
related: Cesw d3v ioU
related: HdZP wKD omF
broad match: C2654

Drifttekniker IT
type: Concept
in scheme: JobTech Taxonomy - Yrke
definition: Drifttekniker ansvarar för att övervaka, felsöka och underhålla tekniska system, servrar och nätverk för att säkerställa tillgänglighet och säker funktion. Arbetsuppgifter omfattar installation och uppgraderingar, hantering av driftstörningar, förebyggande underhåll, dokumentation samt samarbete med support, utvecklare och leverantörer. Rollen innebär också löpande optimering av driften, hantering av felanmälningar samt kontroller och åtgärder för att stärka hållbarhet och energieffektivitet. Källa: Arbetsförmedlingen
broader: Drifttekniker, IT
related: 9Wfr ZER ek4
related: irCm 15u 7sK
related: 8dSa Qna Cfh
related: apaJ 2ja LuF
related: kggS UQ8 Tb3
related: Xez9 qbJ FCX
related: Svw7 yzR 3mr
related: uvHS C3d QbL
related: 9qpr Smu RNi
related: V4Ab oVD oa9
broad match: C3511

Arbetsmiljöingenjör
type: Concept
in scheme: JobTech Taxonomy - Yrke
definition: Arbetsmiljöingenjör
broader: Arbetsmiljöingenjörer, yrkes- och miljöhygieniker
related: 2wxM FXb Tnz
related: YaA2 Kry oqi
related: iQgT cXa kjG
related: E7hm BLq fqZ
related: wTaw Gt5 wDu
related: hx6d CaQ juC
related: an4H WGK CNS
related: tawK jo6 bTd
related: RFRw mj9 41g
related: wX2k kGF gx8
broad match: C2263

Makroanalytiker
type: Concept
in scheme: JobTech Taxonomy - Yrke
definition: Makroanalytiker
broader: Nationalekonomer och makroanalytiker m.fl.
related: X82t awd Qyc
related: Yb1w sSy Rh9
broad match: C2631

Tidningsdistributör
type: Concept
in scheme: JobTech Taxonomy - Yrke
definition: Tidningsbud delar ut morgontidningar till brevlådor. Arbetet innebär att dela ut morgontidningar till brevlådor. Tidningar hämtas vid tryckeri eller annat lager och körs sedan ut av tidningsbudet. Arbetet sker nattetid med bil. Källa: Arbetsförmedlingen
broader: Reklamutdelare och tidningsdistributörer
related: UdVa jRr 9DE
related: 6hdK tBp Ywo
related: t5Rn J66 2qs
related: Kqi6 ED9 Zhw
related: C9M1 VDN MuF
related: Uqba WXk 5Ze
related: ASGV zcE bWf
related: M7Tz eJv 6PS
broad match: C9621

Repetitör, musik
type: Concept
in scheme: JobTech Taxonomy - Yrke
definition: Repetitör, musik
broader: Musiker, sångare och kompositörer
related: 8too bEs 7NU
related: 9puE nYg crq
broad match: C2652

Avdelningschef, region
type: Concept
in scheme: JobTech Taxonomy - Yrke
definition: Avdelningschef, region
broader: Förvaltnings- och planeringschefer
related: wTNz 96R EhQ
related: igt6 iSd JVB
related: X82t awd Qyc
related: epLc SkD cbT
related: bh3H Y3h 5eD
broad match: C1213

Vitvarumontör/Hemelektronikinstallatör
type: Concept
in scheme: JobTech Taxonomy - Yrke
definition: Vitvarumontör/Hemelektronikinstallatör arbetar med att leverera, montera och installera hemelektronik och vitvaror. Arbetet innebär i huvudsak att leverera vitvaror och hemelektronik till kunder, både privatpersoner och företag. Man monterar och installerar sedan hemelektronik och vitvaror. En ingående arbetsuppgift kan även vara att ta med äldre vitvaror och hemelektronik i retur för återvinning. Källa: Arbetsförmedlingen
broader: Ramppersonal, flyttkarlar och varupåfyllare m.fl.
related: ASGV zcE bWf
related: 3mQf WBP bwj
broad match: C9333
broad match: C9332

Restaurang- och köksbiträden m.fl.
type: Concept
in scheme: JobTech Taxonomy - Yrke
definition: Portionerar mat, tar emot betalning i kassa samt plockar disk och diskar inom restaurang eller storkök. Förbereder mat, sköljer, skalar och hackar grönsaker. Deltar i enklare matlagning. Ansvarar för frukostservering.
broader: Snabbmatspersonal, köks- och restaurangbiträden m.fl.
related: i3k9 q6n 5ht
related: ogdH rrn NWT
related: AcZJ S7J ji6
related: JYAn p1X 6sb
related: 6XRu MQm 4NK
related: GQ9R 2Za Awt
related: fJdB viK AaA
related: JYKn PRX tif
related: A8wW vCM a28
related: LDpW xuo jZp
related: gspB 1ci Nt3
related: zMmn 1mh 6D5
related: Eksc iXV Z1S
related: XCMK vWW njd
related: Dywf BPg usG
related: dNA9 T9K JXF
related: sqd6 4Kk b4w
related: C9412
related: Dxqv 2WA TYt
related: M4ei Uvu Ks7
related: f2Nt 4bK HNX
related: 5fAq Squ o7p
related: dmi6 Jfs pso
related: 1Zwa X6Q Dyk
related: xgpz 5A1 B2g
related: hYpk RYx y3V
related: JJiW W7Z kgc
related: aAtJ q2r J5n
related: rwir xvu 443
related: pT39 hq7 jAW
related: P6te TBF 8fh
related: kj4Q nLh u8Q
related: hNkT cJr 4ki
narrower: Måltidsbiträde
narrower: Cateringarbetare
narrower: Restaurangbiträde
narrower: Ekonomibiträde, fartyg
narrower: Diskare
narrower: Köksbiträde
broad match: ScKy FHB 7wT

Uthyrningschef
type: Concept
in scheme: JobTech Taxonomy - Yrke
definition: Uthyrningschef
broader: Chefer inom handel
related: WMvz nrj Xxa
related: RPTn bxG ExZ
related: epLc SkD cbT
related: bh3H Y3h 5eD
broad match: C1420

Advokat
type: Concept
in scheme: JobTech Taxonomy - Yrke
definition: Advokat ger juridisk rådgivning, företräder klienter i rättsliga processer och upprättar juridiska dokument. Arbetsuppgifterna inkluderar att tolka och tillämpa lagar, upprätta och granska avtal, delta i förhandlingar samt företräda klienter i domstol och myndighetskontakter. Advokat arbetar inom olika rättsområden såsom brottmål, affärsjuridik, familjerätt och arbetsrätt. Rollen innebär kontinuerlig uppdatering kring lagstiftning och rättspraxis, samt samarbete med klienter, andra jurister och myndigheter. Advokat är en skyddad yrkestitel som endast får användas av personer antagna som ledamot av Advokatsamfundet. Källor: Advokatsamfundet, Arbetsförmedlingen
broader: Advokater
related: uQHt gJU SPq
related: Kak9 3ed VL6
related: X82t awd Qyc
related: x4Wi NWW ogB
related: k4XK nFe pbj
related: Abcb QtH isZ
broad match: C2611

Ekolog
type: Concept
in scheme: JobTech Taxonomy - Yrke
definition: Ekolog
broader: Specialister inom miljöskydd och miljöteknik
related: kJeN wmw 9wX
related: rjeJ D2Z y3h
related: YGhF CH7 5R1
related: mK3z ykr mWX
related: 4ff1 4gB Dew
broad match: C2133

Fastighetsekonom
type: Concept
in scheme: JobTech Taxonomy - Yrke
definition: Fastighetsekonom
broader: Övriga ekonomer
related: GmwV UkM d5d
related: UR4N 7WU Az4
related: X82t awd Qyc
related: Djzi zve GAh
related: eBQs p5w Jkj
related: uKV8 JVS uZv
related: M4ti tfN iDn
broad match: C2412

Boendestödjare
type: Concept
in scheme: JobTech Taxonomy - Yrke
definition: Boendestödjare arbetar självständigt med att stödja och motivera vuxna personer med psykiska/neuropsykiatriska funktionsnedsättningar till ett fungerande vardagsliv både i och utanför hemmet. Boendestödjare stödjer den enskilde i att planera, genomföra och att vara delaktig i vardagssysslor. Vanliga arbetsuppgifter är stöd med personlig omsorg, fritidsaktiviteter och myndighetskontakter. Det kan också inkludera till exempel städ, tvätt, ekonomi och påminnelse om medicin. Källa: Arbetsförmedlingen, Socialstyrelsen och Stockholms stad
broader: Vårdare, boendestödjare
related: phRo ovK mKW
related: 69WG vzM fJQ
related: Uxsp oYz FDi
related: BmE6 vjL Xiy
related: dp4r DNV y5p
related: txJU cy6 BD9
related: GazW 2TU kJw
related: NJmo PsQ jHS
related: 8GVQ izf cuq
related: z4XY 1hM zNs
related: FJBr M1S AE1
related: 8akM nBH nSn
related: jNxb oLd how
related: 53t5 ph4 PWL
related: TAsU YSx rri
related: xF4R g2R uyc
related: FYGd cqE 8s9
related: m7GW QVG uKB
related: JgGP s1u ngw
related: KpuA 7nG UbW
related: p8q7 XYx jdd
related: ZkvQ 6JB Ssi
related: FeqD xnG DRw
broad match: C5322

VD-assistent
type: Concept
in scheme: JobTech Taxonomy - Yrke
definition: VD-assistenter ger administrativt och strategiskt stöd till VD. Arbetet kombinerar mer traditionellt administrativt stöd med projektledning och affärsnära uppgifter. Rollen innebär att avlasta och underlätta VD:s arbete genom att hantera kalender, möten, resor och korrespondens, men också att administrera och följa upp ledningsgrupps- och styrelsemöten. VD-assistenten fungerar ofta som en förlängning av VD, ofta som en strategisk partner med god insyn i verksamheten, och är involverad i att koordinera projekt, sammanställa presentationsmaterial och analysera rapporter. Ibland kan VD-assistenten företräda VD vid dennes frånvaro. Källa: Arbetsförmedlingen
broader: Chefssekreterare och VD-assistenter m.fl.
related: rUF8 nrb 6uW
related: VsKi Pcs J4T
related: o7G3 pcd WMj
related: X82t awd Qyc
related: kNZm ayc 2kc
related: 2yah yNn WUX
related: P9YH rvk pE6
broad match: C3343

Servicetekniker hyrmaskiner
type: Concept
in scheme: JobTech Taxonomy - Yrke
definition: Servicetekniker för hyrmaskiner arbetar med underhåll och uthyrning av hyrmaskiner, främst för bygg- och anläggningsarbeten. Yrket innebär underhåll av både större anläggningsmaskiner så som grävmaskiner och mindre, handhållna maskiner. Vanliga arbetsuppgifter är rengöring, funktionskontroll och reparation. Beroende på företagets storlek kan även hantering och kundtjänst vara en del av arbetsuppgifterna. Källa: Arbetsförmedlingen
broader: Motorfordonsmekaniker och fordonsreparatörer
related: yhCP AqT tns
broad match: C7231

Grönsaksodlare
type: Concept
in scheme: JobTech Taxonomy - Yrke
definition: Grönsaksodlare odlar och skördar grönsaker och andra köksväxter på friland eller i växthus. Arbetsuppgifter omfattar markberedning, sådd eller plantering, gödsling, bevattning, växtskydd och skörd av olika grönsaker, samt sortering, packning och lagring av skörden. Grönsaksodlare underhåller och använder maskiner, redskap och ekonomibyggnader. I arbetet ingår även planering av odlingssäsongen, val av sorter och grödor samt dokumentation av odlingsåtgärder. Grönsaksodlare följer marknadens efterfrågan och kan kombinera odling av större kulturer som sallat och morötter med mindre kulturer som rödbetor och gurka. Inom växthusodling ingår även övervakning av klimat, ljus, luftfuktighet och näring samt användning av modern teknik för att optimera produktion. Källa: Gröna arbetsgivare, Arbetsförmedlingen
broader: Odlare av jordbruksväxter, frukt och bär
related: jKe8 9fP Ski
related: 3vFr uDd JB3
related: KbQp DnG FjS
related: Low4 zAr tX3
related: VuuL 7CH adj
broad match: C6111

Speditör
type: Concept
in scheme: JobTech Taxonomy - Yrke
definition: Speditörer planerar och samordnar transporter av gods inom och utanför Sverige. Arbetet omfattar bokning av transporter, framtagning av fraktdokument och tullhandlingar, samt kontakt med transportföretag och kunder. Speditörer föreslår transportlösningar, hanterar logistikfrågor och följer upp försändelser. Transporter sker ofta internationellt och kan inkludera flera transportslag, såsom väg, sjö, järnväg och flyg. Inriktningar inom yrket inkluderar importspedition, exportspedition och flygspedition. Arbetet sker i speditionsföretag, på rederier, flygplatser eller inom industri och handel. Källa: Arbetsförmedlingen
broader: Speditörer och transportmäklare
related: d9Md G6d emH
related: xmM2 uZd sPY
related: Xt5c 3PB ent
related: HZSZ joV WB8
related: motX ZwX 8Un
related: RPTn bxG ExZ
related: PuVB xer LFD
related: u6YH qGv maU
related: eTnD Tkj 7Fn
related: 7PWW 3Rj Kr5
related: ASGV zcE bWf
related: N1MV pTV Qa3
related: VAqM Wzu 3ys
related: C89o 9zA XQ6
broad match: C3331

PTP-psykolog
type: Concept
in scheme: JobTech Taxonomy - Yrke
definition: PTP-psykologer arbetar under handledning med psykologisk utredning, bedömning och behandling för att tillämpa och fördjupa sina kunskaper inför ansökan om legitimation som psykolog. För att kunna få en anställning som PTP-psykolog behövs psykologexamen. Vanliga arbetsuppgifter är psykologisk utredning och bedömning av individer med olika psykiatriska tillstånd, psykologiska behandlingar och rådgivning. Det ingår också metodutveckling, organisationsutredning, handledning eller undervisning. Källa: Arbetsförmedlingen, Psykologförbundet, Socialstyrelsen
broader: Psykologer
related: vj6a Eh9 2wV
related: NYW6 mP6 vwf
related: ZB49 q5s Kp2
broad match: C2634

Guide
type: Concept
in scheme: JobTech Taxonomy - Yrke
definition: Guider leder besökare vid visningar och turer inom olika sammanhang, ofta med fokus på att förmedla information om platser, kultur, historia eller verksamheter. Arbetsuppgifter kan omfatta planering och genomförande av guidningar, anpassning av innehåll till olika målgrupper samt kommunikation med grupper eller enskilda deltagare. Guiden använder muntlig presentation, ofta i kombination med transporter eller stopp vid olika sevärdheter. Källa: Arbetsförmedlingen
broader: Guider och reseledare
related: 7goz uuv JWu
related: rLy9 1nb ZP3
related: RPTn bxG ExZ
related: MRnn mpq YJm
related: 6VgQ PH8 s1i
related: Gwuh 8rx j5X
related: aBUJ CuC 6cN
related: 5nW3 zpy FL6
related: EKtK 5mt fum
related: xy76 m4c JQr
related: z5iW 1WM Dez
related: FqL3 GDs Lfh
related: 7rLg 6ht 5Dz
related: umCG HNS QHm
related: 5TWL YnM KQs
broad match: C5113

Motorman
type: Concept
in scheme: JobTech Taxonomy - Yrke
definition: En motorman arbetar i maskinrummet med exempelvis underhåll av huvud- och hjälpmaskiner. Motormannen kontrollerar, smörjer och byter ut reservdelar, reparerar och övervakar driften i maskinrummet. För att arbeta som befaren maskinpersonal krävs Befaren maskinpersonal behörighet. En yh-utbildning med inriktning mot sjöfart som är godkänd av Transportstyrelsen. Källa: Satsa på sjöfart
broader: Underhållsmekaniker och maskinreparatörer
related: dRFw Rcu dX7
related: gs65 ynn fcr
related: ynFn k8s Em6
related: ASGV zcE bWf
related: XouD cCj HZN
related: yhCP AqT tns
related: i91K oMS VHN
related: 7Vob 5y6 j8H
related: 5PN4 hoN ymW
broad match: C7233

Ingenjörer och tekniker inom bygg och anläggning
type: Concept
in scheme: JobTech Taxonomy - Yrke
definition: Utför tekniskt arbete i samband med konstruktion, nybyggnation, underhåll och reparation av byggnader och anläggningar. Utför mätnings-, konstruktions- och beräkningsarbete samt upprättar arbets- och detaljritningar. Deltar i kontroll och slutgranskning av bygg- och anläggningsprojekt. Utvecklar drift- och underhållsverksamheten för att optimera fastigheters tekniska system. Hit hör inte Civilingenjörsyrken inom bygg och anläggning (2142)
broader: Ingenjörer och tekniker
related: N4f3 cLE ygk
related: tCER yDZ XnW
related: JQRo XJx YX9
related: uvcb DuX NW8
related: g7bY vJ5 XC8
related: W5A6 NGs aM9
related: mR9a pbf 4tv
related: Z6GN aCQ MDc
related: xEQs n1U Een
related: 4VUm JpJ LWr
related: ah7i FKc KGU
related: 8YxM PWA RNH
related: eHy7 eMm 1mG
related: dpBU 3E1 JAx
related: CY3S ton bPV
related: Uige jQo uZ4
related: w1sp GnJ YXE
related: 61zA BvK zDd
related: d4fX YoT QQc
related: n5Ww Cc9 xYG
related: 6MJf 3Va KQD
related: hb3b fH2 bvK
related: oaiv GsB AFK
related: Kf1r uu8 QDW
related: QB7Z 7mE fx2
related: 11rR H3J EQQ
related: BV5y wau Zxz
related: t3fW PJW LzP
related: RMwC 4R8 Jdi
related: 74Mw JUN VKx
related: K5JR yfk 8oj
related: sc9x MMP woB
related: KBrp Hsu A2n
related: Xpix Jg8 81T
related: 5FMU Dt4 2hF
related: 1JaM 2oZ iQ3
related: HPfU aG2 m9r
related: YSVk ZwM xm4
related: yFgG g8k r6r
related: yMp7 AwC zqx
related: YAdb Wwj b3N
related: HW3B CwN pst
related: M3tL 3Qr oeB
related: DsHp orw 8Xb
related: zRtu fYj XC4
related: mpwi 6BM SbV
related: jSAi QKc JQk
related: u8ZW NcV 2zS
related: BrdZ oPC Kft
related: hH5E rGv 7vN
related: jt4y g5c GXy
related: rUFy uF1 xEZ
related: M7C1 DAy UTK
related: oPP6 byU yyn
related: WXkX o6j FYv
related: 8jJ3 DbV au2
related: 1VVe BBY rpQ
related: E67G PGy fiG
related: D6xD cSH rZN
related: 8GLo Bn4 XAq
related: MsNS 1ea u4p
related: ZPBk FiE qTG
related: ofzH ikr 67D
related: YqX1 qhL cBm
related: xwfa jdj eiR
related: 9PuU gLx U7V
related: woCn NVG HCt
related: qbEp sGf jyZ
related: nF6J MNc ZxS
related: U1JW vPG Dqk
related: HPrg bZM zh2
related: fFAM jC1 ur5
related: WHbh zcN LWx
related: oDKx 7bc sfk
related: cXQR ss8 GYb

Watch Supervisor, flygledning
type: Concept
in scheme: JobTech Taxonomy - Yrke
definition: Watch Supervisor, flygledning
broader: Flygledare
related: ASGV zcE bWf
broad match: C3154

Produktutvecklare konfektion
type: Concept
in scheme: JobTech Taxonomy - Yrke
definition: Produktutvecklare inom konfektion utvecklar kläder och andra textila produkter. Produktutvecklaren arbetar ofta både kreativt och tekniskt. Vanliga arbetsuppgifter kan vara att skapa tekniska specifikationer som måttlistor och materialval samt att säkerställa att design, kvalitet och funktion möter behov. Yrket kan innebära samarbete med designers, mönsterkonstruktörer och leverantörer. Beroende på arbetsplats kan även samordning av provning, kvalitetssäkring och produktionsprocesser förekomma. Källa: Arbetsförmedlingen
broader: Skräddare och ateljésömmerskor m.fl.
related: uhit a39 vnX
related: kqau D4r 4fE
related: PaxQ o1G wWH
broad match: C7532

Kärnfysiker
type: Concept
in scheme: JobTech Taxonomy - Yrke
definition: Kärnfysiker
broader: Fysiker och astronomer
related: kJeN wmw 9wX
broad match: C2111

Takmålare plåttak
type: Concept
in scheme: JobTech Taxonomy - Yrke
definition: Takmålare av plåttak målar och underhåller plåttak. Arbetet innebär i huvudsak rengöring och målning av plåttak. Takytan rengörs, ofta med högtryckstvätt, för att avlägsna smuts, rost och gamla färglager. Efter rengöring appliceras en rostskyddsbehandling för att förhindra framtida korrosion. Därefter målas taket, vanligtvis med hjälp av färgspruta, i flera lager. Arbetet utförs oftast på hög höjd och ute hos kund. Utbildning i höghöjdsarbete och B-körkort är viktigt i arbetet. Beroende på arbetsgivare kan andra arbetsuppgifter ingå, så som enklare reparationer eller att montera takskydd. Källa: Arbetsförmedlingen
broader: Lackerare och industrimålare
related: srMW hR5 UxY
related: nmWa 4yz Dw4
related: wTEr CBC bqh
broad match: C7132

Curator
type: Concept
in scheme: JobTech Taxonomy - Yrke
definition: Curator planerar, utvecklar och förvaltar konstutställningar och konstprojekt på museer, konsthallar eller andra kulturinstitutioner. Vanliga arbetsuppgifter är faktainsamling och research om utställningens tema, val, placering och installation av konstverk i samarbete med konstnärer. Det ingår också att skriva utställningstexter, till kataloger och annat informationsmaterial, budget, finansiering, praktisk projektledning, marknadsföring och arrangemang av relaterade evenemang. Källa: Arbetsförmedlingen, Statens konstråd
broader: Museiintendenter m.fl.
related: v44G N9D zen
related: JxVv btB MTz
related: 8too bEs 7NU
related: 9puE nYg crq
related: PgQ8 Mfh Wg1
broad match: C2621

Kvalitetsingenjör, kemiteknik/Kvalitetstekniker, kemiteknik
type: Concept
in scheme: JobTech Taxonomy - Yrke
definition: Kvalitetsingenjör, kemiteknik/Kvalitetstekniker, kemiteknik
alternative label: Kvalitetsingenjör, kemiteknik
alternative label: Kvalitetstekniker, kemiteknik
broader: Ingenjörer och tekniker inom kemi och kemiteknik
related: CpFD aoS pkZ
related: 6Hq3 tKo V57
related: 5tyY GjC AcD
related: fM7t axJ RNN
broad match: C3116

Frisör
type: Concept
in scheme: JobTech Taxonomy - Yrke
definition: Frisörer arbetar med att klippa, färga, forma och vårda hår. Arbetsuppgifterna omfattar konsultation, klippning, färgning, slingor, permanent, tvätt, styling och försäljning av hårvårdsprodukter. Frisörer kan arbeta med både kort och långt hår, och anpassar behandlingar efter kundens stil och behov. Inom yrket kan man specialisera sig, till exempel som herrfrisör, damfrisör samt peruk- och tupéfrisör. Källa: Frisörföretagarna, Arbetsförmedlingen
broader: Frisörer
related: Bt76 s5N D4t
related: 5dyL cvf pdX
related: Uuf1 GMh Uvw
related: kxUL f3p yX2
related: bqCP pSX iRF
related: gt6b Gs8 ALr
related: Y6Ve jHq Zkc
related: bFDx 5C8 HF1
related: hQJc Jsw ZtP
related: mMcF Rvk jQ4
related: G8RM cg9 YEN
related: PhdQ A58 M2k
broad match: C5141

Fritidschef
type: Concept
in scheme: JobTech Taxonomy - Yrke
definition: Fritidschef
broader: Chefer inom friskvård, sport och fritid
related: epLc SkD cbT
related: bh3H Y3h 5eD
related: pjHy Y9U YT1
broad match: C1213

Köttmästare livsmedelsbutik
type: Concept
in scheme: JobTech Taxonomy - Yrke
definition: Köttmästare i livsmedelsbutik ansvarar för den manuella köttdisken i livsmedelsbutiker. Arbetsuppgifter innefattar bland annat att stycka och förädla kött, lägga beställningar och kontrollera leveranser. Köttmästaren innebär oftast att vara ansvarig för köttavdelning i en livsmedelsbutik, inklusive ansvar för budget, försäljning och arbetsledning av medarbetare. Källa: Arbetsförmedlingen, Sveriges hantverksråd
broader: Säljande butikschefer och avdelningschefer i butik
related: RPTn bxG ExZ
broad match: C5223

Inköpsplanerare
type: Concept
in scheme: JobTech Taxonomy - Yrke
definition: Inköpsplanerare
broader: Ingenjörer och tekniker inom industri, logistik och produktionsplanering
related: 6Hq3 tKo V57
related: RPTn bxG ExZ
broad match: C3323

Familjerådgivare/Familjeterapeut
type: Concept
in scheme: JobTech Taxonomy - Yrke
definition: Familjerådgivare och familjeterapeut erbjuder samtalsstöd till par och familjer som upplever relationsproblem och konflikter. Arbetsuppgifterna inkluderar att genom terapeutiska samtal bearbeta samlevnadsproblem, konflikter och kriser samt stödja individer och familjsystem i att finna lösningar och förbättra kommunikation. Rådgivning och terapi kan vara kortare processer med rådgivande inslag eller längre behandlingar med terapeutisk inriktning, där familjeterapeuter ofta arbetar med hela familjens dynamik och samspelet mellan medlemmarna. Arbetet kan även omfatta informationsinsatser och samverkan med socialtjänst och andra aktörer. Familjerådgivare och familjeterapeuter har vanligtvis goda kunskaper inom psykologi, psykoterapi, kommunikation och relationsarbete. Källor: Sveriges kommunala familjerådgivare, Socialstyrelsen, 1177 Vårdguiden, Föreningen Sveriges kommunala familjerådgivare
alternative label: Familjerådgivare
alternative label: Familjeterapeut
broader: Socialsekreterare
related: GPpn 2kh 3kZ
related: GazW 2TU kJw
related: Vsmh eek ebF
related: SnmL BdE auX
related: Tz5C 1eK Rax
related: HnV6 JSb oF9
related: GaQT ETq sLw
related: 26Go aaB 4tA
broad match: C2635

Service-, omsorgs- och försäljningsyrken
type: Concept
in scheme: JobTech Taxonomy - Yrke
top concept of: JobTech Taxonomy - Yrke
definition: Service-, omsorgs- och försäljningsyrken
narrower: Försäljningsyrken inom detaljhandeln m.m.
narrower: Andra bevaknings- och säkerhetsyrken
narrower: Serviceyrken
narrower: Omsorgsyrken

Fondförvaltare/Portföljförvaltare
type: Concept
in scheme: JobTech Taxonomy - Yrke
definition: Fondförvaltare/Portföljförvaltare
alternative label: Fondförvaltare
alternative label: Portföljförvaltare
broader: Traders och fondförvaltare
related: RSjr Uhz NLp
related: RbsF qLv jeg
related: RPTn bxG ExZ
related: X82t awd Qyc
related: UqnS soa Upw
broad match: C2412

Handläggare, flygledning
type: Concept
in scheme: JobTech Taxonomy - Yrke
definition: Handläggare, flygledning
broader: Flygledare
related: ASGV zcE bWf
broad match: C3154

Retuschör/Bildbehandlare
type: Concept
in scheme: JobTech Taxonomy - Yrke
definition: Retuschör/Bildbehandlare arbetar med att förbättra och manipulera digitala bilder för användning i olika medier, såsom reklam, mode och konst. Arbetsuppgifterna inkluderar att korrigera färger, justera belysning, ta bort oönskade element och skapa kompositbilder. Vidare ingår anpassning av bilder för olika format och kanaler, till exempel webb, tryck och sociala medier. Retuschör/bildbehandlare arbetar ofta i nära samarbete med fotografer, art directors och formgivare i produktionskedjor inom reklam, e-handel, tidningsproduktion eller fotostudios. Digital bildbehandling utförs huvudsakligen i specialiserade mjukvaror. Källa: Arbetsförmedlingen
broader: Fotografer
related: 1GYW L38 JFj
related: zc6Q EXu srR
related: 9puE nYg crq
related: u2dd E5y oqZ
related: 8534 5ur DS7
related: ekd3 VQn ESX
broad match: C3431

Rostskyddsbehandlare
type: Concept
in scheme: JobTech Taxonomy - Yrke
definition: Rostskyddsbehandlare
broader: Lackerare och industrimålare
related: srMW hR5 UxY
related: wTEr CBC bqh
broad match: C7132

Handläggare, intresseorganisation
type: Concept
in scheme: JobTech Taxonomy - Yrke
definition: En handläggare på en intresseorganisation arbetar med att utreda, bereda och administrera ärenden som rör organisationens medlemmar och intressepolitiska frågor. Rollen innebär ofta att vara ett stöd för förtroendevalda och att bidra till organisationens påverkansarbete och service gentemot medlemmar. Utreda och sammanställa beslutsunderlag inom organisationens sakfrågor, till exempel intressepolitiska frågor eller medlemsärenden. Källa: Arbetsförmedlingen
broader: Planerare och utredare m.fl.
related: cpWA 7fH bG3
related: dsHM bVL 6pH
related: zToY A8t 4FF
related: X82t awd Qyc
related: Byji kuS Afu
related: douN JLx c94
related: VNvS sNP ZC5
related: 3Yii rhW ofk
related: vnS1 uS1 ppD
related: TZe9 NsN uce
related: Qa8A saP ET3
related: zkXY GSA EDT
broad match: C2422

Gymnasielärare
type: Concept
in scheme: JobTech Taxonomy - Yrke
definition: Gymnasielärare
broader: Yrken med krav på fördjupad högskolekompetens inom utbildning
narrower: Gymnasielärare

Reseledare
type: Concept
in scheme: JobTech Taxonomy - Yrke
definition: Reseledare leder och samordnar resor för grupper av turister inom Sverige eller utomlands. Arbetsuppgifterna omfattar mottagande av gäster vid ankomst, informationsmöten, guidning, hantering av transporter som transferbussar samt stöd vid flygförseningar, bagageproblem och andra oförutsedda händelser. Reseledare arbetar på hotell, servicekontor eller direkt i fält och fungerar som kontaktperson mellan gästen och lokala aktörer som hotell, transportbolag och guider. Tjänsten kan innebära stationering på en ort eller medföljande vid rundresor. Reseledare ger information om resmål, kultur och aktiviteter och fungerar som stöd vid sjukdom, problem eller ändrade reseförhållanden. Vissa reseledare arbetar med särskilda uppgifter som golfresor, barnaktiviteter eller bokningsadministration. Källa: Arbetsförmedlingen
broader: Guider och reseledare
related: gyud gvJ i4T
related: RPTn bxG ExZ
related: jmHn gUN Tq1
related: 1Pu4 Qrf fQ8
broad match: C5113

Batteritekniker
type: Concept
in scheme: JobTech Taxonomy - Yrke
definition: Batteritekniker arbetar med allt ifrån planering och utveckling till underhåll av batterilagringssystem och ser till att batterierna fungerar optimalt genom att genomföra nödvändiga reparationer och övervaka deras prestanda för att säkerställa en pålitlig och effektiv energilagring. Batteritekniker ansvarar för att installera, underhålla och reparera fordons batterisystem. Arbetet innebär också att diagnostisera och lösa tekniska problem som kan uppstå, samt att vara involverad i planering och implementering av batterisystem för olika applikationer, från förnybar energilagring till elfordon. Källa: Teknikhögskolan
broader: Ingenjörer och tekniker inom elektroteknik
related: 6Hq3 tKo V57
related: s9pM C7Z mPN
broad match: C3113

Regiondirektör
type: Concept
in scheme: JobTech Taxonomy - Yrke
definition: Regiondirektör
broader: General-, landstings- och kommundirektörer m.fl.
related: epLc SkD cbT
related: bh3H Y3h 5eD
related: qhX4 2KY fFu
broad match: C1112

Domare
type: Concept
in scheme: JobTech Taxonomy - Yrke
definition: Domare avgör tvistemål, brottmål och andra rättsärenden i domstol. Arbetsuppgifterna omfattar att förbereda och utreda mål, leda förhandlingar, tillämpa lagar och fatta beslut genom dom eller beslut. Domare granskar bevisning, förhör parter och vittnen samt formulerar domskäl och domskrifter. Rollen kräver bred juridisk kunskap och oberoende ställning, och domare arbetar inom allmänna domstolar, förvaltningsdomstolar eller specialdomstolar. Domare utvecklar rättstillämpningen och bidrar till rättssäkerheten i samhället. Benämningen används i högsta grad i dagens domstolsväsen. Källa: Sveriges Domstolar
broader: Domare
related: X82t awd Qyc
related: x4Wi NWW ogB
related: Y3AE yRR KEH
related: Abcb QtH isZ
broad match: C2612

Sjukhusdirektör
type: Concept
in scheme: JobTech Taxonomy - Yrke
definition: Sjukhusdirektör
broader: Verkställande direktörer m.fl.
related: NYW6 mP6 vwf
related: epLc SkD cbT
related: bh3H Y3h 5eD
related: gwQ8 dja bdc
broad match: C1120

Offertingenjör
type: Concept
in scheme: JobTech Taxonomy - Yrke
definition: Offertingenjör tar fram tekniskt underlag och utarbetar offerter till kunder, främst inom tekniska och industriella projekt. Arbetsuppgifterna inkluderar analys av förfrågningsunderlag, tolkning av tekniska specifikationer, kostnadsberäkning samt sammanställning av kompletta och affärsmässiga offerter. Offertingenjören samarbetar nära med säljare, produktion, specialister och projektledare för att säkerställa att kundens krav tekniskt och ekonomiskt tillgodoses. Kontakter med kunder förekommer vid förtydligande av underlag samt vid presentation av anbud, och rollen kan även inkludera deltagande vid kommersiella förhandlingar och viss produktpresentation. Källa: KTH, jobbannonser på Platsbanken och Linkedin
broader: Ordersamordnare m.fl.
related: tJR1 krF r98
related: ib7B nUB A5a
related: wPie FPS BzT
related: 5Ytn PwS WFT
related: RPTn bxG ExZ
related: Nneq fTK 2eR
related: GiJb L2t eEL
related: 1i63 tJg 5A6
related: jSFH PfM omQ
related: JeAA beZ JcK
related: E3na Wym xAs
related: B6dq SKx MUn
related: fnfr myF 9wa
related: BxED XCw Ddt
related: KZEt pKf ptc
related: YdKG HTt KXa
broad match: C3339

Sjukhusvaktmästare
type: Concept
in scheme: JobTech Taxonomy - Yrke
definition: Sjukhusvaktmästare ger stöd och service till sjukhusets olika verksamheter. Vanliga arbetsuppgifter är post- och godshantering, varubeställningar och leveranser, teparation och byte av föremål som är trasiga samt möblering av lokaler och montering av inventarier. Sjukhusvaktmästare arbetar mycket med transporter. Det kan handla om att förflytta patienter mellan olika avdelningar, skicka prover till labbet eller transportera tvätt och riskavfall. Transport av avlidna människor ingår i arbetet. Källa: Arbetsförmedlingen - Hitta yrken
broader: Vaktmästare m.fl.
related: NYW6 mP6 vwf
related: yhCP AqT tns
related: pdzu y9D d5K
related: VdhL QFR 7jm
related: qqMj JFJ TWj
broad match: C9621

Kontrollingenjör, maskin
type: Concept
in scheme: JobTech Taxonomy - Yrke
definition: Kontrollingenjör, maskin
broader: Ingenjörer och tekniker inom maskinteknik
related: 6Hq3 tKo V57
related: 1CWj fFi xYV
related: 9aEn jPz gJs
related: ox44 EMd 2oK
broad match: C3115

Turnéledare
type: Concept
in scheme: JobTech Taxonomy - Yrke
definition: Turnéledare ansvarar för att planera, samordna och leda artist- och underhållningsturnéer, inklusive logistik och ekonomisk hantering. Vanliga arbetsuppgifter är att boka och koordinera transporter och boende, hantera scheman och budgetar, förhandla kontrakt och fungera som kontakt mellan artister, arrangörer och teknisk personal. Källa: Arbetsförmedlingen, Platsannonser
broader: Övriga förmedlare
related: RPTn bxG ExZ
related: 8too bEs 7NU
related: 9puE nYg crq
broad match: C3339

Infektionssjuksköterska
type: Concept
in scheme: JobTech Taxonomy - Yrke
definition: Infektionssjuksköterska arbetar med att förebygga, identifiera och behandla infektionssjukdomar hos patienter inom slutenvård, öppenvård eller i samband med smittskyddsarbete. Sjuksköterska är en skyddad titel med legitimationskrav. En infektionssjuksköterska med specialistsjuksköterskeexamen får använda benämningen specialistsjuksköterska inom infektionssjukvård. Vanliga arbetsuppgifter är att bedöma patienters tillstånd, administrera och övervaka läkemedel, informera och utbilda patienter och annan vårdpersonal om smittspridning och behandling. Infektionssjuksköterskan ansvarar för att upprätthålla och utveckla rutiner för hygien och smittskydd. Källa: Arbetsförmedlingen, Karolinska Universitetssjukhuset, Socialstyrelsen, Vårdförbundet
broader: Övriga specialistsjuksköterskor
related: NYW6 mP6 vwf
related: NyyD kKz LEX
related: ytRi QuA XLX
related: 1f7B E5K sh3
broad match: C2221

Vicerektor
type: Concept
in scheme: JobTech Taxonomy - Yrke
definition: Vicerektor
broader: Verkställande direktörer m.fl.
related: bh3H Y3h 5eD
related: MVqp eS8 kDZ
broad match: C1120

Materialkemist
type: Concept
in scheme: JobTech Taxonomy - Yrke
definition: Materialkemist
broader: Kemister
related: kJeN wmw 9wX
related: Yr11 UKD on1
broad match: C2113

Kafébiträde/Konditoribiträde
type: Concept
in scheme: JobTech Taxonomy - Yrke
definition: Ett kafé- och konditoribiträde arbetar med att ge service och sälja varor på ett kafé eller konditori. Arbetsuppgifterna kan inkludera att ta emot beställningar, servera mat och dryck, sköta kassan, och hålla rent och snyggt. Det är ett utåtriktat arbete där kundbemötande är viktigt. Källa: Utbildningsrådet för Hotell och Restauranger
alternative label: Kafébiträde
alternative label: Konditoribiträde
broader: Kafé- och konditoribiträden
related: RnDm ppj u7c
related: Pmxj WR6 Ka3
related: MkmT QyC 9SV
related: UdVa jRr 9DE
related: uDP3 A7y hiH
related: qZG4 pVE ZYZ
related: 8Yef M7Y THY
related: d6CW Axr cX3
related: dfit aYt gVv
related: ScKy FHB 7wT
related: cdmZ D34 zW3
related: Vx5y mAh 57i
related: FSYr rUH rsR
related: ykLN weo xJi
related: jPfj tjb Lja
related: HRL6 GsC DV3
related: ouMq MY3 Gyx
broad match: C5246

Marknadsassistent
type: Concept
in scheme: JobTech Taxonomy - Yrke
definition: Marknadsassistenter planerar, genomför och följer upp marknadsföringskampanjer. Arbetet innebär i huvudsak att producera marknadsföringsmaterial som reklam, sociala medier-inlägg och säljmaterial. Rollen innebär även att planera och följa upp kampanjer, samt koordinera samarbeten med influencers och leverantörer. Marknadsassistenten sköter ofta kundregister, handlar upp tjänster som trycksaker och reklamutskick, och ansvarar för administrativa uppgifter som statistikinsamling, rapportering och eventplanering. Dessutom bistår marknadsassistenten marknadsansvariga och produktchefer med material och presentationer. Källa: Marknadsföreningen i Sverige, Handelsrådet, Arbetsförmedlingen
broader: Marknads- och försäljningsassistenter
related: VzCo WBA UEm
related: 1gWa 784 mDU
related: t5hd q9v 2TH
related: ULPt me5 zMA
related: RPTn bxG ExZ
related: fKju yej bi6
related: D2D6 hHV DiF
related: fnfh s9g pCD
related: vvzR G4N pEh
related: h9Ku ZsG nxU
related: 6ci2 q88 aRA
related: Dyw4 DD7 Qa6
related: gRfp Cyt 4Bg
related: 66ui T4g 5Q1
related: mR4j MzD dEx
related: HCri C65 u5S
related: yYmj c44 K6P
related: piTj hKV gDh
broad match: C4419

GIS-ingenjör
type: Concept
in scheme: JobTech Taxonomy - Yrke
definition: En GIS-ingenjör arbetar med geografiska informationssystem (GIS) och ansvarar för att samla in, analysera, visualisera och hantera geografisk data. Deras arbete är centralt för beslutsfattande inom olika sektorer, som stadsplanering, miljöövervakning och infrastrukturprojekt. GIS-ingenjörer skapar och producerar kartor för olika ändamål, som översiktskartor, planeringskartor och tematiska kartor. Källa: Arbetsförmedlingen, Lunds universitet
broader: GIS- och kartingenjörer
related: 6Hq3 tKo V57
related: XZ3N uRV VYH
related: JCrs yej b5G
related: qXEQ noh U82
related: itgS CEP CTm
related: ki4S K9x cC2
related: d3nx bGR uo4
related: Tprn fcP 6Nc
related: tDUY mUn qYu
related: Yam2 kKR CsJ
related: HQTh pcW Ynu
related: biPq xbU Cst
broad match: C3118

Ateljéchef
type: Concept
in scheme: JobTech Taxonomy - Yrke
definition: Ateljéchef
broader: Informations-, kommunikations- och PR-chefer
related: epLc SkD cbT
related: bh3H Y3h 5eD
related: 9puE nYg crq
related: a73y 4yJ yPw
broad match: C1222

Samhällsplanerare
type: Concept
in scheme: JobTech Taxonomy - Yrke
definition: Samhällsplanerare
broader: Planerare och utredare m.fl.
related: VQ7M VCN Ps4
related: y9pn GGB QaF
related: YbV8 XkG hFV
related: 4TDw ShZ xZj
related: X82t awd Qyc
related: eyQC K4k drr
related: Q7oJ 98Q AUX
related: Yb1w sSy Rh9
related: jHDm jf1 U97
related: tcAK 51M MSM
related: 9T3m 3DM sLS
related: G1UX LFV QfL
related: tK1c iqd C7s
related: vJ9c p2Q vwQ
related: 5Cw5 KYc eub
related: RFrH xC7 doL
related: mFqV xgF sQF
related: TZe9 NsN uce
related: GkXC E1T vQL
related: ZMjY a3i kSx
broad match: C2422

Krematorieföreståndare
type: Concept
in scheme: JobTech Taxonomy - Yrke
definition: Krematorieföreståndare leder och deltar i arbetet vid krematorium. Arbetsuppgifterna omfattar planering och kvalitetskontroll av kremationer, ansvar för processutrustning och kylanläggning, avläsning och inmatning av uppgifter i systemregister samt arbetsledning av medarbetare. Arbetet omfattas av hög sekretess. Man samverkar nära med bland annat kyrkogårdschef och begravningsentreprenörer. Källa: Svenska kyrkan, Arbetsförmedlingen
alternative label: Krematoriemästare
broader: Begravnings- och krematoriepersonal
related: GazW 2TU kJw
broad match: C5163

Industrielektriker
type: Concept
in scheme: JobTech Taxonomy - Yrke
definition: Industrielektrikerns jobb är att installera och trimma in automatiska anläggningar, förebygga fel, felsöka, utföra service och reparation samt att bidra till att utveckla industriprocessen. Arbetet sker både med låg- och högspänning. Arbetsuppgifterna är blandade och även om det finns en planering över service och reparation av maskiner så styrs ofta industrielektrikerns uppdrag utifrån vad som löpande sker i industrin. Källa: ECY
broader: Industrielektriker
related: D4B4 KwF RaD
related: 44Az E7Q bDQ
related: yhCP AqT tns
related: ja7J P8X YC9
related: LhrG dyG dhC
related: WMg3 JJv KxP
related: opHz 5Yd Pcm
broad match: C7412

Varietéartist
type: Concept
in scheme: JobTech Taxonomy - Yrke
definition: Varietéartist framför olika scenakter såsom akrobatik, jonglering, sång, dans och magi ofta inom varieté, cirkus och underhållning inför publik. Vanliga arbetsuppgifter är att repetera och framföra artistnummer, samarbeta med andra artister och tekniker samt anpassa föreställningar efter olika scener och publik. Det är inte ovanligt med resor och oregelbundna arbetstider. Källa: Arbetsförmedlingen
broader: Övriga yrken inom kultur och underhållning
related: 8too bEs 7NU
related: 9puE nYg crq
broad match: C2659

Filmelektrikerassistent/TV-Elektrikerassistent
type: Concept
in scheme: JobTech Taxonomy - Yrke
definition: Filmelektrikerassistent assistera filmelektriker på filminspelningar, med fokus på att hantera och installera teknisk belysningsutrustning. Vanliga arbetsuppgifter är att transportera, rigga, flytta och underhålla lampor, kablage och annan elutrustning i samarbete med kamerateam och övriga teknisk personal. Källa: Arbetsförmedlingen, Film i Väst
alternative label: Filmelektrikerassistent
alternative label: TV-Elektrikerassistent
broader: Ljus-, ljud- och scentekniker
related: 8too bEs 7NU
related: 9puE nYg crq
related: yhCP AqT tns
related: d1Ao 9bY 7Kn
broad match: C3521

Director of photography/DoP/Filmfotograf
type: Concept
in scheme: JobTech Taxonomy - Yrke
definition: Director of Photography (DoP) eller Filmfotograf ansvarar för att skapa filmens visuella uttryck genom att leda arbete med kamera, ljus och bildkomposition. Vanliga arbetsuppgifter är att planera och organisera kamerateamet, testa och välja objektiv och filter, leda ljussättningen på inspelningsplatsen samt säkerställa att bildspråket förstärker berättelsen och stämningen i filmen. Det ingår ansvar för koordinering av utrustning och personal under produktionen. Källa: Arbetsförmedlingen, Film i Väst, Voodoo Film
alternative label: Director of photography
alternative label: DoP
alternative label: Filmfotograf
broader: Fotografer
related: Bk2t w8i K2Y
related: 8too bEs 7NU
related: 9puE nYg crq
related: tJN7 bi5 YW3
broad match: C3431

Stiftsadjunkt
type: Concept
in scheme: JobTech Taxonomy - Yrke
definition: Stiftsadjunkt
broader: Präster
related: GazW 2TU kJw
related: Gjsi sNM Cs1
related: c57D hnj zGv
broad match: C2636

Lantbruksförman blandad drift
type: Concept
in scheme: JobTech Taxonomy - Yrke
definition: En lantbruksförman inom blandad drift planerar och leder det dagliga arbetet på lantbruk med både växtodling och djuruppfödning. Arbetsuppgifterna omfattar bland annat planering och fördelning av arbetsuppgifter inom odling, vattning, plantering, djurskötsel, uppfödning och utfodring. I rollen ingår även att introducera nya medarbetare och samordna insatser tillsammans med andra arbetsledare samt driftledare. Beroende på storlek på lantbruksföretag kan mer arbetsledande funktioner behövas. På större lantbruksföretag är det inte ovanligt att det arbetar driftledare, gårdsmästare och förmän. Se även yrkena Gårdsmästare blandad drift och Driftledare lantbruk med blandad drift. Källa: Jobba grönt, Arbetsförmedlingen
broader: Växtodlare och djuruppfödare, blandad drift
related: UNFi PaS xkT
related: VuuL 7CH adj
broad match: C6130

Brandmän
type: Concept
in scheme: JobTech Taxonomy - Yrke
definition: Släcker bränder och gör räddningsinsatser vid exempelvis trafikolyckor. Förebygger, hindrar och begränsar skador på människor, egendom eller i miljön vid olyckshändelser. Bearbetar skador när olja, farliga kemikalier och andra skadliga ämnen läckt ut. Informerar om brandskydd.
broader: Andra bevaknings- och säkerhetsyrken
related: 7NC1 QuQ QAp
related: DMQt oVU 7uW
related: C5411
related: k8ng 1vy ffT
related: CTex gqv wWT
related: W8Vw 5oR 7EV
related: 62hD ger fqe
related: ur5t WrD DXL
related: pytb kWN p8U
related: opVw 2zx 875
related: YFLE 1xA peL
related: 6BpN oXk 7SL
related: HMp8 53G nNi
related: epLi uE1 D47
related: gvgD JK7 9io
related: F5F4 XLd VFz
related: 7xYo gc8 9Bm
narrower: Brandman
broad match: E7hm BLq fqZ

Animationsoperatör
type: Concept
in scheme: JobTech Taxonomy - Yrke
definition: Animationsoperatör
broader: Bild- och sändningstekniker
related: 8too bEs 7NU
related: 9puE nYg crq
related: d1Ao 9bY 7Kn
broad match: C3521

Ortoptist
type: Concept
in scheme: JobTech Taxonomy - Yrke
definition: Ortopist undersöker, diagnostiserar och behandlar samsynsproblematik och synnedsättningar hos barn och vuxna. Vanliga arbetsuppgifter är utreda och följa synutvecklingen hos barn med skelning, dubbelseende eller andra samsynsproblem samt att behandla vuxna patienter med exempelvis dubbelseende efter stroke eller skalltrauma. Arbetet sker ofta i nära samarbete med ögonläkare, barnhabilitering, barnhälsovård och andra vårdverksamheter. För att kunna arbeta som ortopist behövs ortopistutbildning. Källa: Arbetsförmedlingen, Göteborgs Universitet, Norrbottens läns landsting, S:t Eriks Ögonsjukhus
broader: Övriga specialistsjuksköterskor
related: NYW6 mP6 vwf
related: xwDf akw ghj
related: 1f7B E5K sh3
broad match: C2221

Researcher, rekrytering
type: Concept
in scheme: JobTech Taxonomy - Yrke
definition: Researcher, rekrytering
broader: Personal- och HR-specialister
related: Qn3b eyW z7F
related: d6KN t5B QBo
related: X82t awd Qyc
related: pyNJ Xcf xzg
related: mDTk GGP Mjt
related: arCE 6rM BVZ
broad match: C2423

Dopplackerare
type: Concept
in scheme: JobTech Taxonomy - Yrke
definition: Dopplackerare
broader: Lackerare och industrimålare
related: srMW hR5 UxY
related: wTEr CBC bqh
broad match: C7132

Dagbarnvårdare
type: Concept
in scheme: JobTech Taxonomy - Yrke
definition: Dagbarnvårdare bedriver pedagogisk omsorg för barn som alternativ till förskola eller fritidshem. Omsorg kan ske i familjedaghem, där dagbarnvårdare tar emot inskrivna barn i sitt eget hem eller i en särskild lokal. Det finns även flerfamiljslösningar där familjerna alternerar i de olika familjernas hem eller i en särskild lokal. Arbetsuppgifterna omfattar att planera och genomföra lek, utevistelse, måltider, vila och andra vardagsrutiner. Pedagogisk omsorg kan bedrivas i kommunal eller enskild regi. Källa: Skolverket, Arbetsförmedlingen
broader: Barnskötare
related: GazW 2TU kJw
related: nrmG Yw2 TQY
related: Dnea TaG LD9
related: MVqp eS8 kDZ
related: KTae RqS UoG
related: wkSv t7m 5V2
broad match: C5311

Kontrolltekniker, kemiteknik
type: Concept
in scheme: JobTech Taxonomy - Yrke
definition: Kontrolltekniker, kemiteknik
broader: Ingenjörer och tekniker inom kemi och kemiteknik
related: 6Hq3 tKo V57
related: 5tyY GjC AcD
broad match: C3116

Hundtränare
type: Concept
in scheme: JobTech Taxonomy - Yrke
definition: Hundtränare
broader: Uppfödare och skötare av sällskapsdjur
related: ha8a 31a 2xp
related: VuuL 7CH adj
broad match: C5164

Fastighets- och förvaltningschefer
type: Concept
in scheme: JobTech Taxonomy - Yrke
definition: Fastighets- och förvaltningschefer
broader: Chefer inom IT, logistik, FoU, fastighetsbolag, bygg- och ingenjörsverksamhet samt tillverkning m.m.
narrower: Fastighets- och förvaltningschefer

Forskare, etnologi
type: Concept
in scheme: JobTech Taxonomy - Yrke
definition: Forskare, etnologi
broader: Arkeologer och specialister inom humaniora m.m.
related: X82t awd Qyc
broad match: C2632

Gameplay programmer
type: Concept
in scheme: JobTech Taxonomy - Yrke
definition: Gameplay programmerare är nyckelpersoner i spelutvecklingsteam och ansvarar för att förverkliga speldesignens vision genom kod och tekniska lösningar. Rollen kräver både teknisk skicklighet och kreativ förståelse för vad som gör spel engagerande och roliga att spela. Källa: Arbetsförmedlingen, spelutbildningar.se, diverse annonser i Platsbanken
broader: Utvecklare inom spel och digitala media
related: 2Lgw fMQ qSg
related: apaJ 2ja LuF
related: 8too bEs 7NU
related: 9puE nYg crq
related: PpaS NaH 3Zo
related: 2TYW oUc vdg
broad match: C2513

Kostchef inom offentlig förvaltning
type: Concept
in scheme: JobTech Taxonomy - Yrke
definition: Kostchefer inom offentlig förvaltning ansvarar för måltider inom offentlig sektor. Arbetsuppgifter innefattar måltidsutveckling och planering samt ekonomiskt ansvar för inköp. som skolor och sjukhus, och ansvarar för allt från inköp till färdiga menyer, ofta med ett ekonomiskt ansvar. Kostchefer har vanligtvis ansvar för budget, personal och verksamhet. Beroende på arbetsgivare kan dock ansvarsområden skilja sig. Källa: Sveirges kommuner och regioner, Arbetsförmedlingen
broader: Förvaltnings- och planeringschefer
related: yz6N S6H tw6
related: fn7v wNb DT9
related: epLc SkD cbT
related: BZtA RCn 4vZ
related: bh3H Y3h 5eD
related: neZF 7t1 31Q
broad match: C1219
broad match: C1213

Projekteringsingenjör, gruv och metallurgi
type: Concept
in scheme: JobTech Taxonomy - Yrke
definition: Projekteringsingenjör, gruv och metallurgi
broader: Civilingenjörsyrken inom gruvteknik och metallurgi
related: 6Hq3 tKo V57
related: AZPQ Dz2 LGF
broad match: C2146

Ventilationsingenjör
type: Concept
in scheme: JobTech Taxonomy - Yrke
definition: Ventilationsingenjörer arbetar med energioptimering av ventilations- och kylanläggningar samt energikalkylering, med fokus på både ekonomi och miljö. De gör beräkningar av energieffektivitet och ser till att ventilationssystemen ger bra inomhusklimat för människor. Yrket omfattar också arbete med elsäkerhet, digital teknik och anpassning av lösningar där vanliga metoder inte fungerar. Ventilationsingenjörer kan arbeta som konstruktörer, projektledare eller tekniker och ansvarar för planering, projektering och injustering av ventilationssystem. Källa: Arbetsförmedlingen
broader: Ingenjörer och tekniker inom maskinteknik
related: 6Hq3 tKo V57
related: DBer Nip 34Z
related: 9aEn jPz gJs
related: TC4r 6UD j7M
related: 63Qd Qgm qy6
related: ja7J P8X YC9
broad match: C3115

Riskingenjör, risk management
type: Concept
in scheme: JobTech Taxonomy - Yrke
definition: Riskingenjörer identifierar, analyserar och bedömer olika typer av risker kopplade till verksamheters säkerhet, egendomsskador, miljöpåverkan och operativa processer. Arbetsuppgifterna inkluderar att utföra riskbedömningar och konsekvensanalyser, handlägga risk- och säkerhetsfrågor inom exempelvis detalj- och översiktsplaner samt dokumentera och rapportera risker till berörda parter. Man föreslår också riskförebyggande åtgärder och arbetar ofta med tillsyn av verksamheter som omfattas av särskilda säkerhetskrav, exempelvis enligt Sevesolagstiftningen eller ATEX-direktiv. Vanligtvis efterfrågas en ingenjörsutbildning inom relevant tekniskt område, exempelvis riskhantering, miljö, kemi, brand- eller säkerhetsteknik. Erfarenhet av arbete med lagar, regelverk och myndighetskontakter kan vara meriterande. Källa: Arbetsförmedlingen
broader: Säkerhetsinspektörer m.fl.
related: E7hm BLq fqZ
related: xGfL wDH byV
related: YH9G sqC ikr
related: MQdt 1JP V49
related: AG9J ZvS TcH
related: kDNx z5C AmY
related: ZcbR rWM CCn
related: 4uot dXV qRb
broad match: C3257

Massageterapeut
type: Concept
in scheme: JobTech Taxonomy - Yrke
definition: Massageterapeuter behandlar kroppens mjukdelsvävnader genom massage och muskeltöjningar. Man kan även använda maskinella hjälpmedel för behandling med till exempel laser och stötvågor. Massageterapeuter behandlar specifika skador och besvär i rörelseapparaten och har fördjupade kunskaper i sjukdomslära, skadelära, fysiologi, muskelfunktionsdiagnostik. Man behärskar ofta flera massageterapeutiska metoder. En massageterapeut kan utbilda sig vidare till medicinsk massageterapeut. Källa: Kroppsterapeuternas Yrkesförbund
broader: Massörer och massageterapeuter
related: Uuf1 GMh Uvw
related: CQ8d RFW fKw
broad match: C3255

Försäljningschef
type: Concept
in scheme: JobTech Taxonomy - Yrke
definition: Försäljningschef
broader: Försäljnings- och marknadschefer
related: cgRy eBF Hnh
related: J4hK ntw wxj
related: iM3Y X1v qeP
related: rXbz xA9 eVM
related: RrZw LGR via
related: NjV2 7Nq 24V
related: 2A8N v2J 4St
related: z6rA 2r2 zV2
related: 9x4U dtD 1CG
related: 5TcT UHZ 4cn
related: 5xJ8 keu L8E
related: N3Lw bYd DoP
related: kgCj v1X B1p
related: ajF5 yXg TCp
related: qotM zyT tuP
related: oJrr NZt ita
related: GELp 1em Dnd
related: oV78 vyz cXe
related: RPTn bxG ExZ
related: BjgF dhK tdy
related: naBF 5Q4 DVz
related: 6Q4B acv HQX
related: 1bBr oUQ GZs
related: 5h4j h71 Rrt
related: epLc SkD cbT
related: LFFX Diz 2K3
related: 8zpq 43U uqu
related: EnAW ooR VZm
related: xkRt USi 4Vf
related: BixD 3pV 3j4
related: bh3H Y3h 5eD
related: S98A faV Fv9
related: nmrJ 1oT pS6
related: Ahzh gPy U1Z
related: wdpz 889 pxe
related: TH5y 7gL xRq
related: BcZ6 XzA 1Dg
related: C96f zEZ wpK
related: Wf5J uHi 8Zm
related: McdQ sB2 G7m
related: kJ7N xSJ N4S
related: N3FV bZL trv
related: 7rbq Z33 F4M
related: yp3b Khh wZq
related: nivq PzL Z33
related: ePv1 PHu gQq
related: 9CDu 7kS yYT
related: ztYA yMf cT8
related: sK9r 3ya BBi
related: 1qN3 6wF AQA
related: uc75 iiG N9M
related: YB8B pZs QC8
related: Rp7z M8u zDy
related: GSV3 kbW drS
related: Jvk5 seG CBf
related: s1fe J3N UKE
related: MUHU JoK nmF
related: ewUf ZQU 8hJ
related: b5Q4 oTf sqW
related: 1FJA 5cV NEd
related: Snmb ofx uHB
related: L1dq KmX dT8
related: qJVY Fam GsL
broad match: C1221

Mimare
type: Concept
in scheme: JobTech Taxonomy - Yrke
definition: Mimare
broader: Skådespelare
related: 8too bEs 7NU
related: 9puE nYg crq
broad match: C2655

Massörer och massageterapeuter
type: Concept
in scheme: JobTech Taxonomy - Yrke
definition: Masserar kroppens mjukdelsvävnader för att motverka spänningar och andra lindriga besvär. Behandlar specifika besvär med hjälp av massageterapeutiska metoder. Ger även behandling i förebyggande syfte.
broader: Skönhets- och kroppsterapeuter
related: QG4M 4KN ZiM
related: 4QAE wtY gJh
related: WNdB GYA x1T
related: RWnc ghf C2s
related: bde5 38D zDK
related: ZRan cZZ rCH
related: kcCV THw sxH
related: wTR3 bjG B6G
related: Qecp WbB vyj
related: vHaL 11u eEi
related: GQ9E 49a gD8
related: 854B a1L phG
related: KK7X jyg vTb
related: Gstq 4UH 9na
related: C3255
related: aoVs Qfu U3j
related: conm 1kb kGK
related: Pk1y cpM ZhC
related: yTVh vYt 9WY
narrower: Massageterapeut
narrower: Massör
narrower: Medicinsk massageterapeut
broad match: Uuf1 GMh Uvw

Övriga administrations- och servicechefer
type: Concept
in scheme: JobTech Taxonomy - Yrke
definition: Formulerar och ansvarar för mål och strategier inom annan administrations- och serviceverksamhet på övriga stabs- och specialistfunktioner. Utformar riktlinjer, följer upp och utvärderar verksamheten mot uppsatta mål. Svarar för budget samt fördelar resurserna inom verksamheten. Har personalansvar.
broader: Övriga administrations- och servicechefer
related: C1219
related: s5SS 7bW 1Gh
related: UFfC aC2 MiC
related: YS7V c8n MrS
related: G7Qq r7L 5Jo
related: Cy2v Pnm 97P
related: UH9g R5v MCx
related: SmZd Jaa BeY
related: 29MP yhF mjx
related: 8tYq EXD Xwm
related: ZzN5 m7B 5CY
related: Nksx 4oe fEQ
related: eThQ HCv mY6
related: 5PjX 999 uLZ
related: X9Kc p8a 1FB
related: Gt5f wdi FSJ
related: q7Mx gjU F9q
related: D6ev Zwt x83
related: zXNU zXR hGd
related: stf1 dHR XDT
narrower: Tvättchef
narrower: Administrativ chef
narrower: Kundtjänstchef
narrower: Säkerhetschef
narrower: Kvalitetschef
narrower: Städchef
narrower: Miljöchef
broad match: bh3H Y3h 5eD

Forskare, immunologi
type: Concept
in scheme: JobTech Taxonomy - Yrke
definition: Forskare, immunologi
broader: Cell- och molekylärbiologer m.fl.
related: kJeN wmw 9wX
related: TXx8 Mgv BGZ
broad match: C2131

Rampagent
type: Concept
in scheme: JobTech Taxonomy - Yrke
definition: Rampagent utför markservice vid flygplatsens ramper i samband med flygplans ankomst och avgång. Arbetsuppgifterna inkluderar bland annat att rangera flygplan, koppla markström samt hantera bagage och frakt vid lastning och lossning. Rampagenter kan även medverka vid in- och utcheckning av passagerare samt assistera vid passagerarservice vid flygplansdörr. Arbetet kan även innebära enklare tekniskt underhåll av markutrustning samt kontroll och rapportering av eventuella brister. Arbetsuppgifterna varierar beroende på flygplatsens trafik och kan vara mer inriktade på logistiskt och/eller administrativt arbete. Se även yrkena Flygplatstekniker och Flygplanslastare. Källa: Flygtorget, Arbetsförmedlingen
broader: Transportledare och transportsamordnare
related: h6vP 5QN h2R
related: ASGV zcE bWf
related: kqPC 8rr d2H
related: 4CDT dvj oB2
broad match: C4323

Jaktkonsulent/Viltkonsulent
type: Concept
in scheme: JobTech Taxonomy - Yrke
definition: Jaktkonsulent/Viltkonsulent
alternative label: Jaktkonsulent
alternative label: Viltkonsulent
broader: Specialister och rådgivare inom skogsbruk
related: WGAZ xaM gUE
related: VuuL 7CH adj
broad match: C2132

Lackerare
type: Concept
in scheme: JobTech Taxonomy - Yrke
definition: En lackerare applicerar färg eller lack på olika material och objekt, såsom bilar, möbler, eller industriprodukter. De förbereder ytan, applicerar lacken och ser till att den är jämn och hållbar. Lackeraren kan arbeta med metall, plast, trä, glas och andra material. Beroende på bransch kan lackerare arbeta med traditionell våtlackering, pulverlackering eller andra specialtekniker. Källa: Arbetsförmedlingen
broader: Lackerare och industrimålare
related: JUKE 7BR esh
related: srMW hR5 UxY
related: Vh8d 3gj SQ6
related: gHPg qgB 9z5
related: wTEr CBC bqh
broad match: C7132

Rättssociolog
type: Concept
in scheme: JobTech Taxonomy - Yrke
definition: Rättssociolog
broader: Arkeologer och specialister inom humaniora m.m.
related: X82t awd Qyc
broad match: C2632

Manuella ytbehandlare, trä
type: Concept
in scheme: JobTech Taxonomy - Yrke
definition: Applicerar manuellt färg eller lack på trä eller träbaserat skivmaterial.
broader: Ytbehandlare, trä och möbelsnickare m.fl.
related: Qg8J Y3i sW3
related: kPkd Eqr TQV
related: SxZy 3gn xFg
related: Z3nB Ecc B6h
related: wn7T k1d TBe
related: 22JT eUQ XPo
related: UPx7 WPj h9V
related: C7521
narrower: Manuell ytbehandlare inom trä
broad match: PaxQ o1G wWH

Mätartekniker VA
type: Concept
in scheme: JobTech Taxonomy - Yrke
definition: Mätartekniker VA Mätartekniker VA byter och installerar vattenmätare hos kunder. Arbetet ofta utförs i form av ensamarbete. Tillhörande arbetsuppgifter är även besiktning av mätarplatser, inläsning av vattenmätare, kundkontakt, egenkontroll och att dokumentera och återrapportera utfört arbete. Källa: Arbetsförmedlingen
broader: Övriga montörer
related: NvyJ JYY 1DP
related: wTEr CBC bqh
broad match: C8219

Naprapater, sjukgymnaster och arbetsterapeuter m.fl.
type: Concept
in scheme: JobTech Taxonomy - Yrke
definition: Naprapater, sjukgymnaster och arbetsterapeuter m.fl.
broader: Yrken med krav på fördjupad högskolekompetens inom hälso- och sjukvård
narrower: Arbetsterapeuter
narrower: Fysioterapeuter och sjukgymnaster
narrower: Kiropraktorer och naprapater m.fl.

Produktionschefer inom tillverkning
type: Concept
in scheme: JobTech Taxonomy - Yrke
definition: Produktionschefer inom tillverkning
broader: Chefer inom IT, logistik, FoU, fastighetsbolag, bygg- och ingenjörsverksamhet samt tillverkning m.m.
narrower: Produktionschefer inom tillverkning

Skogsvårdare
type: Concept
in scheme: JobTech Taxonomy - Yrke
definition: Skogsvårdare, även kallat skogsarbetare, utför praktiskt skogsvårdsarbete som röjning, plantering, markberedning och viss avverkning. Arbetet innebär i huvudsak att utföra skogsvård i syfte att maximera avkastning vid senare avverkning. De främsta arbetsuppgifterna är plantering av ny skog och röjning i ungskog för att ge plats åt planterad skog. Det är även vanligt att jobba med linjeröjning, där man röjer skog under kraftledningar. Röjning sker främst med röjsåg. Plantering sker främst manuellt, dock förekommer planteringsmaskiner. Det kan även förekomma avverkning med hjälp av motorsåg, dock sker den mesta avverkningen med skogsmaskiner. Arbetet utförs utomhus och sker oftast säsongsvis. Källa: Gröna arbetsgivare, Arbetsförmedlingen
broader: Skogsarbetare
related: VcZy DAE rQD
related: J1Se aEE vWa
related: kAFH 2qe GTm
related: UdVa jRr 9DE
related: kP3a 1g8 fni
related: DmY4 87J e5y
related: CfGF Umv ShT
related: pHGA gXs 4NY
related: wMpW 8AK fHg
related: U4ET ck7 bSy
related: 69ss pvW 35L
related: C3bo Wxs 4UR
related: eG6G G6K f7q
related: VuuL 7CH adj
related: 3CtV K2V 196
related: Vpsi Zi3 RS2
related: pbud qPJ Yjr
broad match: C6210

Ingenjörer och tekniker inom kemi och kemiteknik
type: Concept
in scheme: JobTech Taxonomy - Yrke
definition: Utför tekniskt arbete i samband med kemiteknisk produktion. Organiserar, leder och samordnar det praktiska arbetet vid tillverkning av petroleumprodukter, kemikalier, kemiska och kemitekniska produkter, läkemedel, syntetiska material eller livsmedel. Utför kvalitets- och produktionskontroller av kemiska och kemitekniska produkter under produktionsprocessen. Hit hör inte Civilingenjörsyrken inom kemi och kemiteknik (2145)
broader: Ingenjörer och tekniker
related: mg8h fe2 kDM
related: GmNx Ekz 81r
related: uvcb DuX NW8
related: pqjF 8wN GsW
related: BvCR wvx Bpa
related: 48zu t6j A28
related: tg8L maz wMN
related: sA2V erA 3WN
related: HBEU dvp 7ZD
related: 7GaA 87a uE5
related: D14A syC i23
related: 74Mw JUN VKx
related: Nwrk 3XY Yur
related: YK2s pxn YWW
related: AQtr C7f Dyt
related: krCG SCu myw
related: NtWF zFu Mhg
related: bwYY qC7 5xE
related: ttnn 9Wu FSU
related: b79m VmW U5U
related: kJCx vqk SQG
related: Bh9h t3B M8h
related: jSAi QKc JQk
related: uwev L2n fpz
related: C3119
related: irPd z5v 2o1
related: VQHQ ScF Fr5
related: WBAe 1rD 5JT
related: ZzN5 m7B 5CY
related: MuoH pDL nFJ
related: 8cdE rAR qFH
related: a1Sf mey gVk
related: G2E9 yG4 zBW
related: 2rqG WLp em4
related: DYdu bfN 4Fh
related: Q6DB h8V mc7
related: GKfd eHz HWB
related: DMim Tzk 2j4
related: NxTN 57S Apf
related: 3i6s BB6 E3X
related: AepF hH2 pT7
related: Rf1n 6Sj exu
related: DnL5 sXM WRb
related: PEty jNu Uqd
related: W4er Syp Wrt
related: nkor VBn U64
related: j3WM Z14 jh2
related: G84U eAD CiF
related: FdP3 vbh FBs
related: rbHc QBR 3NU
related: C3116
related: NB2C zFs C9F
related: o55U zgY GQF
related: Y197 2oc uoE
related: BGJc YEv aPK
related: S4Ku uT7 yuV
related: CTFz 4VM y5H
related: 4y7C Lsh EPM
related: 3Sj1 uuL y1A
related: wZpC X9a xzG
related: MT1a Nyq DGQ
related: 3zgs 61Q etM
related: h6Tu oFS KDH
related: 7xYo gc8 9Bm
related: Bbj8 8y7 XJ5
narrower: Ostmästare
narrower: Processingenjör, kemiteknik
narrower: Kemitekniker
narrower: Projektledare, kemiteknik
narrower: Kemiingenjör
narrower: Livsmedelstekniker
narrower: Valideringsingenjör
narrower: Planeringsingenjör, kemiteknik
narrower: Produktionsingenjör, kemi
narrower: Kontrolltekniker, kemiteknik

Emaljerare, lackering
type: Concept
in scheme: JobTech Taxonomy - Yrke
definition: Emaljerare, lackering
broader: Lackerare och industrimålare
related: srMW hR5 UxY
related: wTEr CBC bqh
broad match: C7132

Chefssekreterare och VD-assistenter m.fl.
type: Concept
in scheme: JobTech Taxonomy - Yrke
definition: Bevakar, förbereder, samordnar och följer upp ärenden och beslut som stöd till chefer, ledningsgrupp och koncernledning m.fl.. Förbereder rapporter. Medverkar vid utredningsarbete. Förbereder och arrangerar styrelsemöten, konferenser och liknande. Upprättar protokoll, gör sammanfattningar och översättningar.
broader: Juristsekreterare, chefssekreterare och institutionssekreterare m.fl.
related: xSLo P6B 2AF
related: DJgq zBj bKt
related: aUr6 Rjg ja2
related: uA7X Pqn n9a
related: 3HjW 1BP k3S
related: 3vYj Rhf Voh
related: Uv9y v2g efa
related: Tmps QPE g3V
related: wKHJ NDQ sSg
related: Go6N bBn 7eM
related: SmZd Jaa BeY
related: QAaJ QeY Q6P
related: NUC3 y1C Scg
related: detQ YNb 9nG
related: cw2M p2W SuJ
related: h7ke CYq RNF
related: dYqT JBz NZE
related: 5wab aFK gdL
related: PVnT yGT SMb
related: qtHa AsU Cfo
related: 8gwE 2o3 XRF
related: Nig2 2pU GT8
related: C3343
related: LmAP e75 pc6
related: 7scD 9YP iwV
related: 4rSF Rqo pDj
related: jcpA Zfs nSz
related: RB7E jE5 MZ3
related: mD1c 2NB pDo
related: X7EA xho HYr
related: 2ZFC 6de YSB
related: NMZ1 bCs WcR
related: U2Vq X6J y3o
related: B1rc wCc vne
related: w8bU wHe omF
related: 73gL 4uv p9J
related: 8u7A ze1 bvd
related: 6Ei3 fZV YKM
related: DSzS seq uep
narrower: Direktionssekreterare
narrower: Chefssekreterare
narrower: VD-assistent
broad match: X82t awd Qyc

Stenhuggare m.fl.
type: Concept
in scheme: JobTech Taxonomy - Yrke
definition: Klyver sten till hällar eller block. Hugger, sågar, slipar och putsar sten samt graverar inskriptioner m.m. i sten.
broader: Malmförädlingsyrken och brunnsborrare m.fl.
related: VPF1 UZM 9Kd
related: qQ61 EQR rcz
related: VTwt 5Fe 6bW
related: Q7eC B7g QiU
related: fhcp fFw Lbj
related: ykyf hFy V5o
related: 7Dcw f63 U9c
related: Vm4m BKv ViX
related: C7113
related: YZNe wKk Di2
related: jZs6 RHz HE7
related: WVkV JPj TWW
related: rwir xvu 443
related: NoNy o7q jCt
narrower: Stenhuggare
narrower: Stengravör
broad match: wTEr CBC bqh

Kustbevakningstjänsteman
type: Concept
in scheme: JobTech Taxonomy - Yrke
definition: Kustbevakningstjänsteman, eller kustbevakare, övervakar och skyddar Sveriges hav och kuster samt bidra till trygghet och miljöskydd i den maritima miljön. Huvudsakliga arbetsuppgifter omfattar patrullering till sjöss, på land och i luften, tillsyn och kontroll av sjötrafik, miljöskydd, fiskerikontroll och gränsövervakning. Arbetet innebär att operativt delta i räddningsinsatser och sjöräddning, hanteraa miljöbrott, genomföra ordningshållning och nykterhetskontroll samt bistå andra myndigheter. För anställning som kustbevakningstjänsteman genomgår man först Kustbevakningens grundutbildning. Under utbildningstiden är man anställd som aspirant. Källa: Kustbesvakningen
broader: Tull- och kustbevakningstjänstemän
related: qVXs LDq m2T
related: vyvB Ekh zmU
related: E7hm BLq fqZ
related: XHQ7 d9G NX3
related: 8Czx SJ7 c2v
related: qVv9 BAz JPq
related: gf5m uU7 9Ev
broad match: C3351

Produktionsledare glasbruk
type: Concept
in scheme: JobTech Taxonomy - Yrke
definition: Produktionsledare vid glasbruk leder arbetet med att tillverkar glasprodukter. Yrket kallas traditionellt hyttmästare. Man är ansvarig för produktionen vid ett glasbruk, även kallat glashytta, och leder det dagliga arbetet. Arbetet kan innebära att leda glasbruksarbetare, planera produktion och samordna underhåll av utrustning. Då tillverkning av glasprodukter vid glasbruk är ett hantverk så kan det vara en fördel att som produktionsledare ha en bakgrund som just glasbruksarbetare eller glasblåsare. Källa: Arbetsförmedlingen
broader: Musikinstrumentmakare och övriga konsthantverkare
related: epLc SkD cbT
related: PaxQ o1G wWH
related: DF9P 3mU qgb
broad match: C7315

Forskningsassistent, medicin
type: Concept
in scheme: JobTech Taxonomy - Yrke
definition: Forskningsassistent, medicin
broader: Farmakologer och biomedicinare
related: kJeN wmw 9wX
related: esAo 5sX FPv
broad match: C2131

Läderhantverkare och skomakare
type: Concept
in scheme: JobTech Taxonomy - Yrke
definition: Avlägsnar kött, fett och hår från hudar. Bereder skinn för vidare användning. Garvar hudar genom kalkhusbehandling och spaltning. Hanterar maskiner för att dela hudar samt färgar och mjukar upp skinn. Tillverkar och reparerar skor, väskor, sadeltyg m.m. Gör mönster för att skära till sko- och sadeldelar, väskor, sport- och andra läderartiklar. Syr läder för hand eller på maskin.
broader: Skräddare, tapetserare och läderhantverkare m.fl.
related: f4z4 xDq bgg
related: L6sX 6nz FWg
related: 96TG 2cE NXY
related: 2yhN g8M WEo
related: Qg8J Y3i sW3
related: 5Sc6 JQW zbn
related: oaiv GsB AFK
related: k7YN Mmw 9Jh
related: 97aC LwV vea
related: 8eK7 ZQ7 upn
related: Kvc2 MPw tDi
related: uYmk 6VP j5Q
related: f5p6 LXp BAe
related: y9g1 Lm5 i5F
related: xxt5 wdH nFF
related: a86X VWZ DXP
related: PL1m xg5 QsL
related: L5BY ziJ qrZ
related: C7535
related: S4U7 K1s E7T
related: TizZ 6Wj Muw
related: CaRJ bRy pph
related: k1Rq EmU nbj
related: sxMZ 4Da Nwi
related: CKwg hzY XHS
related: yQUA ck9 2Ji
related: 2XGY TET niQ
related: pkE6 SNq Cvn
related: GpSA U5b LJx
related: Z3nB Ecc B6h
related: fZdB Mjb SSR
related: wBu8 sKV SiA
related: haMy QRx 7vg
related: vFfP 5jY SZG
related: ePue 7yE CHV
related: deVk ZDQ ipg
related: bweS sFR YLG
related: A6KV 87q pH5
related: C7536
related: nze1 zrD 3NS
narrower: Garvare
narrower: Sadelmakare
narrower: Skomakare
narrower: Ortopedskomakare/Ortopedskotekniker
narrower: Väskmakare
broad match: PaxQ o1G wWH

Klubbledare, golf
type: Concept
in scheme: JobTech Taxonomy - Yrke
definition: Klubbledare, golf
broader: Chefer inom friskvård, sport och fritid
related: yKuQ 64w 1eK
related: epLc SkD cbT
related: bh3H Y3h 5eD
broad match: C1431

Antagningschef, utbildning
type: Concept
in scheme: JobTech Taxonomy - Yrke
definition: Antagningschef, utbildning
broader: Chefer inom grund- och gymnasieskola samt vuxenutbildning
related: LW5h eP5 Vmn
related: epLc SkD cbT
related: bh3H Y3h 5eD
related: MVqp eS8 kDZ
broad match: C1345

Jungman
type: Concept
in scheme: JobTech Taxonomy - Yrke
definition: Jungman är en nybörjarbefattning på ett fartygs däcksavdelning. Vanliga arbetsuppgifter är underhåll såsom att måla, knacka rost och hålla rent på däck. För att arbeta som jungman krävs Basic Safety Källa: Satsa på sjöfart
broader: Matroser och jungmän m.fl.
related: dRFw Rcu dX7
related: gs65 ynn fcr
related: ASGV zcE bWf
related: XouD cCj HZN
related: QQJR 11D LXL
related: 2qb8 QPM n4x
broad match: C8350

Driftchef, VA
type: Concept
in scheme: JobTech Taxonomy - Yrke
definition: Driftchef, VA
broader: Produktionschefer inom tillverkning
related: epLc SkD cbT
related: 6Z12 Bf7 jDn
related: bh3H Y3h 5eD
broad match: C1321

Planerare och utredare m.fl.
type: Concept
in scheme: JobTech Taxonomy - Yrke
definition: Planerar, utreder och handlägger ärenden inom offentlig sektor, företag och organisationer. Utarbetar rapporter, utredningar m.m. Utformar direktiv och förordningar samt utövar tillsyn.
broader: Organisationsutvecklare, utredare och HR-specialister m.fl.
related: xSLo P6B 2AF
related: pni3 zFs Gzi
related: eTW8 AY5 tpe
related: DJgq zBj bKt
related: N4f3 cLE ygk
related: q6QD 6et rcJ
related: E13X ZF3 PAb
related: TuP9 SAc iMs
related: BAs6 jRM 7NP
related: vews zHq Dtu
related: gx8F mte Nm5
related: dDxe fWR Q5Y
related: zkwp b3X jLZ
related: 1edh QbR mg1
related: Kf1r uu8 QDW
related: D14A syC i23
related: CC5H NPf YCZ
related: AVfY mxB iyd
related: wLYv Pyd uSZ
related: aUr6 Rjg ja2
related: TKBk pkx 4He
related: bdQe ReZ Bs4
related: TSpk V3M 58x
related: BQqf 7nu gN5
related: seBy 4Nc c2M
related: kjop UjM GNT
related: zF7h 2Ao sLY
related: DCdD xEr 7ZA
related: WteW WcE Qdn
related: AQtr C7f Dyt
related: h6B2 Egm LWp
related: LLQd jDh gdd
related: 3HjW 1BP k3S
related: Lgt7 qRk rKG
related: cDU5 op5 Tuk
related: 3vYj Rhf Voh
related: E9LX 1eF jDB
related: BKRi T8q VUy
related: JNqq 4GY 5Kc
related: MrnB onr FxX
related: Uv9y v2g efa
related: Tmps QPE g3V
related: hcdL zcK zgq
related: wKHJ NDQ sSg
related: U86s CAP Vwa
related: QRj4 BE5 bEA
related: RNB5 tQp hYD
related: Zfjb CRB 2ii
related: awjU C3D XEJ
related: UH9g R5v MCx
related: Go6N bBn 7eM
related: SmZd Jaa BeY
related: Mw7Y 2pY itu
related: G7so 7Ax 7dW
related: 7ynT 9mC a1o
related: edrF hXV qd9
related: QAaJ QeY Q6P
related: azTh 4zW Tfb
related: uGaX 6vC 5Tq
related: Veoy TRu rDY
related: EboV hrY Y9z
related: CJPH hHQ BbU
related: gGHM b8u jy7
related: X9oL 76D P7S
related: NUC3 y1C Scg
related: cxt1 3BX KJ3
related: VYe2 qzs YBD
related: 9jJ4 gL1 wjS
related: WLAT dbx 43x
related: C2422
related: G2E9 yG4 zBW
related: cw2M p2W SuJ
related: swyJ kkJ zHd
related: qWYC L13 rqj
related: m5yx wHx kVR

Civilingenjör, forskning och utveckling, kemi
type: Concept
in scheme: JobTech Taxonomy - Yrke
definition: Civilingenjör, forskning och utveckling, kemi
broader: Civilingenjörsyrken inom kemi och kemiteknik
related: CpFD aoS pkZ
related: 6Hq3 tKo V57
related: xPXZ WfS Pqs
related: fM7t axJ RNN
broad match: C2145

Kreditchef
type: Concept
in scheme: JobTech Taxonomy - Yrke
definition: Kreditchef
broader: Finansanalytiker och investeringsrådgivare m.fl.
related: X82t awd Qyc
related: epLc SkD cbT
related: bh3H Y3h 5eD
related: JhwH y3f 7Pp
related: eBQs p5w Jkj
broad match: C2413

Övriga specialister inom hälso- och sjukvård
type: Concept
in scheme: JobTech Taxonomy - Yrke
definition: Utför annat specialistarbete inom hälso- och sjukvård än inom 2241-2284. Exempel på arbetsuppgifter: Behandlar, rehabiliterar och arbetar förebyggande med hjälp av bild-, dans- och musikterapi. Diagnostiserar och behandlar sjukdomstillstånd och skador i fot och vrist.
broader: Andra specialister inom hälso- och sjukvård
related: mxzF E88 mBS
related: 4QAE wtY gJh
related: C2269
related: C1qR L83 nzh
related: YyAn TSP sqk
related: nF96 5Ky TaX
related: GeeT jCR c55
related: wBPu wTW RgG
related: rF7s hX1 ECH
related: rVUL AgV ZTH
related: aoVs Qfu U3j
related: 5Kym 2ad Pqi
related: HqA6 3Uz Fim
related: yV9B PxJ TxS
narrower: Bildterapeut
narrower: Dans- och rörelseterapeut
narrower: Musikterapeut
narrower: Podiatriker
broad match: NYW6 mP6 vwf

Yrken med krav på högskolekompetens eller motsvarande inom kultur, friskvård och socialt arbete m.m.
type: Concept
in scheme: JobTech Taxonomy - Yrke
definition: Yrken med krav på högskolekompetens eller motsvarande inom kultur, friskvård och socialt arbete m.m.
broader: Yrken med krav på högskolekompetens eller motsvarande
narrower: Trafiklärare och instruktörer
narrower: Köksmästare och souschefer
narrower: Fotografer, dekoratörer och underhållningsartister m.fl.
narrower: Idrottsutövare och fritidsledare m.fl.
narrower: Behandlingsassistenter och pastorer

Driftledare, skogsbruk
type: Concept
in scheme: JobTech Taxonomy - Yrke
definition: En driftledare inom skogsbruk ansvarar för att planera, leda och övervaka alla aktiviteter inom skogsbruket, från plantering till avverkning, med fokus på hållbarhet och effektivitet. De leder ofta förmän och andra skogsarbetare och säkerställer att arbetet utförs enligt plan och med god ekonomisk hushållning. Driftledaren ansvarar för budgetering, kostnadskontroll och ekonomisk uppföljning av skogsbruksverksamheten samt kontakter med entreprenörer. Källa: Arbetsförmedlingen
broader: Förvaltare inom skogsbruk och lantbruk m.fl.
related: nunA gH3 P1A
related: epLc SkD cbT
related: bh3H Y3h 5eD
related: VuuL 7CH adj
broad match: C1311

Konferenstolk
type: Concept
in scheme: JobTech Taxonomy - Yrke
definition: Konferenstolk
broader: Översättare, tolkar och lingvister m.fl.
related: cspa Mji BMS
related: 9puE nYg crq
broad match: C2643

Kammarrättsråd
type: Concept
in scheme: JobTech Taxonomy - Yrke
definition: Kammarrättsråd är ordinarie domare i kammarrätt och leder processer för att lösa tvister och överklagade mål från förvaltningsrätt. Arbetsuppgifterna omfattar bedömning av rättsutredningar, förberedelse och ledning av muntliga och skriftliga förhandlingar, granskning av rättsliga handlingar samt utskrift och motivering av domar och beslut. Kammarrättsråd deltar i kollegiala överläggningar och bidrar till rättsutvecklingen genom att tolka och tillämpa lagstiftning samt ibland handleda jurister under domarutbildning. Källa: Sveriges Domstolar, Arbetsförmedlingen
broader: Domare
related: X82t awd Qyc
related: x4Wi NWW ogB
related: Abcb QtH isZ
broad match: C2612

Tolk
type: Concept
in scheme: JobTech Taxonomy - Yrke
definition: Person som förmedlar budskap från ett språk till ett annat. Källa: SKR
broader: Översättare, tolkar och lingvister m.fl.
related: cspa Mji BMS
related: C8cN 6iW WMK
related: 9puE nYg crq
broad match: C2643

Maskinställare och maskinoperatörer, metallarbete
type: Concept
in scheme: JobTech Taxonomy - Yrke
definition: Sköter, styr och övervakar hel- och halvautomatiska maskiner som bearbetar arbetsstycken av metall eller liknande material genom borrning, hyvling, svarvning, fräsning, gängning, slipning, svetsning m.m. Programmerar datorstyrda maskiner och korrigerar program. Sköter maskiner som bearbetar och skär material med hjälp av elektroner. Hanterar maskiner som formar detaljer i metall genom pressning eller tryck samt maskiner som kapar eller klipper metallprodukter. Sätter upp, utprovar och besiktigar verktyg. Ställer in och programmerar hel- och halvautomatiska verktygsmaskiner. Hit hör inte Slipare, metall (7224) Svetsare, manuell (7212)
broader: Smeder och verktygsmakare m.fl.
related: 7BLR UdA oiZ
related: i4y8 sr5 g6C
related: JmTk vXN ksH
related: gj5K CAe FpZ
related: aM9L n2B mtR
related: VPF1 UZM 9Kd
related: fSBi ZAL sKa
related: y8M5 vpU yt5
related: nuYb r64 qWu
related: SpwW ay8 Uhm
related: AJAF z5q aGF
related: 5gQS Mcn CRF
related: QKL2 ZLc RRt
related: hwJw 92N rLF
related: 2t7B z1Z NcY
related: GFYD 6fX eZS
related: vt7F XTv 7ED
related: WK5N 8ga bTa
related: ufwM PQ7 99m
related: myAP hPr RFe
related: 9nyH icP Qxt
related: 6feF emv eji
related: 74Mw JUN VKx
related: aHCV VsV LiD
related: 2pjc Vto TGH
related: cmgQ Dgs rmz
related: P7h9 sUt cBp
related: FfhY CoE CpR
related: fgNG pGF 8Tf
related: JUBC Mjj 5Nx
related: FZ7v EmJ oRh
related: aGwd yZq fa4
related: KnpQ pxH wq3
related: pGts PKK c8W
related: qyUS nX3 pGH
related: YVaz 9nR 6NM
related: dovR WDN GGg
related: 8RLp 6Gm 6iF
related: BMYx 57E ESj
related: qQ61 EQR rcz
related: VTwt 5Fe 6bW
related: 7CsQ uUz orf
related: TFJg 3Y4 j2Z
related: HBAX FbP Dhy
related: B8dd RVE soo
related: nENq mKD Z6w
related: Fi1s 3mF Gbs
related: 6a3Q g19 3aE
related: cpPa vTq Vwu
related: a3ff S1X fxb
related: g9fz tss KwV
related: 3kUD mXT Lar
related: KDzy Hra iVr
related: ebqG pcR 9mW
related: brda 5pJ 8cu
related: G3Mh g5z tAz
related: JFDz Uyg Nmy
related: RWx1 fdJ QXA
related: xWdL JUZ Tfr
related: THYW 6v8 ZeD
related: xsv5 dqk LQp
related: sbYJ XwB o8X
related: r9mA wYf 3Ze
related: dcL9 q9R sNF
related: TCMk cUD 2Ye
related: SrzF GXp pFE
related: zVKm f79 DtU
related: Xa6W AB4 Et1
related: ZqZp rib 2PF
related: KAfo pqc tkS
related: yHkb fzD aYS
related: xtHZ fSd MXs
related: vXVH 94E pQD
related: SECo RtS YpB
related: J8Sg Pqv Dtd

Dirigent
type: Concept
in scheme: JobTech Taxonomy - Yrke
definition: Dirigent leder konstnärligt och musikaliskt en orkester eller annan musikensemble för att uppnå samstämmighet och uttrycksfullt framförande. Vanliga arbetsuppgifter är att tolka musikverk och dirigera musikerna eller sångarna under repetitioner och framträdanden, planera repetitioner, välja musikstycken, organisera konserter och kan ansvara för rekrytering av musiker. Källa: Arbetsförmedlingen, Kungliga Musikhögskolan
broader: Musiker, sångare och kompositörer
related: 8too bEs 7NU
related: 9puE nYg crq
broad match: C2652

Museitekniker
type: Concept
in scheme: JobTech Taxonomy - Yrke
definition: Museitekniker
broader: Ljus-, ljud- och scentekniker
related: 9puE nYg crq
related: yhCP AqT tns
related: d1Ao 9bY 7Kn
broad match: C3433

Stenmontör
type: Concept
in scheme: JobTech Taxonomy - Yrke
definition: En stenmontör lägger golv, sätter trappor och monterar fasader av natursten såsom marmor, granit, skiffer, sandsten och kalksten. Stenmontören arbetar med både nyproduktioner och renovering av historiska miljöer. Det krävs stor hantverksskicklighet att sätta komplicerade stenmaterial i hallar, trapphus och öppna ytor. Stenmontören kan ansöka om sitt yrkesbevis efter teoretisk grundutbildning och lärlingsanställning. Källa: BYN
broader: Murare m.fl.
related: j7Cq ZJe GkT
related: Zko3 gps YY9
related: ja7J P8X YC9
broad match: C7112

Perfusionist
type: Concept
in scheme: JobTech Taxonomy - Yrke
definition: Medicinskt utbildad person som sköter hjärt-lungmaskinen under operation. Källa: SKR
broader: Tekniker, bilddiagnostik och medicinteknisk utrustning
related: 6Hq3 tKo V57
related: QZhP xR2 SsZ
broad match: C3211

Tapetserare
type: Concept
in scheme: JobTech Taxonomy - Yrke
definition: Stoppar och klär möbler.
broader: Skräddare, tapetserare och läderhantverkare m.fl.
related: L6sX 6nz FWg
related: MXzz Qay NNV
related: Qg8J Y3i sW3
related: XnWT CPG QU4
related: C7534
related: f5p6 LXp BAe
related: P6jT XQS f4Z
related: ASht i6X E6T
related: pvuA or6 TLK
related: nc3s Hbk kuS
related: qS9D smT F43
related: MiDr iJa gPn
related: 2XGY TET niQ
related: Z3nB Ecc B6h
related: r4FG ubQ jC9
related: wBu8 sKV SiA
related: bjR9 Fnc WkH
related: MozF eKp Lbr
related: A6KV 87q pH5
narrower: Möbeltapetserare
narrower: Bilsadelmakare
broad match: PaxQ o1G wWH

Vindkraftsprojektör
type: Concept
in scheme: JobTech Taxonomy - Yrke
definition: Vindkraftsprojektör
broader: Specialister inom miljöskydd och miljöteknik
related: kJeN wmw 9wX
related: 4ff1 4gB Dew
broad match: C2133

Databasanalytiker
type: Concept
in scheme: JobTech Taxonomy - Yrke
definition: Databasanalytiker
broader: Mjukvaru- och systemutvecklare m.fl.
related: apaJ 2ja LuF
related: KT6P hVH LRD
broad match: C2512
broad match: C2521

Energi- och klimatrådgivare
type: Concept
in scheme: JobTech Taxonomy - Yrke
definition: Energi- och klimatrådgivare arbetar med att stödja och vägleda hushåll, företag och organisationer i frågor om energieffektivisering, förnybar energi och klimatsmarta lösningar. Energi- och klimatrådgivning är en opartisk och kostnadsfri service som erbjuds av kommuner till kommuninvånare. Den kommunala energi- och klimatrådgivningen finansieras helt eller delvis med bidrag från Energimyndigheten. Arbetsuppgifter innefattar rådgivning om energianvändning, hjälp med att förstå tekniska möjligheter som solceller, elbilsladdning och energilagring samt att inspirera till förändrade beteenden och hållbara investeringar. Rådgivaren samverkar med kommunala aktörer, myndigheter och företag för att främja energieffektivitet och minska klimatpåverkan. Källa: Energimyndigheten, Arbetsförmedlingen
broader: Brandingenjörer och byggnadsinspektörer m.fl.
related: 3mJY EDo EV6
related: s79E jJu Gca
related: E7hm BLq fqZ
related: j7Cq ZJe GkT
related: fNmA q8R yhb
related: n2e6 xLC p9n
related: N7Dy ZY8 vvr
related: uY2H o7H MZL
related: wqxr J1S hW7
broad match: C3112

Barnmorskestuderande
type: Concept
in scheme: JobTech Taxonomy - Yrke
definition: Barnmorskestuderande är en student som utbildar sig till barnmorska. Vanliga arbetsuppgifter är att assistera vid graviditetskontroller, delta i förlossningsvård, ge information om amning och preventivmedel samt medverka vid gynekologiska undersökningar. Källa: Arbetsförmedlingen, Saco, Svenska Barnmorskeförbundet, Sveriges Kommuner och Regioner
broader: Barnmorskor
related: NYW6 mP6 vwf
broad match: C3222

Maskinsäljare inom entreprenad
type: Concept
in scheme: JobTech Taxonomy - Yrke
definition: Maskinsäljare inom entreprenad arbetar med försäljning av anläggningsmaskiner såsom grävmaskiner, hjullastare och kompaktlastare till bygg- och entreprenadföretag. Arbetsuppgifterna inkluderar kundbesök, maskindemonstrationer, offertarbete samt koordinering av leverans och service. Maskinsäljare inom entreprenad har vanligtvis goda kunskaper om maskinteknik och anläggningsteknik. Källa: Arbetsförmedlingen
broader: Butikssäljare, fackhandel
related: MupF Q4P Tbx
related: 9UMb YrF cfT
related: UM5z 1bx 5rf
related: rDcj Tao TJJ
related: RPTn bxG ExZ
related: 7SpX iHz EjF
related: UmT9 H8c gvw
broad match: C5223

Djurskötare lantbruk
type: Concept
in scheme: JobTech Taxonomy - Yrke
definition: Djurskötare inom lantbruk arbetar med daglig skötsel av lantbrukets hussdjur, såsom kor, grisar, får eller fjäderfä. Arbetsuppgifter omfattar utfodring, vattning, rengöring av stallar och utrymmen samt övervakning av djurens hälsa och välbefinnande. Djurskötare hanterar enklare vårdåtgärder, dokumenterar djurhållning och följer gällande regler för djurskydd och smittskydd. Vid tecken på sjukdom eller skada kontaktas veterinär. Arbetet kan även inkludera hantering av tekniska system för utfodring och utgödsling samt körning av traktor och andra lantbruksmaskiner vid behov. Arbetsuppgifterna kan variera beroende på djurslag och gårdens inriktning. Källa: Jordbruksverket, Gröna jobb, Arbetsförmedlingen
broader: Uppfödare och skötare av lantbrukets husdjur
related: z2Bg tPX ZwT
related: bavN dmT vAb
related: 28Gv iWB A56
related: BPG1 17H LFJ
related: J3Bk xx3 SeK
related: D3aE Gd6 6A6
related: yZxU N12 EMk
related: QKif Cnd JTf
related: CoKk d7x sCT
related: CHoN 5no bX4
related: 2Yyx 5AM Fia
related: 6fR1 QJ2 fiB
related: QunH X4z DB2
related: bv9K Xdo ZnH
related: aDrp kd9 eDT
related: FLxX Q8E ASe
related: VuuL 7CH adj
related: KmQC seo dth
broad match: C6121

Destinationsutvecklare
type: Concept
in scheme: JobTech Taxonomy - Yrke
definition: Destinationsutvecklare
broader: Planerare och utredare m.fl.
related: KykN ynK rPi
related: X82t awd Qyc
related: TZe9 NsN uce
broad match: C2422

Socialsekreterare och kuratorer m.fl.
type: Concept
in scheme: JobTech Taxonomy - Yrke
definition: Socialsekreterare och kuratorer m.fl.
broader: Yrken med krav på fördjupad högskolekompetens inom juridik, kultur och socialt arbete m.m.
narrower: Kuratorer
narrower: Övriga yrken inom socialt arbete
narrower: Biståndsbedömare m.fl.
narrower: Socialsekreterare

Ljusbordsoperatör
type: Concept
in scheme: JobTech Taxonomy - Yrke
definition: Ljusbordsoperatör
broader: Ljus-, ljud- och scentekniker
related: 9puE nYg crq
related: d1Ao 9bY 7Kn
broad match: C3435

Chefer inom övrig servicenäring
type: Concept
in scheme: JobTech Taxonomy - Yrke
definition: Chefer inom övrig servicenäring
broader: Chefsyrken
narrower: Övriga chefer inom övrig servicenäring
narrower: Chefer inom handel
narrower: Chefer inom friskvård, sport och fritid
narrower: Hotell- och konferenschefer
narrower: Restaurang- och kökschefer

Arbetsledare inom bygg, anläggning och gruva
type: Concept
in scheme: JobTech Taxonomy - Yrke
definition: Leder och fördelar arbete på arbetsplats. Bevakar att maskiner och material finns på plats och samordnar arbete med underentreprenörer. Har ansvar för att arbetet utförs enligt gällande ritningar och anvisningar och för att säkerhetsföreskrifter följs. Har visst personalansvar.
broader: Arbetsledare inom bygg och tillverkning m.m.
related: HACr 3sZ 4gm
related: tCER yDZ XnW
related: g7bY vJ5 XC8
related: Z6GN aCQ MDc
related: xEQs n1U Een
related: ah7i FKc KGU
related: 8YxM PWA RNH
related: eHy7 eMm 1mG
related: w1sp GnJ YXE
related: 61zA BvK zDd
related: n5Ww Cc9 xYG
related: 6MJf 3Va KQD
related: oaiv GsB AFK
related: QB7Z 7mE fx2
related: 11rR H3J EQQ
related: BV5y wau Zxz
related: t3fW PJW LzP
related: 74Mw JUN VKx
related: Ni4P t3u oM1
related: duiL WtX t46
related: sc9x MMP woB
related: yGy3 MAG 5hQ
related: Xpix Jg8 81T
related: C3123
related: 1JaM 2oZ iQ3
related: HPfU aG2 m9r
related: C3121
related: yMp7 AwC zqx
related: YAdb Wwj b3N
related: M3tL 3Qr oeB
related: caWZ HUm yNp
related: zRtu fYj XC4
related: Ush1 k4m xnP
related: hH5E rGv 7vN
related: jt4y g5c GXy
related: rUFy uF1 xEZ
related: M7C1 DAy UTK
related: oPP6 byU yyn
related: WXkX o6j FYv
related: ZzN5 m7B 5CY
related: 1VVe BBY rpQ
related: E67G PGy fiG
related: D6xD cSH rZN
related: MsNS 1ea u4p
related: ZPBk FiE qTG
related: ofzH ikr 67D
related: YqX1 qhL cBm
related: 9PuU gLx U7V
related: woCn NVG HCt
related: qbEp sGf jyZ
related: nF6J MNc ZxS
related: U1JW vPG Dqk
related: HPrg bZM zh2
related: fFAM jC1 ur5
related: WHbh zcN LWx
related: oDKx 7bc sfk
related: cXQR ss8 GYb
related: 76CR p4q sXc
related: eThQ HCv mY6
related: WC8m soQ muu
related: K7xh ysu tnH
related: fUac tth R4H
related: Rf1n 6Sj exu
related: rRou EUn FsL
related: W4er Syp Wrt
related: 4bwR JVU usd
related: yys9 zqj c7R
related: cMAq 57S pfD
related: Etfq CqE Da5
related: e19A nXQ Hxr
related: gdTC 3Eh PMv
related: nkor VBn U64
related: wZg2 hFD TPv
related: PU86 3ea LUQ
related: aJkj 92P Hdu

Besöksbokare/Kundbokare
type: Concept
in scheme: JobTech Taxonomy - Yrke
definition: Besöksbokare/kundbokare kontaktar potentiella eller befintliga kunder via telefon eller digitala kanaler för att boka in möten åt företagets säljare eller rådgivare. Arbetsuppgifter omfattar att identifiera och kontakta målgrupper, presentera erbjudanden, boka in besök eller möten, samt dokumentera samtal och bokningar i administrativa system. Liknande arbetsuppgifter kan förekomma i yrkena Telefonsäljare och Kundmedarbetare. Källa: Arbetsförmedlingen
alternative label: Besöksbokare
alternative label: Kundbokare
broader: Kundtjänstpersonal
related: ZvSr 7nf Vxg
related: KB54 gKV ar3
related: UdVa jRr 9DE
related: c7Fv RUF AFR
related: 4CRH Moe 44E
related: toTh 3hU nM1
related: CoV1 4wb zE2
related: RPTn bxG ExZ
related: 7jbm hNw UBZ
related: yRCN doP hfd
related: w652 2sn vj1
related: 8XZ8 hZ6 HWH
related: nBPM yvt pij
related: U5HK 6Gu jzQ
related: oFzS u8o JQK
related: dWPk 8ox rca
related: 8mTF vev 23A
related: ASpz FKL YhF
broad match: C4222

Fartygsagent
type: Concept
in scheme: JobTech Taxonomy - Yrke
definition: Fartygsagenter fungerar som ombud för redare och befälhavare i samband med fartygs anlöp i hamn. Arbetsuppgifterna omfattar klarering av fartyg, kostnadsberäkningar inför anlöp, bokning av hamntjänster och samordning av hamnoperationer. Fartygsagenter beställer bland annat lots, kajplats, stuveri, logi och transporter för besättning. Under fartygets hamnuppehåll hanteras kontakter med myndigheter, leverantörer och andra aktörer samt praktiska frågor som besättningsbyten och posthantering. Efter avslutat anlöp dokumenteras kostnader, tider och händelser i form av hamnavräkning och "Statement of facts", som ligger till grund för liggetidsberäkning. Fartygsagent verkar ofta i nära samarbete med rederier, hamnmyndigheter och serviceleverantörer. Källa: Sveriges Skeppsmäklareförening, Transportföretagen
alternative label: Fartygsklarerare
broader: Speditörer och transportmäklare
related: p25V ajj dwF
related: dRFw Rcu dX7
related: JiZt EwZ Gpt
related: RPTn bxG ExZ
related: wndc m8T Abu
related: ASGV zcE bWf
related: bDxc FD7 dCd
related: GXPV yNW 7PK
related: ZwgF QSh hcn
related: 3rg1 YMa vpm
broad match: C3331

Maskinoperatör tvätt och textilbehandling
type: Concept
in scheme: JobTech Taxonomy - Yrke
definition: Maskinoperatörer inom tvätt och textilbehandling sköter och övervakar maskiner som tvättar och behandlar textilier, t ex genom färgning eller impregnering. Arbetet innebär i huvudsak att övervaka och justera en eller flera maskiner så att produktionen når sin fulla kapacitet och att åtgärda problem som kan leda till driftstopp. Produktionen är oftast till stor del automatiserad, där tillhörande arbetsuppgifter är att förbereda och tillföra material till maskiner och utföra kvalitetskontroller. Beroende på arbetsplats ingår också att packa och förbereda leverans. Vanliga arbetsplatser är större tvätterier. Källa: Sveriges tvätteriförbund, Arbetsförmedlingen
broader: Maskinoperatörer, blekning, färgning och tvättning
related: UdVa jRr 9DE
related: e5GS LeC q4F
related: rnMh eEa ruu
related: ftfW 3M7 PSN
related: Seue gsy Uzg
related: RzJt WSH 6vU
related: obr2 g2j vcQ
related: qRAd e3U U6m
related: hBmA 4C1 DoP
related: wyX5 JxU n9Z
related: BtBb xJG RpN
related: 4W7C 73a LwZ
related: Vqp4 bwg eZB
related: FF1A tUW BNA
related: wTEr CBC bqh
related: Pf2F 9XJ ywz
broad match: C8157

Präst, romersk-katolsk kyrka
type: Concept
in scheme: JobTech Taxonomy - Yrke
definition: Präst, romersk-katolsk kyrka
broader: Präster
related: GazW 2TU kJw
broad match: C2636

Kontrolloperatör, metallprodukter
type: Concept
in scheme: JobTech Taxonomy - Yrke
definition: Kontrolloperatör, metallprodukter
broader: Övriga ingenjörer och tekniker
related: 6Hq3 tKo V57
broad match: C3119

Brandingenjörer och byggnadsinspektörer m.fl.
type: Concept
in scheme: JobTech Taxonomy - Yrke
definition: Inspekterar och besiktigar byggnader, anläggningar m.m. Inspekterar brandskyddssystem. Informerar och ger råd vid ny- och ombyggnationer. Gör olycksutredningar och arbetar i operativ räddningstjänst i samband med räddningsinsatser. Hit hör inte Brandbefäl/Räddningsledare/Insatsledare (5411)
broader: Skatte- och socialförsäkringshandläggare m.fl.
related: N4f3 cLE ygk
related: mR9a pbf 4tv
related: dpBU 3E1 JAx
related: D8Qb A75 bDH
related: qndS X6D iB8
related: YnBh YGQ scC
related: G117 cFe ufg
related: uA7X Pqn n9a
related: apDb b1W jQx
related: ELT8 7Hk QvJ
related: G4oH peY AMJ
related: qjFa kAf UuP
related: Tias 1Pu S1h
related: CTex gqv wWT
related: jt4y g5c GXy
related: W8Vw 5oR 7EV
related: aVzm vLZ 7Yn
related: 1VVe BBY rpQ
related: 8GLo Bn4 XAq
related: detQ YNb 9nG
related: FFvn Vhc 2dA
related: ur5t WrD DXL
related: NbJ2 swE yJ1
related: gYZ2 QV9 HAA
related: DjBN rka oZV
related: 4diN yo6 SHM
related: otrX HCb Vqx
related: Fnqr GsM mqG
related: afs6 imh xxf
related: 6QXd kBC Gjo
related: XdUe 8cB Hwb
related: cMAq 57S pfD
related: hLqS EHC 3GK
related: zCai NdW 3qn
related: D6ev Zwt x83
related: R9ob Yuq kMn
related: 8E5S bt2 a2S
related: madj KDg KQq
related: KrAH 39w Sd1
related: cRTW MkF 2wh
related: RrWD 6m1 ess
related: 4y7C Lsh EPM
related: syCw 5R7 3eE
related: SNUX VNb FuC
related: C3112
related: 7xYo gc8 9Bm
narrower: Energi- och klimatrådgivare
narrower: Brandingenjör
narrower: Brandtekniker
narrower: Brandinspektör
narrower: Byggnadsinspektör/Bygglovshandläggare
narrower: Fukttekniker
narrower: Energiexpert
broad match: E7hm BLq fqZ

Säkerhetshandläggare
type: Concept
in scheme: JobTech Taxonomy - Yrke
definition: Säkerhetshandläggare arbetar operativt med säkerhetsåtgärder inom olika organisationer. Arbetsuppgifter innefattar bland annat handläggning och administration av registerkontroller, incidentutredningar samt genomförande av säkerhetsprövningsintervjuer. Rollen innefattar också utveckling och handläggning av operativa säkerhetsärenden, exempelvis bevakning, larmsystem och passagesystem i samverkan med andra förvaltningar. Säkerhetshandläggaren stödjer trygghets- och brottspreventiva aktiviteter samt kris- och beredskapsarbete. Källa: Arbetsförmedlingen
broader: Säkerhetsinspektörer m.fl.
related: E7hm BLq fqZ
related: QKXb n4T Wss
related: irPK cPj mP9
related: boF7 KG2 HJS
broad match: C3257

Kontraktsadjunkt
type: Concept
in scheme: JobTech Taxonomy - Yrke
definition: Kontraktsadjunkt
broader: Präster
related: GazW 2TU kJw
broad match: C2636

Djurskyddsinspektör
type: Concept
in scheme: JobTech Taxonomy - Yrke
definition: Djurskyddsinspektör
broader: Miljö- och hälsoskyddsinspektörer
related: kJeN wmw 9wX
related: LaP7 pG6 ZnK
related: 4eJL Zun nUv
broad match: C3257

Museiintendenter och bibliotekarier m.fl.
type: Concept
in scheme: JobTech Taxonomy - Yrke
definition: Museiintendenter och bibliotekarier m.fl.
broader: Yrken med krav på fördjupad högskolekompetens inom juridik, kultur och socialt arbete m.m.
narrower: Bibliotekarier och arkivarier
narrower: Arkeologer och specialister inom humaniora m.m.
narrower: Museiintendenter m.fl.

Nationalparkschef
type: Concept
in scheme: JobTech Taxonomy - Yrke
definition: Nationalparkschef
broader: Chefer inom friskvård, sport och fritid
related: bh3H Y3h 5eD
related: VuuL 7CH adj
broad match: C1431

IT-arkitekter, systemutvecklare och testledare m.fl.
type: Concept
in scheme: JobTech Taxonomy - Yrke
definition: IT-arkitekter, systemutvecklare och testledare m.fl.
broader: Yrken med krav på fördjupad högskolekompetens inom IT
narrower: IT-säkerhetsspecialister
narrower: Systemförvaltare m.fl.
narrower: Utvecklare inom spel och digitala media
narrower: Systemtestare och testledare
narrower: Mjukvaru- och systemutvecklare m.fl.
narrower: Övriga IT-specialister
narrower: Systemanalytiker och IT-arkitekter m.fl.

Borrförman, berg
type: Concept
in scheme: JobTech Taxonomy - Yrke
definition: En borrförman leder och övervakar borrningsarbete för bergvärme, vatten eller geologiska undersökningar. Borrförmannen ansvarar för att planera och organisera borrningsarbetet, se till att rätt utrustning används. Borrförmannen har ansvar för att säkerställa kvaliteten på det utförda arbetet och att eventuella problem eller hinder löses effektivt under projektets gång. Källa: Arbetsförmedlingen
broader: Arbetsledare inom bygg, anläggning och gruva
related: j7Cq ZJe GkT
related: ja7J P8X YC9
broad match: C3121

Systemansvarig
type: Concept
in scheme: JobTech Taxonomy - Yrke
definition: Systemansvarig
broader: Systemförvaltare m.fl.
related: 83kq Gqd ijn
related: YJnZ ms3 2sE
related: o3Cr R6P DZL
related: dBDA Gtd id7
related: JMPw qsd P37
related: yWsG p6X Duf
related: DnsA NgL aKU
related: oZnQ wEG ZfQ
related: JHUb cPq Z94
related: apaJ 2ja LuF
related: GHyo 9f6 84c
related: WqPQ dQQ 8tu
related: T6Ni twB LAR
related: 2rXc dfN k2q
related: sZzV d7B 4z6
related: 5UpJ m4z yRP
broad match: C2522

Aktivitetsledare
type: Concept
in scheme: JobTech Taxonomy - Yrke
definition: Aktivitetsledare leder olika aktiviteter och tar hand om gäster vid olika typer av anläggningar, så som äventyrsparker, konferensanläggningar och friluftsanläggningar. Arbetsuppgifter omfattar bland annat förberedelse och genomförande av aktiviteter, introduktion av utrustning, säkerhetsgenomgångar och stöd till deltagare under aktiviteterna. Se även yrket och Fritdsledare och liknande yrken, som avser aktivitetsledning i mer pedagogisk verksamhet. Källa: Arbetsförmedlingen
broader: Övriga servicearbetare
related: ScKy FHB 7wT
related: kqbd 5Jd UeE
broad match: C9629

Biomedicinska analytiker m.fl.
type: Concept
in scheme: JobTech Taxonomy - Yrke
definition: Utför kliniska analyser vid sjukhus, läkemedelsindustrin eller laboratorium. Gör kemiska och biokemiska analyser samt tar prover. Hanterar teknisk apparatur och annan utrustning för provtagning och analys. Tar fram underlag som läkare behöver för att fastställa rätt diagnos. Deltar i forskning och utvecklingsarbete. Genomför analyser och dokumenterar bevis vid brottsutredningar.
broader: Biomedicinska analytiker, tandtekniker och laboratorieingenjörer m.fl.
related: 4UZL UMh qFG
related: C3212
related: hZDG iqA bka
related: Tnb9 91i XC8
related: xAbn Wt7 ySS
related: tv1x 6Ua Txa
related: UbGZ 9pL wwW
related: a1Sf mey gVk
related: 9bH5 MYw HbH
related: 4dHV ivL jbc
related: 7rJH cCp ccc
related: Wv7A env 1X7
related: aS2X 4ZL 9h7
related: 3qdJ Hpk eZj
related: DYnx H7B w7z
related: kTdr kZC 6uX
related: AdMS ZXC eXi
related: RTv9 C9q 5VM
related: VPpD VFk u9g
related: dpH3 oqg AHa
related: QQJy UXD DZC
related: Bbj8 8y7 XJ5
narrower: Biomedicinsk analytiker/BMA
narrower: Laboratorieassistent
narrower: Forensiker, biomedicinsk analytiker
narrower: Cytodiagnostiker
broad match: kJeN wmw 9wX

IT-forensiker
type: Concept
in scheme: JobTech Taxonomy - Yrke
definition: IT-forensiker säkerställer, extraherar, analyserar och värderar digitala spår från elektroniska enheter och datorsystem som en del av brottsutredningar. Arbetsuppgifterna innefattar hantering av digital bevisning från mobiltelefoner, datorer och nätverk, sökning efter relevant information i databaser samt tekniskt stöd vid husrannsakningar. IT-forensiker analyserar komplex data för att kartlägga brottshändelser, identifiera gärningspersoner och presentera resultatet klart och begripligt för utredare och rättsväsende. Rollen kan inkludera både civila och polisiära tjänster. IT-forensiker kan arbeta både inom Polisen och bland privata arbetsgivare med tjänster inom cybersäkerhet. Källa: Polisen, Arbetsförmedlingen
broader: IT-säkerhetsspecialister
related: TRPL 5av hN9
related: pvUJ QiN QDs
related: ZWiy Rud KAe
related: apaJ 2ja LuF
broad match: C2529

Svetsare och gasskärare
type: Concept
in scheme: JobTech Taxonomy - Yrke
definition: Svetsar och löder samman metalldelar i samband med tillverkning, montering och reparation av metallprodukter. Utför specialiserat svetsningsarbete på röranläggningar. Skär ut detaljer i olika metalliska material och kapar exempelvis grovplåtar, balkar och skrot med skärbrännare eller skärmaskin. Hit hör inte Svetsoperatör/Automatsvetsare (7223)
broader: Gjutare, svetsare och plåtslagare m.fl.
related: eA4L AMV QZg
related: mfa9 Ymb xJj
related: VPF1 UZM 9Kd
related: qgVX T3P j7U
related: zwi4 rDc YJ7
related: Y2fZ kGv yUx
related: tDV6 t9r ugg
related: aHCV VsV LiD
related: c5t5 ucu nrT
related: FZ7v EmJ oRh
related: aGwd yZq fa4
related: KnpQ pxH wq3
related: JUpW QCd vCM
related: n1n9 LKJ PrK
related: x8oG RJN 9pb
related: oZmV VcV sHi
related: 1YZS 1ch vDZ
related: 8RLp 6Gm 6iF
related: qQ61 EQR rcz
related: VTwt 5Fe 6bW
related: Q7eC B7g QiU
related: WBnc JXj MvY
related: fhcp fFw Lbj
related: 2ywJ fcJ Y2S
related: THYW 6v8 ZeD
related: xsv5 dqk LQp
related: SrzF GXp pFE
related: zVKm f79 DtU
related: Q1D1 Pdc rnT
related: sM6P 7yB 1sw
related: MQST tq6 3Cd
related: gdY9 s4U ZCL
related: JNLp 2Aq cnD
related: aENT QTu v8Y
related: EEhN tn1 T8d
related: seev JQ5 q5W
related: VF7G q33 456
related: G8Py QoU bpt
related: C7212
related: ryTS nNC EF4
related: qqjD EVW ohZ
related: AiwS Mhv ttk
related: y9yV GPX 9vD
related: zfNP WYh Wbj
related: Z2cW tFy fv8
related: SfEb uQ9 ohJ
related: VdMH Tm8 CAa
related: BKYD AEo maF
related: PinU qfy qGv
related: GgZs WNA Z8z
related: iQfJ Crz aEJ
related: uenm 75h fEh
related: wZpC X9a xzG
related: xShN Vkr s7D
related: ZTk2 7eo CUb
related: 2WMS bAY GRT
related: 32kt xrc cpE
related: aNcD UfW vYN
related: fRF9 96h p1y
related: m4uF yGD 3mf
narrower: Mjuklödare
narrower: Hårdlödare
narrower: Svetsare
narrower: Spårsvetsare
broad match: wTEr CBC bqh

Logistikchef
type: Concept
in scheme: JobTech Taxonomy - Yrke
definition: Logistikchef
broader: Inköps-, logistik- och transportchefer
related: epLc SkD cbT
related: 2wTY uud Umh
related: ASGV zcE bWf
related: bh3H Y3h 5eD
related: qJqn TrG 6w3
related: ZrG7 Jyz rFk
related: h6JD Sg3 WiF
related: A67g wEY jRn
broad match: C1324

Informatiker
type: Concept
in scheme: JobTech Taxonomy - Yrke
definition: Informatiker utvecklar och förvaltar system och IT-lösningar för informationshantering. Arbetet innebär bland annat att analysera verksamheters behov av information, utforma och förbättra digitala system, samt säkerställa att informationen är tillgänglig, korrekt och säker. Informatiker fungerar ofta som en länk mellan teknik och verksamhet och deltar i projekt för att ta fram nya digitala tjänster eller förbättra befintliga processer. Arbetsuppgifter kan omfatta analys och modellering av informationsflöden och verksamhetsprocesser, utveckling och anpassning av databaser och IT-system, digitalisering och strukturering av dokument och data samt kvalitetssäkring av information och datasäkerhet. Källa: Arbetsförmedlingen
broader: Systemanalytiker och IT-arkitekter m.fl.
related: D6zC nPP 22M
related: apaJ 2ja LuF
related: MTZH 5CY ozU
broad match: C2511

Depåtekniker
type: Concept
in scheme: JobTech Taxonomy - Yrke
definition: Depåtekniker utför reparationer, felsökning och underhåll av teknisk utrustning i depåer för drivmedel, fordon eller industriella anläggningar. Arbetsuppgifterna omfattar samordning av externa entreprenörer vid reparationsarbeten, genomgång av lokala säkerhetsföreskrifter, teknisk tillsyn, lagerhantering, och operativ förvaltning av fordon eller anläggningar. Depåtekniker genomför dagliga kontroller, hanterar produktöverföringar, stöttar fartygsimport/lossning och medverkar i förbättringsarbete. Rollen är aktuell inom petroleumbranschen, kollektivtrafik och större industrier och utbildningskrav regleras delvis av branschorganisationer. Källor: TYA/Drivkraft Sverige, OKQ8, MTR Tech, Sjöfartstidningen
broader: Lager- och terminalpersonal
related: 8MGe 4PL Kgx
related: TVNE dg4 J4G
related: J5gJ 6vV egQ
related: ASGV zcE bWf
related: MxQL yDQ KsB
related: rXPy FPK qhh
related: ApgR WJJ pf7
related: oZfb NWk h5y
related: 7YrS di5 F2c
related: GjaZ 2ky eH1
related: rXsf qbR 7Ed
related: Dm7a Fwk qvA
related: PhiS YAf zgP
broad match: C4321

Förarprövare
type: Concept
in scheme: JobTech Taxonomy - Yrke
definition: Förarprövare, även kallat trafikinspektör, genomför körprov och teoriprov för olika körkortsbehörigheter. Arbetet innebär att bedöma om körkortstagare har tillräckliga kunskaper och färdigheter för att bli en säker förare i trafik. Förarprövaren leder körprovet, fattar myndighetsbeslut och kommunicerar resultaten tydligt till kunden. Huvudsaklig arbetplats är Trafikverket, men rollen kan även förekomma inom Försvarsmakten samt gymnasie- och vuxenutbildning. Som förarprövare ska man ha fyllt 23 år, ha gymnasieutbildning, haft körkort med behörighet B i minst tre år, och vara anställd på Trafikverket eller annan godkänd arbetsplats. Utbildningen till förarprövare omfattar både teori och handledd praktik där man tränar bedömning av körförmåga, fordonsteknik och bedömningsmetodik. Källa: Trafikverket
alternative label: Trafikinspektör
broader: Säkerhetsinspektörer m.fl.
related: E7hm BLq fqZ
related: kDNx z5C AmY
related: 9CXn jAd 32T
broad match: C3257

Inspektör, IVO (Inspektionen för vård och omsorg)
type: Concept
in scheme: JobTech Taxonomy - Yrke
definition: Inspektör, IVO (Inspektionen för vård och omsorg)
broader: Planerare och utredare m.fl.
related: X82t awd Qyc
related: TZe9 NsN uce
broad match: C2421

Yrkeshygieniker
type: Concept
in scheme: JobTech Taxonomy - Yrke
definition: Person som har till uppgift att studera de skador och hälsorisker som är förbundna med yrkesutövning och att försöka ange åtgärder för att förebygga respektive avhjälpa riskerna. Källa: SKR
broader: Arbetsmiljöingenjörer, yrkes- och miljöhygieniker
related: E7hm BLq fqZ
related: ELc6 2ba 34f
related: dHsk wdT c7r
related: gQ8Z Qsc CBe
broad match: C2263

Asbestsanerare
type: Concept
in scheme: JobTech Taxonomy - Yrke
definition: En asbestsanerare är specialiserad på att hantera och ta bort asbest från byggnader och andra strukturer. I arbetsuppgifter ingår bl a att identifiera om asbest finns och var det förekommer. Asbestsaneraren tar bort asbesthaltiga material på ett kontrollerat sätt, ofta genom att använda specialutrustning som dammskydd, filter och vakuumsystem för att minimera risken för att asbestfibrer frigörs i luften samt ansvarar för att asbestmaterialen transporteras till en deponeringsanläggning för farligt avfall. Arbetet som asbestsanerare kräver särskild utbildning, certifieringar och kunskap om säkerhetsföreskrifter för att skydda både arbetaren och omgivningen från hälsorisker. Källa: Arbetsförmedlingen
broader: Saneringsarbetare m.fl.
related: whao Q6A ScE
related: DmJB bS6 7kN
related: ja7J P8X YC9
related: PZQe bHN G5L
broad match: C7133

Byggnadskalkylator/Anbudsingenjör
type: Concept
in scheme: JobTech Taxonomy - Yrke
definition: En byggnadskalkylator beräknar kostnader för ett byggprojekt, inklusive material, arbetskraft, utrustning och andra utgifter. Byggnadskalkylatorn skapar detaljerade kostnadsuppskattningar som används för anbud eller budgetplanering och beaktar faktorer som bygglagar och tekniska standarder. Kalkylatorn måste ha god kännedom om byggprocessen och de kostnader som uppstår under projektets gång. Källa: Arbetsförmedlingen
alternative label: Anbudsingenjör
alternative label: Byggnadskalkylator
broader: Ingenjörer och tekniker inom bygg och anläggning
related: YLsj 6MC v4E
related: nn53 R8z Bwo
related: j7Cq ZJe GkT
related: uvpf Sw7 vBw
related: YrPW xfK mTC
related: fz8w j52 wtU
related: pepo QsS jvw
related: WSTN cGT bYT
related: u54g 52i nyE
related: EU3c tLL Uxz
related: hxng 4yH seV
related: gbtQ Mop qiZ
related: ja7J P8X YC9
related: Hs9f d21 o4d
related: NpXm xHF r8J
related: ZjCw 9JF b8s
broad match: C3112

Frivårdsinspektör
type: Concept
in scheme: JobTech Taxonomy - Yrke
definition: Frivårdsinspektör arbetar inom kriminalvården med personer som dömts till straff utanför fängelse, till exempel villkorlig frigivning, skyddstillsyn, samhällstjänst eller påföljd med elektronisk övervakning. Arbetsuppgifterna omfattar regelbundna samtal och kontakter med klienter för att stödja återanpassning till samhället, upprätta och följa upp åtgärdsplaner samt övervaka att påföljden genomförs enligt domstolens beslut. Frivårdsinspektören genomför utredningar, skriver yttranden till domstol och samarbetar med socialtjänst, vårdgivare och andra myndigheter. Yrket innefattar både ett kontroll- och ett stödjande uppdrag, där strukturerade samtal, risk- och behovsbedömningar samt motivering till behandling och samhällsservice utgör centrala delar. Källor: Kriminalvården, Arbetsförmedlingen
broader: Övriga yrken inom socialt arbete
related: xQYc N4R 29N
related: GazW 2TU kJw
related: tGBJ Tp4 ERc
related: SSDF Bqs YNv
broad match: C2635

Bibliotekarier och arkivarier
type: Concept
in scheme: JobTech Taxonomy - Yrke
definition: Planerar och organiserar biblioteksverksamhet. Bedömer, köper in och klassificerar böcker, tidskrifter och andra typer av publicerat material. Erbjuder fördjupad litteratur- och informationsförmedling samt vägleder bibliotekets användare i informationssökning. Söker, bearbetar och presenterar information. Samlar in, undersöker, bedömer och ordnar handlingar. Värderar och bedömer vilken information som ska sparas för framtiden.
broader: Museiintendenter och bibliotekarier m.fl.
related: udqs kCm YJ6
related: ruo6 dqq 9Uo
related: NEME JBz qhc
related: dDxe fWR Q5Y
related: EaE2 UK8 eSV
related: ZN4T wCg uTW
related: UjRh U4o ZQd
related: HEia YGh KRv
related: TEum xLY t4z
related: 44Lr qs6 RTG
related: UdTc HVX bJN
related: C2621
related: zX4C 7jY ygC
related: McR1 y6q 1U5
related: tqcW y4m 8xb
related: 8gKx WD2 7SM
related: G91h 2aK aXY
related: 1dVh cZS Exw
related: FGhF q98 YE8
related: hdcx LQy E9z
related: LpZq qrw ykW
related: WEFe Aov 1SS
related: 9xoS pdu wqL
related: C2622
related: 63XZ k83 aNi
related: t2ts Uuk Sq2
related: SHmn nzf PJi
narrower: Krigsarkivarie
narrower: Musikbibliotekarie
narrower: Arkivarie
narrower: Informationsspecialist
narrower: Bildarkivarie
narrower: Skolbibliotekarie
narrower: Dokumentalist
narrower: Filmarkivarie
narrower: Bibliotekskonsulent
narrower: Informationsmäklare
narrower: Bibliotekarie
broad match: 9puE nYg crq

Cytodiagnostiker
type: Concept
in scheme: JobTech Taxonomy - Yrke
definition: Cytodiagnostiker
broader: Biomedicinska analytiker m.fl.
related: kJeN wmw 9wX
related: mvTK ciU fot
broad match: C3212

Chefer inom friskvård, sport och fritid
type: Concept
in scheme: JobTech Taxonomy - Yrke
definition: Formulerar och ansvarar för mål och strategier för verksamhet inom friskvård, sport och fritid. Utformar riktlinjer, följer upp och utvärderar verksamheten mot uppsatta mål. Svarar för budget samt fördelar resurserna inom verksamheten. Har personalansvar.
broader: Chefer inom friskvård, sport och fritid
related: yyJQ gFx TKr
related: 86Bs d71 DXd
related: t4f1 Akp Afr
related: s2e6 Tjw aEL
related: s5SS 7bW 1Gh
related: C1213
related: icvA Gu9 EqB
related: 2JeS WZ1 rd1
related: BNas Pf6 5CT
related: G7Qq r7L 5Jo
related: UH9g R5v MCx
related: SmZd Jaa BeY
related: 29MP yhF mjx
related: 8tYq EXD Xwm
related: tDDx FLj XoJ
related: ZzN5 m7B 5CY
related: detQ YNb 9nG
related: Jy7P 8yt zJt
related: Nksx 4oe fEQ
related: eThQ HCv mY6
related: 2wd8 VUk YSq
related: Wkga 1FL tK7
related: Gt5f wdi FSJ
related: q7Mx gjU F9q
related: yXmf iKi 7ci
related: VfP9 2xd g2h
related: zXNU zXR hGd
related: C1431
related: 4fRg DA4 Dj3
related: ro7t 8qz rAz
related: Betk ZCh mY9
related: 5yDE FiQ bMn
narrower: Fritidschef
narrower: Idrottsplatschef
narrower: Turistchef
narrower: Nationalparkschef
narrower: Klubbledare, golf
narrower: Hallföreståndare
narrower: Badföreståndare/Simhallsföreståndare
narrower: Sportchef
narrower: Parkchef
broad match: bh3H Y3h 5eD

Fordonsmekaniker och reparatörer m.fl.
type: Concept
in scheme: JobTech Taxonomy - Yrke
definition: Fordonsmekaniker och reparatörer m.fl.
broader: Metallhantverks- och reparatörsyrken
narrower: Motorfordonsmekaniker och fordonsreparatörer
narrower: Flygmekaniker m.fl.
narrower: Underhållsmekaniker och maskinreparatörer

Turistsekreterare
type: Concept
in scheme: JobTech Taxonomy - Yrke
definition: Turistsekreterare
broader: Planerare och utredare m.fl.
related: MRxn 7Dd ZDT
related: X82t awd Qyc
related: TZe9 NsN uce
broad match: C2422

Maskinoperatör metallformning
type: Concept
in scheme: JobTech Taxonomy - Yrke
definition: Maskinoperatörer inom metallformning styr och övervakar maskiner som drar, pressar och formar metall. Arbetet innebär i huvudsak att förbereda råmaterial samt ställa in och övervaka maskiner för tillverkning av metallprodukter så som tråd, spik, stållinor, rör, stänger och liknande produkter. Beroende på arbetsplats kan även enklare maskinunderhåll, felsökning och processoptimering ingår. Man kan vara inblandad i hela eller delar av produktionskedjan, varför truckkörning, traverskörning och leveransförberedelse även kan förekomma. Källa: Arbetsförmedlingen
broader: Övriga maskin- och processoperatörer vid stål- och metallverk
related: 1Sqk 1oK Z5U
related: s9XC fJJ 7oJ
related: XRMf 5MG bGX
related: SpVZ z7k ZBW
related: BXzC oXJ V1y
related: NHjo Dan K8L
related: Mw29 9ax 5aV
related: 2Amr LNt YqY
related: kv5c dg5 JTi
related: Hr66 YRn HuM
related: wTEr CBC bqh
related: yjy3 XPC oAd
related: JvTm svT mJA
broad match: C8121

Utbildningskonsulent, skola
type: Concept
in scheme: JobTech Taxonomy - Yrke
definition: Utbildningskonsulent, skola
broader: Speciallärare och specialpedagoger m.fl.
related: 3pyE aAA TFD
related: MVqp eS8 kDZ
broad match: C2351

Fiskerikontrollant
type: Concept
in scheme: JobTech Taxonomy - Yrke
definition: En fiskerikontrollant arbetar med att övervaka och kontrollera att fisket bedrivs i enlighet med gällande lagar och regler. Detta innebär att de inspekterar fiskefartyg, fiskeredskap, fångster och transporter för att säkerställa att kvoter, storleksbegränsningar och andra regler följs. De kan även beslagta otillåten utrustning eller fångster och rapportera överträdelser. Fiskerikontrollanter är anställda hos Havs- och vattenmyndigheten Källa: Havs- och vattenmyndigheten
broader: Övriga handläggare
related: X82t awd Qyc
related: GGqZ 6Ew 5Ha
related: mRSs RQb Wpd
broad match: C3359

Teleskoptruckförare
type: Concept
in scheme: JobTech Taxonomy - Yrke
definition: Teleskoptruckförare kör teleskoptruckar vid hantering, transport och placering av material på byggarbetsplatser, lager och återvinningsanläggningar. Arbetsuppgifterna inkluderar lyft, förflyttning och placering av tunga laster, gods, pallar och containrar på svåråtkomliga eller höga platser. Teleskoptruckförare arbetar ofta utomhus med återvinning, materialhantering och assisterar vid byggnation. Teleskoptruckförare hanterar både fasta och runtomsvängande teleskoptruckar och genomför daglig kontroll samt enklare underhåll av maskinen. Arbetet innehåller till stor del säkerhetsrutiner för att undvika olyckor vid arbete med tunga maskiner, ibland på höjd eller i trånga utrymmen. Källa: Arbetsförmedlingen
broader: Truckförare
related: ASGV zcE bWf
related: STSQ MKh bDT
broad match: C8344

Glasmålare
type: Concept
in scheme: JobTech Taxonomy - Yrke
definition: Glasmålare skapar bilder på fönsterglas och andra glasföremål. Arbetet avser främst att dekorera fönsterglas, men kan även ske på kristall. Arbetet utförs med smältfärger, metalliska pigment eller svartlod och kan inkludera slipning för detaljer. Källa: Hantverkslärling, Arbetsförmedlingen, ESCO
broader: Musikinstrumentmakare och övriga konsthantverkare
related: qDnH i2Z UP3
related: PaxQ o1G wWH
broad match: C7316

Krigsarkivarie
type: Concept
in scheme: JobTech Taxonomy - Yrke
definition: Krigsarkivarie
broader: Bibliotekarier och arkivarier
related: 7Vne Ptb Jqi
related: 9puE nYg crq
broad match: C2621

Chefer inom hälso- och sjukvård
type: Concept
in scheme: JobTech Taxonomy - Yrke
definition: Formulerar och ansvarar för mål och strategier för verksamhet inom hälso- och sjukvård, inklusive tandvård. Utformar riktlinjer, följer upp och utvärderar verksamheten mot uppsatta mål. Svarar för budget samt fördelar resurserna inom verksamheten. Har personalansvar.
broader: Chefer inom hälso- och sjukvård
related: icvA Gu9 EqB
related: UH9g R5v MCx
related: C1342
related: mbX6 j18 BrJ
related: 8tYq EXD Xwm
related: ZzN5 m7B 5CY
related: LmpM FA7 ujB
related: A3Fj o8U Twq
related: Nksx 4oe fEQ
related: HdYx psN F8h
related: eThQ HCv mY6
related: wBPu wTW RgG
related: Gt5f wdi FSJ
related: q7Mx gjU F9q
related: zXNU zXR hGd
related: rVUL AgV ZTH
related: 17Uy FAd BRr
narrower: Chefsbarnmorska
narrower: Klinikchef, tandvård/Verksamhetschef, tandvård
narrower: Enhetschef, hälso- och sjukvård
narrower: Verksamhetschef, hälso- och sjukvård
narrower: Sektionschef, sjukhus
narrower: Chefssjuksköterska
broad match: bh3H Y3h 5eD

Skattehandläggare
type: Concept
in scheme: JobTech Taxonomy - Yrke
definition: Skattehandläggare handlägger och utreder olika typer av ärenden som rör beskattning, deklarationer och skattebetalning för både privatpersoner och företag. Arbetsuppgifterna omfattar att granska deklarationer, utföra utredningar, begära in kompletteringar, analysera underlag och fatta beslut enligt gällande lagar och regler. Kontakter med privatpersoner, företag och andra myndigheter sker via telefon, brev, digitala brevlådor samt ibland personliga möten. Handläggare ger även information och vägledning om skatt och folkbokföring, samt besvarar frågor om e-tjänster och bestämmer ibland taxeringsvärde för fastigheter. Källa: Skatteverket, Arbetsförmedlingen
broader: Skattehandläggare
related: rnB2 mxn hQ4
related: JWgz VHh Y1c
related: ecZk XMF 73f
related: X82t awd Qyc
related: ihi9 f7e doV
related: TZe8 AJF 3L3
related: qFeB 9dz QJk
related: 8tZV Gfe 14N
related: KQC5 VFf pxf
broad match: C3352

Expeditionschef, departement
type: Concept
in scheme: JobTech Taxonomy - Yrke
definition: Expeditionschef, departement
broader: Förvaltnings- och planeringschefer
related: epLc SkD cbT
related: bh3H Y3h 5eD
broad match: C1213
broad match: C1112

Mopedmekaniker
type: Concept
in scheme: JobTech Taxonomy - Yrke
definition: Mopedmekaniker Mopedmekaniker arbetar med service och reparation av mopeder. I detta ingår förutom mekaniska reparationer bland annat även enklare felsökning, däckbyen och byten av plastkåpor. Även installation av olika tillbehör kan vara en arbetsuppgift. Beroende på arbetsplats kan även arbete med andra mindre maskiner förekomma, så som fyrhjuling. Källa: Arbetsförmedlingen
broader: Motorfordonsmekaniker och fordonsreparatörer
related: Eidf PVZ d5g
related: JuqN nc1 m4e
related: yhCP AqT tns
broad match: C7231

Kundtjänstchef
type: Concept
in scheme: JobTech Taxonomy - Yrke
definition: Kundtjänstchef
broader: Övriga administrations- och servicechefer
related: RBGJ 4CD Yiy
related: 2FVX 6RV wX8
related: z5hE wmj cRc
related: F2rN MnA M1L
related: epLc SkD cbT
related: nYea WAW cZB
related: fqWf pk4 1tU
related: CyDW yGo L1e
related: tmdM PQB djg
related: bh3H Y3h 5eD
related: qebS Fgv Mgc
related: ghmv dP1 bcf
related: 2Nkn d6R 5td
related: ygjH CSK AdZ
related: RQ9E 5FX X6M
related: KQQT JyX 3HP
related: fVwJ r8b FC1
related: NQCV TFd qK2
related: tXz2 9Pn okC
broad match: C1219

Yrken med krav på kortare utbildning eller introduktion
type: Concept
in scheme: JobTech Taxonomy - Yrke
top concept of: JobTech Taxonomy - Yrke
definition: Yrken med krav på kortare utbildning eller introduktion
narrower: Andra yrken inom bygg, tillverkning och godshantering
narrower: Återvinningsarbetare, tidningsdistributörer och övriga servicearbetare
narrower: Snabbmatspersonal, köks- och restaurangbiträden m.fl.
narrower: Städyrken
narrower: Bärplockare och plantörer m.fl.
narrower: Torg- och marknadsförsäljare

Trapetskonstnär
type: Concept
in scheme: JobTech Taxonomy - Yrke
definition: Trapetskonstnär
broader: Övriga yrken inom kultur och underhållning
related: 8too bEs 7NU
related: 9puE nYg crq
broad match: C2659

Informations-, kommunikations- och PR-chefer
type: Concept
in scheme: JobTech Taxonomy - Yrke
definition: Informations-, kommunikations- och PR-chefer
broader: Chefer inom ekonomi, HR, marknadsföring och försäljning samt annan administration m.m.
narrower: Informations-, kommunikations- och PR-chefer

Hemsjukvårdare
type: Concept
in scheme: JobTech Taxonomy - Yrke
definition: Hemsjukvårdare utför hälso- och sjukvårdsinsatser i patientens hem för personer som på grund av sjukdom eller funktionsnedsättning inte kan ta sig till vårdinrättningar. Arbetsuppgifterna inkluderar medicinska bedömningar, behandlingar, omvårdnad och rehabilitering. Hemsjukvårdare hanterar medicinteknisk utrustning och läkemedel samt följer vårdplaner och dokumenterar insatser. Rollen innebär samarbete med sjuksköterskor, läkare och andra vårdgivare samt handledning och utbildning av omsorgspersonal. Hemsjukvård bedrivs i olika boendeformer och har ofta en långsiktig vårdrelation med patienten. Källor: Uppvidinge kommun, Vårdförbundet, Region Blekinge, Socialstyrelsen,
broader: Undersköterskor, hemtjänst, hemsjukvård, äldreboende och habilitering
related: NYW6 mP6 vwf
related: qUG9 b1W n9P
broad match: C5322

Lärling betonghåltagare
type: Concept
in scheme: JobTech Taxonomy - Yrke
definition: En lärling är anställd för att slutföra sin kvalificeringstid till betonghåltagare innan ett yrkesbevis kan utfärdas. Under kvalificeringstiden får du lärlingslön enligt avtal. Kvalificeringstiden tillsammans med teoretisk grundutbildning leder till yrkesbeviset. Ett lärlingsavtal mellan branschorganisation och företag tecknas. Källa: BYN
broader: Betongarbetare
related: j7Cq ZJe GkT
related: ja7J P8X YC9
broad match: C7114

Driftchef lantbruk
type: Concept
in scheme: JobTech Taxonomy - Yrke
definition: Driftchefer inom lantbruk leder och utvecklar verksamheten på större lantbruksföretag. Arbetsuppgifterna omfattar att formulera mål och strategier för produktion, utforma riktlinjer och arbetsrutiner samt följa upp och utvärdera verksamheten mot uppsatta mål. Driftchefen planerar och fördelar resurser, ansvarar för budget och ekonomisk uppföljning samt leder och organiserar personal. Rollen innefattar även kontakt med leverantörer, kunder och myndigheter samt arbete med långsiktig utveckling av verksamheten. Arbetsuppgifterna kan överlappa med driftledare inom lantbruk, särskilt på mindre företag. Driftchefen har vanligtvis ett mer övergripande och strategiskt ansvar. Se även yrkena Driftledare växtodling och Driftledare lantbruk med blandad drift. Källa: Arbetsförmedlingen
broader: Förvaltare inom skogsbruk och lantbruk m.fl.
related: bh3H Y3h 5eD
broad match: C1311

Keramiker
type: Concept
in scheme: JobTech Taxonomy - Yrke
definition: Keramiker tillverkar konst- och bruksföremål i lera. Arbetet innebär att bearbeta och forma lera med hjälp av tekniker som drejning, gjutning, kavling och ringling. Man använder olika verktyg som drejskivor, handverktyg och brännugnar. Efter formning bränns leran för att härdas, och efter bränning kan ytbehandling som glasering eller dekoration utföras. Keramiker kan arbeta med olika typer av keramik, som stengods, lergods och porslin. Källa: Hantverksakademin, Hantverkslärling, ESCO
broader: Musikinstrumentmakare och övriga konsthantverkare
related: WQD7 yoR r3A
related: wyL1 RnJ b3B
related: jNf2 Rt1 4b2
related: vpkU 2GA 1WK
related: zu62 MDD MBs
related: srNq AL3 ooR
related: 6WZS jXY Dh5
related: MuS7 RKX 4aU
related: 8too bEs 7NU
related: PaxQ o1G wWH
related: qQh5 BLW 3xP
related: zF9k Euu S3x
related: pqW8 85G TQQ
related: ReW3 4cr 86Z
related: bbu2 cRc KB5
related: LpLt TZ1 RBX
broad match: C7314

Specialistläkare, bild- och funktionsmedicin
type: Concept
in scheme: JobTech Taxonomy - Yrke
definition: Specialistläkare, bild- och funktionsmedicin är en specialiserad legitimerad läkare med en djupare kunskap och kompetens inom sitt område. Specialistläkare är en skyddad titel och bara den som har bevis om specialistkompetens får kalla sig specialist i sin specialitet. Specialistläkare ansvarar för att diagnostisera, behandla och förebygga sjukdomar inom sin specialitet. Vanliga arbetsuppgifter är mottagningsarbete med patientbesök, rondarbete på avdelning, handledning av yngre läkare samt konsultationer till andra yrkesgrupper och specialiteter. Specialistläkare ansvarar även för att följa och leda utvecklingen inom sitt medicinska område och utför omfattande medicinsk dokumentation och administration. Källa: Arbetsförmedlingen, Karolinska Institutet, Socialstyrelsen, Sveriges Kommuner och Regioner, Sveriges läkarförbund
broader: Specialistläkare
related: G3n4 CG4 zYK
related: NYW6 mP6 vwf
related: gKZS 5vM Vq9
related: PCmJ cvi K8M
related: qSbw XHD Ycd
related: TChC u37 rt2
related: cxg1 jXB S1y
related: VdsS JtP uP7
related: EBX9 7gC eLt
related: vFjb AHi a54
related: YqRE mXG L6F
related: jFHU uSj 4ke
related: wQr9 ndF jBH
related: KALC VvK 17U
related: QSeQ MpU wpW
related: 89LR AwA UqR
broad match: C2212

Industrilackerare
type: Concept
in scheme: JobTech Taxonomy - Yrke
definition: Industrilackerare lackerar eller rostskyddar material och produkter samt programmerar och övervakar industrirobotar. Arbetet innebär i huvudsak lackering av olika material och produkter inom tillverkningsindustrin. Pulverlackering och våtlackering är de metoder som används. Arbetet är i stor utsträckning automatiserat, vilket innebär programmering och övervakning av robotar, påfyllning av processkemikalier och kvalitetskontroller. Vid manuellt arbete utför man lackeringen själv med sprutpistol. Källa: Arbetsförmedlingen
broader: Lackerare och industrimålare
related: 7VU1 YYD UhB
related: JUKE 7BR esh
related: srMW hR5 UxY
related: Hjcb s2D 3dR
related: enuR Kvs BK3
related: QnDP Ynt jM2
related: wTEr CBC bqh
related: N39h FfJ KT4
broad match: C7132

Ämneslärare, 7-9
type: Concept
in scheme: JobTech Taxonomy - Yrke
definition: Ämneslärare, 7-9 arbetar med att planera, genomföra och följa upp undervisning i ett eller flera ämnen för elever i grundskolans högre årskurser. Lärare är ett reglerat yrke med legitimationskrav för att kunna bli tillsvidareanställd och sätta betyg. Vanliga arbetsuppgifter är att undervisa i klassrum, handleda elever i grupparbeten och individuella studier samt bedöma och dokumentera elevernas kunskapsutveckling. Ämneslärare samarbetar ofta med kollegor i arbetslag, har kontakt med vårdnadshavare och kan ha särskilt ansvar som mentor eller klassföreståndare. Källa: Arbetsförmedlingen, Göteborgs universitet, Skolverket, Socialstyrelsen
broader: Grundskollärare
related: 1im5 gpH TNC
related: kXfH oGq ziE
related: yRys xFQ tET
related: 7x7m fyi 41T
related: kRxj gb4 AE7
related: CXJp V1U ycY
related: FEGW 9fH uCj
related: xCBk bc1 Bpq
related: N8fS PR4 SiB
related: sQjp 5hY mWE
related: LbSu jzW wGt
related: A5gv 2Zi Fzr
related: pj4W RMt q8y
related: 4xo2 qza oLa
related: zPhY JMC weQ
related: jcZD JZZ kHi
related: GnFC WGM uAq
related: ppBe 3r9 2si
related: MyVm Kva oiZ
related: wUit ryo qLN
related: MVqp eS8 kDZ
related: G9yV QuL LSh
related: aYKP 9e2 v9E
related: t74S AZS Bsb
related: X1Rj twR g7h
related: 7qtV Jw2 JGb
related: pyke dAD gwF
related: 3jJC HQR 7px
related: oPQT 2QS TVX
related: 4AC2 Jaw 5xp
related: uGZp sES 56c
related: 9sgR EAy 3W9
related: aUUs 1Se qhU
related: j3ep 8vv nLH
related: fQST HDG cvc
broad match: C2341

Diakoner
type: Concept
in scheme: JobTech Taxonomy - Yrke
definition: Leder det diakonala arbetet. Håller stödjande samtal med ungdomar och äldre. Gör hembesök hos äldre och sjuka. Leder och organiserar de som arbetar frivilligt inom kyrka och församling. Bygger nätverk med andra institutioner som polis och socialtjänst. Assisterar prästen i gudstjänst vid nattvard eller förbön.
broader: Präster och diakoner
related: kb9z LG1 CZE
related: kojv fm9 4JL
related: LK7B LX7 vjo
related: fksd G23 wke
related: C2635
related: QAaJ QeY Q6P
related: oJiB gms Rm7
related: SfoE zq7 ADN
related: rbka PL5 MRM
related: NfMW mM2 Pqr
related: BCCY ZqV imt
narrower: Diakon
broad match: GazW 2TU kJw

Pantlånare
type: Concept
in scheme: JobTech Taxonomy - Yrke
definition: Pantlånare värderar föremål som lämnas som säkerhet för lån, beräknar lånevillkor och hanterar utbetalning och mottagande av pant. Arbetsuppgifterna inkluderar kundmöten i butik, registrering av pantobjekt i datasystem, administrativ dokumentation, lagerhantering och hantering av återlösen eller försäljning av osålda föremål. Pantlånare bedömer värde på smycken, teknik och andra värdeföremål, informerar om avgifter och räntor samt upprättar kvitton och kontrakt. Yrket är aktuellt och efterfrågat, särskilt inom företag som Sefina och Pantbanken, där rollen ofta kombineras med butikstjänst och serviceuppdrag. Pantlånare värderar föremål som lämnas som säkerhet för lån, beräknar lånevillkor och hanterar utbetalning och mottagande av pant. Arbetsuppgifterna inkluderar kundmöten i butik, registrering av pantobjekt i datasystem, administrativ dokumentation, lagerhantering och hantering av återlösen eller försäljning av osålda föremål. Pantlånare bedömer värde på smycken, teknik och andra värdeföremål, informerar om avgifter och räntor samt upprättar kvitton och kontrakt. Yrket är aktuellt och efterfrågat, särskilt inom företag som Sefina och Pantbanken, där rollen ofta kombineras med butikstjänst och serviceuppdrag. Källor: Arbetsförmedlingen, Sefina Svensk Pantbelåning
broader: Inkasserare och pantlånare m.fl.
related: RPTn bxG ExZ
related: X82t awd Qyc
broad match: C4213

Viltmästare
type: Concept
in scheme: JobTech Taxonomy - Yrke
definition: Viltmästare
broader: Specialister och rådgivare inom skogsbruk
related: pDCk zPn jbu
related: WGAZ xaM gUE
related: SJPJ UWn MZ3
related: VuuL 7CH adj
broad match: C2132

Yrken med krav på fördjupad högskolekompetens inom juridik, kultur och socialt arbete m.m.
type: Concept
in scheme: JobTech Taxonomy - Yrke
definition: Yrken med krav på fördjupad högskolekompetens inom juridik, kultur och socialt arbete m.m.
broader: Yrken med krav på fördjupad högskolekompetens
narrower: Jurister
narrower: Konstnärer, musiker och skådespelare m.fl.
narrower: Museiintendenter och bibliotekarier m.fl.
narrower: Socialsekreterare och kuratorer m.fl.
narrower: Författare, journalister och tolkar m.fl.
narrower: Präster och diakoner

Energiexpert
type: Concept
in scheme: JobTech Taxonomy - Yrke
definition: Energiexperter analyserar och optimerar energianvändning samt genomföra energideklareringar för fastigheter. Arbetsuppgifterna omfattar bland annat att granska energistatistik, ta fram åtgärdsförslag, rapportera energiprestanda samt ge rekommendationer för förbättringsåtgärder. Energiexperten utför även energideklarationer, besiktningar och inspektioner. För att utföra energideklarationer krävs certifiering som energiexpert. Källa: Boverket, Kiwa, Arbetsförmedlingen
broader: Brandingenjörer och byggnadsinspektörer m.fl.
related: E7hm BLq fqZ
related: osVT qKH m7H
related: j7Cq ZJe GkT
broad match: C3112

Pastorer m.fl.
type: Concept
in scheme: JobTech Taxonomy - Yrke
definition: Leder och planerar arbetet i frikyrkoförsamling. Leder gudstjänst och håller möten. Förrättar dop, vigslar och begravningar. Uttolkar bibliska skrifter och undervisar i trosfrågor. Utövar själavård.
broader: Behandlingsassistenter och pastorer
related: C3413
related: 2qrj cV2 z8H
related: kb9z LG1 CZE
related: wNqU 8yW c8f
related: Phd3 dMW BLu
related: HZun XTf SfF
related: tPrj wZe BMw
narrower: Pastor, frikyrkoförsamling
narrower: Församlingsföreståndare, frikyrka
broad match: GazW 2TU kJw

Organisationsutvecklare, utredare och HR-specialister m.fl.
type: Concept
in scheme: JobTech Taxonomy - Yrke
definition: Organisationsutvecklare, utredare och HR-specialister m.fl.
broader: Yrken med krav på fördjupad högskolekompetens inom ekonomi och förvaltning
narrower: Lednings- och organisationsutvecklare
narrower: Planerare och utredare m.fl.
narrower: Personal- och HR-specialister

Ekonomikonsult
type: Concept
in scheme: JobTech Taxonomy - Yrke
definition: Ekonomikonsult
broader: Lednings- och organisationsutvecklare
related: X82t awd Qyc
related: Wo8D xys Lew
related: f2Lh Ado 5RU
broad match: C2421

Chefer och ledare inom trossamfund
type: Concept
in scheme: JobTech Taxonomy - Yrke
definition: Har samordnings- och tillsynsansvar för verksamhet i Svenska kyrkan eller i annat trossamfund. Utformar riktlinjer, följer upp och utvärderar verksamheten mot uppsatta mål.
broader: Chefer och ledare inom trossamfund
related: Phd3 dMW BLu
related: 8tYq EXD Xwm
related: ZzN5 m7B 5CY
related: SkzU qDQ Lho
related: Nksx 4oe fEQ
related: C2636
related: Gt5f wdi FSJ
related: zXNU zXR hGd
related: SsWv zGv Vp7
related: Qcej yyR HG3
related: sGky Wqy QvZ
narrower: Kyrkoherde
narrower: Verksamhetschef inom trossamfund
broad match: bh3H Y3h 5eD

PR-chef
type: Concept
in scheme: JobTech Taxonomy - Yrke
definition: PR-chef
broader: Informations-, kommunikations- och PR-chefer
related: M6MM czp Vrq
related: epLc SkD cbT
related: hmHz LTk 6HQ
related: bh3H Y3h 5eD
related: XiB9 quS PQT
related: m4Ez dBa kBp
related: sdbG Jgn 6TG
broad match: C1222

Larmtekniker
type: Concept
in scheme: JobTech Taxonomy - Yrke
definition: Larmtekniker installerar, driftsätter och servar larm- och säkerhetssystem i villor, kontor och offentliga miljöer. Yrket kan även kallas larminstallatöer. Arbetet innebär att installera brandlarm, inbrottslarm, kamerabevaknings- och passersystem samt annan säkerhetsutrustning. I arbetet ingår att installera, driftsätta, programmera och utföra servicearbeten i systemen. Man arbetar ofta på larm- och säkehetsföretag eller av elinstallationsföretag med egen säkerhetsavdelning. Källa: Arbetsförmedlingen
broader: Elektronikreparatörer och kommunikationselektriker m.fl.
related: xwiG 2kc Rvn
related: KbBS SKq sLm
related: jS1k g2V Vfy
related: QrEs 2PE ENm
related: E7hm BLq fqZ
related: upLS W6r KMv
related: PjKS LjU tFh
related: yhCP AqT tns
related: 8mht ZH4 EuP
related: DNBx Aoe Yct
related: ETV6 xiY y3r
related: FP2h 3k2 3HD
broad match: C7422

Psykolog
type: Concept
in scheme: JobTech Taxonomy - Yrke
definition: Psykolog förebygger, utreder, diagnostiserar och behandlar psykisk ohälsa samt främja psykiskt välbefinnande hos individer, grupper och organisationer. Psykolog är en skyddad titel med legitimationskrav. Vanliga arbetsuppgifter är samtalsterapi, psykologiska utredningar och förebyggande och hälsofrämjande insatser. Psykologer kan också handleda personal, ge ledningsstöd, delta i organisationsutveckling och arbeta med forskning eller utbildning. Arbetet sker inom exempelvis hälso- och sjukvård, skola, företagshälsovård, myndigheter och privat verksamhet. Källa: Arbetsförmedlingen, Psykologförbundet, Socialstyrelsen
broader: Psykologer
related: vj6a Eh9 2wV
related: hGKj zEz kHy
related: uLfH SrJ x6n
related: NYW6 mP6 vwf
related: sqvh gTy 6Sj
related: UTMV fWx zBe
related: pscQ wwD PRc
related: xD53 WVR tDV
related: k7rH MTi QnC
related: xKtD kc7 mYw
related: azN4 kD2 CqP
related: HfvF Ezq Wpa
related: DU1n z7d 1Yy
related: u36X YNV QDs
related: 3uD4 vFE CA8
related: XUxN Zct W7K
related: fNSk 1SY 43e
related: xHC8 Roh USp
related: GCMv ji5 A26
related: fdo2 sVF xoR
related: mJCV XoT jSp
broad match: C2634

Dentaltekniker/Dentalutrustningstekniker
type: Concept
in scheme: JobTech Taxonomy - Yrke
definition: Dentaltekniker/Dentalutrustningstekniker
alternative label: Dentaltekniker
alternative label: Dentalutrustningstekniker
broader: Tekniker, bilddiagnostik och medicinteknisk utrustning
related: 6Hq3 tKo V57
broad match: C3211

Bygg- och anläggningsförare
type: Concept
in scheme: JobTech Taxonomy - Yrke
definition: Bygg- och anläggningsförare transporterar byggmaterial. Bygg- och anläggningsförare arbetar med att transportera byggmaterial, antingen för återvinning eller för att frakta fyllnadsmaterial till byggprojekt. Föraren ingår ofta i ett arbetslag och samarbetar nära med andra yrkesgrupper, som grävmaskinister. Föraren behöver ha god kunskap om olika typer av fyllnadsmaterial och byggprocesser, som vid vägbyggen. Arbetet kräver både praktisk kunskap och förmåga att samarbeta effektivt på byggarbetsplatsen. Källa: Transportfackens yrkes- och arbetsmiljönämnd
broader: Lastbilsförare m.fl.
related: dSVd 4Ab kjJ
related: iKT8 eDc J8z
related: viFX RHK nQp
related: A7A9 LsF 9Eg
related: EL4n Rej 5Qu
related: d68E e74 a59
related: uvbc y4z f4b
related: bCUX YKG Vvt
related: hhb7 1hV t7R
related: nD9v iHa ytM
related: ASGV zcE bWf
related: sRa5 6YZ cn9
related: 9s4t Thb Z3q
related: AMzM iAp 4yZ
related: 4abf SeA 4jN
related: 483u hVx psa
related: 9wnn PAV q12
related: v7sz sto NKL
related: nSTH Jr6 JGS
related: 6DmP 5FE Eii
related: 3Y7a qyH gRM
related: B6vf mf7 UAL
broad match: C8332

Agil coach/Agile coach
type: Concept
in scheme: JobTech Taxonomy - Yrke
definition: Agil coach/Agile coach
alternative label: Agil coach
alternative label: Agile coach
broader: Övriga IT-specialister
related: 6VN4 6mB H14
related: apaJ 2ja LuF
related: iyeA 3j5 MQo
broad match: C2519

Scenförman
type: Concept
in scheme: JobTech Taxonomy - Yrke
definition: Scenförman ansvarar för det praktiska ledarskapet och den tekniska samordningen på scen vid teaterföreställningar, konserter och andra evenemang. Vanliga arbetsuppgifter är att leda och hjälpa scenarbetare, hantera teknisk utrustning, rigga och rigga ner scener, samt se till att säkerhetsföreskrifter följs på och bakom scenen. Scenförman planerar, organiserar och leder arbetet med scenografi, rekvisita, ljus och ljud samt säkerställer att allt är på plats inför och under föreställningar. Källor: Arbetsförmedlingen, Platsannonser
broader: Ljus-, ljud- och scentekniker
related: 8too bEs 7NU
related: 9puE nYg crq
related: d1Ao 9bY 7Kn
broad match: C3435

Stenhuggare
type: Concept
in scheme: JobTech Taxonomy - Yrke
definition: Stenhuggare bearbetar sten för olika ändamål, som byggnadsdetaljer, monument eller konstverk. Arbetsuppgifterna innefattar att skära, forma och slipa sten till olika produkter så som gravstenar, interiör beklädnad, gatsten och trädgårdssten. Man kan arbeta både manuellt, hantverksmässigt med manuella verktyg eller maskinellt, till exempel med hydrauliklippare och CNC-maskiner. Man arbetar ofta efter ritning eller mönster. Beroende på arbetsplats kan truckkörning och leveransförberedelser ingå i arbetsuppgifterna. Källa: Sveriges stenindustriförbund, Arbetsförmedlingen
broader: Stenhuggare m.fl.
related: JA9U AMh oZa
related: 5zaw rfP keN
related: 47GW LUm kXY
related: CYvx rY7 tMi
related: iiAN zGw rpD
related: uLUD REv 3nW
related: Qdrp huu ogw
related: 8vFX ML8 q7d
related: ciaW e9N TD7
related: zAFM CVU Fmc
related: wTEr CBC bqh
broad match: C7113

Lärling, sprinklermontör
type: Concept
in scheme: JobTech Taxonomy - Yrke
definition: En lärling är anställd på företag för att göra sin färdigutbildningstid till sprinklermontör. Lärlingsanställningen görs efter skolutbildning eller tillsammans med teoretiskt kurspaket. Under färdigutbildningstiden på företaget lär sig lärlingen yrket mer praktiskt och skall nå sina kunskapsmål för branschcertifikat. Certifikat erhålls efter ett branschprov. Källa: VVSYN
broader: VVS-montörer m.fl.
related: j7Cq ZJe GkT
broad match: C7126

Torg- och marknadsförsäljare
type: Concept
in scheme: JobTech Taxonomy - Yrke
definition: Torg- och marknadsförsäljare
broader: Yrken med krav på kortare utbildning eller introduktion
narrower: Torg- och marknadsförsäljare

Kategorichef/Kategoriansvarig
type: Concept
in scheme: JobTech Taxonomy - Yrke
definition: Kategorichef och kategoriansvarig arbetar med att planera och utveckla produktkategorier inom detaljhandel, e-handel eller andra handelssektorer. Arbetsuppgifterna inkluderar analys av marknadstrender och kundbeteenden, optimering av sortiment, prissättning samt förhandling med leverantörer. De samarbetar med försäljnings- och marknadsavdelningar för att skapa lönsamma och attraktiva produktportföljer och säkerställer att rätt produkter finns tillgängliga vid rätt tidpunkt. Rollen innebär även uppföljning och utvärdering av kategorins försäljningsresultat och affärsmål. Kategorichefer har vanligtvis ett mer strategiskt ansvar medan kategoriansvariga kan ha en mer operativ inriktning, men ansvarsområden kan variera mellan olika företag. Källor: Arbetsförmedlingen, jobbannonser på Platsbanken
alternative label: Kategoriansvarig
alternative label: Kategorichef
broader: Inköpare och upphandlare
related: N1BU td3 mRi
related: 5bVA 5Qw 2tL
related: RPTn bxG ExZ
related: epLc SkD cbT
related: uRG8 BNq D3M
related: bh3H Y3h 5eD
related: xkqi 4ep 61b
related: cW5k i1e t6X
related: 7yiD vRc uXK
related: t14r crF thg
related: Dw8G 7jP BeS
related: 6qMX F2N FCq
related: 84D6 JpY ksz
broad match: C3323

Konsthantverkare
type: Concept
in scheme: JobTech Taxonomy - Yrke
definition: Konsthantverkare tillverkar konstföremål genom traditionella hantverkstekniker. Arbetet kan omfatta flera material som trä, metall, glas, textil, keramik, läder eller sten och kan innefatta både funktionella och dekorativa objekt. Exempel på arbetsuppgifter inkluderar formgivning, design, tillverkning, dekoration och ytbehandling av produkter. Källa: Arbetsförmedlingen
broader: Musikinstrumentmakare och övriga konsthantverkare
related: nwrk qCY grm
related: PaxQ o1G wWH
related: v3cL 6eA RSC
broad match: C7317

Forensiker, biologi
type: Concept
in scheme: JobTech Taxonomy - Yrke
definition: Forensiker, biologi
broader: Cell- och molekylärbiologer m.fl.
related: kJeN wmw 9wX
related: TXx8 Mgv BGZ
broad match: C2131

Förskolerektor
type: Concept
in scheme: JobTech Taxonomy - Yrke
definition: Förskolerektor
broader: Chefer inom förskoleverksamhet
related: uHGL TJh xXU
related: epLc SkD cbT
related: MVnP SKq 3Ae
related: bh3H Y3h 5eD
related: MVqp eS8 kDZ
related: 5u68 d1y a5v
broad match: C1341

Planeringsingenjör, kemiteknik
type: Concept
in scheme: JobTech Taxonomy - Yrke
definition: Planeringsingenjör, kemiteknik
broader: Ingenjörer och tekniker inom kemi och kemiteknik
related: KRsr e9k 9cK
related: 6Hq3 tKo V57
related: 5tyY GjC AcD
related: ibqa c8P izX
broad match: C3116

Sminkör
type: Concept
in scheme: JobTech Taxonomy - Yrke
definition: Sminkörer arbetar med sminkning inför till exempel teater, film, TV och fotografering. Yrket liknar make up-artist och maskör. Make up-artist är ett mer allmänt begrepp och maskör har vanligtvis mer ansvar och mer avancerade arbetsuppgifter under produktioner. Källa: Arbetsförmedlingen, Scen & Film
broader: Övriga skönhets- och kroppsterapeuter
related: 8too bEs 7NU
related: 9puE nYg crq
related: bM8Y 3Qn xkq
broad match: C5142

Gitarrbyggare
type: Concept
in scheme: JobTech Taxonomy - Yrke
definition: En gitarrbyggare är en hantverkare som konstruerar och reparerar gitarrer. Detta innebär att de arbetar med att välja ut träslag, forma gitarrkroppen och halsen, montera strängar och elektronik (på elgitarrer) och justera instrumentet för optimalt ljud och spelbarhet. Gitarrbyggarens arbete kräver både skicklighet i träbearbetning, förståelse för akustik och musikens principer, samt ett noggrant öga för detaljer och precision. Källa: Arbetsförmedlingen
broader: Musikinstrumentmakare och övriga konsthantverkare
related: PaxQ o1G wWH
broad match: C7312

Konstnär
type: Concept
in scheme: JobTech Taxonomy - Yrke
definition: Konstnär
broader: Bildkonstnärer m.fl.
related: nMEr Qg7 iUM
related: 8too bEs 7NU
related: 9puE nYg crq
related: SjLZ ouU A8q
broad match: C2651

Bioinformatiker
type: Concept
in scheme: JobTech Taxonomy - Yrke
definition: Bioinformatiker
broader: Cell- och molekylärbiologer m.fl.
related: kJeN wmw 9wX
related: JTNH kVf TZF
related: TXx8 Mgv BGZ
related: 57m5 NKn iCu
related: nSqj Lgi PqK
broad match: C2131

Specialistarbetsterapeut
type: Concept
in scheme: JobTech Taxonomy - Yrke
definition: Specialistarbetsterapeut är en specialiserad legitimerad arbetsterapeut med en djupare kunskap inom sitt område. Arbetsterapeut är en skyddad titel med legitimationskrav. Vanliga arbetsuppgifter är att genomföra komplexa aktivitetsbedömningar, utreda och utvärdera behandlingsinsatser, handleda kollegor och studenter samt bidra till utveckling och implementering av nya metoder. Specialistarbetsterapeuten fungerar ofta som mentor, deltar i forsknings- och utvecklingsarbete och ansvarar för att det arbetsterapeutiska perspektivet integreras i verksamheten och ledningsarbetet. Källa: Arbetsförmedlingen, Region Blekinge, Socialstyrelsen, Sveriges Arbetsterapeuter
broader: Arbetsterapeuter
related: NYW6 mP6 vwf
related: q5nM r91 9qP
broad match: C2269

Kammarrättspresident
type: Concept
in scheme: JobTech Taxonomy - Yrke
definition: Kammarrättspresident är högsta administrativa chef vid en kammarrätt och leder domstolens verksamhet samt rättskipning. Arbetsuppgifterna innefattar att samordna och utveckla verksamheten, fatta övergripande beslut om domstolens organisation och resurser, följa upp att rättssäkerheten upprätthålls och företräda domstolen utåt. Kammarrättspresident medverkar även vid rekrytering av domare och bidrar vid behov i avgörandet av särskilt viktiga eller komplexa mål. Rollen kombinerar juridiskt arbete med administrativt och strategiskt ledarskap. Källa: Sveriges Domstolar, Arbetsförmedlingen
broader: Domare
related: X82t awd Qyc
related: x4Wi NWW ogB
related: Abcb QtH isZ
broad match: C2612

Layoutchef
type: Concept
in scheme: JobTech Taxonomy - Yrke
definition: Layoutchef
broader: Grafiska formgivare m.fl.
related: epLc SkD cbT
related: 8too bEs 7NU
related: 9puE nYg crq
related: WjCH PZv eAC
broad match: C2166

Experimentingenjör, el-tele
type: Concept
in scheme: JobTech Taxonomy - Yrke
definition: Experimentingenjör, el-tele
broader: Civilingenjörsyrken inom elektroteknik
related: 6Hq3 tKo V57
related: kDRm Yaa jAB
broad match: C2153

Stuntman
type: Concept
in scheme: JobTech Taxonomy - Yrke
definition: Stuntman medverkar i produktion av film, tv och scenkonst där fysiska riskmoment kräver särskild kompetens utanför skådespelarens ansvarsområde. Vanliga arbetsuppgifter är att utföra fall från olika höjder, iscensätta och delta i slagsmålsscener, hantera stuntmoment med fordon, arbeta med eld, vatten eller annan avancerad rekvisita. Källa: Arbetsförmedlingen, StagePool
broader: Övriga yrken inom kultur och underhållning
related: 8too bEs 7NU
related: 9puE nYg crq
broad match: C2659

Besiktningsingenjör
type: Concept
in scheme: JobTech Taxonomy - Yrke
definition: Besiktningsingenjörer utför tekniska besiktningar och kontroller inom olika områden, såsom byggnader, maskiner eller fordon, för att säkerställa att de uppfyller gällande lagar, normer och säkerhetskrav. Arbetsuppgifter innefattar att planera och genomföra inspektioner, analysera teknisk dokumentation, bedöma eventuella avvikelser och skriva rapporter med rekommendationer och åtgärdsförslag. Besiktningsingenjören samarbetar med entreprenörer, myndigheter och kunder för att säkerställa att tekniska system och anläggningar är säkra och fungerar som de ska. Beroende på vad som ska besiktas kan det krävas att arbetsgivare och/eller besiktningsingenjören själv är certifierad, till exempel för besiktning av lyftanordningar, trycksatta kärl eller inom entreprenad. Vanligtvis efterfrågas en teknisk bakgrund genom utbildning eller erfarenhet. Källa: Swedac, Kiwa, Arbetsförmedlingen
broader: Säkerhetsinspektörer m.fl.
related: cy2h M8U WNN
related: E7hm BLq fqZ
related: KDiD 2tu bfe
related: kDNx z5C AmY
broad match: C3115

Laboratorieassistent
type: Concept
in scheme: JobTech Taxonomy - Yrke
definition: Laboratorieassistent
broader: Biomedicinska analytiker m.fl.
related: kJeN wmw 9wX
related: 4R4V fKR GcJ
related: 99p1 f5J 7uu
related: mvTK ciU fot
related: TsYx 54y sdJ
broad match: C3212

Turistchef
type: Concept
in scheme: JobTech Taxonomy - Yrke
definition: Turistchef
broader: Chefer inom friskvård, sport och fritid
related: epLc SkD cbT
related: bh3H Y3h 5eD
related: ntCc cy4 k5h
broad match: C1213

Registrator
type: Concept
in scheme: JobTech Taxonomy - Yrke
definition: Registrator tar emot, registrerar och arkiverar inkommande och utgående handlingar inom en organisation, ofta i offentlig sektor, myndighet eller större företag. Arbetsuppgifterna omfattar diarieföring av ärenden och dokument, hantering av post och digitala funktionsbrevlådor, samordning och vidarebefordran av information, och utlämning av allmänna handlingar enligt offentlighetsprincipen. Registrator hjälper till med frågor om informationsförvaltning, ger stöd och utbildning till kollegor om dokumenthantering samt bidrar till förbättring av administrativa rutiner. Tjänsten innebär också att dokumenteras och kvalitetssäkra informationsflöden enligt gällande lagstiftning. Registrator arbetar i nära samverkan med administratörer, handläggare och ibland arkivarier samt har frekventa kontakter med allmänhet och externa parter. Källor: Jobbannonser på Platsbanken, Arkivit
broader: Övriga kontorsassistenter och sekreterare
related: PzJy 3tb odS
related: PDNm NZ2 WRh
related: x2Fz 8aM mrm
related: X82t awd Qyc
related: XLMP QCQ P3M
related: YwbA F7q zMj
related: xiyE 2FZ 6gt
related: JKFs szF GeB
related: cNi7 X1k pJF
broad match: C4120

Processoperatör kemisk industri
type: Concept
in scheme: JobTech Taxonomy - Yrke
definition: Processoperatörer inom kemisk industri styr och övervakar tillverkning av kemiska produkter. Processoperatörer inom kemisk industri styr och övervakar tillverkning av kemiska produkter. Arbetet sker vanligtvis från ett kontrollrum. Andra vanliga arbetsuppgifter är provtagning, kvalitetskontroll, dokumentation, tillsyn och underhåll. En viktig del i arbetet avser säker hantering av kemikalier och processteg enligt instruktioner. Truckkörning är även förekommande. Källa: Arbetsförmedlingen
broader: Processövervakare, kemisk industri
related: yhCP AqT tns
broad match: C3133

Generalsekreterare
type: Concept
in scheme: JobTech Taxonomy - Yrke
definition: Generalsekreterare
broader: Chefstjänstemän i intresseorganisationer
related: epLc SkD cbT
related: bh3H Y3h 5eD
broad match: C1114

2:e Styrman
type: Concept
in scheme: JobTech Taxonomy - Yrke
definition: 2:e styrman är ansvarig för underhåll och drift av livräddningsutrustningen ombord samt är sjukvårdsansvarig ombord. 2:e styrman tillsammans med överstyrman arbetsleder manskapet vid lastning och lossning och ser till att det blir gjort på ett säkert sätt. En 2:e styrman är ansvarig för navigationen på bryggan under sin vakt. Behörigheter inom sjöfart såsom certifikat och behörighetsbevis som krävs för olika befattningar ombord och som styrs av, typ av fartyg, finns samlade i Transportstyrelsens behörighetsguide Källa: Satsa på sjöfart
broader: Fartygsbefäl m.fl.
related: dRFw Rcu dX7
related: fmCS 7n9 DqW
related: gs65 ynn fcr
related: ASGV zcE bWf
related: XouD cCj HZN
related: gthF y5Z j3Z
related: vSAt THv Rvv
broad match: C3152

Departementschef
type: Concept
in scheme: JobTech Taxonomy - Yrke
definition: Departementschef
broader: Politiker
related: epLc SkD cbT
related: bh3H Y3h 5eD
broad match: C1111

Civilingenjörsyrken inom logistik och produktionsplanering
type: Concept
in scheme: JobTech Taxonomy - Yrke
definition: Utvecklar, leder, planerar och kontrollerar material- och informationsflöden och produktionsplanering. Styr tillverkningsverksamhet och bedömer kostnadseffektivitet. Beslutar tillsammans med marknadsorganisation och kund om tidsplan och produktionsvolym. Planerar och beslutar om leverantörs- och transportkedjan, samt anläggnings- och systemplaner. Hit hör inte Yrken inom logistik och produktionsplanering med arbetsuppgifter motsvarande ingenjör- eller teknikernivå (3111)
broader: Civilingenjörsyrken
related: tx8m dhy jwZ
related: uvcb DuX NW8
related: CY3S ton bPV
related: 9Hvc DYG iqB
related: DNB8 yG1 iSC
related: tg8L maz wMN
related: CpsQ 4fg kpZ
related: LXoc wxV 73h
related: 74Mw JUN VKx
related: kLLw dnR M38
related: YK2s pxn YWW
related: X8qr J5g uXi
related: Bb7a V49 Da8
related: PGDh 8HQ 4BZ
related: fqgM 4N7 usM
related: Ry2v 4Hx 6ta
related: xsSg pg2 Bpq
related: Z2XD GQ9 qvM
related: cCGX 6Y8 87C
related: C2141
related: r78c Y6B h6r
related: ppUe nsQ hn5
related: irPd z5v 2o1
related: WVJF FXY Sqk
related: BE3s D4k E1k
related: a1Sf mey gVk
related: zFHj MT3 baD
related: BcFG Ckm S65
related: 2rqG WLp em4
related: ePwi BWJ RUG
related: UJcF SrQ Jvw
related: MfG9 ybe zVS
related: W4er Syp Wrt
related: PkRJ QEL xm5
related: tZ8d VuQ V7z
related: kvLG 4uo M5p
related: yXmf iKi 7ci
related: iVyx aLa ZWy
related: fKNz Mn2 YCQ
related: t9Um wBh Cb4
related: NB2C zFs C9F
related: Y197 2oc uoE
related: AjDN 1rp vzp
related: AEgv 4gP ndv
related: Lgt8 xjP 7Fq
related: 3Sj1 uuL y1A
related: MT1a Nyq DGQ
related: 3zgs 61Q etM
related: 2ZDh 43R pbp
related: YHb7 uwj 7NG
related: Musz 6dL pDx
related: Bbj8 8y7 XJ5
related: cjzD 31U USf
narrower: Logistiker
narrower: Supply chain manager/SCM manager
narrower: Materialplanerare
narrower: Materialstyrare
narrower: Logistikingenjör
broad match: 6Hq3 tKo V57

Ekonomi- och finanschefer
type: Concept
in scheme: JobTech Taxonomy - Yrke
definition: Ekonomi- och finanschefer
broader: Chefer inom ekonomi, HR, marknadsföring och försäljning samt annan administration m.m.
narrower: Ekonomi- och finanschefer

Psykologstuderande
type: Concept
in scheme: JobTech Taxonomy - Yrke
definition: Psykologstuderande är en student som utbildar sig till psykolog. Vanliga arbetsuppgifter är samla in och sammanställa testresultat, assistera vid anamnes och observationer och genomföra enklare behandlingsmoment under handledning. Källa: Arbetsförmedlingen, Sveriges Kommuner och Regioner
broader: Psykologer
related: NYW6 mP6 vwf
related: pWGx v5P gSu
broad match: C2634

Miljöcontroller
type: Concept
in scheme: JobTech Taxonomy - Yrke
definition: Miljöcontroller
broader: Specialister inom miljöskydd och miljöteknik
related: s3Za h2V wUg
related: kJeN wmw 9wX
related: vw7i 55Q xxT
related: 4ff1 4gB Dew
related: Zgn8 jd7 jEm
broad match: C2133

Ortodontiassistent
type: Concept
in scheme: JobTech Taxonomy - Yrke
definition: Ortodontiassistenter arbetar inom tandvården med inriktning på tandreglering och assisterar tandläkare vid behandling av patienter med bettavvikelser. Arbetet innefattar både självständiga och assisterande uppgifter, såsom att justera tandställningar, ta avtryck, fotografera tänder och sköta administrativa uppgifter. Yrket kräver en yrkesutbildning som tandsköterska och vidareutbildning inom ortodonti. Källa: Svenska Tandsköterskeförbundet, Arbetsförmedlingen
broader: Tandsköterskor
related: NYW6 mP6 vwf
related: ZUeb s1b ruF
broad match: C3251

Inredningsarkitekt
type: Concept
in scheme: JobTech Taxonomy - Yrke
definition: Inredningsarkitekt planerar och utformar inomhusmiljöer för bostäder, arbetsplatser och offentliga lokaler med fokus på funktion, estetik och användarvänlighet. Arbetsuppgifterna innefattar att skapa designkoncept, rita skisser och tekniska ritningar samt välja material, färger och möbler. Inredningsarkitekten samarbetar med kunder, byggentreprenörer och andra yrkesgrupper för att säkerställa att design och projektkrav uppfylls. Rollen omfattar projektledning, budgetering och uppföljning av projekt under genomförandefasen. Yrket kombinerar kreativitet med teknisk kunskap och har ofta fokus på hållbarhet och ergonomi. Källor: Sveriges Arkitekter, Arbetsförmedlingen, branschföreningar,
broader: Arkitekter m.fl.
related: 4epy u8B Q5t
related: 6Hq3 tKo V57
related: 8too bEs 7NU
broad match: C2161

Hudterapeuter
type: Concept
in scheme: JobTech Taxonomy - Yrke
definition: Utför ansikts- och kroppsbehandlingar. Gör hudanalyser, djuprengör huden, ger massage och lägger masker och krämer. Ger råd och föreslår lämpliga behandlingar och produkter. Hit hör inte Manikyrist/Manikurist (5149) Nagelterapeut/Nagelteknolog (5149) Pedikyrist/Pedikurist (5149)
broader: Skönhets- och kroppsterapeuter
related: YKKr PYc Bhh
related: p4mQ KPR u1g
related: 5APZ gLs AB4
related: 4QAE wtY gJh
related: 8S2f kNg dUk
related: C5142
related: GL3x bFE 86J
related: JUgh t44 jVw
related: wXzF XdX EwR
related: bPCR BeT Jo2
related: kcCV THw sxH
related: RVLi 2no Eyg
related: Mz8Q Xfp x7x
related: CHJs Q9A T5V
related: 3jaq H3s L5x
related: yCKb VPi Lqn
related: Gstq 4UH 9na
related: WW1S XpE BVK
related: mYYL Cdm 9DU
related: ayge aHH pkG
related: x8pz eVh sjQ
narrower: Ekologisk hudvårdsterapeut
narrower: Hudterapeut
broad match: Uuf1 GMh Uvw

Lantbruksinspektor
type: Concept
in scheme: JobTech Taxonomy - Yrke
definition: Lantbruksinspektor
broader: Specialister och rådgivare inom lantbruk m.m.
related: 6nbS RdB kzm
related: VuuL 7CH adj
broad match: C2132

Åklagare
type: Concept
in scheme: JobTech Taxonomy - Yrke
definition: En åklagare är en jurist som arbetar för staten och är ansvarig för att utreda brott, besluta om åtal ska väckas och att företräda åklagarsidan i domstol. Åklagaren är den som leder förundersökningen och bedömer om det finns tillräckliga bevis för att väcka åtal eller om förundersökningen skall läggas ner. Källa: Åklagarmyndigheten
broader: Åklagare
related: X82t awd Qyc
related: x4Wi NWW ogB
related: uEc9 rYt EU2
related: 6LgT oDj yUt
related: BSN5 HJF mPH
related: Kc4B wV8 viz
related: Abcb QtH isZ
related: vQSJ P7f ZRK
broad match: C2611

Mimpedagog
type: Concept
in scheme: JobTech Taxonomy - Yrke
definition: Mimpedagog
broader: Övriga pedagoger med teoretisk specialistkompetens
related: pVzY rff Amk
related: MVqp eS8 kDZ
broad match: C2355

Övriga yrken inom kultur och underhållning
type: Concept
in scheme: JobTech Taxonomy - Yrke
definition: Utför övrigt arbete inom kultur och underhållning än inom 3431-3433. Exempel på arbetsuppgifter: Framför cirkuskonster och illusionsnummer. Jonglerar, imiterar m.m. Agerar i farliga sekvenser på film. Presenterar program i radio och TV.
broader: Fotografer, dekoratörer och underhållningsartister m.fl.
related: 27SK YN7 i8o
related: hmzA oSF ttk
related: Unro ZTB 8mE
related: ikFp FNn YxB
related: C3435
related: srKm zQs Zqt
related: SSJa aug itH
related: YBBL 6Te Eqv
related: xaey xNz Jg6
related: KcLQ k3H SLE
related: fgD6 N1b oab
related: Mqh7 gYw ZDC
related: mcwk TMB KHn
related: 42PE qfg e8t
related: DTx9 wZ6 jeC
related: D5p7 wzU NXV
related: 5XhW VQA 2CW
related: b6eJ GMv Vp8
related: 17YF AnH VvA
related: 98C6 xyV h75
related: RS9e z4J jSs
related: RG5k D9y iW5
related: tTCv G5T myB
related: C2659
related: VVQA hhQ fSw
related: P6bN 37W 48N
related: WfAZ bJH rUo
related: PDiG Kwa zyy
related: gB6F 6dC Gct
related: 9X2P HNB uNM
related: L1Q1 Msi Ce5
related: ZTMP i6C 9Sq
related: VB6Y VoL Cnz
related: ZBTV r1p MV9
related: YaGu P82 ffU
related: dU6q dVr s9o
related: hRTw YKx cDQ
related: 9HMn 4fe y34
related: JimQ Gu4 ePZ
related: C2656
related: Pk1y cpM ZhC
narrower: Varietéartist
narrower: Trollkonstnär
narrower: Moderator
narrower: Imitatör
narrower: Inläsare
narrower: Trapetskonstnär
narrower: Illusionist
narrower: Showartist
narrower: Programpresentatör
narrower: Cirkusartist
narrower: Konferencier
narrower: Jonglör
narrower: Lindansare
narrower: Programvärd/Programvärdinna
narrower: Stand-up-komiker
narrower: Statist
narrower: Stuntman
narrower: Akrobat
narrower: Diskjockey
narrower: Programledare
broad match: 9puE nYg crq

Officerare
type: Concept
in scheme: JobTech Taxonomy - Yrke
definition: Officerare
broader: Militära yrken
narrower: Officerare

Kontrollingenjör, textil, trä, glas, förpackningar
type: Concept
in scheme: JobTech Taxonomy - Yrke
definition: Kontrollingenjör, textil, trä, glas, förpackningar
broader: Övriga ingenjörer och tekniker
related: 6Hq3 tKo V57
broad match: C3119

Piloter, fartygs- och maskinbefäl m.fl.
type: Concept
in scheme: JobTech Taxonomy - Yrke
definition: Piloter, fartygs- och maskinbefäl m.fl.
broader: Yrken med krav på högskolekompetens eller motsvarande inom teknik
narrower: Maskinbefäl
narrower: Flygledare
narrower: Piloter m.fl.
narrower: Fartygsbefäl m.fl.
narrower: Flygtekniker

Onkologisjuksköterska
type: Concept
in scheme: JobTech Taxonomy - Yrke
definition: Onkologisjuksköterska ger omvårdnad, behandling och stöd till patienter med cancersjukdomar genom hela vårdprocessen. Sjuksköterska är en skyddad titel med legitimationskrav. En onkologisjuksköterska med specialistsjuksköterskeexamen får använda benämningen specialistsjuksköterska inom onkologisk vård. Vanliga arbetsuppgifter är att administrera cytostatika och annan läkemedelsbehandling, övervaka patienternas hälsotillstånd, hantera symtom och biverkningar samt ge information och stöd till patienter och närstående. Onkologisjuksköterskan ansvarar för att planera och samordna vårdinsatser samt deltar i utvecklingsarbete inom cancervården. Källa: Arbetsförmedlingen, Socialstyrelsen, Svensk sjuksköterskeförening
broader: Övriga specialistsjuksköterskor
related: NYW6 mP6 vwf
related: vkBk QNA 3ZU
related: HCB2 dhX 6ro
related: 6wRq sYF RDU
related: ytRi QuA XLX
related: 1f7B E5K sh3
broad match: C2221

Torg- och marknadsförsäljare m.fl.
type: Concept
in scheme: JobTech Taxonomy - Yrke
definition: Säljer frukt, grönsaker, mat och andra varor på torg och allmänna platser t.ex. vid marknader.
broader: Torg- och marknadsförsäljare
related: cWRj kbz Zh3
related: C9520
related: Yufg GC2 LXS
related: UssR m8J XA6
related: FMyD iiR FKA
related: 4oKa e7b oHW
related: C5211
related: mRyD DRC 5tT
related: C5212
related: y71S LsF xLV
related: hYpk RYx y3V
related: rJsb Rse ixK
related: RFer rtf x6t
narrower: Gatuförsäljare
narrower: Marknadsförsäljare
broad match: RPTn bxG ExZ

Äldreomsorgschef
type: Concept
in scheme: JobTech Taxonomy - Yrke
definition: Äldreomsorgschef
broader: Chefer inom äldreomsorg
related: GazW 2TU kJw
related: epLc SkD cbT
related: bh3H Y3h 5eD
broad match: C1343

Maskinkonstruktör
type: Concept
in scheme: JobTech Taxonomy - Yrke
definition: Maskinkonstruktör
broader: Ingenjörer och tekniker inom maskinteknik
related: 6Hq3 tKo V57
related: L775 h7B XrZ
related: 9aEn jPz gJs
related: KWNv oWK 5E2
related: tLSo 1RM Tjj
related: 8P2V L1r 8Da
related: WoQ9 Uhj gTs
related: aHvp 7CA reh
related: M67P LTc ksz
related: XeVy FEL vKf
related: hCgF qPG BUJ
related: C41S vox 2gE
related: jpFv qFK GmS
related: Wyz7 4NY Muq
broad match: C3115

Transport- och maskinföraryrken
type: Concept
in scheme: JobTech Taxonomy - Yrke
definition: Transport- och maskinföraryrken
broader: Yrken inom maskinell tillverkning och transport m.m.
narrower: Bil-, motorcykel- och cykelförare
narrower: Maskinförare
narrower: Lokförare och bangårdspersonal
narrower: Matroser och jungmän m.fl.
narrower: Lastbils- och bussförare

Yrkesdykare
type: Concept
in scheme: JobTech Taxonomy - Yrke
definition: Yrkesdykare
broader: Anläggningsdykare
related: j7Cq ZJe GkT
related: yiWn Cs3 fbV
related: Kppc 7wC mEw
broad match: C7541

Beläggningsarbetare
type: Concept
in scheme: JobTech Taxonomy - Yrke
definition: En beläggningsarbetare anlägger, underhåller och reparerar vägytor. Det kan vara en parkväg, en Europaväg, en väg i ett öppet landskap, på en bro eller i en tunnel, allt från grus med bindemedel till nyutvecklade specialbeläggningar. Det är ett yrke där utveckling av teknik och arbetsmiljö går hand i hand, till exempel datoriserade asfaltverk som styrs från miljösäkrade kontrollrum eller satellitstyrda utläggningsmaskiner. Beläggningsarbetaren kan ansöka om sitt yrkesbevis efter teoretisk grundutbildning och lärlingsanställning. Källa: BYN
broader: Anläggningsarbetare
related: j7Cq ZJe GkT
related: ammt Jz4 fjx
related: mgx9 BWz dVe
related: ja7J P8X YC9
related: upbS QFL YQP
related: y7Tx knR LT8
related: ENRQ GMC rBL
related: SaE2 uq1 8g1
related: xGxk WsH 9Xe
broad match: C7119

Databasadministratör
type: Concept
in scheme: JobTech Taxonomy - Yrke
definition: Databasadministratörer underhåller, konfigurerar och övervakar databaser för hantering av information i IT-miljöer. Arbetsuppgifter inkluderar installation av databasprogramvara, optimering och uppgradering av databassystem, utveckling av backup- och återställningsrutiner, felsökning samt anpassning av databasservermiljöer till verksamhetens behov. Databasadministratörer samarbetar med utvecklare och andra IT-specialister för att säkerställa datakvalitet och tillgänglighet. Källa: SACO, Arbetsförmedlingen
broader: Systemadministratörer
related: a9XP 4HH yAC
related: 3Wne 76z c8h
related: RW9b fT3 WgZ
related: RdvH V8j wBH
related: 2XQE ftd KDw
related: E3Jz JH7 cZk
related: FcKv GDN wWE
related: GUiS jkP JLd
related: apaJ 2ja LuF
related: kvtS DEM ASs
related: JFDr qE6 RPM
related: 54E8 9Mj 8CP
related: dprC Fq3 xeL
related: 8THv 88X Jh3
broad match: C2521

Textildesigner
type: Concept
in scheme: JobTech Taxonomy - Yrke
definition: Textildesigner skapar mönster för textilprodukter. Vanligtvis arbetar en textildesigner med inredning, produktdesign eller mode. Arbetsuppgifter kan inkluderar att undersöka trender, sätta färgpaletter, rita och digitalisera mönster samt producera säljmaterial som kollektionskataloger. Beroende på arbetsplats kan även produktutveckling ingå. Textildesigner har kunskaper i formgivning, färgsättning, textila material och mönsterformgivning. Källa: Högskolan i Borås, Arbetsförmedlingen
broader: Övriga designer och formgivare
related: gT9u ZKX DRD
related: 9puE nYg crq
related: p4Av WX4 8wG
broad match: C2163

Språkutbildare
type: Concept
in scheme: JobTech Taxonomy - Yrke
definition: Språkutbildare undervisar i språk för olika syften, utanför det reguljära utbildningsväsendet. Vanligtvis arbetar man för privata företag eller andra organisationer som erbjuder språkutbildning för specifika syften, så som affärsspecifik terminologi eller extra utbildning i svenska för icke-modersmålstalare. Yrket kan likna SFI-lärare, med skillnad att SFI-undervisning utförs av kommuner. Källa: Arbetsförmedlingen
broader: Övriga utbildare och instruktörer
related: 1RF3 4z9 AmY
related: MVqp eS8 kDZ
broad match: C2353

Sändningstekniker
type: Concept
in scheme: JobTech Taxonomy - Yrke
definition: En sändningstekniker arbetar med att planera, förbereda, genomföra och övervaka sändningar av TV-, radio- och andra medieproduktioner. Yrket är tekniskt inriktad och innebär ansvar för att ljud och bild håller hög kvalitet under både direktsändningar och inspelningar. I arbetsuppgifterna ingår att ansvara för tekniken och leda det tekniska arbetet vid sändning av TV-program från studio eller inspelningsbuss samt planera och hantera utrustning för redigering och mixning av ljud- och bildinspelningar Källa: Arbetsförmedlingen, div jobbannonser
broader: Bild- och sändningstekniker
related: YoLp nua yJ4
related: 8too bEs 7NU
related: 9puE nYg crq
related: d1Ao 9bY 7Kn
broad match: C3521

Maskinoperatör hygienteknik
type: Concept
in scheme: JobTech Taxonomy - Yrke
definition: Maskinoperatörer inom hygienteknik sköter maskiner för tillverkning av hygienprodukter, till exempel tvålar. Arbetet innebär i huvudsak att övervaka och justera en eller flera maskiner så att produktionen når sin fulla kapacitet och att åtgärda problem som kan leda till driftstopp. Arbetet är starkt automatiserat och många produktionslinjer är robotiserade. Som maskinoperatör kan också underhåll och programmering av maskiner förekomma. Det ingår också vanligtvis att kontrollera, avvikelserapportera och dokumentera enligt anvisningar. Ibland ingår också att packa den färdiga produkten och att köra truck. Skiftarbete är vanligt förekommande. Källa: Arbetsförmedlingen
broader: Maskinoperatörer, farmaceutiska produkter
related: UdVa jRr 9DE
related: 6TaJ kgd rNV
related: wTEr CBC bqh
broad match: C8131

Maskinoperatörer, mejeri
type: Concept
in scheme: JobTech Taxonomy - Yrke
definition: Styr och övervakar maskiner för behandling av mjölk samt för tillverkning av ost, smör och andra mejeriprodukter.
broader: Maskinoperatörer, livsmedelsindustri
related: s5nN ufD 8ay
related: i3kd fCX jxz
related: VPF1 UZM 9Kd
related: 2pjc Vto TGH
related: zbkT 7Bb UWu
related: aF3J SgE uck
related: qQ61 EQR rcz
related: VTwt 5Fe 6bW
related: tx9U y45 rnL
related: nxLp 9ds miB
related: CDfm 8EV VAZ
related: KDzy Hra iVr
related: 1vX4 pj1 yao
related: MuoH pDL nFJ
related: sbYJ XwB o8X
related: AP6y xf5 4WK
related: d3oB oX3 kF8
related: GdFM 7x5 eZc
related: Rbju P7i 12U
related: AiwS Mhv ttk
related: WxW8 cwb Cod
related: uenm 75h fEh
related: C8160
related: MT1a Nyq DGQ
related: qn22 kbi Mwa
related: dWbY gXC Frx
related: 7Zbm 6s9 Znv
related: LhvF NZc r6N
related: kj4Q nLh u8Q
narrower: Processoperatör mejeri
broad match: wTEr CBC bqh

Regulatorisk handläggare/Regulatory affairs specialist
type: Concept
in scheme: JobTech Taxonomy - Yrke
definition: Regulatorisk handläggare/Regulatory affairs specialist
broader: Farmakologer och biomedicinare
related: kJeN wmw 9wX
related: Aqxt qe9 BXt
related: F1Xz rRd wBT
related: LA8n RjX Tsa
related: dyS7 mG8 H8o
related: 79Wc 7N3 TUX
related: EAdi 7vq 4dT
related: BguM dBA sMM
related: Gqgg 7qu Jhk
related: hGNM x8X Jfp
related: nHgY 76o q8h
related: ocme acz 7kF
related: px9G FGr M44
related: tbLU fy3 UVQ
related: esAo 5sX FPv
broad match: C2131

Specialisttandläkare inom pedodonti
type: Concept
in scheme: JobTech Taxonomy - Yrke
definition: Specialisttandläkare inom pedodonti är en specialiserad legitimerad tandläkare med en djupare kunskap och kompetens inom sitt område. Specialisttandläkare är en skyddad titel och bara den som har bevis om specialistkompetens får kalla sig specialist i sin specialitet. Vanliga arbetsuppgifter är att utreda, diagnostisera och behandla komplexa fall inom exempelvis oral kirurgi, ortodonti, pedodonti, parodontologi, oral protetik, bettfysiologi, endodonti eller odontologisk radiologi. Specialisttandläkare samarbetar ofta i team, tar emot remisser från allmäntandläkare och bidrar med expertkunskap till både patienter och kollegor. Arbetsuppgifterna kan även omfatta konsultationer, handledning och ibland ansvar för verksamhet eller personal inom sitt specialistområde.´ Källa: Arbetsförmedlingen, Sveriges Kommuner och Regioner, Socialstyrelsen
broader: Tandläkare
related: NYW6 mP6 vwf
related: proQ odJ 3A7
related: NgG1 5qR MDs
related: SRs7 HCS tVp
related: bvS2 Vmd o8t
related: 2B4i UAL 5kg
related: wcPj ZkE Prv
broad match: C2261

Maskinoperatörer, plastindustri
type: Concept
in scheme: JobTech Taxonomy - Yrke
definition: Styr och övervakar maskiner som blandar, gjuter, formar, armerar och svetsar plastämnen och plastkompositer till olika produkter och detaljer. Bygger båtskrov m.m. i plast. Hit hör inte Montör, gummi- och plastprodukter (8213)
broader: Maskinoperatörer, gummi-, plast- och pappersvaruindustri
related: 1Qmy Gy8 fCx
related: c7Sz dNp Na2
related: VPF1 UZM 9Kd
related: 4hFt Pef TBV
related: S8R1 9cW e75
related: aDwK gJT mV8
related: WK5N 8ga bTa
related: dvEW ndU GQU
related: 74Mw JUN VKx
related: C8142
related: 2pjc Vto TGH
related: 82fn Hhm 4wx
related: pGts PKK c8W
related: qQ61 EQR rcz
related: T5UV tZe N3A
related: VTwt 5Fe 6bW
related: RJty YSz DSS
related: TFJg 3Y4 j2Z
related: 85C2 bUX JUW
related: KDzy Hra iVr
related: 8cdE rAR qFH
related: Rtef oWE Ed9
related: tMML aCZ xKU
related: sbYJ XwB o8X
related: mMG2 MM1 4eg
related: d3oB oX3 kF8
related: ZqZp rib 2PF
related: oUWW xL4 6Qw
related: EGCS 78o x3F
related: PuQP aBK nqJ
related: Rbju P7i 12U
related: X4EU ZC7 QmK
related: AiwS Mhv ttk
related: RCs8 Wor Joc
related: 5uDy cV5 BZC
related: EWkh cWq zmo
related: z79u fRS ZSG
related: YBY5 2Np HQH
related: uenm 75h fEh
related: gEWP Lgj M4X
related: MT1a Nyq DGQ
related: KyvQ kWy oLn
related: wgzc YWB GRr
related: z98j kcf JyA
related: dWbY gXC Frx
related: zYMv ZNm D4e
related: Uytu hWi 5nh
related: rZy7 aHP 1aj
related: p4L5 Y74 qrT
narrower: Plastmaskinoperatör
narrower: Plastbåtbyggare
narrower: Formsprutningsprocesstekniker
narrower: Plastmaskinställare
narrower: Plastsvetsare
broad match: wTEr CBC bqh

Hyveloperatör inom trä- och möbelindustri
type: Concept
in scheme: JobTech Taxonomy - Yrke
definition: Hyveloperatörer inom trä- och möbelindustri sköter bland annat maskinhyvlar för finare bearbetning av förädlat virke. Som hyveloperatör inom trä- och möbelindustrin bearbetar man redan sågat och hyvlat virke som levererats från sågverk. Hyveloperatören är en del av verksamheten på snickerier som till exempel tillverkar fönster och dörrar. Yrket liknar maskinsnickare i det att de båda rollerna ofta förekommer på samma arbetsplats. Hyveloperatören är dock mer specialiserad på just hyvling, snarare än att arbeta med hela tillverkningsprocessen. Källa: Arbetsförmedlingen, Trä- och möbelföretagen
broader: Maskinsnickare och maskinoperatörer, träindustri
related: 2CnS UmE mQU
related: ui9K nkU ivu
related: wTEr CBC bqh
broad match: C7523

Trafiklärare
type: Concept
in scheme: JobTech Taxonomy - Yrke
definition: Genomför teoretisk och praktisk körkortsutbildning för motorfordon. Lär ut trafikregler, körteknik och trafiksäkerhet.
broader: Trafiklärare och instruktörer
related: CNSz pXC f63
related: 3Loo 6Fy Y1R
related: C5165
related: vsdz cNF c2C
related: HTW1 LbJ FPE
related: oLnc YZn 3bm
related: g61c Frt kfL
related: Ndue oNb iXo
related: Bi9e N54 rQV
related: US4W Foa CSg
related: Y3vb WoB mZR
narrower: Trafiklärare
narrower: Utbildningsledare på trafikskola
broad match: MVqp eS8 kDZ

Domstolshandläggare
type: Concept
in scheme: JobTech Taxonomy - Yrke
definition: Domstolshandläggare handlägger och förbereder olika typer av mål och ärenden vid domstolar. Arbetsuppgifter omfattar registrering och administration av handlingar, skriftväxling med parter och myndigheter, planera och kalla till rättegångar, expediering av domar samt ibland protokollföring. Domstolshandläggaren är ofta det första bemötandet för allmänheten i domstolen och bidrar till rättssäkerhet och effektivitet. Källa: Sveriges domstolar, Arbetsförmedlingen
broader: Domstols- och juristsekreterare m.fl.
related: jgWW Lmt 9uF
related: tzMw Dxk Y9A
related: 4YXW 3b8 KYv
related: X82t awd Qyc
related: ywQV wBb BSz
broad match: C3411

Restaurangbiträde
type: Concept
in scheme: JobTech Taxonomy - Yrke
definition: Restaurangbiträde hjälper gäster och annan personal på restauranger. Arbetet innebär i huvudsak att ge service till besökare i restauranger. Vanliga arbetsuppgifter är att portionera upp mat, förbereda bufféer, ta emot betalning i kassa, servera gäster och att plocka bort disk från borden. I arbetsuppgifterna ingår också att diska och städa. Restaurangbiträde och köksbiträde liknar varandra och beroende på arbetsplats kan man använda båda benämningarna. Källa: Arbetsförmedlingen
broader: Restaurang- och köksbiträden m.fl.
related: VeZi ER5 bnB
related: oq2L y1Z VHd
related: UdVa jRr 9DE
related: kYA6 rEH VEm
related: juEd 5FC mFk
related: 2LM8 Ubw ote
related: QvFT Sn6 zWj
related: 4m7d jiu xKJ
related: snvp SUt gFe
related: J2F5 HDr yHE
related: 4V8s oG5 bu6
related: Dm6M g6t hKy
related: Q8fW dvu Pok
related: oxA3 Lpi 11v
related: YkBL iCJ 37y
related: LpEA BGo x9w
related: pHRH 6kz HkH
related: xQkE 81V 1vB
related: sqGo 8JJ gv4
related: EJJj K3R 4qQ
related: JqBx uAB 4D4
related: ik6h KgV FJ2
related: ScKy FHB 7wT
related: nW9q duw xXa
related: YtKd NH3 Egw
related: KF4Z DPw Ryx
related: 9uNR vGT 1Dw
related: M1Y6 Jhu x6H
related: gZVV nVJ LkV
related: Pwmo b5Y eMj
related: 3Pm4 3UM Lb1
related: NGvs HJs Xik
related: 7Gcd Spc fcD
related: jDcn m2M UEy
related: hGfm df8 MnA
related: QWBt m4T 6xm
related: 2SwQ Wxj sAv
related: R6eq vcx MJa
related: My9v 57J EUx
related: ZYjR db3 jN5
related: o2zG vKk NkB
related: 5T2W UHs guz
broad match: C9412

Driftchef, data
type: Concept
in scheme: JobTech Taxonomy - Yrke
definition: Driftchef, data
broader: IT-chefer
related: epLc SkD cbT
related: apaJ 2ja LuF
related: bh3H Y3h 5eD
related: Y2Py kJt zEG
related: 1pfZ qUJ 1hU
related: sMDN Z8c psG
broad match: C1330

Naturgeograf
type: Concept
in scheme: JobTech Taxonomy - Yrke
definition: Naturgeograf
broader: Arkeologer och specialister inom humaniora m.m.
related: kJeN wmw 9wX
broad match: C2632

Beläggningsmaskinförare
type: Concept
in scheme: JobTech Taxonomy - Yrke
definition: Beläggningsmaskinförare hanterar maskiner och utrustning som används för att lägga asfalt, betong och andra material på vägar, parkeringsplatser och andra ytor. Masinföraren ansvarar för att fordon och teknisk utrustning sköts och är i gott skick, samt hanterar material, mätutrustning och annan teknisk utrustning. Det är ett arbete som kräver noggrannhet, teknisk skicklighet och en god förståelse för maskiner. Källa: Arbetsförmedlingen
broader: Anläggningsmaskinförare m.fl.
related: RzNw FHa zDk
related: j7Cq ZJe GkT
related: ja7J P8X YC9
related: Mxyf t2J iLA
broad match: C8342

Företagskonsult
type: Concept
in scheme: JobTech Taxonomy - Yrke
definition: Företagskonsult
broader: Lednings- och organisationsutvecklare
related: 5RmN 1GU ULm
related: YWft bBn Jyt
related: BBr5 uzo vhZ
related: X82t awd Qyc
related: CyyY aNP m7t
related: Wo8D xys Lew
related: tavD pDF ydT
related: fnhW EBh bfJ
broad match: C2421

Flygledare
type: Concept
in scheme: JobTech Taxonomy - Yrke
definition: Övervakar och leder flygtrafik på start- och landningsbanor samt i luften. Ger instruktioner om startpunkt, färdväg, flyghöjd m.m.
broader: Piloter, fartygs- och maskinbefäl m.fl.
related: EPzz Dy6 FZU
related: QnvA akR Rd7
related: Pyp3 qR3 qp5
related: zhmm 9A2 GGp
related: C3154
related: qEQz Mbj kQP
related: 2qWx WKP XYH
narrower: Watch Supervisor, flygledning
narrower: Handläggare, flygledning
narrower: Briefing Officer, luftfart
narrower: Flight Data Operator/FDO/Flygledarassistent
narrower: Flygledare
broad match: ASGV zcE bWf

Fiolbyggare
type: Concept
in scheme: JobTech Taxonomy - Yrke
definition: Fiolbyggare bygger och reparerar fioler och liknande stråkinstrument. Musikinstrumentmakare är ett hantverksyrke, där viktiga kunskaper är bland annat materialkunskap, verktygsvård, maskinbearbetning, ritning och uppmätning samt ytbehandling. För fiolbyggare är kunskaper om olika träslag särskilt viktigt. Källa: Hantverksakademin, Hantverkslärling, Arbetsförmedlingen
broader: Musikinstrumentmakare och övriga konsthantverkare
related: htLe 6wV XGg
related: PaxQ o1G wWH
broad match: C7312

Elektronikreparatör
type: Concept
in scheme: JobTech Taxonomy - Yrke
definition: Elektronikreparatör installerar, sköter service och reparerar hemelektronik och vitvaror. Elektronikreparatörer arbetar med installation, service och reparation av elektroniska produkter. Beroende på arbetsplats och intresse är det vanligt att man specialiserar sig mot en viss kategori av produkter, till exempel mobiltelefoner, TV-apparater, ljudanläggningar, vitvaror, datorer eller kontorsmaskiner. Arbetet kan ske på plats hos kunder eller på en verkstad. Källa: Arbetsförmedlingen - Hitta yrken
broader: Elektronikreparatörer och kommunikationselektriker m.fl.
related: jS1k g2V Vfy
related: 8sT5 JL8 o7h
related: g2Qv JJC MTh
related: 8QDn zGm 2vi
related: YWoo kZZ nss
related: BSx8 gAm RSm
related: uvZ2 n8h byW
related: 3Kem K9v GH1
related: 1B6q 2gm Uik
related: oF19 U2R 8df
related: UBGG mVg qHH
related: yhCP AqT tns
related: x3ci Nzc Rwp
related: eznE cYa BCf
related: poDt nBk pF1
related: qKHE Rjg 9d6
related: XfYD UNc QhT
related: Z8eY MWW uLS
related: 5EVq ZRA F7j
related: wzQi 3DX zrx
related: zuWr hbK mNk
related: bSjw TsM Ghz
broad match: C7421

Undervisningsråd
type: Concept
in scheme: JobTech Taxonomy - Yrke
definition: Undervisningsråd
broader: Planerare och utredare m.fl.
related: 3pyE aAA TFD
related: MVqp eS8 kDZ
broad match: C2422
broad match: C2351

Arbetsterapibiträde
type: Concept
in scheme: JobTech Taxonomy - Yrke
definition: Arbetsterapibiträden assisterar arbetsterapeuter. Arbetsuppgifter innefattar att genom delegering från arbetsterapeut hjälpa patienter med rehabiliterings, så som mobilisering, arm- och handträning, ADL-träning (aktiviteter i dagliga livet) och utprovning av hjälpmedel. Källa: Sveriges kommuner och regioner, Arbetsförmedlingen
broader: Övrig vård- och omsorgspersonal
related: NYW6 mP6 vwf
related: 9d9g A86 zue
related: Qp5R Ax3 7Go
related: dB3J 44o nt4
broad match: C5329

Driftchef fastighet
type: Concept
in scheme: JobTech Taxonomy - Yrke
definition: Driftchefer inom fastighet leder och samordnar den tekniska driften av fastigheter och anläggningar. Arbetsuppgifter omfattar planering, schemaläggning, felhantering, uppföljning av driftkostnader samt utveckling av rutiner. Yrkesrollen innefattar även personalledning, upphandling av tjänster och kontakt med hyresgäster. Arbetet omfattar tekniska system som ventilation, värme, VA och brandskydd samt daglig skötsel som sophantering och vinterväghållning. Även medverkan i projekt, verksamhetsutveckling och digitalisering i samverkan med andra avdelningar kan ingå.
broader: Fastighets- och förvaltningschefer
related: V9nh oAT PQw
related: bh3H Y3h 5eD
related: T2VZ fSo grm
related: ekRP yqV aCo
related: xARe DRP WjV
broad match: C1219

Operationskoordinator
type: Concept
in scheme: JobTech Taxonomy - Yrke
definition: Operationskoordinator
broader: Övriga specialistsjuksköterskor
related: NYW6 mP6 vwf
related: 9C9q rtM 8mf
broad match: C2221

Forskningschef, museum
type: Concept
in scheme: JobTech Taxonomy - Yrke
definition: Forskningschef, museum
broader: Forsknings- och utvecklingschefer
related: epLc SkD cbT
related: bh3H Y3h 5eD
broad match: C1223

Game designer/Speldesigner
type: Concept
in scheme: JobTech Taxonomy - Yrke
definition: Game designer ansvarar för att utveckla och genomföra det övergripande spelkonceptet, inklusive spelregler, mekanik och spelupplevelse, för att skapa engagerande och balanserade datorspel. Vanliga arbetsuppgifter är att skapa spelregler, balansera spelmekanik, skriva manus, kommunicera spelets vision och leda spelprojekt. Det ingår nära samarbete med producenter, programmerare och grafiker för att säkerställa att spelets alla delar fungerar. Källor: Arbetsförmedlingen, Dataspelsbranschen
alternative label: Game designer
alternative label: Speldesigner
broader: Designer inom spel och digitala medier
related: oeHg J1V PEg
related: apaJ 2ja LuF
related: 8too bEs 7NU
related: 9puE nYg crq
related: PpaS NaH 3Zo
broad match: C2166

Resebyråassistent
type: Concept
in scheme: JobTech Taxonomy - Yrke
definition: Resebyråassistenter arbetar på resebyråer eller reserelaterade företag med administration, bokning och kundservice kring resor. Arbetsuppgifterna omfattar till exempel hantering av resebokningar, prisuppgifter, biljettutskrifter, ombokningar, kommunikation med kunder via telefon, e-post och vid personliga besök, samt informationsgivning om resmål, transporter och försäkringar. Resebyråassistenter hanterar ibland även fakturering, resehandlingar och koordinering med researrangörer och leverantörer. Yrket förekommer både inom fysiska resebyråer och i digitala miljöer hos större resenätverk och arrangörer. Källa: Arbetsförmedlingen
broader: Resesäljare och trafikassistenter m.fl.
related: RPTn bxG ExZ
related: ASGV zcE bWf
broad match: C4221

Lastbilssäljare
type: Concept
in scheme: JobTech Taxonomy - Yrke
definition: Lastbilssäljare arbetar med försäljning av nya och begagnade lastbilar. Arbetsuppgifterna omfattar kundkontakt, teknisk rådgivning, offertframtagning och försäljningsavslut. Arbetet kan även innebära arbete med upphandlingar, specialanpassningar och koordinering med verkstad och eftermarknad. Finansierings- och försäkringslösningar för kund är en viktig del av arbetet. Lastbilssäljare har vanligtvis goda kunskaper om fordonsteknik och transportbranschen. Källa: Arbetsförmedlingen
broader: Butikssäljare, fackhandel
related: UM5z 1bx 5rf
related: rDcj Tao TJJ
related: RPTn bxG ExZ
related: nKiu uaE 7KY
broad match: C5223

Försäkringsjurist
type: Concept
in scheme: JobTech Taxonomy - Yrke
definition: Försäkringsjurist
broader: Affärs- och företagsjurister
related: X82t awd Qyc
related: x4Wi NWW ogB
related: txNe 772 ENJ
related: Abcb QtH isZ
related: wZAt Fxh P3c
broad match: C2619

Installations- och serviceelektriker
type: Concept
in scheme: JobTech Taxonomy - Yrke
definition: Gör elinstallationer i byggnader. Utför felsökning och reparationer på elektriska anläggningar. Hit hör inte Distributionselektriker (7413) Industrielektriker (7412)
broader: Installations- och industrielektriker m.fl.
related: sKfH MGG 3CS
related: FqWP 6FQ Wz5
related: wBLK nWZ 7ek
related: 42Zw EBR Yu7
related: cnkK 3ev Ccf
related: Ytcy v8N P2w
related: aHCV VsV LiD
related: qyxC Z7Z dXH
related: rmuF Dce PPS
related: ax2t Yyg 2Sy
related: fjyp Sft A2M
related: eVwv pwi 6Gj
related: 8ZhW wNv 5k9
related: MKjv MCq SVT
related: 1YZS 1ch vDZ
related: PELm cH9 AE9
related: Q7eC B7g QiU
related: GUw2 Ek8 CY7
related: WdBL 5qJ F7N
related: vQTv Fio W9o
related: hxAR yMs 9Z9
related: NQVA bUW n1F
related: fhcp fFw Lbj
related: C7411
related: 9PuU gLx U7V
related: 8pwJ sfn cAx
related: nkhA jPz pcE
related: kraG fcm 3Mo
related: ynWd oCo o61
related: VQxj dHG UCE
related: ncgu Kpq TR3
related: 5JSC d5R Em9
related: eojD i4f 4f6
related: GCYi 9tC 1pP
related: Uya4 Qvw hmw
related: 4bwR JVU usd
related: EjB9 prP VQZ
related: c14d Mgx MFA
related: WLAi BDr 5fW
related: Gwek vrQ kRU
related: KymG vW5 bjG
related: KfEn V5y npV
related: AEgv 4gP ndv
related: HxYt DAb sK2
related: Sbs4 dpg Y2B
related: kzto Ymy cPC
related: wZpC X9a xzG
related: MT1a Nyq DGQ
related: 4mNF 7vZ vCx
related: Uytu hWi 5nh
related: ZTk2 7eo CUb
related: bG9S mns 7q9
related: 84Y4 ZsE KQb
narrower: Serviceelektriker, installation
narrower: Installationselektriker
narrower: Lärling, installationselektriker
narrower: Ledande montör, el
broad match: yhCP AqT tns

Featurechef
type: Concept
in scheme: JobTech Taxonomy - Yrke
definition: Featurechef
broader: Övriga chefer inom samhällsservice
related: bh3H Y3h 5eD
related: 8too bEs 7NU
related: 9puE nYg crq
broad match: C1349

Fotografassistent
type: Concept
in scheme: JobTech Taxonomy - Yrke
definition: Fotografassistent ansvarar för att förbereda, rigga och assistera med utrustning och ljussättning under fotograferingar. Vanliga arbetsuppgifter är att packa upp och montera kameror, objektiv och ljusutrustning, koordinera teamet under fotografering, justera ljus och scenuppsättning samt hantera rekvisita. Fotografassistenten kan också hjälpa till med efterarbete som att sortera och göra enklare redigeringsuppgifter på bilder. B-körkort är ett vanligt krav. Källa: Arbetsförmedlingen
broader: Fotografer
related: w66Q ZfF Xsa
related: 8too bEs 7NU
related: 9puE nYg crq
related: kMdL YCs KB4
related: rTXb 2hW axy
related: Dxrf QBG Vx2
broad match: C3431

Tornkranförare
type: Concept
in scheme: JobTech Taxonomy - Yrke
definition: Tornkranförare förflyttar tungt material med stor precision i samspel med andra yrkesgrupper. Tornkranförare manövrerar och styr kranar på byggarbetsplatser. Tornkranförare kan ansöka om sitt yrkesbevis efter teoretisk grundutbildning och lärlingsanställning. Källa: Arbetsförmedlingen, BYN
broader: Kranförare m.fl.
related: rSUT XEm 5tW
related: j7Cq ZJe GkT
related: 8zzY Z98 6Hf
related: ja7J P8X YC9
related: vtY3 TC1 Hg6
broad match: C8343

Projektledare, IT
type: Concept
in scheme: JobTech Taxonomy - Yrke
definition: IT-projektledare ansvarar för att driva förstudier och projekt kopplade till IT-utveckling. Arbetet innefattar ofta resurs- och tidsplanering, kravställning, kravsamordning projektdokumentation, riskanalys och arbetsledning av projektdeltagare, ofta utifrån inom området vedertagna metoder såsom Agile. Källa: Unionen
alternative label: IT-projektledare
broader: Mjukvaru- och systemutvecklare m.fl.
related: mbzs NDd NRM
related: drdq 2pa 4zk
related: bUj6 oRy C4P
related: kct9 JQ3 Cwm
related: 1MSY 6RD umg
related: HSaC QiR Nzi
related: apaJ 2ja LuF
related: T1wW drP F5y
related: rgFd wcy LG2
related: KT6P hVH LRD
related: Hccu 6NC zrw
related: whvP vpG cQy
related: yJ4J EL3 TN2
related: yXSE wvx EAN
related: MMa3 dJt RwD
related: MYcj Pkg i6J
related: HNms ddm zZ1
broad match: C2511

Fysiker
type: Concept
in scheme: JobTech Taxonomy - Yrke
definition: Fysiker
broader: Fysiker och astronomer
related: kJeN wmw 9wX
related: mB5A 8Ho LCk
related: BeZ6 1jC SBy
related: Bpp6 qdj 6Rb
broad match: C2111

Flight Operating Officer
type: Concept
in scheme: JobTech Taxonomy - Yrke
definition: Flight Operating Officers planerar och övervakar flygningar. Arbetsuppgifterna inkluderar ruttplanering, beräkning av bränsle och viktbalans samt hantering av operativ flyginformation. Övriga arbetsuppgifter kan vara att samordnar information mellan markpersonal och besättning samt följa upp trafikflöde under pågående flygningar. Yrkesrollen omfattar även dokumentation, väderanalys och flygtrafikövervakning i realtid. Källa: Arbetsförmedlingen
broader: Transportledare och transportsamordnare
related: ASGV zcE bWf
related: xjso kR7 zQn
broad match: C4323

Kronoinspektör
type: Concept
in scheme: JobTech Taxonomy - Yrke
definition: Kronoinspektör utreder tillgångar och reglerar skulder för privatpersoner och företag. Arbetsuppgifterna inkluderar utmätning av tillgångar som bankmedel, fastigheter, bostadsrätter och löneinkomster, verkställande av avhysning, handräckning och betalningssäkring samt bedömning och beslut om tvångsåtgärder enligt lag. Kronoinspektör har kontakt med gäldenärer och borgenärer, ger råd och information om ärendets gång, dokumenterar beslut och samarbetar med andra myndigheter vid behov. Kronoinspektör verkar både administrativt och operativt, och rollen är central inom Kronofogdemyndigheten. Källor: Kronofogden, Saco
broader: Inkasserare och pantlånare m.fl.
related: X82t awd Qyc
related: jgB4 3ar WJv
broad match: C4214

Chefer inom grund- och gymnasieskola samt vuxenutbildning
type: Concept
in scheme: JobTech Taxonomy - Yrke
definition: Formulerar och ansvarar för mål och strategier för verksamhet inom grund- och gymnasieskola samt vuxenutbildning och motsvarande skolform. Planerar och ansvarar för utbildningsverksamhet utifrån styrdokument fastställd av regering, riksdag och skolmyndigheter. Utformar riktlinjer, följer upp och utvärderar verksamheten mot uppsatta mål. Svarar för budget samt fördelar resurserna inom verksamheten. Har personalansvar.
broader: Chefer inom grund- och gymnasieskola samt vuxenutbildning
related: nMBj 4GR csR
related: s5SS 7bW 1Gh
related: 8V12 wQM NWp
related: pMsw qiZ eNz
related: YS7V c8n MrS
related: G7Qq r7L 5Jo
related: JKxk 2A6 ZYt
related: UH9g R5v MCx
related: SmZd Jaa BeY
related: oLnc YZn 3bm
related: 8tYq EXD Xwm
related: azTh 4zW Tfb
related: ZzN5 m7B 5CY
related: detQ YNb 9nG
related: Ju2P fHA n5B
related: C1345
related: VVFX crE dzw
related: Nksx 4oe fEQ
related: eThQ HCv mY6
related: 5PjX 999 uLZ
related: 7VsB 78P sGW
related: Gt5f wdi FSJ
related: q7Mx gjU F9q
related: D6ev Zwt x83
related: zXNU zXR hGd
related: echN F9u bRp
narrower: Biträdande rektor
narrower: Skolchef/Skoldirektör/Skolledare
narrower: Rektor
narrower: Studierektor
narrower: Utbildningschef
narrower: Antagningschef, utbildning
broad match: bh3H Y3h 5eD

Hattmakare
type: Concept
in scheme: JobTech Taxonomy - Yrke
definition: Hattmakare tillverkar och reparerar herrhattar. Hattmakare är ett kreativt och traditionellt hantverksyrke. Det är vanligt att vara egen företagare med egen verkstad, så kallat hattmakeri. Yrket liknar hattmakare, med skillnaden att hattmakare traditionellt tillverkar herrhattar och modister traditionellt tillverkar damhattar. Källa: Sveriges Hattmakare Förening
broader: Skräddare och ateljésömmerskor m.fl.
related: kqau D4r 4fE
related: PaxQ o1G wWH
broad match: C7531

Skidlärare
type: Concept
in scheme: JobTech Taxonomy - Yrke
definition: Skidlärare undervisar i skidåkning för barn, ungdomar och vuxna på olika nivåer. Arbetsuppgifterna omfattar teknikträning, säkerhetsinformation, pedagogisk anpassning efter individ och grupp, samt skapande av trygga och roliga skidupplevelser i backen. Skidlärare har vanligtvis goda kunskaper i skidteknik, pedagogik, säkerhet och anpassar undervisningen efter olika förutsättningar och åkarens utveckling. Källor: Svenska skidanläggningars organisation, Friluftsfrämjandet, Arbetsförmedlingen
alternative label: Skidinstruktör
broader: Idrottstränare och instruktörer m.fl.
related: wcpC XAC W5A
related: gG1P PSu PBb
related: KBng NAC FDp
related: NE66 Uox Huu
related: CjP6 uJT vWA
related: kRTu wUb UwC
related: MVqp eS8 kDZ
related: 173e hjN 55X
related: MbhJ mWh 9VG
broad match: C3423

Förlagschef, bokförlag
type: Concept
in scheme: JobTech Taxonomy - Yrke
definition: Förlagschef, bokförlag
broader: Övriga chefer inom samhällsservice
related: epLc SkD cbT
related: bh3H Y3h 5eD
related: 9puE nYg crq
broad match: C1120
broad match: C1349

Dekormålare
type: Concept
in scheme: JobTech Taxonomy - Yrke
definition: Dekormålare målar och skapar dekorativa element, kulisser och rekvisita för teater, film och TV-produktioner. Vanliga arbetsuppgifter är att tolka skisser och instruktioner från scenografen, måla storformatskulisser och detaljer som ska se trovärdiga ut från publikens perspektiv, tillverka attribut och specialeffekter och anpassa dekorens ytor efter ljus och scenens tekniska krav. Källa: Arbetsförmedlingen, Hantverksakademin, Uppsala stadsteater
broader: Inredare, dekoratörer och scenografer m.fl.
related: u7zK VKN 8Ht
related: 8too bEs 7NU
related: 9puE nYg crq
related: QkPN U4K reh
broad match: C3432

Eventtekniker
type: Concept
in scheme: JobTech Taxonomy - Yrke
definition: Eventtekniker
broader: Ljus-, ljud- och scentekniker
related: q78N 94M NRp
related: 9puE nYg crq
related: yhCP AqT tns
related: Dt3o 8gC NAB
related: Xhre AbM HnM
broad match: C3521

Näringsterapeut
type: Concept
in scheme: JobTech Taxonomy - Yrke
definition: Näringsterapeut
broader: Terapeuter inom alternativmedicin
related: NYW6 mP6 vwf
related: Uuf1 GMh Uvw
broad match: C3230

Chefer inom bank, finans och försäkring
type: Concept
in scheme: JobTech Taxonomy - Yrke
definition: Chefer inom bank, finans och försäkring
broader: Chefsyrken
narrower: Chefer inom bank, finans och försäkring

Botaniker
type: Concept
in scheme: JobTech Taxonomy - Yrke
definition: Botaniker
broader: Växt- och djurbiologer
related: kJeN wmw 9wX
related: 1Lo3 PVR Hff
related: 8kYw PQ5 P8G
related: XXWA uWY 1Mh
broad match: C2131

Domstols- och juristsekreterare m.fl.
type: Concept
in scheme: JobTech Taxonomy - Yrke
definition: Utför assisterande juridiskt arbete. Förbereder, granskar och bearbetar juridiska handlingar. Kallar parter till förhandlingar. Skickar förelägganden. Protokollför rättegångar och förhandlingar. Upprättar förteckningar över dödsbons tillgångar och skulder samt bistår vid arvskifte.
broader: Juristsekreterare, chefssekreterare och institutionssekreterare m.fl.
related: xSLo P6B 2AF
related: DJgq zBj bKt
related: ep2C YdH Qor
related: C3411
related: ZuYj ADn tk7
related: 7H4j dRM Vbo
related: M58q o8J LLV
related: gQjW r5i 8KU
related: RZLF S7J 25Q
related: 6thd xZq KsU
related: bwjW 1SE XWZ
related: aUr6 Rjg ja2
related: uA7X Pqn n9a
related: 3HjW 1BP k3S
related: 49Hd QeU Dvg
related: 3vYj Rhf Voh
related: HEia YGh KRv
related: Uv9y v2g efa
related: Tmps QPE g3V
related: 43H8 6iv Ptp
related: CtU5 jL4 he2
related: BrdZ oPC Kft
related: Go6N bBn 7eM
related: Hny7 dcS 724
related: NUC3 y1C Scg
related: 8GLo Bn4 XAq
related: cw2M p2W SuJ
related: EU8B Vir DXH
related: pLfm Uff BsM
related: C3342
related: dYqT JBz NZE
related: 5wab aFK gdL
related: AW8R baL eV1
related: 1dVh cZS Exw
related: PVnT yGT SMb
related: rCko kQw 1jv
related: qtHa AsU Cfo
related: Nig2 2pU GT8
related: Qcp3 Ptz 73U
related: LmAP e75 pc6
related: MxW4 GEL ChA
related: 7scD 9YP iwV
related: NYbU buD WVZ
related: jcpA Zfs nSz
related: Juia j2p bAj
related: R5ce 7aY mEs
related: hmrq EaU Hex
related: RB7E jE5 MZ3
related: SHiQ hfH nuX
related: Kvft WHn KJE
related: 2ZFC 6de YSB
related: ceGc 82S ZCw
related: Em9g vpP fDo
related: B1rc wCc vne
related: w8bU wHe omF
related: 73gL 4uv p9J
related: 8u7A ze1 bvd
related: 6Ei3 fZV YKM
narrower: Paralegal
narrower: Juristassistent/Advokatsekreterare
narrower: Domstolshandläggare
narrower: Förrättningsassistent fastighetsbildning
broad match: X82t awd Qyc

Ytbehandlare, trä och möbelsnickare m.fl.
type: Concept
in scheme: JobTech Taxonomy - Yrke
definition: Ytbehandlare, trä och möbelsnickare m.fl.
broader: Hantverksyrken inom trä, textil m.m.
narrower: Maskinsnickare och maskinoperatörer, träindustri
narrower: Manuella ytbehandlare, trä
narrower: Fin-, inrednings- och möbelsnickare

Projektledare, gruva
type: Concept
in scheme: JobTech Taxonomy - Yrke
definition: Projektledare, gruva
broader: Ingenjörer och tekniker inom gruvteknik och metallurgi
related: 6Hq3 tKo V57
related: yXSE wvx EAN
broad match: C3117

Teknisk redaktör
type: Concept
in scheme: JobTech Taxonomy - Yrke
definition: En teknisk redaktör granskar och redigerar tekniskt material för att säkerställa klarhet, korrekthet och användarvänlighet. De arbetar med att förtydliga komplex information och göra den mer begriplig för läsaren, ofta i form av manualer, produktbeskrivningar och annan teknisk dokumentation. I arbetsuppgifterna ingår bl a skapa tekniska specifikationer och produktbeskrivningar, utveckla instruktionsguider och hjälpdokumentation. Källa: Arbetsförmedlingen
broader: Författare m.fl.
related: mzDp tnj ard
related: 9puE nYg crq
related: qDR6 Tqw Eeh
broad match: C2641

Arbetsledare, VVS
type: Concept
in scheme: JobTech Taxonomy - Yrke
definition: Arbetsledare inom VVS är den som leder arbetet med vvs-installationer på byggarbetsplatsen. Arbetsledaren bevakar att maskiner och material finns på plats och samordnar arbetet med de entreprenörer. Arbetsledaren har ansvaret för att arbetet utförs enligt gällande ritningar och anvisningar och för att säkerhetsföreskrifterna följs. Källa: Arbetsförmedlingen
broader: Arbetsledare inom bygg, anläggning och gruva
related: j7Cq ZJe GkT
related: ja7J P8X YC9
broad match: C3123

Enhetschef inom social omsorg/Föreståndare inom social omsorg
type: Concept
in scheme: JobTech Taxonomy - Yrke
definition: Enhetschef inom social omsorg/Föreståndare inom social omsorg
alternative label: Enhetschef inom social omsorg
alternative label: Föreståndare inom social omsorg
broader: Chefer inom socialt och kurativt arbete
related: CA6z 5iL jqV
related: GazW 2TU kJw
related: hoRQ gWR pru
related: epLc SkD cbT
related: bh3H Y3h 5eD
related: 8kV5 L8J u6L
related: 9yCi fou Rn1
broad match: C1344

Psykologiskt ledningsansvarig psykolog/PLA
type: Concept
in scheme: JobTech Taxonomy - Yrke
definition: Psykologiskt ledningsansvarig psykolog leder och kvalitetssäkrar psykologiska insatser inom en verksamhet, ofta på uppdrag av verksamhetschef. Psykolog är en skyddad titel med legitimationskrav. Vanliga arbetsuppgifter är att utveckla och utvärdera rutiner och metoder för psykologiskt arbete, kvalitetssäkra behandlingar och utredningar, samt implementera ny forskning och riktlinjer. Det ingår ansvar för patientsäkerhet, rådgivning och handledning och konsultation till kollegor. Källa: Arbetsförmedlingen, Psykologförbundet, Region Värmland, Socialstyrelsen
alternative label: PLA
alternative label: Psykologiskt ledningsansvarig psykolog
broader: Psykologer
related: vj6a Eh9 2wV
related: NYW6 mP6 vwf
related: GazW 2TU kJw
broad match: C2634

Konsertarrangör
type: Concept
in scheme: JobTech Taxonomy - Yrke
definition: Konsertarrangör
broader: Övriga förmedlare
related: SJh7 Vto RL8
related: RPTn bxG ExZ
related: gHg6 TbA TyC
related: 9puE nYg crq
related: fVxD gA2 Df6
broad match: C3339

Lageradministratör
type: Concept
in scheme: JobTech Taxonomy - Yrke
definition: Lageradministratörer utför administrativa uppgifter inom lagerverksamhet. Arbetsuppgifter kan varar registrering av inkommande och utgående leveranser, uppdatering av lagersystem, skapande av fraktdokument och följesedlar samt planering och koordinering av leveranser. Andra arbetsuppgifter kan vara att genomföra inventeringar, rapportera avvikelser och kommunicera med leverantörer, transportörer och interna avdelningar. Digitala affärssystem används regelbundet för administration och uppföljning. Arbetsuppgifter för lageradministratör förekommer även inom närliggande yrken som Lagerplanerare och Transportadministratör. Källa: Arbetsförmedlingen
broader: Lager- och terminalpersonal
related: sSu6 qMg nYu
related: oR3C 1nG Hp9
related: J5gJ 6vV egQ
related: tir7 BLM P6G
related: 7JkC hou Lxo
related: X82t awd Qyc
related: e6b7 r1n ZPc
related: 3U1Q PR9 UiJ
related: ASGV zcE bWf
related: CitH MEj 5jn
related: G9ax Gq1 dec
related: 6o2P PLV v7r
related: oZfb NWk h5y
related: 9UcB 3xi AEL
related: gyp5 cjt 8ZW
related: MmD2 NqA cc5
related: rqYc CtP juu
broad match: C4321

Ställningsbyggare, utan yrkesbevis
type: Concept
in scheme: JobTech Taxonomy - Yrke
definition: En ställningsbyggare bygger och monterar byggnadsställningar som används när nya hus byggs eller gamla hus och fasader renoveras. Ställningsbyggarna bygger hela ställningar från grunden med stålrör och träplank eller monterar ihop färdiga ställningssystem. Byggnadsställning behövs inte bara vid byggprojekt, utan även vid t ex anläggningsprojekt och inom industri. Källa: STIB
broader: Ställningsbyggare
related: RQbr SzR 2B6
related: j7Cq ZJe GkT
related: ja7J P8X YC9
broad match: C7119

Leveranschef
type: Concept
in scheme: JobTech Taxonomy - Yrke
definition: Leveranschef
broader: Inköps-, logistik- och transportchefer
related: epLc SkD cbT
related: zwSJ NvJ gTE
related: ASGV zcE bWf
related: bh3H Y3h 5eD
broad match: C1324

Författare m.fl.
type: Concept
in scheme: JobTech Taxonomy - Yrke
definition: Planerar och gör research för och skriver exempelvis böcker, manus och pjäser för publicering eller presentation. Korrekturläser och redigerar texter.
broader: Författare, journalister och tolkar m.fl.
related: rPMH yr9 h7d
related: 1CnL 8ZQ tTd
related: q7yb wcm uFb
related: Z6bE fvU 2Rh
related: oQre F86 kHG
related: TdRH mHo U2N
related: 49Hd QeU Dvg
related: Muvf Anu QYp
related: Rz5y 53L 7Tk
related: qjeU 6sK 9Uf
related: JGkC RTc XNU
related: gtQC bGT 65a
related: ryXf E4d FYU
related: qhJ9 N4G BQg
related: dYog aJL kok
related: 4RmJ wiU N4k
related: 67C3 Yoo jte
related: Krbu VkM PdQ
related: FiV2 Gk2 bG9
related: LuDq dXy jRN
related: 5T5g ij5 JUC
related: rDwo tV5 qic
related: oEJ1 Jm7 J97
related: s25s cww uFS
related: 7NpA Fob fUr
related: nVJB JB5 rr5
related: JVQm QcV WTB
related: 5XhW VQA 2CW
related: t9A6 jvd 6h5
related: YBuN Wgv 19X
related: gNjv tRy 1RK
related: KKQV aGF bWq
related: FGhF q98 YE8
related: Ko1g 8NU Bhs
related: C2641
related: zg4F Pxs oJ6
related: 2TWQ fjd stf
related: pkKr hxU RX8
related: CTTL 357 Ld2
related: jHPZ f6N Kjg
related: Y2t4 aS8 tGo
related: qK2A 9oq zx6
related: XN9D c7f vF1
related: WuBt CYU 2Qf
related: Pk1y cpM ZhC
related: 5yDE FiQ bMn
related: zPdv znE aka
narrower: Teknisk redaktör
narrower: Förlagsredaktör
narrower: Korsordsmakare/Korsordskonstruktör
narrower: Manusförfattare
narrower: Författare
narrower: Redigerare
narrower: Dramatiker
narrower: Dramaturg
broad match: 9puE nYg crq

Läromedelsintendent
type: Concept
in scheme: JobTech Taxonomy - Yrke
definition: Läromedelsintendent
broader: Speciallärare och specialpedagoger m.fl.
related: 3pyE aAA TFD
related: MVqp eS8 kDZ
broad match: C2351

Kärnborrare
type: Concept
in scheme: JobTech Taxonomy - Yrke
definition: Kärnborrare utför kärnborrning eller diamantborrning, som det ibland kallas, en borrteknik som i huvudsak används vid prospektering i befintliga gruvor men även där helt nya fyndigheter ska undersökas. Arbetsuppgifterna består i huvudsak av att producera borrkärnor som sedan skickas på analys. I arbetsuppgifterna ingår även service och underhåll av utrustningen samt viss reparation. Källa: Arbetsförmedlingen
broader: Brunnsborrare m.fl.
related: ibKR zh6 55T
related: j7Cq ZJe GkT
related: oit4 bZk s2J
related: wQHq 9GK ZBV
broad match: C8113

Data scientist
type: Concept
in scheme: JobTech Taxonomy - Yrke
definition: Data scientist
broader: Systemanalytiker och IT-arkitekter m.fl.
related: 3Wbd PnR P1M
related: apaJ 2ja LuF
related: PDpM TEo Q7h
related: qBsw ikL hZ2
related: BGMJ VN6 nH2
related: AHmo qSf viN
broad match: C2511

Brandingenjör
type: Concept
in scheme: JobTech Taxonomy - Yrke
definition: Brandingenjör arbetar med att förebygga olyckor genom riskbedömningar, byggnadstekniskt brandskydd och tillsyn enligt lagar. Rollen inkluderar att utforma föreskrifter, ge råd, utbilda räddningstjänstpersonal samt planera och leda räddningsinsatser vid olycksplatser. Brandingenjörer samarbetar med kommuner i samhällsplanering och arbetar operativt med insatsledning. Yrket kräver högskoleingenjörsexamen och kombinerar teknisk expertis med ledarskap inom räddningstjänst och säkerhet. Källa: MSB, SACO, Arbetsförmedlingen
broader: Brandingenjörer och byggnadsinspektörer m.fl.
related: irDe AKD jXF
related: iynp B7m FRm
related: E7hm BLq fqZ
related: B1EM Det 922
related: ESTN evw pTH
related: X462 rdK aPk
related: CDer 7Yv 8Bs
related: KdWb Vek x2a
related: 2dDC u1B EMY
related: wP5w Pjj WXn
related: 7srG Pv4 bLw
related: vNxA Gv9 Dym
related: mSJf L2e MDf
related: 24Fe mGc Qqt
related: mGvA FSc 1oR
broad match: C3112

Skadetekniker
type: Concept
in scheme: JobTech Taxonomy - Yrke
definition: Skadetekniker
broader: Skadereglerare och värderare
related: ddZa HQA vaw
related: X82t awd Qyc
related: 7zru M52 H9o
broad match: C3315

Produktionsplanerare, tillverkningsindustri
type: Concept
in scheme: JobTech Taxonomy - Yrke
definition: Produktionsplanerare, tillverkningsindustri
broader: Ingenjörer och tekniker inom maskinteknik
related: 6Hq3 tKo V57
related: mao6 chB 34V
related: FGBW 3gR fwZ
related: 9aEn jPz gJs
broad match: C3115

ST-läkare, akutsjukvård
type: Concept
in scheme: JobTech Taxonomy - Yrke
definition: Specialisttjänstgöring, ST, är den vidareutbildning som legitimerade läkare genomför för att uppnå specialistkompetens. ST-läkare akutsjukvård arbetar under handledning för att fördjupa sina medicinska kunskaper och färdigheter med målet att bli specialistläkare inom sitt område. ST-läkaren arbetar självständigt med patientutredningar, diagnostik och behandling, men alltid med stöd av specialister och enligt ett individuellt utbildningsprogram. Vanliga arbetsuppgifter är att ta medicinskt ansvar för patienter, delta i jourverksamhet, genomföra medicinska undersökningar och behandlingar samt dokumentera och följa upp vårdinsatser. Tjänsten omfattar också kontinuerlig kompetensutveckling, sidotjänstgöring inom närliggande områden och aktivt deltagande i handledning och utbildningsinsatser för kollegor och studenter. Källa: Arbetsförmedlingen, Karolinska Universitetssjukhuset, Sveriges läkarförbund, Region Kronoberg, Region Skåne.
broader: ST-läkare
related: NYW6 mP6 vwf
related: UtCj yMj ubw
broad match: C2211

Valutamäklare
type: Concept
in scheme: JobTech Taxonomy - Yrke
definition: Valutamäklare förmedlar köp och försäljning av valutor på uppdrag av banker, företag och institutionella kunder. Arbetsuppgifterna omfattar att analysera valutamarknaden, erbjuda handelsplattformar och genomföra valutatransaktioner. Valutamäklare agerar ofta som mellanhand mellan kund och marknad, underlättar transaktioner och kan erbjuda rådgivning om valutahandel. Yrket innebär även att följa regler och riktlinjer från finansinspektioner samt hantera kundrelationer och transaktionsdokumentation. Källor: Arbetsförmedlingen, Forexgruppen, jobbannonser på Platsbanken
broader: Mäklare inom finans
related: RbsF qLv jeg
related: RPTn bxG ExZ
related: X82t awd Qyc
broad match: C3311

Hudterapeut
type: Concept
in scheme: JobTech Taxonomy - Yrke
definition: Hudterapeuter behandlar huden i både ansikte och kropp med målet att bevara eller förbättra hudens hälsa och funktion. Arbetsuppgifter omfattar hudanalys, rengöring, peeling, portömning, massage, ansiktsmasker samt återfuktning. Hudterapeuter utför även behandlingar som hårborttagning, färgning av fransar och bryn samt kroppsinpackningar. I rollen ingår att ge produktrekommendationer och vägledning kring hudvårdsrutiner. Källa: Kroppsterapeuternas Yrkesförbund
broader: Hudterapeuter
related: JPts 6TB RxR
related: nPzP y29 CU8
related: bknV gGR 7aP
related: EprZ aca 9XE
related: Uuf1 GMh Uvw
related: evbo yPB ZYj
related: J2Q8 K5B KrB
related: JdJa v88 Nu9
related: eh2Y Cvg bUj
related: mHPM R4C vaa
related: UTR4 RpJ R65
related: B3AU YYc DFV
related: NKp7 zcx xWu
related: Wdfa Xds D7P
broad match: C5142

Laboratorieingenjör, fysik
type: Concept
in scheme: JobTech Taxonomy - Yrke
definition: Laboratorieingenjör, fysik
broader: Laboratorieingenjörer
related: 6Hq3 tKo V57
related: Y11c b66 3Ef
related: EsWG kHG oXZ
related: hBzg sf4 HHU
broad match: C3111

Musikpedagog/Musiklärare
type: Concept
in scheme: JobTech Taxonomy - Yrke
definition: Musikpedagog/Musiklärare
alternative label: Musikpedagog
broader: Övriga pedagoger med teoretisk specialistkompetens
related: pVzY rff Amk
related: HBMF E6v 752
related: L2UR wJf YXE
related: LBqC QGB P6H
related: cLTs Gdz GjJ
related: yYtC ByH Xvm
related: Cmsp soR K96
related: aABj ts7 QGA
related: xRbB qR3 ePA
related: PHxm yqX BFw
related: Jtk7 6Jr uAm
related: FuRR W2B Cfa
related: dWUE R47 Uqk
related: Y8yz JFZ qE1
related: ybNP fWQ Ri8
related: pC4A d88 tRZ
related: heNZ cwt RQS
related: qdVK DYf GBJ
related: aeG8 yZ5 SFU
related: ajkF kUN hkP
related: dGBC rEP UUW
related: iJgG fV3 gsS
related: eRif 6Rv cTX
related: WCRw swf vP3
related: Ah5K xbx eBu
related: MjSb zzQ 2Mv
related: MVqp eS8 kDZ
related: 39Mv oev vyH
related: bixn jnb z3d
related: JWsz 7Nf 4Wj
related: VJUa UvJ ScU
related: 8ioB xfK RYL
related: Lc32 rUh NJS
related: 14uS oFQ SR5
related: LCAb LhH m84
related: w8ax N3t 2AF
related: 3VZQ 1jd wwa
related: pANF t7b cAj
related: HGgk rF1 Ngu
broad match: C2354

Kassaledare butik
type: Concept
in scheme: JobTech Taxonomy - Yrke
definition: Kassaledare i butik leder kassapersonalens arbete. Yrket kan även kallas kassachef och teamledare kassa. Arbetsuppgifterna omfattar öppning och stängning av kassalinjen, kassaredovisning, handledning av nya medarbetare samt lösning av praktiska frågor vid betalning eller returer. Kassaledare har vanligtvis goda kunskaper i kassasystem och butikens betalrutiner. Källa: Handelsanställdas riksförbund, Arbetsförmedlingen
broader: Säljande butikschefer och avdelningschefer i butik
related: e2f2 4Bk WkL
related: RPTn bxG ExZ
related: PvhG Tru Bv7
related: bvHJ 6hA oEM
broad match: C5222

Notskrivare
type: Concept
in scheme: JobTech Taxonomy - Yrke
definition: Notskrivare överför musikaliska idéer till noter, både för hand och digitalt, och arbetar ofta tillsammans med kompositörer, dirigenter och musiker. Vanliga arbetsuppgifter är att skapa, arrangera och revidera noter för ensembler, solister eller körer samt att ansvara för hantering av notbibliotek och notmaterial. Arbetet kan även innebära att anpassa och digitalisera äldre noter och administrera utskrifter, arkivering och katalogisering av notmaterial. Källa: Arbetsförmedlingen, Platsannonser
broader: Musiker, sångare och kompositörer
related: 8too bEs 7NU
related: 9puE nYg crq
broad match: C2652

Röntgensjuksköterska
type: Concept
in scheme: JobTech Taxonomy - Yrke
definition: Röntgensjuksköterska genomför medicinska bilddiagnostiska undersökningar och behandlingar med hjälp av röntgenteknik för att ge underlag till diagnos och behandling. Röntgensjuksköterska är en skyddad titel med legitimationskrav. Vanliga arbetsuppgifter är att planera och utföra röntgenundersökningar, säkerställa bildkvalitet och följa strålskydds- och säkerhetsrutiner. Röntgensjuksköterskan ansvarar för att informera och förbereda patienter, samarbeta med läkare och övrig vårdpersonal samt hantera och underhålla medicinteknisk utrustning. Källa: Arbetsförmedlingen, Karolinska Institutet, Region Stockholm, Socialstyrelsen, Uppsala universitet
broader: Röntgensjuksköterskor
related: NYW6 mP6 vwf
related: sqvh gTy 6Sj
related: zw2c 74u xjo
related: Xwas fLN NhP
related: XUUy rFC Xog
related: 1f7B E5K sh3
broad match: C3211

Mediachef
type: Concept
in scheme: JobTech Taxonomy - Yrke
definition: Mediachef
broader: Informations-, kommunikations- och PR-chefer
related: epLc SkD cbT
related: Yfed RNn aJ8
related: bh3H Y3h 5eD
related: 9puE nYg crq
broad match: C1222

Linjeagent
type: Concept
in scheme: JobTech Taxonomy - Yrke
definition: Linjeagenter representerar ett rederi inom ett geografiskt område och ansvarar för att boka last till linjefartyg samt hantera tillhörande logistik och administration. Arbetsuppgifter omfattar försäljning av rederiets transporttjänster, kontakt med exportörer, importörer och speditörer, bokning av last, containerdepåverksamhet, landtransporter och dokumentation. Linjeagenten ombesörjer även fraktinkassering och marknadsför rederiets avgångar. Källa: Sveriges Skeppsmäklare
alternative label: Rederiagent
broader: Speditörer och transportmäklare
related: RPTn bxG ExZ
related: ASGV zcE bWf
related: GXPV yNW 7PK
broad match: C3331

Ugnsoperatör
type: Concept
in scheme: JobTech Taxonomy - Yrke
definition: Ugnsoperatör styr och övervarkar värmebehandlingsugnar inom metallproduktion. Ugnsoperatörer inom metallproduktion övervakar och styr värmebehandlingsugnar genom att ställa in temperatur och tid för att uppnå rätt metallkvalitet. Förutom skötsel av värmebehandlingsugn ingår vanligtvis provtagning, kvalitetskontroll och dokumentation samt enklare underhåll och felsökning vid behov. Källa: Arbetsförmedlingen
broader: Processövervakare, metallproduktion
related: yhCP AqT tns
related: hWgR 2e5 Wvj
related: G4Tw o6r KJo
related: AbqB CNg of6
broad match: C3135

Specialtransportförare
type: Concept
in scheme: JobTech Taxonomy - Yrke
definition: Specialtransportförare transporterar stora och otympliga objekt. Specialtransportförare transporterar stora och otympliga objekt, som maskiner, brodelar eller nedmonterade fabriker. Specialtransportförare har erfarenhet från olika typer av transporter och är teknisk kunniga för att lösa praktiska problem. Lastsäkring är en central del av arbetet. Föraren måste också behärska vanliga arbetsmaskiner och gärna ha yrkesbevis för olika typer av arbetsfordon. Ofta arbetar man parallellt med andra transporter som exempelvis kranbilstransporter. Källa: Transportfackens yrkes- och arbetsmiljönämnd
broader: Lastbilsförare m.fl.
related: iKT8 eDc J8z
related: 3hoQ 8i6 GjM
related: j4oE mFS bZ9
related: zGjD M5a HCX
related: d68E e74 a59
related: bCUX YKG Vvt
related: hhb7 1hV t7R
related: nD9v iHa ytM
related: ASGV zcE bWf
related: 483u hVx psa
related: 9wnn PAV q12
related: Bc91 Tyo 3ce
related: 4VuT d9Y w3f
related: VNGU P8A nHQ
broad match: C8332

Översättare, skönlitteratur
type: Concept
in scheme: JobTech Taxonomy - Yrke
definition: Översättare, skönlitteratur arbetar med att överföra litterära verk såsom romaner, poesiböcker och teaterpjäser från ett språk till ett annat med bevarad stil och känsla. ¨ Vanliga arbetsuppgifter är att analysera och tolka originaltexten, översätta och anpassa språkbruk, kultur och referenser, och ofta samverka med förläggare eller redaktör. Källa: Arbetsförmedlingen, Stockholms universitet och Översättarcentrum
broader: Översättare, tolkar och lingvister m.fl.
related: 8too bEs 7NU
related: 9puE nYg crq
related: oBXK kUK a67
broad match: C2643

Lagman
type: Concept
in scheme: JobTech Taxonomy - Yrke
definition: Lagman är administrativ chef för tingsrätten och leder verksamheten så att domstolen arbetar effektivt, rättssäkert och med hög kvalitet. Arbetsuppgifterna innefattar att strukturera och utveckla domstolens organisation, leda genom andra chefer, fördela mål och ärenden samt följa upp arbetsbelastning och se till att mål handläggs inom rimlig tid. Lagman representerar tingsrätten i externa sammanhang, ansvarar för samverkan med andra myndigheter och driver kvalitets- och utvecklingsarbete. Lagman är också ordinarie domare och kan delta i dömande uppgifter. Källa: Förordning (1996:381) med tingsrättsinstruktion, Sveriges Domstolar
broader: Domare
related: X82t awd Qyc
related: x4Wi NWW ogB
related: Abcb QtH isZ
broad match: C2612