JobTech Taxonomy - Yrkesområde
type: ConceptScheme
description: Terminologi för begrepp av typerna 'occupation-field'
publisher: https://jobtechdev.se/en

JobTech Taxonomy - Yrkesområde
type: Collection
description: Begrepp av typen 'Yrkesområde' (kod 'occupation-field')
member: Administration, ekonomi, juridik
member: Bygg och anläggning
member: Chefer och verksamhetsledare
member: Data/IT
member: Försäljning, inköp, marknadsföring
member: Hantverk
member: Hotell, restaurang, storhushåll
member: Hälso- och sjukvård
member: Industriell tillverkning
member: Installation, drift, underhåll
member: Kropps- och skönhetsvård
member: Kultur, media, design
member: Militära yrken
member: Naturbruk
member: Naturvetenskap
member: Pedagogik
member: Sanering och renhållning
member: Yrken med social inriktning
member: Säkerhet och bevakning
member: Yrken med teknisk inriktning
member: Transport, distribution, lager

Yrken med teknisk inriktning
type: Concept
in scheme: JobTech Taxonomy - Yrkesområde
top concept of: JobTech Taxonomy - Yrkesområde
definition: Exempel på arbetsuppgifter: Utvecklar, leder, planerar och kontrollerar material- och informationsflöden och produktionsplanering alternativt utför produktions- och materialplanering. Leder projekterings- och konstruktionsarbete som avser exempelvis elektrotekniska produkter alternativt fordon, maskiner eller ventilations- och kylsystem. Utformar, projekterar och ritar byggnader alternativt yttre miljö t.ex. bostadsområden, parker och trädgårdar. Organiserar och övervakar processer vid tillverkning och montering av exempelvis el-, tele- och elektronikutrustning. Installerar och utför service på medicinteknisk utrustning. Utför experiment och analysarbete exempelvis vid kemiskt forskningslaboratorium.
related: a8zs G2c Wxf
related: Qs9G z7A tY8
related: 7Yn2 NLJ oa2
related: CC4H YCh 77T
related: qCeG oQA cxB
related: ciWH LHa Wf1
related: 7pWL NSY Sap
related: mCvk 3K4 Ktj
related: bkGc GEk ngc
related: Z22a Yjn Pi8
related: xEn5 ViV mnh
related: XjEC vph KJH
related: 4omd 94n 7Hn
related: 32bC YdL JtU
related: q5pb Us6 ChJ
related: EBur MWp Xkz
related: wBxx oHc YCn
related: RU3Y Gqt h3c
related: 4mpC 7ue qJb
related: fyfn HPQ Gnz
related: NbhD gbP tHm
related: 7cAw HzP 3Kv
related: 66nJ dqL YGj
related: 84z6 pWk XJQ
related: KyUN dkM sDB
related: 3vTw fLi JoX
related: jK73 q3a fcZ
related: Gnrd Brt 15j
related: ZEak n3Q WjS
related: YfnX HAo gsa
related: CzL7 oqF zrY
related: Rd3G bFa zvR
related: DrU2 d7W Ana
related: eQpn LHp c2a
related: 44U4 7Fz GCy
related: tyjn 6qY Ked
related: 3MDV uBQ 6oG
related: QU7D U7E G66
related: 8X6p EBT DZK
related: 9NVr Rdx 8Ay
related: 9fEz 9ji 74Y
related: Fy1A qaK t5R
related: p4vQ Dpo d6a
related: zmTy qPb e9e
related: UZNy RhJ TNM
related: xvdi Fud jKF
related: UiHJ 37W 7vn
related: nBVy mkU UrM
related: cAJj uJb s9C
related: a46P 3cL 149
related: CQQn 66u vXj
related: pE7V mGU k1K
related: f2PC hUg XpT
related: GYd6 A2J kFK
related: 4ZyQ 56y MwM
related: 2NdT qer nQk
related: HdqU oqU fr7
related: JaTP TuX 3wA
related: rhFN FEC 4Ye
related: GCza QNs oUe
related: uXRf emU Fou
related: VEBd otK nKq
related: pdKf yyX vWc
related: 9Vqi fu8 Nat
related: S75J j1p EEp
related: T6yh MNf CKv
related: 37Yu WtR fRM
related: Su5E har ADS
related: 7oRE Ejt YWQ
related: cGMD PSS 35h
related: TRVV bXp BG9
related: ATsD LxE fZ6
related: uEAk r6E Ko9
related: uL8r kGS Xfu
related: hJhQ Fxc Mjp

Kultur, media, design
type: Concept
in scheme: JobTech Taxonomy - Yrkesområde
top concept of: JobTech Taxonomy - Yrkesområde
definition: Exempel på arbetsuppgifter: Designar, formger och utvecklar produkter exempelvis för tillverkning eller för digital media alternativt för mode-, smyckes- och glasprodukter. Planerar och organiserar verksamhet på museer, konstgallerier och bibliotek. Planerar, gör research för och skriver artiklar, böcker, manus, manualer, beskrivningar, ledare och nyhetsinslag. Översätter text eller tal. Skapar konst i olika former. Framför klassisk musik, populär- eller kyrkomusik som sångare eller instrumentalmusiker. Skapar och utformar konstnärlig dans. Regisserar eller gestaltar roller i teater-, film-, TV- och radioproduktion m.m. Tar stillbilder och rörliga bilder. Ansvarar för tekniken och leder arbetet vid sändning av TV-program.
related: M4Ld 18g XzK
related: zEWh oPy Qmt
related: febp FvM dkW
related: 48KV oBC Ffd
related: woHv Nnf tCs
related: YTjK wVy YNM
related: 1qgf mXF 5Xp
related: GPNi fJR B2B
related: 6arZ cAe r8f
related: H7ct ff1 9sP
related: a1Kd 3zW cwK
related: K3kr anm MnN
related: GBys 6Zx 25W
related: xUwN SAt vGg
related: soMb U4k fzo
related: TPtR 2LX 6B3
related: E4KE 68y 6ag
related: zzdq iU5 Ph4
related: JCzk 4xw LrF
related: kPWD ic7 CLm
related: N1NW zL4 2LA
related: c6R7 bxh Hg9
related: JX2V yLy 1Fc
related: s8L4 bRy BqF
related: WBAb PN5 jJo
related: Q5D4 pTu 3aQ
related: qkm9 9tN mtA
related: zEQp 7L8 AkE
related: Qrbr LWo Pqt
related: 4SdN cwv Tfo
related: a8Vk 3Vu XLs
related: vXi8 Pqz gsR
related: RdVK 4zC kFV
related: m9vB abw GZ3
related: Xoz2 dQe 9KC
related: PLGk sfY QfQ
related: 4bqt oWT Jo8
related: bqrn 3Hf Wtv
related: KZSb ze9 LCc
related: euJP wxo skF
related: SV22 7W1 pFT
related: zNEo 54u hSC
related: MzGw NJ2 JV1
related: g4pc eLB HXn
related: 82bk gCY NS2
related: uaUH r3u ygB
related: ELDW fuy NjZ
related: u4X9 hZb kzs
related: 1N2U 6xW Tdx
related: f4mp tWX wa9
related: Many vs3 Kaw
related: YBxu 4hV dNB
related: imJC PfJ RHt
related: GTFy iPM msj
related: JfyC gDr U4e
related: arJK xQM qou
related: zTjU B9f PT4
related: TkCs kYx ZFn
related: oV7J UML Zy2
related: kJtR sGs BP1
related: aQDK H6n bwK
related: naaw 9jV ab3
related: 7Rih wMN qpR
related: 9HaV n46 t88
related: Ao7E HFK aqF
related: LYdh 6qh 9Kr
related: Zjz2 R2c ySs
related: ugmL 11t RvD
related: scLn msY o7P
related: RjeB w9X dhM
related: qhRQ V1m ysq
related: 49G8 LRE 73K
related: HWxz PRg S9f
related: 2MYm KVX GfS
related: jg79 1KF Hvq

Transport, distribution, lager
type: Concept
in scheme: JobTech Taxonomy - Yrkesområde
top concept of: JobTech Taxonomy - Yrkesområde
definition: Exempel på arbetsuppgifter: Ansvarar för drift och underhåll ombord på fartyg alternativt sköter däcksutrustning, rengör och målar däck och skrov. Navigerar och styr flygplan, helikoptrar och fartyg alternativt övervakar och leder flygtrafik. Ansvarar för och leder daglig drift på lager eller terminal alternativt tar emot samt packar och lastar gods med hjälp av exempelvis truck. Samordnar och övervakar person- och godstrafik. Förbereder distribution samt distribuerar post och direktreklam. Svarar för passagerares säkerhet ombord på flygplan eller på tåg och spårvagnar. Framför lok, pendeltåg eller tunnelbana. Växlar och iordningställer tåg på bangårdar. Kör buss, spårvagn och lastbil alternativt taxi- och personbilar för att transportera passagerare eller gods. Tankar flygplan och hanterar bagage.
related: X35x Uai iEK
related: tkGT kPC L3S
related: sSsf D7Q JyQ
related: JiE6 FnP qXP
related: iLgH g2C 2KH
related: AMCU cUq Eup
related: YWfW snc CTn
related: GLp9 DyP gHJ
related: XUsX DaN meJ
related: GQSf fnq kjF
related: VXjE yRK 6o3
related: Kzpt MdQ f3i
related: k4k1 LhW o5U
related: wQLK eDg pD4
related: WYkE arW 7Z1
related: s8L4 bRy BqF
related: F1CJ eRU TBg
related: zxMH Zgf tsS
related: nDGY Jbi cRM
related: AFXd nYV aT3
related: R2un HhG 7oY
related: 1zWB 81n EEV
related: i9VX mum dFB
related: HXv5 i9k t5P
related: 8UPT SpB Zqh
related: u46u NZb ck3
related: qLua Ure N8S
related: jDJN Q3V 3ot
related: pUQK VgY EMT
related: JEhg Dmh mzv
related: HdJy NMc Ey8
related: YEm9 pLR XoT
related: PtiU 6mm yyL
related: 2p8h gqm 4LG
related: bhk6 aNU xRe
related: EymQ sK4 wBA
related: sxew RLg hyK
related: z7WD aBS m9N
related: ytyd woW QVz
related: YtDb 3jB j3C
related: tPmR aUG qhr
related: w9N1 eTj 2jq
related: Ce5J e8j 7oh
related: AKCn v5B mUy
related: RoCf 4ac hBg
related: LNfx Wzs mdx
related: EB6b fRU tA5
related: Z1sb ZS4 hNz
related: o7LP duC u9Z
related: BNz8 F9J y2L
related: SauB 4Gt FTk
related: c4S8 tmV fJW
related: 6dqD oy2 se4
related: TkRn mQA xtD
related: kT6D nm2 KP8
related: vL9M 7hk 1X9
related: 7FqZ 2r8 CEN
related: f67v vgo iau
related: oohW snt MqM
related: GkMH KEV QKX
related: FTFm Rp2 k6t
related: o8aU Geg vRm
related: 68DU 3eK 84a
related: nViA Utf vPc
related: afDJ LWv ESt
related: aNrh uSe mok
related: WU2H o2e rrm
related: ktE3 SWm Qaj
related: xhjJ p62 8Gs
related: CMSX P2L ZYx
related: 4itw Zm3 2YB
related: bw3n mG3 Jx8
related: 77vi dL6 FZR
related: QfuC LxN w4T
related: wjGn DCt 3Br

Säkerhet och bevakning
type: Concept
in scheme: JobTech Taxonomy - Yrkesområde
top concept of: JobTech Taxonomy - Yrkesområde
definition: Exempel på arbetsuppgifter: Inspekterar arbetsplatser för att kontrollera att arbetsmiljölagen och gällande föreskrifter följs. Övervakar person- och godstrafik vid rikets gränser och kontrollerar att tullbestämmelser efterlevs. Besiktigar fordon, fartyg och luftfartyg. Inspekterar brandskyddssystem alternativt inspekterar och besiktigar byggnader, anläggningar m.m. Ingriper vid lagöverträdelser samt utreder brott. Släcker bränder och gör räddningsinsatser. Svarar för vård och tillsyn av intagna på kriminalvårdsanstalter och allmänna häkten. Patrullerar och bevakar fastigheter och områden. Tar emot, samordnar och förmedlar larm om inträffade eller befarade olyckor i luften, på land och till sjöss.
related: tKCe Qpx Thx
related: vqv8 Tiz NeL
related: 3wHJ rrt WDK
related: 3N52 wtb L2r
related: Xv3V shd fJp
related: Cdn7 Auj 1mv
related: g41i MsZ 2Ga
related: BLrV Pvm rL6
related: 1WsA bfK QUd
related: xdLw h9E dNV
related: 2RC6 tLW jCJ
related: SwJ6 7pG qYk
related: UY47 7BK rfi
related: mobn aTk jS6
related: 77wX fg5 rMa
related: XEUg tcM vjF
related: W2dh NJx QLB
related: bpCT mnW CKr
related: wTfw 7hJ gkU
related: pCtL mkz HVe
related: sgib x6a wnW
related: zjT2 Qw3 XmE
related: SRCS uYJ MUP
related: rP7c J3E h5G
related: BbNn Gtf rKp
related: na2q CC2 U5R
related: PX1A 3JR jUL
related: Jpr5 Qf8 e5d
related: 4GHe kgB cAk
related: HTi3 9dQ gxH
related: Lkio vzx RxG
related: mUBt TFY MNK
related: 78kB N1K piG
related: GqEz Pan 2nm
related: rfpp bnQ RoQ
related: gfzz zS3 TLa
related: L7dr edw VWG
related: nPhL nKW sqs
related: 5cVu BVm nNG
related: Ck8X 6eY 3VW
related: wRxU Co2 FgS
related: Dk1g 6Du mNF
related: qxqj zKy PmC
related: rv8W E8i aMo
related: wD6h B4b BBh
related: PrPH J1d qua
related: 3Uhk 4A8 cy6
related: NCaY h1f Eni
related: ac5J 3uW FZ2
related: WV2B NSa Qvs
related: 9UWD XwF 4nX
related: pquy 7kP XJh
related: X5V5 aFQ STV
related: xAjj Dx7 LvV
related: DXkj DPC Cix
related: x5jo dN4 psq
related: uuGY vBh H4w
related: XSW5 zeV fSU
related: E6Kf Y8Q baT
related: NoHX doS a8J
related: mq6p cdg f1i
related: TH8w hsR AMf
related: Geiy N5y GLi
related: Wx94 afX z65
related: vDxV 16d K9u
narrow match: wCx8 rY3 XUT
narrow match: ug5y o6z U3L
narrow match: Uw64 cuc U3H
narrow match: hgAg gLr YGg
narrow match: kZwz D8K bKs
narrow match: nuXg Wjc JPd
narrow match: ayQ4 G3W A2w
narrow match: FKCE Anf zGH
narrow match: rNcE Zno pD8
narrow match: iqZh 3yX i8n

Yrken med social inriktning
type: Concept
in scheme: JobTech Taxonomy - Yrkesområde
top concept of: JobTech Taxonomy - Yrkesområde
definition: Exempel på arbetsuppgifter: Utreder individers, familjers och gruppers sociala och ekonomiska problem eller samlevnadsproblem. Leder och planerar församlingsarbete i Svenska kyrkan eller annat trossamfund. Behandlar och rehabiliterar klienter och patienter inom psykiatrisk vård, missbruksvård och kriminalvård. Planerar, organiserar och leder fritidsverksamhet alternativt friskvårdsinsatser. Förbereder, arrangerar och utför uppgifter i samband med begravningsceremonier. Ger stöd, service och omsorg till barn och vuxna med funktionsnedsättning.
related: zR5y K7c TNp
related: jJNX nBj SN9
related: FwM7 WYB qgc
related: rMfT rsj WQv
related: ujBX nic wuH
related: fKDg zwQ iE2
related: aEF1 qeh 5Qe
related: PzLV Vcy RJG
related: jEX9 VcQ u2N
related: TtGo UiH sEN
related: Xuko NMb NL1
related: ZssB k2K VME
related: SEhy kME xFW
related: SF73 TBz fhR
related: wFCc JcG dnb
related: GLvv qyx iMK
related: R21j e4A SU8
related: S8DR 6EK m92
related: NSEG DmQ waj
related: q4Aj RjF Uj2
related: MMTE fiP 1Ng
related: zRLw Aid zDh
related: qSsm wXn Z6i
related: UT3U ctb LE2
related: PSzA zqV o2j
related: aWHP Fv2 1US
related: 7G2k Lgp fGW
related: VRVR RgP 6jV
related: d9nv iUm Jyg
related: 3tXK 9La M3W
related: j57s wsS ecL
related: SDk3 uMJ 8an
related: t8eC vg7 Uyg
related: ddSf Ytu Kw1
related: wA6t jij 7q9
related: BUnV RWN xvi
related: GLCR pYe cxx
related: 5h8g xbH FQs
related: kbMR 1Di iVA
related: Wnx2 nLc JWY
related: jQKk Wzd pvu
related: uZ4a nJb ucb
related: Zafp rUq z3A
related: feYj 4wY fCC
related: 9rvw tBz kFG
related: TQdN j7Q mBj
related: CnYS d4N CZJ
related: a4jH apZ psf
related: 5avt 87C rXE
related: hvsu Jok LKX
related: 7SA6 pBP 4ek
related: r2Gv ft9 p51
related: Qopb b1K cm3
related: UmP3 4RG XnW
related: 6ybD FpX WDW
related: BY1K mZ4 oKj
related: wVNJ 2v4 NKo
related: ZnNn D2K pTi
related: 8Y3v LhQ srX
related: 6gF2 LeK d34
related: rM7G ge7 XhP
related: tT85 Pdp 4Uq
related: y114 8sx SXk
related: KJoL 2hp Sa5
related: YpRs ybt 47a
related: LxhG of8 eMi
related: 9HFY TcS 6qs
related: eU1q zvL 9Rf
related: dBVw 5Cw upG
related: Vq8N Qvz i4u
related: UVvg XmH CA4
related: J9hX byC fkn
related: udVE 5Hy qGb
related: pYiF Z6V ULQ
related: TS9s VV4 q6e

Pedagogik
type: Concept
in scheme: JobTech Taxonomy - Yrkesområde
top concept of: JobTech Taxonomy - Yrkesområde
definition: Exempel på arbetsuppgifter: Undervisar på högskolenivå alternativt på gymnasial eller eftergymnasial nivå eller i grundskola. Undervisar elever med behov av särskilt stöd eller ger specialpedagogiskt stöd till lärare och utvecklar undervisningsmetodik. Undervisar och organiserar aktiviteter i förskola eller i förskoleklass alternativt planerar och organiserar fritidsaktiviteter för skolelever i fritidshem eller öppen fritidsverksamhet. Tränar och instruerar professionella idrottsutövare och motionärer. Leder studiecirklar och kurser utanför det reguljära utbildningsväsendet.
related: au7G ooX gGy
related: DXJY cZD 68D
related: QhS4 HKc T2v
related: TFdz Dvb vwc
related: ps1c 9CW NDy
related: ujBX nic wuH
related: WX68 sGe oUm
related: VZoJ 4oe xyR
related: E6Ts Gns DjW
related: 4L47 MLv eFJ
related: rUcW z9R Qsv
related: qaj9 brh EM1
related: yDui fD3 o5A
related: g7NJ ZHN MPB
related: xrVh 3uf kWi
related: SA7K jqY K81
related: Curv dHm 3dZ
related: r8Cv UQf sS9
related: Cn7e qQS nPF
related: K2j2 Rpv Enk
related: KYPa Jv8 ZbU
related: t7wJ 6wi kFx
related: kbCX 1s6 vqh
related: M7TY sct XPk
related: 86sy hBf exW
related: PC9e 5Fn 5Vx
related: DdMT ukX LGq
related: 2iBk N8d Gm4
related: cztk vjQ Jyo
related: 9kWY X1U RyC
related: Pgpp B8P wot
related: Tyia uZN ZSc
related: qSsm wXn Z6i
related: zrQ9 1z2 kT3
related: MiRr LaG kz8
related: LX5L e6N 4jS
related: kR6N 46L Hc9
related: rgsj poi koz
related: rN8K yrD VDk
related: KuqL bsD Zqd
related: etkf dBn JbW
related: f5ea EuN EfJ
related: yhF2 vDD WB9
related: Zfgc BYU HM2
related: 3XMs GiA szk
related: 1yBB G2R LGr
related: edK4 xTQ 5Pe
related: dT2w rhK JtM
related: hERw LKk uJK
related: p96L aTJ kkG
related: hhzp fKU NQ2
related: H9ej iRx 9G6
related: P9Et 5en uwo
related: f1zq tpA QtN
related: 6U5J pNt h6t
related: 6Smf Gqg cv8
related: YfCD kUE kck
related: 9KY5 egr EUA
related: xUfR QAo B3a
related: KVDo WU8 MSS
related: zBWk kpm 25V
related: 2DVG WgT 925
related: 4mUk ow8 wji
related: S9LC 4m4 yza
related: Sbzf iBA MAS
related: 6LWS 5vt pvD
related: uV8X VNM XsF
related: AR9u x9n nGa
related: tF8h J5J 3Bq
related: jUbF gem LC8
related: dhXy 7Te Tzb
related: JUu4 wcP kQG
related: pUgn qWq yog
related: D8xk 1Sz Dqo
related: PXPJ LKH pmy

Hälso- och sjukvård
type: Concept
in scheme: JobTech Taxonomy - Yrkesområde
top concept of: JobTech Taxonomy - Yrkesområde
definition: Exempel på arbetsuppgifter: Utvecklar teorier, studerar och analyserar fenomen inom medicin samt förebygger sjukdomar och andra hälsoproblem. Undersöker, opererar och behandlar patienter samt ansvarar för medicinsk omvårdnad och läkemedelshantering. Ger stöd, assistans, omvårdnad och vård till patienter alternativt ger individuell vård och omsorg till äldre i eget eller särskilt boende. Vårdar, ger stöd och råd samt medverkar i rehabilitering av patienter inom psykiatrisk vård och missbruksvård. Leder apoteksverksamhet. Bereder, expedierar, marknadsför och kvalitetskontrollerar läkemedel inom exempelvis apotek, läkemedelsindustri och sjukhus. Undersöker och behandlar sjuka och skadade djur. Behandlar patienter och ger information om förebyggande åtgärder om tandhälsa.
related: b856 q3P tzU
related: s649 4qV ucB
related: xwG4 5v2 7ZC
related: qw9j P87 bcJ
related: ewwW RjX 2BQ
related: yrJP GPE xpq
related: nZCK nUi VS1
related: L27F P6M YgS
related: YJKc yXU DUH
related: Di9K poT rCx
related: C1FR RzT hzP
related: JPfM Ye1 r71
related: R2kh 8rW qbm
related: Ncin Mdw pRT
related: dAmo ydH Fko
related: 7Ngz tJ4 hZ3
related: UTWj ogC 1vd
related: ir1D hfe jPD
related: b3hK sJG AaB
related: U7JN o3K cB1
related: UvTy Pc7 g3L
related: uHya vGf iyL
related: pTLX W9d byF
related: 9K3i XD4 Kyy
related: SEhy kME xFW
related: 1WsA bfK QUd
related: 7Kxn MMG TuY
related: S7fN qrm XeC
related: L8BG yS3 47d
related: AFm7 LbR f1U
related: hEZU XUN X3b
related: BnhE hcg H2c
related: 8Vew BX8 97h
related: dASq 9GH jbS
related: KREy LcZ kvM
related: XyDr 64q Wxw
related: aCoU U6i fza
related: 3gEQ 8d7 G94
related: dvdA ymy 6tN
related: PB9o ES7 vmw
related: TfPJ UNQ pZo
related: o88C 4FD QDs
related: nm6i zmH rEz
related: yNu2 zWd pM9
related: LQMa 8hg qQX
related: zRLw Aid zDh
related: Pj8T bST f7D
related: TprQ iME Evi
related: XBpo B5s mZA
related: Hs5u t2n 318
related: qnF9 wC7 zTq
related: Pi5N 5NB 7BY
related: Edjj 2Q7 P8X
related: xaaV c7e mk7
related: oBzD Pym iqC
related: 6dCj L43 LpC
related: vrZx wdU 6MX
related: GgmE SvH mtm
related: TdvW S8R CFH
related: 47p3 SHB BaN
related: szfD hPZ y7M
related: TG6L znT mbR
related: 3Hz5 7WC nyE
related: bXNH MNX dUR
related: YHfo Sbx vzK
related: CbFL fwZ WzR
related: ePrU 2x1 yY4
related: 7z3p xDw Xs4
related: pTLB 6Zr fGi
related: k4xL m1y aKQ
related: psA7 tjX Dz1
related: Ctfy d3y vN6
related: dZts e4s C98
related: NiVs zKS 8Jr
related: bSEB VKd Ub3

Hantverk
type: Concept
in scheme: JobTech Taxonomy - Yrkesområde
top concept of: JobTech Taxonomy - Yrkesområde
definition: Exempel på arbetsuppgifter: Skär till och monterar glas i fönster, dörrar och ramar. Tillverkar konstruktions-, inrednings- och utsmyckningsdetaljer i samband med byggnation eller renoveringsarbeten. Tillverkar och reparerar tekniska och vetenskapliga precisionsinstrument. Formger och tillverkar guld- och silversmedsvaror, konsthantverk och andra föremål. Designar, tillverkar, reparerar trä-, textil- och läderprodukter.
related: evtB Zc1 S4L
related: Lkpi 2QR zd5
related: SSjm 1Js RCu
related: c8PJ S6r Lg2
related: ezMJ 6c9 P5z
related: imUa z6c NDM
related: U4LG FMd R8B
related: KiD2 B8H U7U
related: 3C5w yFv KP9
related: EVMd 5ES dRT
related: 7P58 BVX 1sE
related: pU9K 6eK YNU
related: xYHS T5r RyK
related: gJBf GLN b7x
related: EuTa edS Add
related: bgWo nJB eXP
related: c3tM knt TxY
related: EWXb FW7 fTJ
related: B9AJ ZZZ mgd
related: TUuA ZFY 3uF
related: 2ZTF EUL UyD
related: tn2F 2Aw NWq
related: vFw4 cSz TUi
related: rBXf cgf xzc
related: F9MR v8m FT3
related: KFJe A3f YQr
related: VQGM JwH QUh
related: rssB q7A N5C
related: eKBZ aZC KCq
related: jGxn g2j tUC
related: Y9x5 F4p HYf
related: L8T2 zWq 9pC
related: CYG8 P5g 7yp
related: hYDg MVv nqM
related: yfBV uVJ JSr
related: MJvj tVV zpZ
related: KudS WCe gRA
related: 7dfm UMS 2je
related: JUt1 s8J UJV
related: 6xVT BAz win
related: YJMS XMf fAA
related: Mwuy Cxp 2ds
related: 9xw5 9HF gm5
related: MieG x63 WQg
related: AiN9 YkN zMR
related: FKGg b6g hvN
related: P4m2 Ej7 mgv
related: ouHN LPH a3A
related: oDdD iSi MAW
related: kpNH bFZ 3X2
related: DcK5 3TS 5ou
related: jvdd vUd o2x
related: 93t8 g4b yeL
related: 4jr9 Ywm 6J1
related: XugJ 6hw wVV
related: qy8Z AhS M8F
related: SomG sf1 VZw
related: KgJQ nBR eQr
related: UtNk wRs 2k6
related: L26k Psr p9P
related: 1Liw W5W n2z
related: ras1 rJP 9UX
related: DmaA udM 7Rv
related: z9Cu vJh B55
related: t7Uq w4o DA1
related: M7XY rbq hwD
related: kBdt K9U vgC
related: cyCt LLE qDy
related: aEjW XfW Bx9
related: rbjK vsq v67
related: FM1r vQd zS8
related: bS4M dZq 39m
related: f876 1rP bai
related: xQxJ E6e Hzv
related: NwkH hFi uZx

Försäljning, inköp, marknadsföring
type: Concept
in scheme: JobTech Taxonomy - Yrkesområde
top concept of: JobTech Taxonomy - Yrkesområde
definition: Exempel på arbetsuppgifter: Utvecklar, planerar och samordnar reklamkampanjer, marknadsförings-, informations- och kommunikationsstrategier. Säljer produkter och tjänster till exempelvis återförsäljare, grossister och företag alternativt säljer varor i dagligvaru- och fackhandel. Köper in varor och tjänster. Organiserar godstransporter och förhandlar om fraktavtal. Producerar och organiserar resor samt arrangerar evenemang och tillställningar. Bevakar och bereder marknads- och försäljningsärenden alternativt gör beställningar samt kontrollerar varor och fakturor.
related: 9nHg tvX ajZ
related: xQP2 w9J jbZ
related: E4wN d1X eYy
related: Qbmc 5Yr Lca
related: H7ct ff1 9sP
related: 3abF Jyu WtS
related: bmgy Rsq 4DA
related: EysC CUe gKG
related: rynG URT erJ
related: tPp6 tmB EsY
related: UK96 XF1 w6F
related: PtwA N8T GTo
related: ZaFc F2b Yuo
related: uWwq jF2 nhq
related: Py1W JCz LNX
related: p17k znk osi
related: bXfh r3N Wue
related: efeN hRi hHL
related: tyjn 6qY Ked
related: 8ZFC 8DK zWD
related: MS32 GJL 6sB
related: 1zWB 81n EEV
related: HXv5 i9k t5P
related: EbSk Hv8 qog
related: qLua Ure N8S
related: GnQz w5A c8Q
related: KVVN sqH Wpz
related: jtGy ZBL NEP
related: W8Kb rxf uRQ
related: hX12 2Ab w5g
related: Upxo s6Y 1RJ
related: rDKi QTj qxa
related: GTFy iPM msj
related: ytyd woW QVz
related: zTjU B9f PT4
related: MqZd qqV ZUM
related: w9N1 eTj 2jq
related: KdkP 9UN kTa
related: LNfx Wzs mdx
related: t3dE Qph Bvd
related: EB6b fRU tA5
related: qggA Smr PbQ
related: EuTa edS Add
related: 1z8u QoC C56
related: uwYE D2Z 45B
related: QKLA M7n kcj
related: 1xNQ zHp Gtj
related: UMGQ Hmq ccz
related: csRX KHF KCS
related: 8NWY SC6 LVA
related: DcqL E5d uFe
related: T9Yp 4Fm q4o
related: XJNz k5q CGS
related: 8cJ8 fJJ X5X
related: jsUx ngg Kz2
related: kxew SY8 LFZ
related: hfq6 Rpw EKK
related: uC1H igy 1X9
related: bw3n mG3 Jx8
related: mUa7 6EA jUn
related: 77vi dL6 FZR
related: Eh2z fA6 4Ls
related: WWVG 4sM faC
related: WCma 2oa gyZ
related: QLwS aMP Jcu
related: mYcf TH2 zPj
related: Mw5Q M2i ca5
related: Jd8e 1UD 8Vo
related: RGNc B6x 1A8
related: uJM6 kRc rCb
related: Aer4 NYa BYg
related: HoGM mYc krU
related: vugJ jNY XLH
related: tbMx bRW QSM
related: XiJJ yXL TC7

Hotell, restaurang, storhushåll
type: Concept
in scheme: JobTech Taxonomy - Yrkesområde
top concept of: JobTech Taxonomy - Yrkesområde
definition: Exempel på arbetsuppgifter: Ansvarar för och leder dagligt arbete i köket i en restaurang, på ett internat, inom storhushåll eller på ett fartyg. Lagar, lägger upp och garnerar mat inom hotell- och restaurangnäring, inom storkök, provkök, på ett fartyg eller i en butik alternativt på pizzeria eller gatukök. Serverar maträtter och dryck. Tar emot, checkar in och checkar ut gäster på hotell, konferensanläggning, vandrarhem eller campingplats m.m. Diskar och biträder vid matlagning på restauranger och i storkök.
related: 9nHg tvX ajZ
related: iLgH g2C 2KH
related: Ba4Z 5Q7 Xwf
related: SWZ5 f7C 6PH
related: 3wHJ rrt WDK
related: rynG URT erJ
related: EaDK DwG ujx
related: fzwa vK3 4c3
related: Bfn9 6FK iaY
related: UK96 XF1 w6F
related: JQ1x uHt jnP
related: Tzxr VqW gwF
related: 1r5s qHw 84e
related: 5E9J 4Ka UPK
related: Pppw ySf 9m7
related: KdkP 9UN kTa
related: EH8C 7Pm SMZ
related: nZc4 PaT ZTx
related: JECy 3w6 gah
related: YfiC FN1 dzY
related: gFRe kD3 jPc
related: XSBp 5wD VaU
related: Vg3d Azf p5Y
related: h6oZ 9aZ 27G
related: 4uw5 ysb 1Ky
related: kntm Uen 7Bn
related: 3kFW XLk v9H
related: TkuE Rcv WQb
related: rGGf KLs To7
related: RnSZ Ub1 DiV
related: dPjw 76j Eo5
related: 4ZeS 9Z9 wmL
related: wNVe 2CE 6of
related: XugJ 6hw wVV
related: Z3zH Cbd bbC
related: V3rJ XAo 1kT
related: of8z oz7 gBp
related: fQz9 cLZ bw8
related: JbJw as4 S93
related: uWvx kdX rL5
related: TaUi uMx WrZ
related: KarC Tsk u1m
related: FntA 2Z4 8zD
related: iugg Qq9 QHH
related: yXRQ Ad9 E8V
related: fLps qRU 1CC
related: SsZw eeZ ZHF
related: 9YaE Syg 5ZB
related: HuYB gtA 7jL
related: p299 kkg 67z
related: 6Spw ptw fgR
related: 73vz UAk B8d
related: Ki3J DNi 7Hi
related: pKTY Kwu sUw
related: oRB5 b7i Qzv
related: sqJi voF eaR
narrow match: XFXX Jq9 Y2a
narrow match: BStc SJh DKG
narrow match: YHwG fk2 MDL
narrow match: bYde Frc xcB
narrow match: UjoW meY Zwt
narrow match: a8gg ktU w8V
narrow match: 1wqU Jhj amb
narrow match: tPox ie4 X9X
narrow match: XGyi i4B ME7
narrow match: h324 DPT 7Tw

Kropps- och skönhetsvård
type: Concept
in scheme: JobTech Taxonomy - Yrkesområde
top concept of: JobTech Taxonomy - Yrkesområde
definition: Exempel på arbetsuppgifter: Klipper och behandlar hår. Utför ansikts-, spa- och kroppsbehandlingar eller fotvård. Masserar kroppens mjukdelsvävnader.
related: GBys 6Zx 25W
related: r4Ax 25F QjZ
related: JPfM Ye1 r71
related: TPtR 2LX 6B3
related: 2mPd wgX 1zA
related: UvTy Pc7 g3L
related: GNX3 2s8 99p
related: ChpK qqA uwn
related: ePrU 2x1 yY4
related: 7z3p xDw Xs4
related: dZts e4s C98
related: KaLZ kAT YjF
related: VDPL pKt otU
related: tuoE 9Nj fAS
related: LQr3 tB2 nBD
related: phfy cnb jUQ
related: zqBJ sRm m5Z
related: uwSN G39 cex
related: Noiq KAF ukM
related: zGks S1b trc
related: 6Auk A7b XwR
related: ZZXM bxk Cqq
related: kTPN 7g7 fhV
related: QpQj PcA eFY
related: FLLX TUw rU5
related: WWB9 qEe F91
related: kjD1 wUs D8a
related: hDzC BF5 Wz2
related: U4qz GCB dbU
related: 8j8g qj8 gZi
related: R5zK XyF czg
narrow match: ezKk kss CiQ
narrow match: HATH AfN RRz
narrow match: xr7w N6Q QMA
narrow match: LyBp bY6 bZK
narrow match: uxHV KXc PKD

Naturbruk
type: Concept
in scheme: JobTech Taxonomy - Yrkesområde
top concept of: JobTech Taxonomy - Yrkesområde
definition: Exempel på arbetsuppgifter: Utvecklar teorier och metoder, samt bedriver försök och ger råd inom agronomi och trädgårdsvetenskap alternativt om skogsbruk, jakt och naturvård. Odlar och skördar jordbruksväxter eller trädgårdsväxter. Anlägger och underhåller parker, trädgårdar, kyrkogårdar och golfbanor m.m. Bedriver avel, uppfödning och skötsel av djur. Driver skogsbruk, vårdar och avverkar skog. Bedriver havs-, kust- och insjöfiske. Kör skogsmaskiner i samband med gallring och slutavverkning av skog alternativt jordbruksmaskiner exempelvis i samband med plöjning, harvning, sådd och skörd. Skördar grönsaker, frukt och bär.
related: KmXs JvR Ns2
related: 6239 5FJ vLb
related: vVhN YyP Xrv
related: SRpJ Wci 3qU
related: vxKf 9ig cob
related: 3kbp yfk LgT
related: v9Ux bdL D74
related: dksu Shs BKd
related: 7cAw HzP 3Kv
related: tYNQ WZ6 8ic
related: ZmGX NiA 4qh
related: Tufb JbW wS6
related: Co7T yKa Zb1
related: g6hq ENJ Yno
related: oXqv 9m5 6Dn
related: hVUG 5nN gBh
related: 4Y6u JPp jas
related: hfBR H6L vbv
related: dZtR dHx stS
related: rSdC s2a vzC
related: 7MTK RiL Vde
related: hqts 17R Uaj
related: M72y eD6 3HN
related: uf6y 4sG vV1
related: pHNj F3k Dmd
related: 77Gm wws Dqp
related: VwH7 tvk ief
related: V1QR VzZ vbj
related: iyR6 i3U aC3
related: j5hb nHr 8Q5
related: ZwCN YoJ coi
related: 1WpJ Ho8 Ley
related: chpC tet f1t
related: wLC4 eWh wvD
related: qMzT BiK kzf
related: t5Aa WvJ Rfi
related: Y3oJ CKn aGS
related: FAo1 Ftu Jwc
related: 43oy qgN eds
related: aeJj czs 5Tq
related: GAuY xyP 5bQ
related: hcoE duS bdQ
related: mzyt mwS Lhr
related: 93yX vHS nfn
related: 8e4C 3b3 qAW
related: mAg4 DVZ qaw
related: WEAR T5W Bxa
related: a26B RC7 TS7
related: aQeS LkP v3G
related: UYCF W2i Wch
related: dn3p YMa E8p
related: BLeD 2gg F6H
related: fPML mHU d94
related: MC1m 9BX EgT
related: JZur dmf EPY
related: j6ZJ 7WS dMX
related: 8xCC ojw 7fg
related: jhj8 puk Eht
related: oRBx v9Q vH2
related: StaK vgD 1pR
related: oM6Y bP4 41Z
related: FtjZ ATU Sup
related: Lpbi kUf VeM
related: x42Z 9vG pPF
related: PMhn hVG ms2
related: Tnkm dQ2 UXu
related: VwvD G8d LjR
related: sFXn bQg 36b
related: Jocy apM 4v4
related: 6vCW mkV T5F
related: rEeE DXA Q4h
related: RvHV ckc cbT
related: WJ8c 6aZ 9CL
related: egDr i9z xoT
related: dGC5 1ze AHS

Administration, ekonomi, juridik
type: Concept
in scheme: JobTech Taxonomy - Yrkesområde
top concept of: JobTech Taxonomy - Yrkesområde
definition: Exempel på arbetsuppgifter: Utvecklar och tillämpar statistiska teorier, modeller och metoder alternativt utvecklar teorier och metoder inom ekonomi och finans. Utreder och granskar företags, myndigheters och organisationers redovisning och verksamhet. Analyserar företags och organisationers ekonomiska data och framtidsutsikter alternativt analyserar och utvärderar placeringsalternativ. Handlägger kredit- och låneansökningar, upprättar ekonomiska handlingar eller sammanställer och rapporterar ekonomiska resultat. Handlägger tekniska, ekonomiska och juridiska frågor i samband med fastighetsbildning. Organiserar rekrytering, omplacering, utveckling och avveckling av personal. Tolkar lagar och avtal och handlägger juridiska ärenden. Handlägger, utreder samt fattar beslut om olika socialförsäkringar. Registrerar, sammanställer och bearbetar data om ekonomiska transaktioner. Utför löneberedningsrutiner och löpande lönearbete, för register över personal, patienter, elever, leverantörer och kunder m.m. Skriver ut, registrerar, ordnar och förvarar dokument och handlingar.
related: 9LoK Hba 2NG
related: EgyF T9E tg6
related: zknj NWK YpX
related: vZwa QWZ tYo
related: QQ23 iVQ Kzw
related: qvok 3rm CB7
related: NXvm ETm ouA
related: E4wN d1X eYy
related: aRp4 qjZ tPV
related: kxKW LiD FuW
related: sBhb Rma Cq5
related: 6arZ cAe r8f
related: pp2y Kru xG6
related: 7YVF kE4 aPm
related: GLp9 DyP gHJ
related: XWyW 4YA kjf
related: 3yNP r6U JEp
related: 2tSL RP2 jUP
related: EsXb 35r rTR
related: 9ENZ 5kK FrP
related: 5bYa vBF REN
related: aY7W GJ6 o62
related: om9i fYm RSu
related: UrNc Tx6 vGs
related: bmgy Rsq 4DA
related: k7GJ Ysw GbY
related: 4HnZ K23 35y
related: J2oU Cpq ZVX
related: 1DSQ YqU AMs
related: 3QrR fRx u4U
related: b3hK sJG AaB
related: bwvf zQg wKH
related: WSwv qhW HCp
related: Ge1J Xyz cAL
related: rkXK cb5 Ft9
related: 99va MQm DWY
related: g41i MsZ 2Ga
related: ZaFc F2b Yuo
related: zzs5 u1V MWZ
related: 6Cud aLn ehn
related: x6oS 7T1 8Rh
related: ZwtT u1t CsN
related: iWoz Qa7 UQC
related: 3j5w jGS use
related: RXmH rsM 2vB
related: iCy6 G72 abh
related: JQ3q X9q aTC
related: c9xX 2pP 87h
related: CeoS Wzo uz5
related: iiJF QdU neU
related: oXqv 9m5 6Dn
related: SV22 7W1 pFT
related: Jus5 Fsv LTi
related: d7s6 CJT vmu
related: kJZE gsT YQK
related: NqN3 Mur sGB
related: LJZw d7H QWZ
related: pfiK oXH eYR
related: qz4J GR9 MgZ
related: R1KJ g9V Hd1
related: 1ERY 48v Q6m
related: srEz jK8 dQ5
related: o8W6 jkq JoX
related: gPCx T6e 6P8
related: QkvS u4h S55
related: ds7X mdp bPc
related: arJK xQM qou
related: EQFf p7V m84
related: WX27 7Bu Rcv
related: VHbS mPv NRi
related: Mg5T Wi4 5my
related: ho3v 5nB pK4
related: UYEg 5GS 1mJ
related: YkcC EmP nA5
related: CNqp v1H VoC

Data/IT
type: Concept
in scheme: JobTech Taxonomy - Yrkesområde
top concept of: JobTech Taxonomy - Yrkesområde
definition: Exempel på arbetsuppgifter: Analyserar, designar, utvecklar, testar eller förvaltar IT-system. Utvecklar och programmerar interaktiva medier. Ansvarar för IT-säkerhet. Sköter daglig drift av informations- och kommunikationssystem samt kringutrustning. Ger teknisk support inom IT eller installerar och konfigurerar kommunikationsutrustning.
alternative label: Data
alternative label: IT
related: TU7g mwa VzB
related: 843H Mp1 EVL
related: Bk9y Nbk FYQ
related: mBMU HvW LMY
related: LF9w UCf gow
related: iwJU gW4 SxT
related: 1qgf mXF 5Xp
related: n2kJ qFK x2K
related: nFJR WkF ir7
related: wQA4 aaU D3W
related: kPWD ic7 CLm
related: Qrbr LWo Pqt
related: e5sX ceH kV7
related: i1F4 cZZ PJu
related: 6CfM iwp hDJ
related: CZkP hCz KM8
related: AQ8y 9XL Jvv
related: J4Rt 8su TcY
related: kHsW KVe dT4
related: XZaM BRb 3mM
related: Lxas 8K9 W1o
related: 9jYT DS5 6JE
related: jg79 1KF Hvq
related: y763 SQh 71J
related: MGCL TYX EUA
related: wNG8 Rsg RQc
related: TQKD b9Y 57Z
related: X85i eSh Kfv
related: sUih DqP zQP
related: 96k5 qy6 PQv
related: hP7c k43 mUw
related: YAB4 1jM DAK
related: fZoS si8 SFg
related: Gjz2 EJT HGL
related: QQjZ NAN bDR
related: AF1L wVt xmK
related: rxZf XT6 5xt
related: CQse CRd snw
related: 9yMK 8ep D1K
related: nTwt VnS Z2x
related: fg7B yov smw
related: uo9D Kkk xuh
related: YpXF Mob zM8
related: 1UTZ bS9 kUD
related: pm44 MPD 1wd
related: 7jMK KQk M9L
related: rz2m 96d vyF
related: PTs4 wYQ zDP
related: z5AM ayf WcL
related: 3GKG 7xX AcT
related: J7aL Ugk bkU
related: ytrP JCv bwH
related: 83ms KJt Pv6
related: GDHs eoz uKx
related: pnt9 PEs zZy
related: eSph tp4 T7Z
related: 7TWG 1jQ ULf
related: 7YaM bPu c1T
related: 7wdX 4rv 33z
related: oSg4 2uU wpN
related: tJQK eGb V9R
related: wPEL cpR WA2
related: TpGL 8kr 6K1
related: JPBx Vxc zWM
related: rQds YGd quU
related: YLgW 3fm CmS
related: xJQz S3z vab
related: CTqd fc6 MG5
related: FHwx yXu FAd
related: WoBk fWz nrt
related: 5tRi kgo ZAJ
related: ziUj 67V Yk4
related: 71Ji irM rSJ

Militära yrken
type: Concept
in scheme: JobTech Taxonomy - Yrkesområde
top concept of: JobTech Taxonomy - Yrkesområde
definition: Exempel på arbetsuppgifter: Leder, planerar och genomför alternativt medverkar i militära operationer nationellt och internationellt.
related: fsDP fPf xfC
related: EsHf niD 7PB
related: UDVa DtE Fpb
narrow match: jXUQ rUV iBv
narrow match: dhgR 9jk 95r
narrow match: KiVA anS RJh

Chefer och verksamhetsledare
type: Concept
in scheme: JobTech Taxonomy - Yrkesområde
top concept of: JobTech Taxonomy - Yrkesområde
definition: Exempel på arbetsuppgifter: Planerar, leder och samordnar verksamheten i företag, organisationer, myndigheter m.m. Utformar riktlinjer, följer upp och utvärderar verksamhetens uppsatta mål. Svarar för budget samt fördelar resurserna och har personalansvar.
related: zR5y K7c TNp
related: M4Ld 18g XzK
related: DXJY cZD 68D
related: vVhN YyP Xrv
related: rMfT rsj WQv
related: LF9w UCf gow
related: xQP2 w9J jbZ
related: NgHp xhG cD4
related: E6Ts Gns DjW
related: 3HoD 9KS 4Lb
related: djLC zjB Wuq
related: oeg9 aaz cgC
related: VwdS mNV 7zf
related: 6eXR JYV FEF
related: DBuv W9M 5rt
related: EysC CUe gKG
related: q25G ETx j3f
related: Czct Myo YZr
related: 4REQ 8b1 Nee
related: nvUH JLD s4F
related: 3QrR fRx u4U
related: tPp6 tmB EsY
related: Bfn9 6FK iaY
related: PtwA N8T GTo
related: U7JN o3K cB1
related: g4wu n3y VN4
related: txzH XhY ycA
related: Kev7 Wpg oeP
related: 99va MQm DWY
related: TtGo UiH sEN
related: CzL7 oqF zrY
related: mDyj aDh T2o
related: P5d3 vV8 gXq
related: uHya vGf iyL
related: KpHq s4h 7ns
related: AFXd nYV aT3
related: a8Vk 3Vu XLs
related: 5seg CMk FtK
related: Cn7e qQS nPF
related: js93 H6m jmr
related: K2j2 Rpv Enk
related: iCy6 G72 abh
related: RdVK 4zC kFV
related: 7Kxn MMG TuY
related: QvzY zbq Bb8
related: NZcr uB1 6rX
related: EbSk Hv8 qog
related: G1Mf Kj8 2WE
related: 6iy2 mSs y9A
related: kJZE gsT YQK
related: DdMT ukX LGq
related: LJZw d7H QWZ
related: gfTT a2J 3wX
related: RsdJ eFW eE4
related: nBVy mkU UrM
related: EWHP bxy Uao
related: 21B5 fF6 MTN
related: hX12 2Ab w5g
related: 1ERY 48v Q6m
related: rSdC s2a vzC
related: GLvv qyx iMK
related: xebT T36 D4K
related: FC86 VDF rqB
related: MzBp xg2 Jix
related: EQFf p7V m84
related: ZwAg s4F TUT
related: Mg5T Wi4 5my
related: ypdM QPA qLt
related: wwmJ dqW J9p
related: Pppw ySf 9m7
related: rJ3v uyL NWU
related: f2EK V1t 89m
related: t3dE Qph Bvd
related: 2MYm KVX GfS
related: jgo4 iYd cr6

Bygg och anläggning
type: Concept
in scheme: JobTech Taxonomy - Yrkesområde
top concept of: JobTech Taxonomy - Yrkesområde
definition: Exempel på arbetsuppgifter: Utvecklar konstruktionsmetoder, produkter, tjänster och material inom byggnadsteknik eller väg- och vattenbyggnadsteknik. Utför tekniskt arbete i samband med konstruktion, nybyggnation, underhåll eller reparation av byggnader och anläggningar. Leder och fördelar arbete på byggarbetsplats, anläggning eller gruva. Bygger, underhåller, reparerar eller målar byggnader och anläggningar. Täcker, installerar, monterar, underhåller och reparerar tak, golv, isoleringssystem eller glas alternativt rör och rörledningar eller kyl- och värmepumpsanläggningar i byggnader m.m. Borrar och transporterar malm från gruva.
related: iYvF nPP nJB
related: 4z18 2pz Lof
related: yays pQS czh
related: vqv8 Tiz NeL
related: ciWH LHa Wf1
related: fRKT Fdr fHL
related: Dz54 J8f tgi
related: xNZX tnB NQj
related: bpwq MEr hvP
related: 84h8 6JS XQR
related: VwdS mNV 7zf
related: p8fz GGb BFC
related: 3XPa uKH Dwp
related: k6dT xMj pNe
related: 4EZJ 3HN fUK
related: 79h8 5t6 p8d
related: rAgy tQu JC1
related: mvnD QKo UPh
related: YfnX HAo gsa
related: y5XM 3yd YN6
related: pSke JBu 461
related: P5d3 vV8 gXq
related: a7xB Muv bGQ
related: 5Cj7 PtE aUX
related: fd4V Y5T X8a
related: nQLQ 6Ln rjy
related: NZcr uB1 6rX
related: eV6T 4DA V8m
related: kgyb GN3 qR1
related: nFA1 RN5 GNu
related: s4uc rN5 Lje
related: em7T Cwz MWd
related: mY9m WER ZCf
related: wM9w 1qH Nz1
related: UUQD UFi 9hX
related: 4Y6u JPp jas
related: ZZTi v6g 4cZ
related: 31Uw P9P AgC
related: bjAo 61d BEc
related: EYZ5 MuN yEn
related: TEWT q89 rcn
related: Kyaz piB MNV
related: qKE5 dUi zg9
related: 9wDu THq WZQ
related: GCza QNs oUe
related: 8nJG 4x9 BGX
related: BUeN T5B 77E
related: HdcS g6a jPk
related: cAYP wEe u3D
related: oFwf BeY DEs
related: EYGb fhL 6Zy
related: zYsH PP5 nyt
related: B4x6 Ed3 14i
related: 3uEE 35U U6j
related: YjEG xmo jJu
related: 2F9v VeB 3AQ
related: Euqs sFt uAP
related: gwt3 c6R h8Y
related: o2zh wq4 3L7
related: K7QL Xmt nut
related: SBhY tbt WV4
related: zgfW Kmq yct
related: vcGg bkm g4E
related: FMqS ifG ot3
related: t3k2 je2 TES
related: rSuQ 9o8 6Gw
related: bour RRe n9Y
related: j3pm WJX Hty
related: ryWZ 9B8 KME
related: 2d5J nX1 74P
related: pTTz 5DC itW
related: 8MFH Ud4 ysM
related: namT cva UiK
related: 78kB N1K piG
related: 5tLG 3ir 2e5

Naturvetenskap
type: Concept
in scheme: JobTech Taxonomy - Yrkesområde
top concept of: JobTech Taxonomy - Yrkesområde
definition: Exempel på arbetsuppgifter: Utvecklar teorier, modeller och metoder samt utformar praktiska tillämpningar inom fysik, kemi, geologi och geofysik alternativt inom biologi, farmakologi, agronomi, trädgårdsvetenskap, skogsbruk och naturvård m.m. Utvecklar och tillämpar matematiska och statistiska teorier, modeller och metoder. Kontrollerar att lagar och föreskrifter om miljö-, hälso- och djurskydd samt för livsmedel efterlevs. Undersöker miljön och utvecklar planer och lösningar för att skydda, bevara och förebygga skador på miljön. Utför kliniska analyser vid sjukhus, läkemedelsindustrin eller laboratorium.
related: 8xAv A7E Gix
related: UPRK 9CK ogn
related: 2gtP DKV nfQ
related: 5LS7 Cbz 1Yt
related: viXg 7h3 zzB
related: uWB8 3zo 6ib
related: VT9M Ppq pDM
related: 1n3p xeZ Zhy
related: xaQL Wbc 6su
related: PiQ3 Wzy U1X
related: 694U oMU aKN
related: bsHZ v4H M7Y
related: BFsJ Kit mTi
related: SrQv qDW cLW
related: RxXh WPg cwF
related: tQue 1d4 APA
related: BNJ8 fkp z4N
related: 2HAP 3Fe duM
related: M3HD hZH XoQ
related: Dhyj JLZ JA6
related: mUD2 7si XaE
related: NV4H 3uM a6d
related: jRge ki1 8cd
related: RtCz v7Z Lm6
related: Dg8t GnL p2e
related: 3bJd 7LS t8i
related: Pj8T bST f7D
related: 6Tm4 YY7 HyY
related: ULqj eRx kVd
related: gmx1 BCX EEe
related: yMd7 87H qf2
related: yaAT Ecj 77b
related: WdKG DQU 4y7
related: xTwt sEt 9QA
related: 6T6w 6Kk b8S
related: 6QtF TWT Sri
related: aeZy 4k3 bCr
related: 3g1T NaF M1m
related: cPcf Ns3 tUM
related: 3rpb wDe 7U9
related: 96TD UsQ X4S
related: afNH oNR 44N
related: CnD6 kKA g2C
related: h87Z 5Fc wzR
related: BhJk 66z inc
related: njXa 2sj 1ET
related: aYGF ANg pzR
related: Uc39 yCn Vka
related: nWmN VPm kot
related: BnmA vvT aod
related: 41dT obG dFc
related: XkZK zG3 LbS
related: vGyq S18 JKE
related: xoTd uUm g8g
related: hiNZ t7u yLx
related: KanX 2ou 7gD
related: WKEE jCt x2p
related: 2ub7 Wtv 2Fb
related: ms96 qce p79
related: J4jV dZU ykz
related: GhGu qim 5oB
related: mQAY wtA 7G2
related: 9nfm 4Xa Tat
related: FQZB voM KN6
related: Agi7 Q14 oxk
related: SMii y8Z VmX
related: RYu4 YEr tYJ
related: icuk htc ti4
related: UADD eJ1 SNQ
related: 6EaX 6kb 5wW
related: dF9d yih ua7
related: xe4v KjM 4uF
related: Fahu B3C 9H2
related: 6Vv6 zHA LCD
related: Pt1j hPW CZb

Industriell tillverkning
type: Concept
in scheme: JobTech Taxonomy - Yrkesområde
top concept of: JobTech Taxonomy - Yrkesområde
definition: Exempel på arbetsuppgifter: Samordnar, leder och följer upp arbete vid tillverkningsprocesser. Underbehandlar och lackerar produkter av olika slag och material. Gjuter föremål alternativt svetsar och skär ut metalldelar. Tillverkar och reparerar beklädnader, produkter och konstruktioner av tunnplåt. Programmerar datastyrda maskiner för metallarbete och korrigerar program. Tar emot, kvalitetsbedömer, anpassar och justerar material inför tryckning. Slaktar djur samt grov- eller finstyckar djurkroppar. Styr och övervakar maskiner som tillverkar produkter av exempelvis metall, mineral, kemikalier, gummi, plast, trä, papper, textil, skinn och läder. Monterar produkter av olika komponenter och delar. Fyller och tillsluter förpackningar.
related: berf Sgt yWP
related: eXSQ Gwt hZN
related: 7m9j eBh GeH
related: XHXj WBN 21D
related: Ja9V x6C mTt
related: 8xk8 SZa cyW
related: NQyP S3J Jby
related: oWzq KaC AyB
related: NFei dZP hv5
related: 9g2J Nhw Bwg
related: 8Kvc Fxt Jei
related: XGS1 7V1 8EN
related: v2HV VNh D7s
related: 4kjM ehP cRa
related: gVdm kTY c7h
related: AsUQ NKv XeC
related: ZS6E gwQ wDF
related: LRCD yS5 LYY
related: 9Da5 6yz HBR
related: bQpS SPS L9u
related: LU1M o4D y7y
related: T1g1 9J5 SxG
related: qRP9 1dB UXM
related: o8dP hY4 p8p
related: 1vrZ JJL fLC
related: 8wmm Wto 9iG
related: h4wH 7kG UTN
related: CbLe XeE 6en
related: yPpE 9Cp YXv
related: GaiH Bzd mU5
related: chjQ sAN hJC
related: SVKA 8r1 1TX
related: YtGc hYN fdA
related: hSQx wVQ 2gU
related: w9Un 9h8 vHK
related: gUu8 FXb qCv
related: 17Xf MuM vg2
related: hH2v Buz QPS
related: v7ct osY UL1
related: gTRr TKo t71
related: pCty rZs kXa
related: eNuV KQ1 n3y
related: Qkmi AHY bFo
related: JG8k mXR Hat
related: 6wcp 7D7 GU7
related: Abi5 CxG 9mK
related: kPtx 9Fh AhB
related: a6Hu zpi ALp
related: AANB pao y2q
related: LWXj LgT xzB
related: LyUS QzV 4BG
related: RPSf oyY 4BF
related: EMSh 67p cSp
related: Jt42 Mjo zC5
related: bpHr Kbh b8v
related: jJXM Gbn jez
related: mHBk U3f Bvf
related: dw48 BNM yEF
related: ksX5 LFd sW1
related: 6osP V1z os1
related: jQwP ds3 Toe
related: 88wr R2s FrV
related: bCPg hTb uRo
related: JUt1 s8J UJV
related: Ttw6 MFW i6j
related: eLMo pXL HKP
related: CBQm qze DQd
related: L67L 8eL ug5
related: jk4K uNT BkL
related: sppM JCw UR1
related: XzvX AHE ECV
related: AUYy tH3 nkA
related: LqpA Uyv Sk3
related: cE4c 9ML jHz
related: P8M1 XTH Ryt

Sanering och renhållning
type: Concept
in scheme: JobTech Taxonomy - Yrkesområde
top concept of: JobTech Taxonomy - Yrkesområde
definition: Exempel på arbetsuppgifter: Leder, planerar och samordnar städarbete. Sotar rökgasvägar i eldstäder och skorstenar alternativt rengör och återställer platser och lokaler efter olyckor, utsläpp eller skadeangrepp. Städar och rengör lokaler som t.ex. bostäder, hotell, industrier, kontor och skolor alternativt rengör fönster. Utför rekonditioneringsarbete och fordonsvård.
related: 8xk8 SZa cyW
related: 2eTw 69k MEy
related: 9YZg 5x3 REV
related: 6iy2 mSs y9A
related: K7KE FG6 Sqt
related: DixA mfm THe
related: 52nn w2h wuK
related: gP3r Q2H ht9
related: gBcF mUm Ruc
related: KZ18 3N9 F6y
related: 8MFH Ud4 ysM
related: snWH Lp8 JfA
related: 89uF Vvx qcD
related: KJ3U fNr b8K
related: jvPc 9RA vBq
related: d8Kq mRD TvK
related: RxYj fc9 z7L
related: 2qmv BHZ kuo
related: R2Wu ULy eHC
related: MhSm oVM hJP
related: YFh5 8k9 UK1
related: Nvb6 uT7 hSa
related: qn4x gMp dsJ
related: KF64 AvU S4N
related: gaiS XtL PH7
related: paPY ebB VvS
related: pKTY Kwu sUw
related: wUVt uYQ 4Ld
narrow match: o1gn FoS fB7
narrow match: idjo 2Wr a3E
narrow match: X7HR rZK 4wj
narrow match: Z6TY xDf Yup
narrow match: SUfj 4D9 FNx
narrow match: FjdF H2e tAG
narrow match: FtyZ Joo tB8

Installation, drift, underhåll
type: Concept
in scheme: JobTech Taxonomy - Yrkesområde
top concept of: JobTech Taxonomy - Yrkesområde
definition: Exempel på arbetsuppgifter: Övervakar, sköter och underhåller fastigheters inre och yttre miljö. Analyserar fel, underhåller och reparerar motorer, fordon, jordbruks- och industrimaskiner samt mekanisk utrustning. Gör elinstallationer i byggnader. Installerar, underhåller och reparerar elektriska anläggningar alternativt utrustningar som styr processer inom industrin, ledningsnät, ställverk och transformatorstationer. Installerar och reparerar data- och telenät samt larm och signalsystem. Styr och övervakar anläggningar och maskiner som framställer och distribuerar elektricitet, ånga och hetvatten alternativt smälter och raffinerar malm och metall. Ansvarar för kontorsmaterial samt underhåller vissa kontorsmaskiner.
related: zEWh oPy Qmt
related: TCGb VdF NSm
related: 5XnU 5ZJ LQN
related: mpm9 k4R NKR
related: YTjK wVy YNM
related: F7YT bKk 1jK
related: VXjE yRK 6o3
related: UepW aZ5 CWo
related: k4k1 LhW o5U
related: fzwa vK3 4c3
related: mszs EcM DgP
related: nDGY Jbi cRM
related: BK7A kh5 xWc
related: bqrn 3Hf Wtv
related: J63w XYr isZ
related: xhPp qTB poK
related: UEsj tfo nGD
related: ci6b Nc2 FmS
related: chze 8HV Ujk
related: K3iK iEb 41Y
related: tULR RMF oHJ
related: 1jm3 XFQ TdJ
related: XEUg tcM vjF
related: paDm hYD LFG
related: gD5N mCM ea5
related: EymQ sK4 wBA
related: 9uVb cNz M1q
related: zwrY va8 dXe
related: aQDK H6n bwK
related: 7zzg eYA jij
related: wseg bur Egm
related: SRCS uYJ MUP
related: o7LP duC u9Z
related: MZAa r7q ofj
related: 84Uc bhA s47
related: h9yf QED SCC
related: oH9v baf a3d
related: nb39 NDw fNE
related: 8qCg sxp 6fq
related: K7QL Xmt nut
related: GpE8 Cy4 zL8
related: dp2q xZZ gP4
related: PswE Eyf RTP
related: 8HRs 652 CEB
related: 5Lm9 jot RaW
related: EbyD yr3 wmJ
related: kpw6 7cd 9X6
related: afDJ LWv ESt
related: 1ijm oAT HVx
related: aNrh uSe mok
related: uZU6 oxo Dpd
related: ktE3 SWm Qaj
related: pahf 9Ek WVz
related: ZUqm i6F goq
related: mSRg Zwo mrK
related: RF7q DSJ FbY
related: mbmF rYM oFG
related: cRmS zdM NEA
related: bgTi SxA pLX
related: T55e efV Eqh
related: cUfj 4io mFf
related: NapE zvy guo
related: 6LYA Sgu hsR
related: Gic7 SUy mGj
related: ubgh Tgi RgH
related: vaq4 wCT Pu9
related: FTeN dsG P21
related: swZK y6d 5Wb
related: GtM1 tT6 UUy
related: NsCV eWr uwV
related: mbDn h6o Tuy
related: PrPH J1d qua
related: Vccr YPx Hs5
related: Qq5v QZ3 EE9
related: NCaY h1f Eni